##TITLE=31Pdec_DE-37_rm1d
 
 64 sc
 6.3.2024
##JCAMPDX= 6.0         $$ Bruker NMR JCAMP-DX V2.0
##DATA TYPE= NMR SPECTRUM
##DATA CLASS= NTUPLES
##ORIGIN= UXNMR, Bruker Analytische Messtechnik GmbH
##OWNER= root
$$ XWIN-NMR		Version 3.5
$$ Wed Mar  6 17:56:41 2024 Russian Standard Time (UT+4h)  she@DPX200
##.OBSERVE FREQUENCY= 81.013821
##.OBSERVE NUCLEUS= ^31P
##.ACQUISITION MODE= SIMULTANEOUS
##.ACQUISITION SCHEME= undefined
##.AVERAGES= 64
##.DIGITISER RES= 16
##SPECTROMETER/DATA SYSTEM= spect
##.PULSE SEQUENCE= zgpg30
##.SOLVENT NAME= CDCl3
##.SHIFT REFERENCE= (INTERNAL, CDCl3, 0, 248.564)
##AUDIT TRAIL= $$ (NUMBER, WHEN, WHO, WHERE, WHAT)
$$ ##TITLE= Audit trail, XWIN-NMR		Version 3.5
$$ ##JCAMPDX= 5.01
$$ ##ORIGIN= Bruker BioSpin GmbH
$$ ##OWNER= she
$$ F:/spectra/data/she/nmr/P31/1/pdata/1/auditp.txt
$$ ##AUDIT TRAIL=  $$ (NUMBER, WHEN, WHO, WHERE, WHAT)
(   1,<2024-03-06 17:55:41.54 +0400>,<she>,<DPX200>,
      <continue with go, POWCHK disabled, PULCHK disabled
       configuration hash MD5:
       00 E9 B6 7A A2 85 ED C7 34 08 36 98 17 FE 4E 26
       data hash MD5: 32K
       26 EE C1 4B 30 DC C6 8F 5E F5 D7 64 6D A4 14 76>)
(   2,<2024-03-06 17:55:43.10 +0400>,<she>,<DPX200>,
      <Start of raw data processing
       efp BC_mod = 2 LB = 10 FT_mod = 6 PKNL = 1 PHC0 = -12760.02 PHC1 = -227.1165 SI = 64K 
       data hash MD5: 64K
       96 5E 87 9E 91 E1 05 95 A7 4A 03 55 36 AA 98 0D>)
(   3,<2024-03-06 17:55:59.95 +0400>,<she>,<DPX200>,
      <pk PHC0 = 17.52345 PHC1 = -18 
       data hash MD5: 64K
       50 E3 FE 31 55 C1 65 91 D5 56 E1 DE E7 1A 19 3A>)
$$ ##END=
$$ 
$$ hash MD5
$$ 60 38 A7 BC A2 48 E0 A8 65 1C DB 42 D3 EC 87 DA
##$RELAX= 
##$RELAX= 
##$RELAX= 
##$RELAX= 
##$RELAX= 
##$RELAX= 
##$RELAX= 
##$RELAX= 
##$RELAX= 
$$ Bruker specific parameters
$$ --------------------------
##$DU= <F:/spectra>
##$EXPNO= 1
##$NAME= <P31>
##$PROCNO= 1
##$TYPE= <nmr>
##$USER= <she>
##$AMP= (0..31)
100 100 100 100 100 100 100 100 100 100 100 100 100 100 100 100 100 100 
100 100 100 100 100 100 100 100 100 100 100 100 100 100 
##$AQSEQ= 0
##$AQ_mod= 1
##$AUNM= <au_zg>
##$AUTOPOS= <>
##$BF1= 81.014009
##$BF2= 200.13
##$BF3= 200.13
##$BF4= 200.13
##$BF5= 200.13
##$BF6= 200.13
##$BF7= 200.13
##$BF8= 200.13
##$BYTORDA= 1
##$CFDGTYP= 0
##$CFRGTYP= 5
##$CHEMSTR= <none>
##$CNST= (0..31)
1 1 145 1 1 1 1 1 1 1 1 1 1 1 1 1 1 1 1 1 1 1 1 1 1 1 1 1 1 1 1 1 
##$CPDPRG= <waltz16>
##$CPDPRG1= <>
##$CPDPRG2= <waltz16>
##$CPDPRG3= <>
##$CPDPRG4= <mlev>
##$CPDPRG5= <mlev>
##$CPDPRG6= <mlev>
##$CPDPRG7= <mlev>
##$CPDPRG8= <mlev>
##$CPDPRGB= <>
##$CPDPRGT= <>
##$D= (0..31)
0 1 0 0 0 0 0 0 0 0 0 0.03 2e-05 3e-06 0 0 0 0 0 0 0 0 0 0 0 0 0 0 0 0 
0 0 
##$DATE= 1709733262
##$DBL= (0..7)
120 120 120 11 120 120 24 19 
##$DBP= (0..7)
150 150 150 150 150 150 150 150 
##$DBP07= 0
##$DBPNAM0= <>
##$DBPNAM1= <>
##$DBPNAM2= <>
##$DBPNAM3= <>
##$DBPNAM4= <>
##$DBPNAM5= <>
##$DBPNAM6= <>
##$DBPNAM7= <>
##$DBPOAL= (0..7)
0.5 0.5 0.5 0.5 0.5 0.5 0.5 0.5 
##$DBPOFFS= (0..7)
$$ [...]
##$SUBNAM2= <"">
##$SUBNAM3= <"">
##$SUBNAM4= <"">
##$SUBNAM5= <"">
##$SUBNAM6= <"">
##$SUBNAM7= <"">
##$SUBNAM8= <"">
##$SUBNAM9= <"">
##$SW= 501.771253377433
##$SWIBOX= (0..15)
0 1 3 0 0 0 0 0 0 0 0 0 0 0 0 0 
##$SW_h= 40650.406504065
##$TD= 32768
##$TD0= 1
##$TE= 0
##$TE2= 300
##$TE3= 300
##$TEG= 300
##$TL= (0..7)
0 120 53 12 22 120 120 120 
##$TP= (0..7)
150 150 150 150 150 150 150 150 
##$TP07= 0
##$TPNAME0= <>
##$TPNAME1= <>
##$TPNAME2= <>
##$TPNAME3= <>
##$TPNAME4= <>
##$TPNAME5= <>
##$TPNAME6= <>
##$TPNAME7= <>
##$TPOAL= (0..7)
0.5 0.5 0.5 0.5 0.5 0.5 0.5 0.5 
##$TPOFFS= (0..7)
0 0 0 0 0 0 0 0 
##$TUNHIN= 0
##$TUNHOUT= 0
##$TUNXOUT= 0
##$USERA1= <user>
##$USERA2= <user>
##$USERA3= <user>
##$USERA4= <user>
##$USERA5= <user>
##$V9= 5
##$VALIST= <valist>
##$VCLIST= <CCCCCCCCCCCCCCC>
##$VD= 0
##$VDLIST= <DDDDDDDDDDDDDDD>
##$VPLIST= <PPPPPPPPPPPPPPP>
##$VTLIST= <TTTTTTTTTTTTTTT>
##$WBST= 1024
##$WBSW= 4
##$XGAIN= (0..3)
0 0 0 0 
##$XL= 0
##$YL= 0
##$YMAX_a= 2469
##$YMIN_a= -1927
##$ZGOPTNS= <>
##$ZL1= 120
##$ZL2= 120
##$ZL3= 120
##$ZL4= 120
##$ABSF1= 0
##$ABSF2= 0
##$ABSG= 0
##$ABSL= 0
##$ALPHA= 0
##$AQORDER= 0
##$ASSFAC= 0
##$ASSFACI= 0
##$ASSFACX= 0
##$ASSWID= 0
##$AUNMP= <proc_1d>
##$AZFE= 0.1
##$AZFW= 0.5
##$BCFW= 0
##$BC_mod= 2
##$BYTORDP= 0
##$COROFFS= 0
##$CY= -3
##$DATMOD= 1
##$DC= 0
##$DFILT= <>
##$DTYPP= 0
##$F1P= 0
##$F2P= 0
##$FCOR= 1
##$FTSIZE= 65536
##$FT_mod= 6
##$GAMMA= 0
##$GB= 0
##$INTBC= 1
##$INTSCL= 6.047779e-11
##$ISEN= 30
##$LB= 10
##$LEV0= 0
##$LPBIN= 0
##$MAXI= 10000
##$MC2= 0
##$MEAN= 0
##$ME_mod= 0
##$MI= 50
##$NCOEF= 0
##$NC_proc= -10
##$NLEV= 6
##$NOISF1= 182.463
##$NOISF2= 159.3651
##$NSP= 0
##$NTH_PI= 0
##$NZP= 0
##$OFFSET= 248.5645
##$PC= 4
##$PHC0= -12742.5
##$PHC1= -245.1165
##$PH_mod= 1
##$PKNL= yes
##$PPARMOD= 0
##$PSCAL= 0
##$PSIGN= 0
##$REVERSE= no
##$SF= 81.0140089999694
##$SI= 65536
##$SIGF1= 159.3651
##$SIGF2= -187.1042
##$SINO= 113.3802
##$SIOLD= 16384
##$SREGLST= <1H.CDCl3>
##$SSB= 0
##$STSI= 65536
##$STSR= 0
##$SW_p= 40650.406504065
##$SYMM= 0
##$S_DEV= 0
##$TDeff= 32768
##$TDoff= 0
##$TI= <>
##$TILT= no
##$TM1= 0
##$TM2= 0
##$TOPLEV= 0
##$USERP1= <user>
##$USERP2= <user>
##$USERP3= <user>
##$USERP4= <user>
##$USERP5= <user>
##$WDW= 1
##$XDIM= 65536
##$YMAX_p= 363714233
##$YMIN_p= -159207337
$$ End of Bruker specific parameters
$$ ---------------------------------
##NTUPLES= NMR SPECTRUM
##VAR_NAME=  FREQUENCY,     SPECTRUM/REAL,   SPECTRUM/IMAG
##SYMBOL=    X,             R,               I
##VAR_TYPE=  INDEPENDENT,   DEPENDENT,       DEPENDENT
##VAR_FORM=  AFFN,          ASDF,            ASDF
##VAR_DIM=   65536,         65536,           65536
##UNITS=     HZ,            ARBITRARY UNITS, ARBITRARY UNITS
##FACTOR=    0.620285442955139, 1,           1
##FIRST=     20137.2065510682, 0,            0
##LAST=      -20513.1999529968, 0,           0
##MIN=       -20513.1999529968, -159207337,  0
##MAX=       20137.2065510682, 363714233,    0
$$ Real data points
##PAGE= N=1
##DATA TABLE= (X++(R..R)), XYDATA
$$ [...]
41189 495351 273041 -311163 -1197790 -2257599 -3322851 -4237673 -4905793 -5315255 -5530837
41180 -5530837 -5659897 -5808011 -6042247 -6373295 -6758031 -7116392 -7353250 -7377360 -7113646 -6509958
41170 -6509958 -5542703 -4225403 -2619261 -838081 962234 2612744 3970176 4948420
41162 4948420 5529017 5748955 5675864 5384176 4940456 4398335 3799201 3175037 2551448 1950123
41152 1950123 1390734 892466 474117 150566 -74791 -217773 -315930 -424294 -606681 -923748
41142 -923748 -1416254 -2085894 -2885042 -3728136 -4523593 -5207407 -5756971 -6180207 -6493742 -6706793
41132 -6706793 -6815776 -6804556 -6646604 -6311406 -5777048 -5044270 -4144012 -3135448 -2098302
41123 -2098302 -1124035 -306007 273823 560982 541488 245135 -262690 -895731 -1561118 -2169798
41113 -2169798 -2644215 -2924417 -2971023 -2764155 -2301794 -1602627 -712929 289862 1304003
41104 1304003 2220739 2945679 3416765 3613895 3558351 3303123 2917433 2469523 2011625 1571289
41094 1571289 1151876 740543 317561 -137870 -644652 -1216484 -1858550 -2567374 -3334668
41085 -3334668 -4152176 -5015037 -5923865 -6885432 -7909989 -9005303 -10172157 -11406205 -12704656
41076 -12704656 -14070727 -15510059 -17018506 -18564455 -20071616 -21412576 -22425131 -22954601
41068 -22954601 -22907797 -22292450 -21222261 -19887751 -18509541 -17292627 -16392244 -15894783 -15814103
41059 -15814103 -16101320 -16663264 -17383909 -18145200 -18845519 -19413886 -19818296 -20068261 -20212479
41050 -20212479 -20330441 -20514916 -20845043 -21356882 -22023812 -22757838 -23434038 -23928672 -24154100
41041 -24154100 -24075379 -23702729 -23065464 -22181711 -21041401 -19614630 -17882515 -15871115 -13665046
41032 -13665046 -11391518 -9185816 -7158664 -5379367 -3876020 -2645752 -1666801 -907675
41024 -907675 -333325 89534 387589 578896 674745 682960 609984 463320 258076 26605
41014 26605 -176551 -282606 -229497 14195 436780 991049 1617773 2269895 2922243 3563272
41004 3563272 4178392 4737794 5193992 5485603 5542971 5296980 4695198 3723030 2417792
40995 2417792 863210 -835065 -2577667 -4287191 -5908029 -7399098 -8727936 -9867031
40987 -9867031 -10790038 -11469031 -11876748 -11994764 -11823147 -11385844 -10729945 -9921702 -9042532
40978 -9042532 -8183894 -7436386 -6871670 -6524290 -6385150 -6412735 -6556541 -6779279 -7065416 -7411843
40968 -7411843 -7807722 -8219196 -8592841 -8876907 -9043000 -9089668 -9026214 -8852306 -8549067 -8083266
40958 -8083266 -7416146 -6511769 -5347470 -3928406 -2299447 -543008 1241138 2964184
40950 2964184 4567618 6023108 7317224 8435507 9357920 10065900 10551385 10818593 10878107
40941 10878107 10740416 10414835 9912050 9243455 8414075 7414392 6220536 4807305 3168362
40932 3168362 1331378 -641935 -2671647 -4682393 -6621238 -8463884 -10210462 -11875759
40924 -11875759 -13476618 -15016954 -16473350 -17788653 -18879865 -19658224 -20051488 -20019372 -19561203
40915 -19561203 -18719908 -17582830 -16273516 -14929518 -13670831 -12573128 -11660030 -10918316
40907 -10918316 -10325964 -9874670 -9572443 -9426572 -9421611 -9508915 -9613615 -9653652 -9562548 -9309513
40897 -9309513 -8910072 -8420675 -7918151 -7475470 -7146637 -6963210 -6935564 -7053640 -7288509 -7596707
40887 -7596707 -7924697 -8210409 -8383778 -8370374 -8097975 -7502244 -6530752 -5149668 -3356045
40878 -3356045 -1191196 1253895 3846530 6431489 8855423 10991110 12757241 14128290
40870 14128290 15129632 15818566 16259351 16503036 16578454 16493962 16245596 15827115 15238685
40861 15238685 14492272 13612764 12634591 11594961 10527176 9458679 8414963 7424138 6514737
40852 6514737 5705056 4990129 4334672 3676691 2942180 2068256 1027934 -154304 -1405732
40843 -1405732 -2629012 -3738159 -4692945 -5517583 -6294821 -7136882 -8145353 -9375776 -10817166
40834 -10817166 -12388827 -13953247 -15342812 -16394600 -16982401 -17035216 -16539337 -15530649 -14086163
40825 -14086163 -12317464 -10360911 -8359314 -6437788 -4683996 -3141122 -1813477 -678250
40817 -678250 302606 1173711 1982485 2779407 3617122 4542361 5580810 6722804 7919167
40808 7919167 9091576 10155844 11051020 11761744 12320235 12783750 13199429 13577452 13887420
40799 13887420 14077959 14107095 13966381 13685140 13311778 12883112 12400797 11829633 11118486
40790 11118486 10231512 9172930 7993211 6774836 5606109 4556202 3661013 2921219
40782 2921219 2308467 1775450 1267657 735339 144398 -514225 -1217165 -1906732 -2500874
40773 -2500874 -2918015 -3109742 -3086247 -2922665 -2746412 -2714020 -2983804 -3685434 -4889166 -6584406
40763 -6584406 -8677716 -11011417 -13395034 -15641531 -17603474 -19202187 -20438102 -21373791
40755 -21373791 -22095572 -22673297 -23138364 -23486827 -23699109 -23761021 -23674978 -23459566 -23142819 -22755558
40745 -22755558 -22327173 -21881708 -21431008 -20965242 -20446773 -19815332 -19006888 -17978631 -16727131
40736 -16727131 -15291160 -13740085 -12154295 -10603632 -9128789 -7732039 -6383081 -5038688
40728 -5038688 -3664912 -2247833 -788027 712014 2252383 3825750 5401679 6920945
40720 6920945 8307846 9494799 10446225 11170736 11716289 12148898 12523162 12859756 13143275
40711 13143275 13340705 13426310 13395974 13264586 13053040 12776432 12440475 12044948 11588032 11067014
40701 11067014 10476442 9808430 9057484 8226942 7331377 6391623 5423788 4428128 3385937
40692 3385937 2270164 1067261 -201755 -1475711 -2669654 -3705875 -4542888 -5187265
40684 -5187265 -5684802 -6100273 -6499485 -6940425 -7470054 -8120585 -8904967 -9816019 -10830640
40675 -10830640 -11915103 -13028222 -14124567 -15160192 -16096889 -16898366 -17520402 -17908130 -18011316
40666 -18011316 -17811592 -17341348 -16678462 -15919668 -15149617 -14420658 -13746939 -13108497 -12461103
40657 -12461103 -11750276 -10928291 -9971294 -8892105 -7743283 -6606286 -5567984 -4694184 -4013814
40648 -4013814 -3521747 -3195995 -3016099 -2970505 -3049938 -3234539 -3487924 -3767483 -4048231 -4345230
40638 -4345230 -4716951 -5242827 -5985175 -6955950 -8105611 -9337806 -10539511 -11609859 -12474894
40629 -12474894 -13086218 -13411246 -13425500 -13112860 -12473451 -11535451 -10366315 -9077908 -7819378
40620 -7819378 -6754850 -6030914 -5746100 -5934840 -6571278 -7588237 -8899781 -10415502 -12041993
40611 -12041993 -13677493 -15211280 -16534155 -17555306 -18215511 -18491696 -18395866 -17972454 -17292917
40602 -17292917 -16444024 -15510593 -14558809 -13626130 -12719609 -11821744 -10902988 -9939059 -8927605
40593 -8927605 -7896268 -6896984 -5988210 -5212784 -4581037 -4066810 -3619338 -3186774 -2740257
40584 -2740257 -2286716 -1866297 -1539973 -1375265 -1432380 -1749050 -2326118 -3121411 -4057498 -5039960
40574 -5039960 -5976766 -6791263 -7426519 -7841816 -8004298 -7882528 -7450338 -6703305 -5679084
40565 -5679084 -4466924 -3196935 -2011235 -1027761 -310381 142666 385532 491938 521249
40556 521249 504517 456619 399690 376214 443271 655876 1050123 1629173 2352757 3136719
40546 3136719 3870300 4447908 4799478 4903741 4780786 4472034 4019439 3452711 2787362
40537 2787362 2030213 1186386 264769 -717203 -1729127 -2726148 -3652414 -4447769 -5055355
40528 -5055355 -5430650 -5552232 -5430270 -5107253 -4650547 -4141082 -3661235 -3282296 -3053606
40519 -3053606 -2997954 -3114492 -3384925 -3778784 -4258084 -4782197 -5310352 -5800009 -6205786 -6485006
40509 -6485006 -6607715 -6561338 -6344819 -5958582 -5400902 -4674253 -3796212 -2806828 -1766963
40500 -1766963 -746723 191631 1008383 1692688 2260447 2746722 3193706 3634270 4075397
40491 4075397 4490228 4824606 5015741 5014669 4803626 4401270 3852233 3205027 2490864 1716903
40481 1716903 877247 -28224 -982285 -1954441 -2916644 -3857043 -4778953 -5683983 -6552427
40472 -6552427 -7337467 -7978564 -8424128 -8648283 -8653965 -8465522 -8119716 -7661949 -7147668 -6642515
40462 -6642515 -6215489 -5927273 -5821791 -5924365 -6240197 -6746419 -7382229 -8050360 -8637096
40453 -8637096 -9043231 -9210007 -9128204 -8828696 -8361889 -7777715 -7115508 -6404713 -5669849 -4933044
40443 -4933044 -4212685 -3519992 -2854959 -2204137 -1544817 -857279 -138764 590404 1291162
40434 1291162 1914775 2411618 2740858 2882896 2850204 2689196 2470688 2272615 2159923 2166306
40424 2166306 2284938 2475401 2685490 2874369 3021195 3114711 3134148 3036942 2762924 2254508
40414 2254508 1483867 473029 -705815 -1952253 -3169753 -4288777 -5269831 -6091802 -6740428
40405 -6740428 -7206656 -7492027 -7611206 -7585712 -7432270 -7154801 -6746927 -6204328 -5539403 -4788746
40395 -4788746 -4007875 -3254206 -2565277 -1942473 -1349990 -733188 -50862 692445 1429281
40386 1429281 2035761 2360435 2266576 1674102 586205 -909463 -2663827 -4500953 -6248899
40377 -6248899 -7759777 -8922121 -9670865 -9993757 -9926869 -9535129 -8884993 -8024584 -6982360
40368 -6982360 -5781454 -4456689 -3063504 -1677156 -385053 726939 1593123 2183790
40360 2183790 2506012 2584946 2437012 2054577 1413356 496124 -684793 -2080285 -3614276
40351 -3614276 -5202955 -6774858 -8286354 -9728087 -11118494 -12486099 -13851202 -15218726
40343 -15218726 -16583192 -17935334 -19261571 -20538863 -21732670 -22799139 -23685832 -24329109
40335 -24329109 -24654524 -24587302 -24071893 -23092229 -21683547 -19930374 -17950634 -15871767 -13808716
40326 -13808716 -11851101 -10059131 -8462441 -7058661 -5815403 -4682270 -3614089 -2596916
40318 -2596916 -1663084 -885915 -355683 -146708 -286120 -732034 -1368838 -2026832 -2525100
40309 -2525100 -2722064 -2550959 -2026218 -1224079 -252352 775625 1754647 2589212 3190830
40300 3190830 3481246 3405482 2947769 2138794 1048971 -227652 -1590780 -2947961 -4224475
40291 -4224475 -5368293 -6349392 -7155046 -7784464 -8243924 -8540014 -8669658 -8611676 -8329101
40282 -8329101 -7787134 -6980084 -5951408 -4792588 -3619082 -2535996 -1612135 -874664 -322910
40273 -322910 50969 247896 260355 80902 -286034 -815429 -1460309 -2159387 -2850916 -3486210
40263 -3486210 -4036674 -4493213 -4861420 -5155724 -5393182 -5587816 -5749112 -5887914 -6027238
40254 -6027238 -6210019 -6496648 -6951623 -7624550 -8532512 -9650040 -10911461 -12227265 -13510135
40245 -13510135 -14700127 -15777517 -16758496 -17679029 -18578025 -19487635 -20429681 -21411413 -22416503
40236 -22416503 -23395171 -24262817 -24914168 -25250995 -25211903 -24789786 -24029181 -23007656 -21812986
40227 -21812986 -20526201 -19213571 -17925699 -16700520 -15566427 -14541572 -13628643 -12810080
40219 -12810080 -12050688 -11309777 -10557732 -9788422 -9020599 -8286765 -7614580 -7010430 -6453433
40210 -6453433 -5901594 -5305673 -4624384 -3835101 -2935601 -1936710 -852454 303726 1515242
40201 1515242 2758133 4002507 5217179 6370454 7424344 8326284 9004479 9371868 9341721
40192 9341721 8853301 7898474 6535675 4882118 3086059 1290585 -396249 -1913977
40184 -1913977 -3243723 -4392915 -5382948 -6244936 -7018810 -7748998 -8475827 -9227016 -10012455
40175 -10012455 -10821494 -11621241 -12357087 -12958780 -13353611 -13483977 -13323097 -12882766 -12210765
40166 -12210765 -11380470 -10478274 -9594026 -8816129 -8227871 -7898720 -7867854 -8126211 -8610051
40157 -8610051 -9215106 -9826985 -10352067 -10733657 -10949769 -11000756 -10898005 -10658795 -10304148 -9853564
40147 -9853564 -9315145 -8677274 -7911088 -6986588 -5894240 -4658546 -3336292 -2003376 -739212
40138 -739212 386268 1322905 2047258 2563210 2895184 3077754 3146407 3130725 3049430 2908818
40128 2908818 2706594 2438884 2104406 1702799 1231541 688931 85383 -543008 -1128331
40119 -1128331 -1578043 -1793602 -1692960 -1229404 -403336 732937 2076909 3485144 4791634
40110 4791634 5834880 6488686 6686623 6429358 5771378 4795222 3587800 2228974 792188
40101 792188 -650667 -2028105 -3274295 -4337930 -5190149 -5830114 -6289810 -6636918 -6968592
40092 -6968592 -7389666 -7980251 -8769573 -9731319 -10801147 -11903068 -12969702 -13950014 -14807456
40083 -14807456 -15515017 -16051682 -16401431 -16554585 -16511331 -16286086 -15909281 -15423834 -14877724
40074 -14877724 -14316629 -13778274 -13286997 -12848272 -12446556 -12049921 -11621703 -11136619 -10596918
40065 -10596918 -10041067 -9536633 -9156391 -8948593 -8917241 -9020931 -9187382 -9334529 -9389339 -9299260
40055 -9299260 -9036303 -8597163 -8000527 -7277975 -6456866 -5543324 -4518598 -3353518 -2031587
40046 -2031587 -566847 990325 2558480 4038415 5331230 6355993 7061591 7431068
40038 7431068 7480343 7253001 6810652 6218337 5527504 4762598 3918146 2968982 1888257
40029 1888257 662641 -702611 -2187018 -3759388 -5378842 -6993241 -8537939 -9936523
40021 -9936523 -11104420 -11956865 -12421900 -12456150 -12058083 -11272935 -10186316 -8908636 -7556529
40012 -7556529 -6237148 -5037642 -4019558 -3217803 -2642689 -2280415 -2088386 -1990798 -1888276
40003 -1888276 -1688951 -1347949 -887942 -383126 83804 462380 748355 968554 1152831
39994 1152831 1311816 1429256 1466979 1376665 1114512 657051 14850 -762224 -1593775 -2390388
39984 -2390388 -3078281 -3615069 -3990608 -4216496 -4313826 -4307428 -4228014 -4116432 -4021972 -3991185
39974 -3991185 -4051526 -4199344 -4400412 -4604648 -4768800 -4875760 -4940120 -4997083 -5081914 -5212115
39964 -5212115 -5380989 -5562968 -5725526 -5841683 -5898236 -5896052 -5842153 -5739160 -5580674 -5356432
39954 -5356432 -5061836 -4702337 -4288671 -3828218 -3320809 -2762171 -2151276 -1495589 -810748
39945 -810748 -114928 578849 1267382 1954881 2644217 3327360 3980340 4562682 5017610 5271939
39935 5271939 5239969 4835925 3992825 2679004 904281 -1284411 -3811036 -6575787 -9458707
39926 -9458707 -12328106 -15057326 -17543902 -19719372 -21543181 -22987046 -24024543 -24636126
39918 -24636126 -24825685 -24633980 -24136287 -23423771 -22578975 -21657396 -20681304 -19646033 -18535576
39909 -18535576 -17341695 -16078532 -14786097 -13521968 -12346158 -11305280 -10420446 -9682721
39901 -9682721 -9059486 -8510340 -8003627 -7522154 -7054630 -6581478 -6068193 -5471947 -4755526
39892 -4755526 -3898331 -2899793 -1778061 -568024 682152 1919959 3103255 4214226
39884 4214226 5264160 6286873 7326804 8429268 9633688 10964513 12417411 13947643
39876 13947643 15471786 16886699 18098002 19045282 19715021 20138648 20377941 20503619 20574853
39867 20574853 20624887 20653057 20622025 20461884 20083929 19403085 18363859 16963630 15266227
39858 15266227 13396889 11513775 9764336 8246463 6991184 5969099 5111556 4337093
39850 4337093 3576794 2792962 1986565 1192711 466805 -134632 -571997 -829960 -908674 -805705
39840 -805705 -504603 19149 777499 1745136 2840539 3920034 4791079 5246093 5108147
39831 5108147 4272624 2731374 574985 -2023224 -4834210 -7603640 -10080069 -12038466
39823 -12038466 -13299570 -13746035 -13334633 -12102142 -10162406 -7693395 -4915202 -2061697
39815 -2061697 650167 3047980 5022320 6531934 7597030 8286614 8704900 8976750 9228897
39806 9228897 9566036 10046388 10665948 11361341 12034866 12592058 12970395 13141363 13088823 12786991
39796 12786991 12200383 11306058 10117125 8685754 7081957 5363619 3559191 1674891
39788 1674891 -279122 -2263396 -4205143 -6021196 -7653874 -9096943 -10397205 -11633208
39780 -11633208 -12882685 -14191211 -15552056 -16904515 -18152309 -19194111 -19951907 -20386341
39772 -20386341 -20498323 -20323045 -19921772 -19372415 -18757771 -18150992 -17600110 -17116515 -16673982
39763 -16673982 -16221113 -15701917 -15074884 -14325326 -13472787 -12575115 -11725128 -11035292 -10613937
39754 -10613937 -10543173 -10866348 -11585947 -12669500 -14060258 -15686311 -17460140 -19268214 -20963458
39745 -20963458 -22377375 -23355317 -23798977 -23692580 -23099860 -22137327 -20940694 -19638191 -18333048
39736 -18333048 -17090292 -15927256 -14814895 -13695663 -12512118 -11231957 -9859246 -8432100
39728 -8432100 -7012202 -5669801 -4466371 -3439094 -2592485 -1900170 -1315957 -789801 -281334
39719 -281334 236086 781403 1374095 2036192 2788334 3647651 4631362 5759736 7049280
39710 7049280 8497056 10068980 11704959 13339667 14922905 16423140 17813235 19053630
39702 19053630 20089576 20865478 21345533 21527209 21440666 21135143 20659117 20044753 19305173
39693 19305173 18443901 17466120 16381674 15200133 13927031 12569001 11147077 9710394
39685 9710394 8340716 7140867 6207411 5597780 5307508 5268795 5370808 5493731 5545522
39676 5545522 5489452 5351478 5203547 5130577 5196098 5418357 5761441 6142725 6456924 6611326
39666 6611326 6558393 6310379 5929517 5499195 5088660 4725452 4387462 4018706 3560558 2981141
39656 2981141 2287181 1514368 705892 -104452 -893497 -1637934 -2306771 -2867734 -3300992
39647 -3300992 -3603776 -3779708 -3824747 -3725493 -3472515 -3077915 -2585094 -2065497 -1604002 -1279955
39637 -1279955 -1154170 -1268282 -1651786 -2324071 -3283529 -4489623 -5853216 -7246921 -8533762
39628 -8533762 -9599106 -10368120 -10802021 -10882333 -10599350 -9954203 -8971271 -7710102 -6266062
39619 -6266062 -4754812 -3285257 -1933980 -733771 321558 1263476 2133226 2966262 3778527
39610 3778527 4560924 5286628 5925933 6456806 6864704 7136228 7255281 7204378 6966624 6524588
39600 6524588 5859869 4961118 3841832 2557862 1211285 -64657 -1134850 -1897859 -2318878
39591 -2318878 -2447236 -2404822 -2344269 -2395061 -2623689 -3022767 -3526227 -4037804 -4460043 -4715622
39581 -4715622 -4759354 -4584577 -4226576 -3758699 -3274834 -2861356 -2573255 -2427943 -2415985 -2515474
39571 -2515474 -2698043 -2926587 -3154832 -3337451 -3447672 -3488766 -3488301 -3477864 -3472243 -3459810 -3405405
39560 -3405405 -3260722 -2978006 -2524440 -1893667 -1110422 -225821 697753 1610951 2503177
39551 2503177 3415196 4427234 5625627 7064189 8737079 10571826 12444228 14212014
39543 14212014 15756424 17013640 17981231 18699039 19216913 19563855 19728096 19653508 19254548
39534 19254548 18446142 17178828 15468818 13415577 11200321 9058850 7229795 5894811
39526 5894811 5136581 4932270 5180351 5744564 6497707 7353916 8283364 9306824 10472123
39517 10472123 11819937 13350823 15006636 16675163 18216544 19499442 20431791 20976117
39509 20976117 21146916 20992918 20571999 19930580 19096801 18086287 16910473 15579756 14103160
39500 14103160 12490739 10760908 8949238 7113440 5329853 3678513 2219533 971162
39492 971162 -98188 -1059382 -1999324 -2995096 -4093765 -5303649 -6599641 -7938473 -9272553
39483 -9272553 -10552288 -11718612 -12698830 -13417304 -13818532 -13887872 -13656503 -13190173 -12572429
39474 -12572429 -11892765 -11241581 -10707207 -10370267 -10294236 -10514181 -11028099 -11796783 -12755514
39465 -12755514 -13833431 -14970419 -16123464 -17262696 -18363439 -19400184 -20344612 -21166343
39457 -21166343 -21832903 -22305574 -22532373 -22445693 -21972282 -21053969 -19667409 -17830935 -15596596
39448 -15596596 -13035553 -10226891 -7254788 -4212243 -1204736 1654071 4258462 6534198
39440 6534198 8457413 10056179 11390265 12517542 13464768 14219218 14745249 15014692 15032186
39431 15032186 14840958 14506893 14091211 13628141 13120005 12549907 11900720 11168018 10363544
39422 10363544 9513597 8655180 7827477 7057639 6347798 5674020 5001207 4306755 3599998
39413 3599998 2927482 2362081 1981730 1847899 1993019 2420685 3115296 4053068 5206794
39404 5206794 6542441 8012421 9552264 11083155 12518236 13770906 14765470 15448449
39396 15448449 15795022 15807130 15507807 14939265 14165260 13270695 12353181 11508721 10816180
39387 10816180 10322639 10032134 9903831 9864132 9828669 9724133 9503406 9153953 8700219 8197268
39377 8197268 7713227 7303897 6988631 6737666 6477683 6115467 5570940 4805424 3833933
39368 3833933 2719888 1558664 457790 -481382 -1178420 -1584411 -1689344 -1527189 -1177111
39359 -1177111 -756733 -405142 -259349 -431806 -994430 -1969111 -3322531 -4966070 -6764862
39350 -6764862 -8557880 -10184755 -11511016 -12445423 -12947842 -13027923 -12733684 -12130182 -11274421
39341 -11274421 -10198027 -8906791 -7396102 -5672162 -3767583 -1745197 310177 2308051
39333 2308051 4169299 5835048 7262472 8412038 9238602 9697232 9763637 9457451 8854001
39324 8854001 8077865 7281926 6620038 6219102 6154139 6432815 6999009 7759488 8623365 9533268
39314 9533268 10471728 11443383 12448334 13462864 14433929 15284927 15929073 16289165 16321093
39305 16321093 16032677 15486920 14785674 14041827 13354676 12798496 12423413 12259750 12317267
39296 12317267 12577374 12984447 13445619 13843716 14059203 13992372 13580400 12809557 11723418
39287 11723418 10423982 9060968 7808112 6830645 6251336 6123610 6419147 7033720 7809756
39278 7809756 8570253 9156349 9458733 9432817 9093530 8495904 7713238 6820257 5880777 4937676
39268 4937676 4007238 3082519 2147459 1198270 264427 -581037 -1231291 -1576257 -1540868 -1110270
39258 -1110270 -328735 722948 1953692 3275674 4602202 5839882 6888527 7655055
39250 7655055 8075973 8135484 7868233 7345462 6653251 5874168 5077975 4319285 3637315 3055865
39240 3055865 2585254 2227020 1978313 1831657 1769771 1760797 1761051 1728119 1639734 1508086 1379411
39229 1379411 1316144 1369801 1559463 1867269 2250945 2663308 3067138 3440296 3773660 4067679
39219 4067679 4331128 4580933 4838728 5121514 5429274 5736924 5996392 6148013 6134922 5914575
39209 5914575 5465915 4794029 3933613 2949983 1934264 989985 211996 -335771 -634126
39200 -634126 -707085 -606094 -388347 -99398 234149 602221 1003226 1434756 1886082 2334873
39190 2334873 2749927 3099099 3357833 3512835 3559759 3499303 3336689 3084668 2765784 2410248
39180 2410248 2049995 1712575 1418730 1185303 1031407 981946 1062326 1284151 1631023 2057609
39170 2057609 2507846 2943581 3364810 3806629 4313729 4908536 5572202 6247760 6861112
39161 6861112 7347768 7673689 7843297 7892996 7873821 7831304 7791701 7759148 7721392 7658483 7551534
39150 7551534 7392113 7191520 6985160 6826929 6773973 6867503 7116024 7485449 7900265 8259419
39140 8259419 8465796 8460277 8246532 7894887 7522071 7254939 7194885 7398467 7877281 8606791
39130 8606791 9532743 10574568 11632968 12604575 13397742 13942458 14193867 14133106 13767407
39121 13767407 13128532 12268892 11255845 10164413 9068608 8033183 7109005 6333628 5734836
39112 5734836 5332551 5135681 5134989 5297460 5567889 5878471 6161164 6356557 6417950 6315212
39102 6315212 6043048 5631288 5147165 4680794 4317406 4113159 4090748 4255116 4613405 5182636
39092 5182636 5981260 7012348 8248188 9622616 11034389 12361807 13484349 14304135
39084 14304135 14761727 14844563 14587915 14067891 13387182 12657659 11986206 11467887 11184313
39075 11184313 11200088 11552470 12238640 13211721 14392202 15689495 17022532 18333638 19596644
39066 19596644 20818621 22030773 23269102 24556466 25899032 27296974 28756430 30291941
39058 30291941 31920718 33655512 35497154 37423254 39375332 41255199 42939123 44305302
39050 44305302 45260303 45753094 45775807 45356728 44550122 43425108 42055977 40516162 38874805
39041 38874805 37191417 35505646 33825378 32121456 30336458 28408278 26300754 24027628
39033 24027628 21656957 19292475 17042636 14996768 13221791 11775095 10714870 10092372
39025 10092372 9928397 10190811 10788752 11586517 12430037 13177014 13723899 14024243 14094432
39016 14094432 14006027 13866979 13795704 13893724 14224194 14801867 15593869 16525659 17488149 18347562
39006 18347562 18961969 19204800 18989759 18288840 17137174 15623966 13874244 12027744 10218723
38997 10218723 8558339 7122701 5951578 5058778 4447202 4118231 4070839 4294518 4763128
38988 4763128 5434073 6254178 7171935 8152133 9183602 10271067 11412159 12572959 13677981
38979 13677981 14620766 15289556 15598262 15514114 15073501 14377110 13560945 12751836 12025652
38970 12025652 11386071 10772585 10094170 9274064 8285270 7161013 5979397 4836484 3824585
38961 3824585 3022470 2492887 2280023 2403715 2852132 3577296 4499239 5523675 6572145
38952 6572145 7614053 8683989 9872403 11291880 13034489 15138336 17573775 20250489
38944 20250489 23041287 25814930 28466594 30934953 33202978 35289003 37235771 39098822
38936 39098822 40932569 42777373 44655715 46581279 48574521 50672137 52920272 55350121
38928 55350121 57945776 60623081 63237163 65620874 67635936 69210046 70343698 71089627
38920 71089627 71519946 71696876 71657718 71417441 70983154 70367145 69586648 68650517 67545193
38911 67545193 66233218 64667635 62816168 60686604 58345444 55920875 53582382 51499087
38903 51499087 49793294 48512050 47630610 47083378 46803251 46747647 46899030 47243307 47742190
38894 47742190 48318179 48862502 49263446 49442571 49382847 49136267 48807616 48521758 48387919
38885 48387919 48472567 48786632 49288889 49905512 50561405 51211297 51854785 52526116 53264157
38876 53264157 54080114 54941376 55779275 56514075 57081272 57444296 57588247 57501007 57154723
38867 57154723 56499341 55472413 54020957 52125908 49819522 47190117 44373737 41535699
38859 41535699 38845699 36450148 34447067 32871020 31694624 30847357 30244260 29811969
38851 29811969 29501250 29283893 29142381 29064924 29051531 29124619 29332131 29737605 30401586 31361768
38841 31361768 32616221 34113089 35752758 37406414 38945319 40266865 41306285 42033249
38833 42033249 42440019 42527862 42296241 41738755 40848529 39630766 38114723 36357095 34434759
38824 34434759 32431723 30427151 28488111 26666539 24998469 23503826 22185451 21027400
38816 21027400 19996084 19049365 18153055 17295139 16486607 15748395 15095567 14530216 14045219
38807 14045219 13633716 13298810 13058960 12943942 12978787 13161487 13447560 13752271 13971179
38798 13971179 14010217 13813533 13379383 12758759 12036833 11302907 10619405 10002642 9425165
38789 9425165 8839356 8208672 7526529 6811352 6084150 5347287 4579769 3750273 2836996
38780 2836996 1841197 787332 -288509 -1353342 -2384680 -3365216 -4269457 -5054197 -5661722
38771 -5661722 -6033153 -6120574 -5889178 -5311699 -4365128 -3036658 -1335797 697810 2999159
38762 2999159 5493803 8113978 10803195 13506698 16156642 18664631 20928268 22848916
38754 22848916 24352554 25405452 26019219 26244345 26156742 25844413 25398348 24906113 24445190
38745 24445190 24077461 23849631 23800791 23970642 24398762 25110606 26095166 27285845 28557025
38736 28557025 29743361 30678043 31234836 31355542 31053853 30400738 29502558 28478394 27437079
38727 27437079 26455923 25567999 24764321 24010143 23268266 22521053 21784586 21110648 20575570
38718 20575570 20259669 20224158 20492221 21039167 21794938 22659800 23529418 24320701 24987964
38709 24987964 25522328 25935531 26238372 26426695 26480625 26372167 26073695 25566244 24850350
38700 24850350 23956307 22943821 21886159 20847879 19871836 18981776 18192219 17513197 16946321
38691 16946321 16479132 16085707 15733469 15389350 15020355 14591574 14068343 13423965 12647459
38682 12647459 11746147 10744380 9682571 8616718 7614765 6748243 6081983 5664469 5517898
38673 5517898 5627283 5933146 6335801 6714921 6958903 6992688 6794570 6398768 5885357 5360570
38663 5360570 4931442 4680602 4647367 4818293 5127506 5467981 5716028 5765912 5561865 5112096
38653 5112096 4480009 3762233 3067524 2503187 2166662 2137462 2467187 3168459 4206429
38644 4206429 5498490 6926651 8361293 9688670 10832599 11763862 12496105 13072175 13548978
38635 13548978 13989187 14462105 15046613 15824486 16857732 18156073 19651174 21195264 22591627
38626 22591627 23647987 24230530 24295314 23886301 23106230 22076937 20906534 19675968 18449275
38617 18449275 17298932 16324756 15645035 15358366 15499588 16019779 16802247 17702428 18589964
38608 18589964 19377140 20027532 20545861 20956934 21286610 21554603 21777879 21975429 22168208
38599 22168208 22375586 22611084 22875886 23148302 23374585 23471945 23349108 22936855 22212694
38590 22212694 21206919 19988044 18635987 17217128 15774383 14337085 12942247 11649546
38582 11649546 10535487 9667109 9070465 8712991 8510155 8353433 8146546 7834044 7411153
38573 7411153 6914205 6401484 5937267 5584948 5405151 5451559 5762950 6356298 7224538 8336072
38563 8336072 9631722 11022152 12395805 13643192 14689949 15521380 16184294 16764047 17346469
38554 17346469 17980200 18654227 19298576 19805652 20061328 19973498 19490308 18606111 17358078
38545 17358078 15819327 14093491 12309665 10610986 9131735 7966923 7146549 6627498
38537 6627498 6309729 6073625 5824887 5526773 5203258 4912085 4704294 4593335 4547839 4505661
38527 4505661 4395872 4156665 3746504 3152231 2395350 1531350 636864 -212465 -963002
38518 -963002 -1593061 -2108995 -2531602 -2880439 -3162968 -3371312 -3484263 -3471281 -3298852 -2941247
38508 -2941247 -2393003 -1675499 -833075 77401 996295 1867643 2644667 3296437 3815201
38499 3815201 4222748 4572812 4944498 5423952 6080346 6949883 8037403 9331033 10814797
38490 10814797 12467740 14252653 16108723 17959761 19735542 21391748 22915124 24311961
38482 24311961 25587715 26726857 27680319 28368384 28704820 28636786 28180078 27426598 26516969
38473 26516969 25593601 24759666 24061462 23495432 23029270 22623639 22244672 21864516 21455420
38464 21455420 20987725 20438661 19807953 19127431 18454940 17855566 17383104 17071781 16937601
38455 16937601 16982669 17199464 17577598 18113203 18813238 19685369 20715616 21850527 23001438
38446 23001438 24071511 24987626 25716777 26260586 26636236 26855921 26912566 26774817 26392121
38437 26392121 25709086 24686552 23323960 21673719 19837669 17944297 16119121 14464566
38429 14464566 13053239 11924399 11076173 10461383 10000239 9609278 9229776 8839323 8444585
38420 8444585 8064388 7712893 7389517 7080081 6769328 6457025 6165611 5933547 5800066
38411 5800066 5792349 5920936 6181222 6556994 7025754 7567704 8177074 8869796 9680882 10649469
38401 10649469 11797041 13110334 14539970 16016658 17474642 18868147 20174180 21385021
38393 21385021 22495988 23491755 24335696 24970556 25335323 25391542 25143723 24641764 23964461
38384 23964461 23192946 22387018 21575006 20758730 19924663 19050812 18109038 17072358 15933316
38375 15933316 14726163 13537526 12495542 11740010 11386104 11496543 12071630 13056308 14355472
38366 14355472 15849370 17407850 18906744 20246799 21368819 22255925 22918893 23371438
38358 23371438 23610778 23616217 23364761 22849660 22087559 21111177 19954697 18640662 17173745
38349 17173745 15543708 13736936 11752007 9612403 7371464 5108587 2918157 894227
38341 894227 -884137 -2361542 -3507562 -4314388 -4795706 -4987413 -4946128 -4741226 -4440862
38332 -4440862 -4097656 -3740655 -3375847 -2992338 -2570604 -2092538 -1554489 -980744 -429624
38323 -429624 15560 271008 282445 45206 -396460 -968819 -1592841 -2198541 -2725675 -3118843
38313 -3118843 -3327833 -3317534 -3083009 -2660231 -2123250 -1564905 -1068281 -683457 -421964 -270430
38303 -270430 -212801 -245673 -376465 -606651 -914036 -1249469 -1551033 -1762719 -1840743 -1744530
38293 -1744530 -1427350 -844540 19195 1121566 2355096 3566335 4590169 5283131 5547913
38284 5547913 5348809 4717167 3743313 2554720 1287097 57606 -1053535 -2009919 -2812524
38275 -2812524 -3481975 -4038247 -4489314 -4833901 -5072868 -5219058 -5299459 -5350507 -5410439 -5511355
38265 -5511355 -5671639 -5889448 -6139196 -6373082 -6527694 -6533387 -6323950 -5845585 -5064875 -3974153
38255 -3974153 -2592284 -961103 859806 2797759 4770815 6690344 8460563 9976253
38247 9976253 11126528 11813452 11983380 11654778 10924601 9948878 8908233 7972552 7273123
38238 7273123 6885709 6827159 7066129 7542995 8190044 8944588 9753318 10571794 11365360 12114643
38228 12114643 12821155 13503912 14184071 14867104 15536711 16164535 16725840 17208223 17608752
38219 17608752 17923459 18135857 18210872 18099249 17752562 17140581 16259207 15124127 13757978
38210 13757978 12184647 10437228 8571935 6672674 4838104 3158432 1697415 488186
38202 488186 -461309 -1161956 -1639317 -1929246 -2071472 -2101610 -2041926 -1891793 -1622831 -1185415
38192 -1185415 -526995 386647 1558731 2962648 4553782 6284169 8112149 10002695
38184 10002695 11920209 13820550 15648422 17340781 18832867 20064703 20989295 21583692
38176 21583692 21859678 21866895 21683141 21394522 21075656 20779479 20537382 20362347 20248675 20168905
38166 20168905 20072472 19888454 19532688 18921228 17992122 16730097 15179952 13436486 11613495
38157 11613495 9809077 8085490 6469939 4969895 3592145 2357022 1302450 475440
38149 475440 -85916 -370148 -398332 -214538 130924 591779 1122912 1670952 2171360 2557969
38139 2557969 2777747 2798447 2605034 2192022 1560637 722271 -296027 -1447127 -2661705
38130 -2661705 -3852285 -4928114 -5818128 -6489334 -6947910 -7221914 -7336805 -7298447 -7093701
38121 -7093701 -6709612 -6160603 -5503985 -4827719 -4213387 -3697684 -3258677 -2835022 -2363622
38112 -2363622 -1812343 -1192583 -551145 50236 558455 948153 1229378 1438956 1618996
38103 1618996 1795969 1975313 2155142 2347721 2591794 2946317 3469067 4192854 5113143
38094 5113143 6193178 7380789 8623240 9869802 11063341 12131488 12987729 13545051
38086 13545051 13736942 13536785 12967280 12095414 11014397 9820105 8592809 7391978 6262842
38077 6262842 5245050 4374838 3681834 3187719 2908242 2850894 3002786 3315989 3703885
38068 3703885 4053096 4242819 4162142 3724422 2882573 1644269 78537 -1695668 -3539970
38059 -3539970 -5333729 -6997687 -8491672 -9794173 -10885037 -11744295 -12360201 -12731860 -12863225
38050 -12863225 -12758049 -12422951 -11873984 -11137627 -10244265 -9220434 -8086037 -6856528 -5545199
38041 -5545199 -4162145 -2712118 -1196687 377350 1988520 3597965 5156849 6620900
38033 6620900 7966136 9199498 10359366 11505007 12699906 13995774 15419670 16963089
38025 16963089 18574534 20161078 21602053 22771730 23564954 23920110 23832294 23349043 22549098
38016 22549098 21517304 20330688 19057054 17754213 16461239 15188115 13917259 12621174
38008 12621174 11285442 9920737 8556377 7222400 5935235 4697343 3509350 2385056
38000 2385056 1360497 492947 -151541 -520650 -599848 -422563 -55164 437246 1021974
37991 1021974 1705293 2511619 3452115 4504015 5610993 6701342 7713928 8620801 9436371
37982 9436371 10208042 10993356 11836898 12757647 13748002 14780897 15824193 16861449 17910551
37973 17910551 19026649 20283646 21742183 23417903 25259727 27143561 28885529 30274850
37965 30274850 31118085 31281172 30718011 29479449 27699847 25563154 23259687 20951492
37957 20951492 18758985 16766498 15032769 13594635 12464392 11630282 11066386 10746791
37949 10746791 10651969 10760614 11032343 11393899 11739092 11945354 11902796 11546283 10878306 9973666
37939 9973666 8965285 8017470 7293784 6924612 6979646 7451698 8256578 9249176 10251806
37930 10251806 11088309 11615968 11748229 11465439 10814344 9896889 8848291 7808520 6896856
37921 6896856 6197244 5753408 5567963 5604693 5798992 6077512 6377884 6656158 6879003 7011038
37911 7011038 7012195 6851925 6532969 6108696 5680756 5375193 5306177 5541376 6082676 6871132
37901 6871132 7814389 8821122 9822342 10771731 11635903 12390275 13022953 13535883 13935510
37892 13935510 14217302 14353188 14286251 13934991 13212235 12059697 10484061 8570136 6457533
37883 6457533 4292505 2182974 179376 -1714574 -3513645 -5224089 -6832139 -8310019
37875 -8310019 -9629528 -10770887 -11723456 -12484372 -13061248 -13477475 -13773145 -13996178 -14184304
37866 -14184304 -14345013 -14444601 -14415148 -14178464 -13675266 -12886028 -11837778 -10598553 -9261568
37857 -9261568 -7919896 -6637760 -5432375 -4279015 -3138203 -1988867 -847969 233014
37849 233014 1190729 1979245 2593343 3078107 3523037 4043044 4750935 5727854 6999954
37840 6999954 8529060 10220413 11943798 13559954 14944888 16008358 16705000 17036493
37832 17036493 17043730 16791946 16356328 15814805 15247690 14737079 14359724 14174437 14210782 14464253
37822 14464253 14897688 15445827 16022128 16530114 16880516 17009893 16891722 16533262 15961329
37813 15961329 15208876 14312611 13320051 12293941 11303726 10406039 9626959 8958419 8370731
37804 8370731 7831658 7318500 6815908 6303429 5744629 5088318 4284005 3305121 2169634
37795 2169634 949077 -238533 -1250813 -1952356 -2246700 -2099261 -1543040 -664329 425168
37786 425168 1616084 2816839 3954271 4966489 5797368 6398028 6734750 6797483 6600645
37777 6600645 6171739 5533883 4697275 3670867 2489095 1233649 31422 -973474 -1658041
37768 -1658041 -1949352 -1834694 -1356843 -602947 310061 1257058 2134920 2893459 3552641
37759 3552641 4195708 4939717 5894699 7124715 8621995 10303061 12031170 13658334 15068310
37750 15068310 16201121 17053111 17661632 18086221 18390668 18625937 18817217 18960558 19029414
37741 19029414 18985483 18789942 18416114 17863143 17163644 16378159 15579220 14836570 14211284
37732 14211284 13755110 13506853 13484997 13684132 14080642 14642927 15336008 16115927 16918674
37723 16918674 17651375 18190454 18389557 18100884 17210677 15679648 13569926 11042641 8325050
37714 8325050 5662118 3272513 1321114 -92308 -934703 -1234898 -1070349 -544977 235702
37705 235702 1183321 2235086 3353363 4518861 5720143 6945096 8180334 9417235
37697 9417235 10655356 11896803 13136062 14354873 15524619 16609710 17565843 18335271
37689 18335271 18847351 19030864 18836483 18259226 17348337 16198467 14926181 13641890 12427214
37680 12427214 11325037 10344805 9477565 8708513 8018653 7380138 6757434 6119452 5455236
37671 5455236 4781833 4139033 3573112 3116341 2772070 2514446 2303698 2107245 1913689
37662 1913689 1733836 1591918 1513296 1512985 1587304 1711062 1843120 1941085 1980361 1967644 1940395
37651 1940395 1952294 2052535 2267615 2590790 2982308 3381883 3729472 3984807 4136989 4202174
37641 4202174 4212464 4200451 4185539 4169404 4143325 4101274 4049710 4011461 4027111 4154630 4462485
37630 4462485 5012857 5839000 6926240 8205894 9567594 10888354 12067095 13047478 13817133
37621 13817133 14386157 14760436 14926959 14858857 14534883 13959749 13172772 12240881 11241260
37612 11241260 10243028 9295717 8427148 7646726 6946742 6298727 5651467 4940042 4105103
37603 4105103 3110110 1946968 634365 -781269 -2223471 -3595335 -4807853 -5813966
37595 -5813966 -6624852 -7296584 -7896642 -8470757 -9025549 -9530982 -9938694 -10207728 -10325952
37586 -10325952 -10315816 -10221641 -10087935 -9943574 -9799163 -9652114 -9489007 -9281799 -8984561 -8539163
37576 -8539163 -7889340 -6992939 -5823395 -4364029 -2608514 -575126 1674984 4034733
37568 4034733 6372550 8567618 10537622 12244585 13679841 14841104 15717518 16292248
37560 16292248 16559964 16545893 16312329 15948065 15547162 15187588 14917626 14753193 14684399 14685710
37550 14685710 14723400 14758585 14749851 14660006 14465697 14163386 13766606 13296712 12774899 12221155
37540 12221155 11657380 11106011 10579176 10064088 9517062 8873704 8071268 7071763 5876145
37531 5876145 4526102 3094486 1667823 327011 -865538 -1866251 -2639800 -3146958
37523 -3146958 -3341711 -3181992 -2649194 -1766590 -607979 707516 2034396 3229724 4183996
37514 4183996 4842518 5207718 5321608 5238192 5000034 4628678 4129993 3508972 2786284 2008650
37504 2008650 1246424 576155 53446 -311805 -564788 -792757 -1092589 -1531479 -2118067
37495 -2118067 -2797959 -3476338 -4057248 -4481782 -4749802 -4918754 -5083220 -5345107 -5785646
37486 -5785646 -6447060 -7326624 -8381442 -9539489 -10711633 -11800956 -12710188 -13351807 -13663416
37477 -13663416 -13623605 -13258788 -12636167 -11848112 -10997287 -10185668 -9502978 -9011945 -8737134
37468 -8737134 -8667541 -8773650 -9026593 -9405533 -9891384 -10456850 -11062578 -11660525 -12200371 -12637221
37458 -12637221 -12941467 -13109083 -13166648 -13167034 -13177227 -13262124 -13466072 -13793972 -14199437 -14591284
37448 -14591284 -14862307 -14928150 -14754163 -14355265 -13772725 -13045926 -12195910 -11225144 -10126876
37439 -10126876 -8895624 -7535619 -6069046 -4545131 -3045773 -1679899 -562940 211768
37431 211768 594938 584668 211455 -483160 -1460059 -2681891 -4102893 -5659719 -7271799
37422 -7271799 -8852165 -10322249 -11621724 -12708353 -13549514 -14111655 -14354301 -14233272 -13715625
37413 -13715625 -12805042 -11569005 -10151576 -8757332 -7606551 -6879851 -6676669 -7001541 -7776406
37404 -7776406 -8869163 -10129402 -11423526 -12660118 -13797541 -14833351 -15784169 -16667472
37396 -16667472 -17491672 -18253817 -18940707 -19529740 -19987647 -20267243 -20305290 -20027714 -19367569
37387 -19367569 -18293610 -16837097 -15100479 -13238863 -11419349 -9775405 -8376262 -7223112
37379 -7223112 -6268074 -5439220 -4656378 -3837235 -2905583 -1809595 -543309 843435 2254463
37370 2254463 3571805 4684223 5508859 5999722 6144930 5962431 5502002 4848646 4112994
37361 4112994 3402049 2782929 2262238 1793269 1302658 716736 -25588 -970259 -2142704
37352 -2142704 -3532482 -5075604 -6649838 -8091187 -9227541 -9919900 -10101826 -9805432 -9159829
37343 -9159829 -8356198 -7592350 -7022008 -6727217 -6714155 -6921780 -7236092 -7511189 -7600234 -7393014
37333 -7393014 -6848538 -6008564 -4984123 -3918688 -2942632 -2138322 -1530917 -1106785 -845572
37324 -845572 -743963 -816571 -1076502 -1511005 -2067767 -2658939 -3180409 -3536896 -3660990 -3519217
37314 -3519217 -3107925 -2447549 -1579403 -561089 544930 1688482 2846780 4029034 5267022
37305 5267022 6595313 8029920 9553461 11108818 12599144 13895232 14855821 15362029
37297 15362029 15354596 14854879 13956777 12791753 11482035 10102220 8666319 7145667 5506612
37288 5506612 3745378 1901288 46409 -1734339 -3356752 -4740510 -5810147 -6502959
37280 -6502959 -6783487 -6655974 -6167256 -5399045 -4452282 -3426639 -2400676 -1422070 -514617
37271 -514617 302735 999393 1531488 1855693 1949679 1829195 1555026 1226760 964393 883925
37261 883925 1075663 1591552 2442210 3600252 5005872 6572816 8195457 9759561 11158749
37252 11158749 12315191 13197844 13828290 14266959 14581982 14813721 14952445 14940625 14698586
37243 14698586 14160476 13302956 12153728 10778691 9258193 7666644 6063332 4491790
37235 4491790 2980140 1538743 158958 -1180712 -2500398 -3804778 -5079838 -6302590
37227 -6302590 -7453258 -8516593 -9470880 -10277781 -10887435 -11259331 -11384834 -11295261 -11049916
37218 -11049916 -10711600 -10324208 -9904878 -9453240 -8968905 -8464319 -7966753 -7513317 -7146363
37209 -7146363 -6911690 -6855790 -7017691 -7415132 -8029742 -8799085 -9623383 -10389524 -11004894 -11424864
37199 -11424864 -11658272 -11746851 -11730127 -11615898 -11372296 -10943674 -10278919 -9356581 -8198143
37190 -8198143 -6870614 -5482616 -4172934 -3086421 -2337231 -1970860 -1942880 -2126728 -2349235
37181 -2349235 -2439448 -2270937 -1782691 -976791 96435 1352883 2685265 3976017 5117468
37172 5117468 6034034 6694686 7108962 7311360 7346223 7262248 7115363 6969145 6881558 6877715
37162 6877715 6922806 6915259 6711564 6176208 5234264 3900548 2271312 485361 -1323012
37153 -1323012 -3057446 -4670088 -6151978 -7510653 -8745083 -9831050 -10726489 -11392421
37145 -11392421 -11812203 -11994241 -11959164 -11725029 -11303199 -10707670 -9971236 -9156876 -8353885
37136 -8353885 -7657132 -7139866 -6834660 -6728983 -6770950 -6878670 -6952212 -6890552 -6613048 -6081230
37126 -6081230 -5315300 -4398909 -3465158 -2661668 -2104557 -1841711 -1843715 -2025613 -2285440 -2538516
37116 -2538516 -2733224 -2847342 -2873856 -2806343 -2629591 -2317600 -1840458 -1179538 -344470 619272
37106 619272 1639827 2642342 3574494 4422193 5209705 5984995 6795801 7665818 8582038
37097 8582038 9500156 10365357 11136424 11798912 12360157 12830866 13207230 13466792 13580613
37088 13580613 13531867 13327870 13000440 12599451 12186323 11828391 11590917 11526544 11667806 12028216
37078 12028216 12609990 13409719 14415569 15599167 16911688 18289224 19662360 20961069
37070 20961069 22112923 23041284 23670176 23934716 23790239 23215380 22210484 20795661 19011186
37061 19011186 16919516 14606045 12175766 9745590 7434909 5356782 3608312 2256374
37053 2256374 1318609 747399 428573 202701 -92768 -572683 -1264606 -2101316 -2954689
37044 -2954689 -3697829 -4263181 -4665323 -4979979 -5297132 -5676494 -6124966 -6600283 -7033739
37035 -7033739 -7359575 -7538009 -7563436 -7457525 -7253347 -6977769 -6638268 -6220276 -5699143 -5062806
37025 -5062806 -4331696 -3561817 -2827886 -2197039 -1708705 -1370616 -1169935 -1089525 -1117532 -1244885
37015 -1244885 -1455395 -1718277 -1988940 -2215879 -2347708 -2337010 -2141849 -1726853 -1064552 -137445
37005 -137445 1057348 2499218 4133412 5866447 7576255 9138779 10461732 11508944
36997 11508944 12301252 12891369 13325179 13611286 13716982 13592677 13208838 12583233 11784736
36988 11784736 10914260 10073123 9331727 8709641 8173908 7656154 7082484 6405445 5625853
36979 5625853 4795296 3998822 3327869 2857754 2638057 2694252 3034463 3656844 4554854 5717308
36969 5717308 7121565 8723046 10448197 12196447 13851174 15294638 16420159 17138013
36961 17138013 17378081 17096585 16290254 15011601 13373768 11538586 9690974 8007772
36953 8007772 6629179 5640235 5068254 4895519 5077886 5557660 6266802 7126117 8048345
36944 8048345 8947922 9754000 10420773 10929982 11283692 11490306 11550446 11449118 11157633 10646490
36934 10646490 9908024 8981483 7965511 7004087 6246893 5803444 5714602 5951375 6433489
36925 6433489 7054156 7702584 8282101 8723168 8990004 9080374 9019727 8851764 8627580 8395470
36915 8395470 8193146 8043131 7950906 7904191 7872174 7806858 7652286 7364401 6933577 6393893
36905 6393893 5809511 5245781 4743943 4313708 3944230 3623695 3355099 3158369 3056346
36896 3056346 3053222 3121174 3206355 3251757 3223711 3128942 3016249 2963644 3055364 3355366 3885484
36885 3885484 4615502 5467896 6333624 7092164 7631661 7869768 7774893 7379930 6776023 6082436
36875 6082436 5405717 4810995 4320005 3931559 3646772 3482220 3465245 3616509 3929977 4360052
36865 4360052 4823048 5215385 5442933 5447786 5218465 4780422 4177413 3458425 2676376 1893287
36855 1893287 1181889 617332 259970 136619 230038 482818 814298 1142705 1403774 1560929
36845 1560929 1607148 1561578 1463262 1361475 1301758 1311652 1394826 1538257 1725907 1946138 2186840
36834 2186840 2424237 2616061 2705086 2632043 2352489 1850392 1143166 279185 -666403 -1595272
36824 -1595272 -2394320 -2954104 -3192320 -3069825 -2592091 -1800736 -764129 429818 1682342
36815 1682342 2897313 3997007 4933127 5687749 6265896 6687349 6983350 7195605 7370594
36806 7370594 7547799 7748446 7970747 8189776 8357408 8404206 8250353 7827103 7099962 6081987
36796 6081987 4832365 3442630 2014900 637261 -635532 -1786832 -2825767 -3766545
36788 -3766545 -4613540 -5359873 -5994851 -6509412 -6894440 -7137317 -7224862 -7152522 -6930672 -6581215
36778 -6581215 -6129427 -5602371 -5036962 -4486601 -4012549 -3659568 -3432024 -3289348 -3165549
36769 -3165549 -2998915 -2751129 -2405456 -1951481 -1373737 -655619 204361 1176808 2197994
36760 2197994 3182820 4049304 4743099 5249457 5587618 5795035 5914710 5991948 6074682 6207573
36750 6207573 6417320 6696685 6998867 7250743 7383849 7369407 7236701 7061899 6934041 6920143
36740 6920143 7049059 7317920 7710176 8210532 8808987 9497386 10268740 11125441 12090685
36731 12090685 13210335 14539132 16118066 17955323 20018482 22239013 24527100 26792114
36723 26792114 28960109 30980132 32818589 34449280 35847897 36994353 37880146 38514825
36715 38514825 38926585 39157088 39256542 39284858 39316914 39443321 39761577 40362351 41319953 42690439
36705 42690439 44513490 46813585 49600900 52875829 56639032 60902927 65696044 71054538
36697 71054538 77005768 83558893 90715406 98497690 106979105 116297753 126647370 138250988
36689 138250988 151327375 166057540 182553872 200830684 220773744 242107774 264363168
36682 264363168 286844783 308610447 328480272 345112173 357170605 363569875 363714233
36675 363714233 357635494 345972257 329811949 310468936 289271225 267397550 245779932
36668 245779932 225072358 205673721 187782088 171457025 156676868 143385750 131524938
36661 131524938 121043025 111887303 103987828 97246191 91533191 86692653 82547977 78911442
36653 78911442 75598967 72452022 69363104 66295025 63282610 60411306 57777855 55447376
36645 55447376 53423929 51645766 50004116 48372852 46634410 44695629 42496892 40019981
36637 40019981 37294707 34399013 31447174 28565774 25863808 23407466 21209163 19234615
36629 19234615 17424912 15725012 14106624 12574589 11154703 9873470 8744965 7770828
36621 7770828 6946091 6260838 5696501 5223419 4804559 4403972 3996017 3572700 3146928
36612 3146928 2748651 2413161 2166658 2017868 1960473 1982382 2073898 2232032 2465277 2800813
36602 2800813 3286125 3974338 4895310 6029969 7304677 8605906 9803069 10771008 11413231
36593 11413231 11686532 11618193 11303118 10877538 10479907 10215846 10139571 10255372 10536056 10951577
36583 10951577 11498062 12215075 13181689 14491430 16216825 18377754 20922647 23724849
36575 23724849 26593426 29296664 31594343 33272704 34175585 34225374 33427861 31858731 29637039
36566 29637039 26896476 23763422 20345447 16731989 13008423 9278535 5680994 2384379
36558 2384379 -441644 -2665153 -4221836 -5124843 -5454743 -5336023 -4907730 -4295470 -3591383
36549 -3591383 -2847070 -2080573 -1292785 -483551 342332 1182231 2049049 2978782 4023778
36540 4023778 5232983 6628465 8188294 9840621 11468869 12927273 14066908 14769425
36532 14769425 14979124 14719800 14087005 13217378 12247640 11280262 10368271 9520717 8719422
36523 8719422 7934646 7134161 6289909 5388645 4445922 3514628 2679177 2033936 1652546
36514 1652546 1558766 1709958 2002021 2296889 2461785 2401774 2072159 1471884 630187 -402704
36504 -402704 -1559798 -2762388 -3930924 -5001286 -5941904 -6766275 -7536436 -8354098 -9338061
36495 -9338061 -10591319 -12168400 -14056842 -16179690 -18412201 -20599640 -22571915 -24163337
36487 -24163337 -25244204 -25754587 -25719696 -25235551 -24434373 -23449686 -22393960 -21348485 -20359977
36478 -20359977 -19441923 -18582229 -17756736 -16943177 -16128069 -15303104 -14455160 -13558716 -12576846
36469 -12576846 -11469527 -10203160 -8757621 -7132895 -5357922 -3497050 -1642895 110411
36461 110411 1702648 3127625 4420695 5620528 6732744 7721563 8533857 9136668 9541792
36452 9541792 9802301 9986079 10145975 10305568 10465901 10624549 10794410 11013844 11343492
36443 11343492 11847366 12562790 13474660 14511792 15569219 16541956 17351371 17956818 18356685
36434 18356685 18583437 18692280 18743721 18785713 18842535 18912480 18971185 18977244 18879095 18623228 18163426
36423 18163426 17470869 16544348 15417118 14154196 12836238 11534634 10290874 9113030
36415 9113030 7991531 6923315 5929181 5056810 4373120 3953519 3870887 4182389 4913908
36406 4913908 6047466 7518771 9228232 11063353 12926299 14757119 16541529 18296950
36398 18296950 20042319 21768371 23425153 24931762 26200011 27158956 27771740 28043083
36390 28043083 28019011 27779952 27426887 27060656 26757397 26547269 26405811 26264515 26039296
36381 26039296 25665928 25126191 24451970 23705831 22949036 22213306 21488745 20731797 19889213
36372 19889213 18928401 17861238 16750064 15692991 14796113 14144535 13780442 13690967 13807121
36363 13807121 14015360 14181135 14179170 13922151 13379284 12578195 11588555 10493859 9364055
36354 9364055 8240142 7133253 6033255 4920820 3779495 2605685 1413910 235196
36346 235196 -890827 -1925656 -2836832 -3594366 -4163035 -4500707 -4568309 -4344461 -3831465
36337 -3831465 -3047857 -2016887 -763447 678535 2257602 3905304 5548132 7125536
36329 7125536 8605555 9990597 11310029 12602016 13891121 15169182 16386591 17460415
36321 17460415 18301460 18852616 19121405 19189339 19191597 19275507 19556267 20088805 20865573 21835520
36311 21835520 22928395 24069336 25181107 26183361 26998702 27565061 27845439 27828076 27518917
36302 27518917 26933502 26092903 25022877 23753957 22322498 20773675 19164100 17558673
36294 17558673 16019599 14593562 13306949 12172424 11199693 10400677 9787611 9370755 9160315
36285 9160315 9168119 9401199 9846678 10457427 11150500 11823271 12381035 12761935 12945884 12944862
36275 12944862 12785432 12498354 12120341 11699335 11291705 10949518 10706605 10573006 10539749
36266 10539749 10589098 10704351 10876235 11105340 11400316 11771641 12222485 12740878 13297372
36257 13297372 13848826 14345251 14737038 14982950 15059924 14972295 14754535 14463370 14161796 13903524
36247 13903524 13725798 13651334 13693470 13860245 14160355 14615240 15271311 16196480 17452075
36238 17452075 19052577 20939683 22988254 25038868 26936586 28557952 29821133 30685318
36230 30685318 31149020 31252314 31079431 30753126 30416087 30203546 30216893 30506548 31067655
36221 31067655 31847983 32764279 33721022 34626557 35405207 36006011 36406587 36608726 36625801
36212 36625801 36468537 36137492 35624836 34920866 34019843 32924507 31651735 30239050 28747362
36203 28747362 27255803 25849767 24607105 23586242 22817142 22295708 21983822 21816828 21716628
36194 21716628 21605394 21415600 21096822 20623264 20003391 19285392 18548142 17874317 17316154
36185 17316154 16872176 16487307 16075279 15551505 14861714 13995595 12984142 11888981 10793707
36176 10793707 9798192 9007599 8510072 8349097 8504727 8895383 9402718 9911695 10349003
36167 10349003 10700348 10997771 11287080 11596289 11919871 12220404 12442683 12535176 12471435 12260319
36157 12260319 11937773 11545540 11112591 10652844 10179877 9725972 9348851 9118225 9089802
36148 9089802 9284105 9682580 10239047 10894544 11585773 12247071 12813004 13227719 13459001
36139 13459001 13506427 13393361 13144585 12764672 12232593 11514584 10584834 9443340 8126975
36130 8126975 6712084 5305046 4019840 2950478 2151663 1635933 1384712 1363835 1535848
36121 1535848 1867197 2332409 2916391 3612784 4416438 5313238 6275174 7265487 8249646
36112 8249646 9203422 10114645 10983024 11822406 12663124 13548595 14524957 15628471 16875963
36103 16875963 18259942 19747926 21286013 22806379 24236391 25505990 26552299 27324075
36095 27324075 27789843 27950056 27847406 27566523 27219231 26920988 26768869 26827245 27120644
36086 27120644 27631952 28306470 29061358 29795590 30395286 30735388 30684282 30116886 28936040
36077 28936040 27096627 24623125 21610737 18206767 14580827 10899212 7312073 3949012
36069 3949012 914144 -1721337 -3923887 -5695882 -7069586 -8100012 -8855302 -9401175
36061 -9401175 -9781434 -10005207 -10052902 -9901663 -9554502 -9051687 -8456257 -7826703 -7198159 -6581634
36051 -6581634 -5973073 -5358996 -4715162 -4005107 -3185176 -2214875 -1066526 268794 1777190
36042 1777190 3418339 5125958 6818242 8418858 9880769 11201508 12422689 13614493
36034 13614493 14853017 16200989 17698579 19362443 21185291 23132228 25139837 27126381
36026 27126381 29011039 30728505 32227830 33460351 34373769 34925036 35108048 34978650 34659341
36017 34659341 34317640 34127147 34229069 34709436 35595593 36864808 38456826 40288856 42274564
36008 42274564 44342365 46440638 48521554 50510689 52282332 53658259 54433988 54423382
36000 54423382 53506176 51662504 48982602 45649039 41900166 37989796 34155717 30602055
35992 30602055 27493389 24954451 23069226 21877396 21371353 21498400 22168906 23266847
35984 23266847 24659006 26202557 27753645 29179468 30373290 31267640 31839586 32106205
35976 32106205 32114610 31931760 31633906 31292129 30955146 30637790 30322982 29975768 29559416 29043724
35966 29043724 28404071 27619332 26679371 25604173 24462269 23369701 22461500 21847996 21580117
35957 21580117 21640697 21959646 22435918 22950278 23367907 23543960 23343269 22668736 21480994
35948 21480994 19799415 17692014 15267450 12671114 10076170 7662999 5590841 3971024
35940 3971024 2850478 2211854 1992066 2112115 2504368 3126751 3963328 5016273 6292667
35931 6292667 7788687 9477065 11305056 13203943 15102883 16938458 18657557 20217208
35923 20217208 21584727 22736870 23655170 24319868 24710456 24817446 24657620 24277529 23738226
35914 23738226 23090996 22360698 21543814 20615243 19536169 18262891 16760815 15022603 13081938
35905 13081938 11013731 8919127 6902864 5054103 3437722 2095189 1048681 302945
35897 302945 -155546 -357922 -346821 -166289 145285 553323 1019479 1499869 1956865 2377547
35887 2377547 2781442 3206776 3682878 4208409 4749664 5257403 5689144 6024432 6268698
35878 6268698 6448444 6602335 6771347 6989700 7277768 7637482 8049936 8475369 8856961
35869 8856961 9129721 9233581 9127804 8803446 8290113 7652495 6974213 6333138 5778856
35860 5778856 5322713 4944060 4608686 4290366 3984381 3704876 3468130 3275446 3110156
35851 3110156 2950365 2785060 2620351 2473550 2362553 2298315 2282403 2306575 2350596 2378076
35841 2378076 2334997 2156459 1781000 1164388 285111 -858446 -2253107 -3873793 -5683884
35832 -5683884 -7633327 -9653833 -11653119 -13514596 -15109103 -16319613 -17072492 -17363835
35824 -17363835 -17268321 -16922899 -16488955 -16108244 -15870561 -15802728 -15876830 -16029689 -16186275 -16281989
35814 -16281989 -16279487 -16175803 -15997418 -15785068 -15574609 -15382781 -15205158 -15027513 -14843690 -14667653
35804 -14667653 -14529950 -14459493 -14462456 -14512005 -14554587 -14529178 -14391608 -14134412 -13790850 -13415357
35794 -13415357 -13046269 -12671990 -12222352 -11590744 -10674872 -9418243 -7838032 -6029406 -4142115
35785 -4142115 -2336834 -741076 574524 1591774 2320923 2773638 2947157 2826027 2398639
35776 2398639 1678393 716899 -398996 -1565395 -2684925 -3683118 -4510771 -5136686 -5542382
35767 -5542382 -5726714 -5716855 -5573820 -5383164 -5231543 -5179371 -5243266 -5398353 -5600864 -5819595
35757 -5819595 -6058295 -6356028 -6766527 -7329510 -8047927 -8877670 -9730209 -10488198 -11033557
35748 -11033557 -11281070 -11203372 -10835411 -10258268 -9572152 -8868712 -8208719 -7610415 -7054053
35739 -7054053 -6502229 -5925615 -5320174 -4709048 -4132226 -3631446 -3236831 -2960020 -2797255
35730 -2797255 -2742025 -2801095 -3003815 -3397042 -4026666 -4916048 -6053799 -7395504 -8873330
35721 -8873330 -10404356 -11894727 -13244578 -14359714 -15170772 -15653755 -15841679 -15817883 -15689429
35712 -15689429 -15551000 -15457161 -15416374 -15406184 -15396489 -15365933 -15305037 -15210626 -15080424 -14912314 -14706071
35701 -14706071 -14464003 -14190916 -13896201 -13597785 -13323480 -13105697 -12970031 -12922110 -12938575 -12967633
35691 -12967633 -12942171 -12802813 -12521658 -12114139 -11629911 -11123508 -10617894 -10080668 -9426767
35682 -9426767 -8545023 -7332614 -5722056 -3695904 -1291005 1408179 4289738 7243927
35674 7243927 10188116 13072693 15866427 18534363 21024101 23266865 25189471 26731022
35666 26731022 27861385 28598808 29019828 29252626 29450873 29755946 30262756 31002597 31946619
35657 31946619 33022794 34135399 35180988 36061779 36698322 37039351 37064988 36782982 36220423
35648 36220423 35412921 34394137 33192327 31839479 30387457 28914720 27511621 26250274
35640 26250274 25158307 24212122 23350682 22499591 21594330 20596956 19505149 18352481 17197554
35631 17197554 16103388 15116800 14260353 13539891 12956913 12512102 12196312 11976772 11789696
35622 11789696 11547076 11158284 10557367 9719947 8659050 7405695 5991983 4449383 2818920
35613 2818920 1159463 -456758 -1960467 -3301764 -4454209 -5405300 -6144857 -6662526 -6952374
35604 -6952374 -7014615 -6852738 -6475873 -5912526 -5226525 -4519467 -3913646 -3522977 -3424385 -3639799
35594 -3639799 -4134536 -4832100 -5639267 -6472760 -7279818 -8045144 -8777567 -9479121 -10114879
35585 -10114879 -10607248 -10862898 -10816982 -10469503 -9897990 -9245240 -8689159 -8404517 -8528451
35576 -8528451 -9140605 -10261446 -11862068 -13874680 -16198724 -18706560 -21255238 -23704331
35568 -23704331 -25932215 -27843289 -29366234 -30450172 -31065246 -31208748 -30912738 -30247058 -29313313
35559 -29313313 -28230414 -27118097 -26086090 -25230946 -24634918 -24359429 -24432071 -24835231 -25507128
35550 -25507128 -26358000 -27291088 -28212919 -29027898 -29628830 -29900002 -29737247 -29074245 -27901484
35541 -27901484 -26271886 -24293129 -22107604 -19863124 -17682538 -15642010 -13763373 -12021891
35533 -12021891 -10369593 -8770203 -7231653 -5816735 -4622751 -3741690 -3224921 -3070529
35525 -3070529 -3234563 -3654111 -4267492 -5023054 -5877202 -6788569 -7714579 -8610967 -9430731
35516 -9430731 -10121059 -10621916 -10871075 -10815487 -10422914 -9687128 -8624837 -7267805 -5654543
35507 -5654543 -3823121 -1805294 375124 2693970 5106913 7527557 9820546 11821193
35499 11821193 13376499 14388191 14837770 14785082 14345756 13660154 12865636 12077742 11379851
35490 11379851 10819507 10412211 10154200 10040398 10077001 10279278 10655558 11188862 11828872
35481 11828872 12499416 13117696 13615767 13953497 14116037 14098066 13886645 13456215 12780582
35472 12780582 11854533 10711544 9426557 8100674 6833192 5693024 4703004 3844434
35464 3844434 3077582 2364429 1680233 1009928 336232 -369546 -1146663 -2033398 -3049579
35455 -3049579 -4180872 -5373150 -6542066 -7595791 -8461399 -9102759 -9521358 -9739243 -9771893
35446 -9771893 -9605359 -9191719 -8467456 -7385658 -5945343 -4204985 -2277546 -312711 1525358
35437 1525358 3078853 4215176 4846907 4951798 4581881 3848489 2884004 1800534 669248
35428 669248 -472831 -1601029 -2683037 -3669573 -4496630 -5096765 -5414280 -5417730 -5105954
35419 -5105954 -4507725 -3675108 -2669729 -1546009 -342227 912698 2181898 3406675
35411 3406675 4505268 5383250 5951658 6151252 5979039 5505753 4870974 4252147 3818604
35402 3818604 3690415 3918762 4491618 5354264 6427963 7616130 8799854 9834035 10556182
35393 10556182 10813500 10503579 9613884 8240757 6574445 4851097 3288223 2029039
35385 2029039 1118457 519083 155642 -36838 -83354 33817 355587 914731 1704924 2662929
35375 2662929 3673099 4593349 5291048 5674470 5710814 5428471 4904324 4238542 3523569
35366 3523569 2819184 2145565 1497351 868954 274948 -245621 -641024 -866547 -901942 -758235
35356 -758235 -469797 -75322 400962 956031 1599724 2338713 3163170 4041871 4925040 5751162
35346 5751162 6454645 6973423 7256624 7271047 7004221 6464814 5685222 4728447 3691858
35337 3691858 2696091 1857636 1259396 936628 882405 1062896 1431800 1941022 2548726 3223808
35327 3223808 3944705 4693751 5451109 6191207 6882443 7490836 7987889 8359647 8611164
35318 8611164 8763498 8846400 8892009 8930881 8988579 9082978 9224923 9422019 9680336 10000050
35308 10000050 10367960 10753545 11111130 11385589 11519787 11465099 11194780 10714420 10062321
35299 10062321 9298079 8484608 7671784 6888783 6148634 5462514 4854726 4367546 4051478
35290 4051478 3945784 4058629 4353899 4748845 5126412 5364249 5373191 5126303 4659068 4038724
35280 4038724 3324049 2544164 1708129 831473 -45661 -863870 -1569106 -2140179 -2603248
35271 -2603248 -3025807 -3492664 -4074400 -4802151 -5659128 -6590431 -7523407 -8386849 -9120687
35262 -9120687 -9676053 -10013139 -10105899 -9956529 -9612395 -9171490 -8766176 -8527827 -8547764 -8852600
35252 -8852600 -9403254 -10114318 -10882570 -11612795 -12232432 -12691422 -12949649 -12960844 -12664674 -11994144
35242 -11994144 -10894824 -9344359 -7363105 -5017047 -2419635 267531 2845429 5107246
35234 5107246 6877751 8041239 8545212 8387493 7604579 6269607 4493314 2418090 204360
35225 204360 -1983375 -3985909 -5657804 -6882870 -7598402 -7818635 -7641975 -7232813 -6782905
35216 -6782905 -6468286 -6417662 -6699715 -7327384 -8272128 -9479957 -10882088 -12396500 -13923213
35207 -13923213 -15342703 -16527268 -17366362 -17794326 -17803954 -17437688 -16763493 -15851524 -14763578
35198 -14763578 -13555162 -12280493 -10991331 -9729299 -8520546 -7382147 -6339995 -5445839
35190 -5445839 -4778305 -4422960 -4441891 -4850938 -5616759 -6672153 -7937514 -9336335 -10800345
35181 -10800345 -12267391 -13676671 -14963676 -16056067 -16873515 -17335331 -17376588 -16967676 -16128695
35172 -16128695 -14931708 -13489603 -11936240 -10405334 -9014267 -7855353 -6993092 -6463771
35164 -6463771 -6274363 -6400820 -6788337 -7355381 -8000542 -8610620 -9070518 -9276267 -9149775
35155 -9149775 -8651146 -7785544 -6604104 -5198587 -3688694 -2203367 -860974 247250
35147 247250 1070388 1608275 1915078 2088610 2242790 2470893 2814647 3253791 3722165 4142541
35137 4142541 4460864 4660774 4753385 4754191 4665125 4472288 4157764 3716107 3164696 2540797
35127 2540797 1885549 1223058 545971 -184979 -1027603 -2036824 -3242937 -4637180 -6170679
35118 -6170679 -7768100 -9349231 -10846031 -12205813 -13382789 -14330327 -15004880 -15381356 -15469519
35109 -15469519 -15320871 -15023369 -14688313 -14434417 -14370241 -14574086 -15073941 -15836034 -16770980
35100 -16770980 -17757738 -18674267 -19420972 -19930791 -20168693 -20125179 -19806603 -19226334 -18403285
35091 -18403285 -17370142 -16183230 -14920701 -13664184 -12473894 -11373221 -10350215 -9370249
35083 -9370249 -8390183 -7370711 -6289129 -5151269 -3994251 -2873117 -1835847 -901690
35075 -901690 -56219 734650 1500047 2241149 2920102 3466163 3797374 3849159 3598374 3074416
35065 3074416 2355134 1549994 775004 125220 -347430 -642846 -804150 -896444 -984140 -1116998
35055 -1116998 -1327374 -1633949 -2045208 -2558509 -3155131 -3796205 -4426197 -4986274 -5431243
35046 -5431243 -5738849 -5904949 -5928904 -5800837 -5501129 -5013951 -4346033 -3535902 -2643928 -1728717
35036 -1728717 -828751 34088 830602 1500030 1948004 2073618 1811351 1163346 204777
35027 204777 -937108 -2115875 -3195131 -4066837 -4659833 -4942727 -4923535 -4645612 -4178384
35018 -4178384 -3604049 -3004950 -2455743 -2019019 -1739632 -1636870 -1699785 -1890852 -2157081 -2443788
35008 -2443788 -2707555 -2926400 -3103742 -3262232 -3427693 -3609410 -3786722 -3911299 -3928488 -3809464
34998 -3809464 -3575411 -3296508 -3064522 -2955776 -3006218 -3209873 -3536189 -3951856 -4433445 -4966033
34988 -4966033 -5532279 -6099417 -6609538 -6977927 -7105743 -6909366 -6356804 -5492165 -4434100
34979 -4434100 -3349356 -2413935 -1774981 -1521625 -1669338 -2159989 -2877443 -3676316 -4418683
34970 -4418683 -5008515 -5409993 -5640839 -5746467 -5773341 -5757626 -5728691 -5712191 -5719974 -5732299 -5692470
34959 -5692470 -5527358 -5183812 -4654394 -3973773 -3191170 -2341440 -1434944 -471173 534224
34950 534224 1527304 2414649 3086846 3454361 3476251 3168935 2595526 1845011 1011325 178791
34940 178791 -584670 -1229857 -1728530 -2076543 -2294727 -2424393 -2517271 -2621517 -2765920 -2947013
34930 -2947013 -3126415 -3243008 -3236082 -3068982 -2744044 -2305680 -1832039 -1415378 -1132548 -1013037
34920 -1013037 -1019039 -1051559 -985174 -717616 -210937 494034 1292722 2050047 2636744 2958524
34910 2958524 2974064 2700043 2201737 1570930 899994 265531 -270379 -647143 -797439 -657538
34900 -657538 -194701 564027 1519697 2514392 3364532 3901485 4006083 3629066 2795683 1595648
34890 1595648 160130 -1370244 -2877646 -4288233 -5575506 -6748477 -7834497 -8866961
34882 -8866961 -9882482 -10924007 -12040397 -13273832 -14635633 -16082834 -17512171 -18780584
34874 -18780584 -19746802 -20316833 -20473343 -20276293 -19836435 -19276855 -18701503 -18180898 -17751801
34865 -17751801 -17421672 -17173033 -16969508 -16765913 -16519866 -16199496 -15784479 -15262285 -14623199
34856 -14623199 -13856492 -12949511 -11891568 -10682549 -9341360 -7906905 -6428607 -4951433
34848 -4951433 -3504466 -2098998 -736088 580554 1831961 2976818 3953169 4688117
34840 4688117 5111520 5169949 4839874 4140216 3142576 1974254 808246 -162584 -763327
34831 -763327 -876355 -468928 401372 1607202 2993536 4427981 5840172 7233294 8662229
34822 8662229 10187240 11821929 13497237 15059556 16308597 17060166 17202487 16718226 15668109
34813 15668109 14156066 12299904 10216356 8013779 5784111 3594999 1490008 -498710
34805 -498710 -2331473 -3949841 -5284576 -6282131 -6935332 -7298627 -7476098 -7587139 -7728337
34796 -7728337 -7950188 -8254464 -8604121 -8934892 -9165526 -9211373 -9004840 -8517995 -7776126 -6852881
34786 -6852881 -5847339 -4854006 -3939886 -3136313 -2444051 -1846571 -1327601 -887926 -552002
34777 -552002 -356342 -323467 -438296 -643793 -858546 -1003991 -1025943 -903003 -644231 -281843
34767 -281843 137988 566460 964544 1311186 1601439 1835536 2008528 2110403 2136888 2100654
34757 2100654 2032679 1973907 1966951 2055613 2288523 2715557 3371798 4258000 5333187 6526689
34747 6526689 7762547 8982340 10156501 11282260 12371841 13436965 14475825 15466759
34739 15466759 16369502 17132892 17707194 18058374 18179749 18096009 17857289 17525258 17156364
34730 17156364 16787876 16430671 16070592 15678496 15227008 14707846 14140261 13564406 13023882
34721 13023882 12550295 12159708 11859477 11656575 11561262 11586415 11744958 12045985 12489271 13058847
34711 13058847 13717502 14405293 15046596 15568220 15923498 16109716 16168034 16166741 16179547 16270313
34701 16270313 16486024 16851720 17362653 17977537 18622693 19212926 19683068 20014174 20239121
34692 20239121 20424098 20636305 20914583 21255253 21614986 21923789 22099624 22060433 21734292
34683 21734292 21069469 20043607 18668707 16989157 15073583 13004802 10872646 8770986
34675 8770986 6795553 5036901 3565256 2409958 1542530 875803 287570 -335708 -1055605
34666 -1055605 -1864397 -2704000 -3505450 -4219761 -4823147 -5303621 -5647318 -5834176 -5839648 -5637620
34656 -5637620 -5205796 -4535267 -3639814 -2557948 -1346594 -71522 1201238 2413214 3521905
34647 3521905 4508396 5380873 6170593 6918285 7652998 8372582 9038743 9592858 9984715
34638 9984715 10197655 10258069 10229195 10197136 10255967 10493634 10977894 11743720 12786252 14062062
34628 14062062 15497081 16997085 18458505 19780309 20877349 21692664 22204571 22425330
34620 22425330 22390630 22142912 21715960 21129337 20395609 19533855 18578331 17575077 16567855
34611 16567855 15581503 14612398 13631630 12598696 11477412 10246919 8907011 7480602
34603 7480602 6013867 4571909 3229815 2062554 1137022 506996 210503 268985 686171
34594 686171 1444397 2500837 3791276 5246169 6812634 8468396 10217971 12073152
34586 12073152 14028647 16044829 18045495 19931350 21601869 22974087 23991675 24627186
34578 24627186 24884147 24799216 24436878 23871424 23161765 22332328 21370423 20241175 18913309
34569 18913309 17385411 15701765 13949960 12239756 10671300 9306017 8152973 7177079
34561 7177079 6324638 5551968 4842275 4206436 3675004 3290309 3100207 3149473 3466807 4050516
34551 4050516 4859099 5813516 6814789 7771681 8623549 9344550 9930069 10380975 10700723
34542 10700723 10905262 11031867 11133170 11255730 11417078 11598501 11758574 11854420 11851728 11717768
34532 11717768 11410642 10883006 10105148 9094126 7928258 6734016 5649511 4783884 4193878
34523 4193878 3885237 3829272 3979391 4280945 4677592 5118117 5562804 5986389 6377159 6733429
34513 6733429 7057796 7348994 7593175 7758722 7798454 7660118 7303028 6716984 5938153 5054288
34503 5054288 4191280 3479351 3010121 2805952 2819188 2961352 3143950 3307759 3428427 3502552
34493 3502552 3527301 3484363 3332222 3007724 2438618 1566362 371131 -1113847 -2806532
34484 -2806532 -4596114 -6369566 -8035658 -9539423 -10861655 -12003111 -12961985 -13718207
34476 -13718207 -14233338 -14464134 -14380702 -13980034 -13290027 -12363902 -11268237 -10069592 -8824902
34467 -8824902 -7579380 -6372058 -5243913 -4241063 -3408680 -2777782 -2351024 -2093509 -1933524
34458 -1933524 -1776217 -1527659 -1119343 -521745 256884 1181219 2201508 3263803 4316282
34449 4316282 5311420 6205899 6961923 7552005 7965457 8212595 8323021 8336075 8285303 8184207
34439 8184207 8022088 7771867 7402340 6885959 6201229 5335870 4294795 3109306 1839323
34430 1839323 563223 -642029 -1720034 -2642295 -3401238 -3997226 -4429976 -4697038 -4794816
34421 -4794816 -4718824 -4464628 -4030780 -3421235 -2644795 -1714312 -651012 505815 1691478
34412 1691478 2820772 3807797 4591853 5153949 5512850 5703134 5749919 5655746 5404479 4974981
34402 4974981 4353655 3540701 2552260 1422230 203107 -1038514 -2233591 -3324580 -4273869
34393 -4273869 -5063765 -5692242 -6170134 -6520530 -6777353 -6982289 -7183537 -7439345 -7822987
34384 -7822987 -8420051 -9310795 -10540195 -12089228 -13864088 -15712373 -17461846 -18966696
34376 -18966696 -20142985 -20979089 -21517516 -21818902 -21929411 -21869338 -21644168 -21263711 -20753833
34367 -20753833 -20155728 -19516398 -18874927 -18248292 -17622664 -16956759 -16198003 -15304442 -14262458
34358 -14262458 -13093316 -11846494 -10583739 -9363532 -8235368 -7243637 -6430172 -5825873
34350 -5825873 -5434408 -5220773 -5114651 -5028973 -4887064 -4648071 -4318167 -3938809 -3556668 -3194107
34340 -3194107 -2839731 -2463389 -2042887 -1584376 -1125961 -725593 -441727 -315259 -357021 -542361
34330 -542361 -815853 -1109924 -1374186 -1600958 -1829988 -2128226 -2558444 -3156860 -3930241 -4867580
34320 -4867580 -5953008 -7169675 -8494747 -9895025 -11332651 -12779639 -14227807 -15680485
34312 -15680485 -17127057 -18517710 -19757804 -20726926 -21310438 -21426003 -21035153 -20141026 -18778593
34303 -18778593 -17003538 -14885073 -12507166 -9978480 -7442841 -5076389 -3062268 -1548274
34295 -1548274 -606499 -215911 -276928 -649969 -1198526 -1818278 -2444559 -3043060 -3595109 -4087812
34285 -4087812 -4514058 -4880812 -5217663 -5574507 -6002885 -6528794 -7134881 -7765163 -8348783
34276 -8348783 -8826397 -9164914 -9357741 -9415762 -9354936 -9185707 -8910492 -8533332 -8076600 -7590758
34266 -7590758 -7145225 -6802787 -6593897 -6507666 -6503169 -6530290 -6545901 -6519337 -6431109 -6271955 -6045153
34255 -6045153 -5769350 -5477099 -5207266 -4995084 -4866580 -4839974 -4928084 -5133091 -5434032 -5779763
34245 -5779763 -6100297 -6334776 -6459579 -6499604 -6517712 -6588694 -6768699 -7071262 -7459095 -7854631
34235 -7854631 -8162948 -8295340 -8185013 -7794210 -7116815 -6179520 -5040819 -3784371 -2503748
34226 -2503748 -1280331 -162497 843620 1767751 2659647 3574472 4564646 5674619 6933009
34217 6933009 8343081 9878853 11491786 13123696 14715378 16204291 17514659 18550155
34209 18550155 19198053 19346995 18913593 17868597 16252169 14171191 11779721 9252505
34201 9252505 6763326 4472585 2518574 1004675 -17864 -564219 -719699 -630398 -480807
34192 -480807 -458559 -711029 -1308022 -2228574 -3379518 -4635681 -5881237 -7035642 -8059819
34183 -8059819 -8948841 -9721163 -10410913 -11063080 -11727970 -12453419 -13276337 -14214008 -15253518
34174 -15253518 -16341117 -17379785 -18242830 -18801369 -18954367 -18650511 -17898155 -16763581 -15357589
34165 -15357589 -13811497 -12248905 -10764717 -9422116 -8268867 -7361080 -6775481 -6598924
34157 -6598924 -6901632 -7712245 -9007329 -10713891 -12716840 -14868351 -17002340 -18955892
34149 -18955892 -20593067 -21822547 -22602117 -22928745 -22820492 -22301063 -21395558 -20137535 -18579894
34140 -18579894 -16800904 -14900822 -12989598 -11169497 -9518075 -8076752 -6848695 -5807679
34132 -5807679 -4916797 -4151229 -3515074 -3043032 -2785239 -2782700 -3044898 -3538550 -4190190 -4899350
34122 -4899350 -5556156 -6058547 -6327803 -6322254 -6046427 -5550794 -4920536 -4257913 -3664716 -3227214
34112 -3227214 -3001875 -3001719 -3188309 -3475755 -3747753 -3881583 -3771086 -3344797 -2579247 -1505635
34102 -1505635 -203960 1219264 2663473 4061598 5389858 6658250 7889800 9098578
34094 9098578 10274508 11380883 12366164 13183581 13807008 14236216 14494276 14623157 14677772
34085 14677772 14713866 14769279 14846001 14902006 14856454 14607009 14056535 13143862 11867843 10292457
34075 10292457 8529155 6705357 4933633 3291335 1813308 497831 -674693 -1716496
34067 -1716496 -2614606 -3333645 -3838029 -4115989 -4186357 -4085002 -3844816 -3485188 -3015202 -2444130
34057 -2444130 -1791633 -1094231 -406743 202442 661977 911122 912145 657876 172265 -494954
34047 -494954 -1274658 -2081472 -2815981 -3373331 -3660892 -3617168 -3221239 -2491075 -1478421 -265751
34037 -265751 1039158 2318807 3470611 4428661 5169726 5701119 6039587 6194244 6161674
34028 6161674 5933413 5510208 4915687 4203615 3456723 2778234 2277671 2051308 2159267
34019 2159267 2606798 3340430 4263632 5264797 6243746 7127061 7870778 8453109 8860355
34010 8860355 9071356 9049759 8752094 8150413 7256838 6133309 4877443 3590261 2343948
34001 2343948 1168619 64722 -969683 -1916601 -2734417 -3371614 -3785951 -3958893 -3903402
33992 -3903402 -3667134 -3329589 -2989130 -2740973 -2655217 -2764416 -3062864 -3513894 -4062231 -4649655
33982 -4649655 -5229341 -5772368 -6265279 -6705124 -7097949 -7458563 -7804787 -8144609 -8463211
33973 -8463211 -8718474 -8847297 -8778003 -8442954 -7789719 -6793061 -5468119 -3879309 -2136745
33964 -2136745 -377315 1263538 2678673 3805912 4630431 5173529 5473660 5569230 5490929
33955 5490929 5264373 4917871 4489387 4029466 3598843 3259770 3060472 3014723 3083810 3173133
33945 3173133 3152752 2897105 2324251 1415041 209066 -1210929 -2736043 -4250629 -5657967
33936 -5657967 -6906495 -8002829 -9002657 -9983965 -11015965 -12135359 -13334000 -14556619
33928 -14556619 -15707690 -16668799 -17326092 -17600989 -17472770 -16984641 -16232935 -15345075 -14453297
33919 -14453297 -13670396 -13073293 -12698440 -12549152 -12610214 -12861708 -13284049 -13851240 -14517901
33910 -14517901 -15211267 -15836343 -16293126 -16497913 -16400986 -15996639 -15323937 -14457333 -13487802
33901 -13487802 -12498131 -11539157 -10615583 -9688264 -8693610 -7572534 -6296775 -4882207 -3385075
33892 -3385075 -1884313 -458614 831665 1952299 2894583 3672281 4319603 4888770 5443543
33883 5443543 6047169 6747357 7564588 8490163 9495001 10542761 11598956 12633769 13623286
33874 13623286 14553619 15426121 16257617 17071642 17882675 18680800 19426255 20059357 20522014
33865 20522014 20778572 20823846 20675056 20354412 19873222 19226403 18401030 17395503 16239210
33856 16239210 15000902 13779789 12682938 11799039 11179043 10830383 10725146 10815193 11042685
33847 11042685 11338048 11608958 11734339 11576496 11012073 9968823 8450741 6540156 4375912
33838 4375912 2115843 -102913 -2191842 -4118531 -5894269 -7550163 -9113246 -10592024
33830 -10592024 -11975924 -13246180 -14389295 -15403501 -16295275 -17071626 -17735549 -18285936 -18717635
33821 -18717635 -19019249 -19172492 -19158505 -18970856 -18627940 -18176150 -17680050 -17202731 -16784725
33812 -16784725 -16431418 -16115391 -15792226 -15420863 -14978059 -14461741 -13884541 -13262571 -12605510
33803 -12605510 -11913712 -11184891 -10426240 -9662747 -8934960 -8288211 -7761514 -7382313 -7166399
33794 -7166399 -7118665 -7232736 -7492213 -7877516 -8377676 -8999640 -9766176 -10700784 -11808487
33785 -11808487 -13064298 -14414247 -15785190 -17097453 -18277465 -19268989 -20040009 -20581941
33777 -20581941 -20901255 -21008309 -20909993 -20610597 -20120536 -19467850 -18705888 -17912381 -17178673
33768 -17178673 -16591291 -16211387 -16059727 -16112955 -16310903 -16570184 -16800403 -16922090 -16884124 -16674223
33758 -16674223 -16316504 -15856651 -15341984 -14804640 -14252571 -13668699 -13015796 -12244271 -11301865
33749 -11301865 -10145656 -8754871 -7139838 -5343048 -3432594 -1490985 398206 2163007
33741 2163007 3750105 5123107 6256101 7131021 7741586 8097397 8220738 8136648 7863392
33732 7863392 7409329 6777651 5977299 5036055 4009258 2978002 2035665 1267645 731443
33723 731443 443393 376879 474467 671250 920423 1209544 1559729 2008456 2584854 3289296
33713 3289296 4085143 4903596 5658513 6267574 6674329 6861255 6844366 6651412 6300692 5799225
33703 5799225 5162223 4435910 3702216 3058788 2585769 2317335 2230983 2258698 2316019 2338393
33693 2338393 2310739 2278654 2337209 2601434 3168713 4086677 5339002 6852928 8520239
33684 8520239 10218098 11823061 13222500 14329483 15098374 15531010 15667140 15563261 15269947
33675 15269947 14815448 14198757 13393349 12361189 11073085 9528175 7766177 5869076
33667 5869076 3951046 2137337 537712 -775125 -1773463 -2468958 -2900712 -3123410 -3197841
33658 -3197841 -3185061 -3145775 -3142407 -3236163 -3474128 -3872230 -4406936 -5023091 -5653576 -6240076
33648 -6240076 -6746558 -7162709 -7498945 -7776716 -8018244 -8238208 -8438349 -8605551 -8714068
33639 -8714068 -8731634 -8628561 -8388921 -8021416 -7564146 -7077293 -6624525 -6252206 -5976494 -5782042
33629 -5782042 -5630939 -5479763 -5300807 -5097705 -4903919 -4761779 -4694395 -4688989 -4702665 -4687637
33619 -4687637 -4622728 -4535759 -4505588 -4640555 -5039806 -5752541 -6753205 -7944441 -9185434
33610 -9185434 -10329464 -11251733 -11859418 -12090974 -11917092 -11347590 -10436599 -9275750 -7974985
33601 -7974985 -6642215 -5373039 -4249051 -3332801 -2653215 -2192358 -1891666 -1681435 -1515080
33592 -1515080 -1383744 -1303462 -1288294 -1328898 -1386319 -1399402 -1300422 -1033785 -571213 84976
33582 84976 914089 1896506 3023468 4285797 5648099 7029531 8309153 9356097 10068543
33573 10068543 10402487 10379381 10071984 9575783 8978500 8340046 7688006 7024223 6334566
33564 6334566 5598144 4796709 3924329 2994388 2041163 1115889 278278 -416340 -933009
33555 -933009 -1271372 -1471188 -1604244 -1752671 -1979415 -2302451 -2687150 -3064758 -3368825 -3567318
33545 -3567318 -3670042 -3709237 -3709701 -3667819 -3547562 -3289811 -2829164 -2115719 -1138708 57265
33535 57265 1375465 2693524 3901385 4929123 5748857 6352574 6723257 6819074 6579610
33526 6579610 5948556 4898551 3444916 1643063 -426051 -2672895 -5010818 -7360665
33518 -7360665 -9652952 -11832555 -13866356 -15749255 -17502871 -19164984 -20773453 -22351877
33510 -22351877 -23903235 -25413190 -26860042 -28225846 -29502780 -30690203 -31782552 -32756231
33502 -32756231 -33568581 -34176042 -34563216 -34763641 -34857926 -34950844 -35140382 -35490890 -36015835 -36672336
33492 -36672336 -37369324 -37988769 -38413898 -38554815 -38363014 -37830796 -36977578 -35830888 -34412405
33483 -34412405 -32735748 -30814382 -28671724 -26346259 -23890224 -21364864 -18835042 -16363256
33475 -16363256 -14002959 -11793792 -9762788 -7932208 -6329061 -4989312 -3952692 -3248202
33467 -3248202 -2874096 -2780336 -2864875 -2990912 -3020017 -2845620 -2413197 -1723666 -823609 212884
33457 212884 1304683 2377607 3366626 4211272 4855500 5256752 5398124 5295027 4993530
33448 4993530 4561223 4070849 3579322 3112063 2664370 2220625 1777444 1354083 985080
33439 985080 703204 523526 434165 395954 353782 259461 96779 -106633 -288864 -378149
33429 -378149 -318393 -87691 290936 748874 1187860 1514205 1679274 1705521 1682827 1735343
33419 1735343 1973770 2454997 3166845 4041794 4987833 5917831 6764858 7482520 8037430
33410 8037430 8402082 8553071 8474511 8163112 7631764 6910690 6045297 5088251 4086169
33401 4086169 3068306 2046599 1026696 17711 -970670 -1940782 -2914296 -3922417 -4981422
33392 -4981422 -6067915 -7109832 -8001635 -8640107 -8965934 -8991531 -8801208 -8523408 -8288744
33383 -8288744 -8194007 -8287563 -8578263 -9055684 -9703779 -10497379 -11386840 -12288019 -13092306 -13695162
33373 -13695162 -14024969 -14052191 -13775236 -13199887 -12334318 -11205661 -9881582 -8472520 -7104989
33364 -7104989 -5880044 -4842808 -3979409 -3236952 -2548748 -1850355 -1085157 -207291 812141
33355 812141 1977493 3266375 4637433 6046472 7464585 8891487 10359636 11927220
33347 11927220 13660241 15607627 17778162 20129186 22570873 24980591 27218318 29139369
33339 29139369 30607636 31513133 31791574 31437846 30505085 29087159 27291146 25212271 22921895
33330 22921895 20470195 17896686 15240039 12542861 9851167 7210288 4660772 2239302
33322 2239302 -13138 -2040700 -3769551 -5118797 -6022709 -6453915 -6437142 -6049367 -5408952
33313 -5408952 -4657953 -3938927 -3366580 -2999902 -2826676 -2770032 -2715360 -2545667 -2172324 -1552863
33303 -1552863 -691990 372698 1590650 2909609 4271643 5603085 6814803 7819839
33295 7819839 8559426 9021162 9238556 9272158 9182156 9006819 8757967 8433499 8035222 7577728
33285 7577728 7082930 6566706 6028837 5453020 4815508 4095382 3279728 2362144 1339057
33276 1339057 210663 -1010219 -2285462 -3544775 -4693680 -5637258 -6310333 -6699614 -6847154
33267 -6847154 -6834312 -6754380 -6685387 -6671859 -6718273 -6791479 -6827742 -6742681 -6445285 -5856095 -4925182
33256 -4925182 -3643210 -2042129 -188540 1823679 3877672 5837653 7559961 8915127
33248 8915127 9815173 10232486 10199620 9791952 9105399 8239425 7285589 6316443 5373785 4461869
33238 4461869 3551509 2595504 1550415 396943 -849585 -2144262 -3430111 -4655716
33230 -4655716 -5780161 -6763626 -7554764 -8088274 -8296667 -8129115 -7566732 -6628816 -5371756
33221 -5371756 -3884523 -2280633 -682760 800442 2096566 3177941 4051283 4735976
33213 4735976 5243655 5567067 5680045 5548298 5148728 4489215 3617100 2610352 1557723
33204 1557723 540698 -375154 -1141427 -1725599 -2107577 -2272167 -2200888 -1872628 -1278086
33195 -1278086 -439461 581104 1693167 2803199 3839784 4770022 5604840 6391912 7195417
33186 7195417 8067657 9024250 10033641 11023496 11898958 12565145 12947406 13005696 12743332
33177 12743332 12211868 11510554 10774428 10147315 9745519 9626316 9774789 10113755 10531104
33168 10531104 10912070 11163931 11227361 11077788 10724060 10207634 9599081 8987385 8462324
33159 8462324 8095314 7924799 7949379 8129240 8395691 8667618 8870696 8952280 8886220 8667686
33149 8667686 8303350 7802642 7173523 6424599 5573363 4655265 3724490 2842148 2058717
33140 2058717 1403141 884406 500604 246801 116665 97187 158360 242676 261704 104689
33130 104689 -341691 -1166877 -2407855 -4024747 -5891005 -7808421 -9547500 -10900865 -11731520
33121 -11731520 -12001311 -11771627 -11174698 -10362637 -9453234 -8498156 -7490241 -6403830 -5241534
33112 -5241534 -4058872 -2955206 -2040637 -1398737 -1061406 -1002284 -1146510 -1389850 -1618863
33103 -1618863 -1726502 -1623338 -1249339 -589927 307777 1330259 2315104 3089895 3518602
33094 3518602 3537359 3168287 2509945 1709268 922900 278541 -151989 -360318 -389966 -312700
33084 -312700 -201984 -111316 -61796 -39292 367 118991 377095 813526 1433569 2212310
33074 2212310 3108497 4075812 5063347 6009983 6843915 7492343 7895422 8015052 7835466
33065 7835466 7360850 6616159 5650151 4532693 3340449 2135745 951960 -204644 -1340071
33056 -1340071 -2458729 -3561981 -4657251 -5764891 -6911634 -8111945 -9350051 -10576346
33048 -10576346 -11722346 -12726631 -13558127 -14225285 -14768023 -15238406 -15680300 -16115699 -16540343
33039 -16540343 -16928351 -17244429 -17458743 -17555902 -17532571 -17388696 -17124327 -16748257 -16291394 -15811566
33029 -15811566 -15383179 -15076783 -14939657 -14986464 -15202268 -15552756 -15992709 -16467256 -16909703
33020 -16909703 -17245572 -17407788 -17356669 -17092185 -16650837 -16089583 -15465221 -14817331 -14160195
33011 -14160195 -13486325 -12779480 -12029581 -11241383 -10435583 -9647545 -8926275 -8328306 -7900578
33002 -7900578 -7656844 -7561732 -7533199 -7461872 -7237699 -6775597 -6036011 -5037803 -3860155 -2630075
32992 -2630075 -1494579 -583585 21599 298256 267542 -31178 -560191 -1292849 -2218199
32983 -2218199 -3343020 -4686497 -6265427 -8076437 -10083085 -12209884 -14342827 -16339081
32975 -16339081 -18048072 -19339351 -20127603 -20387576 -20156668 -19525097 -18615580 -17558509 -16470531
32966 -16470531 -15440506 -14521433 -13726680 -13032375 -12389551 -11746263 -11072995 -10378269 -9701877
32957 -9701877 -9085345 -8537157 -8017068 -7450572 -6762220 -5905889 -4877579 -3710422 -2459666
32948 -2459666 -1185683 59041 1235844 2319188 3292774 4146178 4873926 5477319 5968668
32939 5968668 6376256 6745710 7131630 7576540 8083194 8595368 9002181 9169003 8982318
32930 8982318 8388523 7411881 6148714 4744515 3363733 2159792 1249432 694035 491355
32921 491355 581014 863912 1230486 1588712 1882251 2093313 2232960 2328512 2416337 2538535
32911 2538535 2735060 3027861 3405151 3817503 4188897 4435755 4484897 4285009 3809380 3050104
32901 3050104 2007955 684599 -918611 -2795736 -4927324 -7269510 -9745532 -12246659
32893 -12246659 -14646192 -16821628 -18674935 -20143736 -21202284 -21855155 -22128937 -22068587 -21741709
32884 -21741709 -21244879 -20699876 -20233079 -19944642 -19882229 -20030771 -20321268 -20655199 -20936514
32875 -20936514 -21098881 -21116585 -20997198 -20765927 -20453853 -20093435 -19715878 -19345372 -18991434
32866 -18991434 -18643990 -18274335 -17842280 -17307769 -16643443 -15843921 -14929808 -13947722 -12967646
32857 -12967646 -12075547 -11358050 -10880616 -10668102 -10699185 -10920011 -11270832 -11711060 -12229803
32848 -12229803 -12839224 -13557783 -14392689 -15327308 -16315822 -17285589 -18145417 -18796903 -19148560
32839 -19148560 -19134853 -18737391 -17995814 -16995434 -15834257 -14590321 -13311445 -12031225 -10795333
32830 -10795333 -9678011 -8779129 -8204197 -8034965 -8299418 -8952135 -9876963 -10916925 -11920952
32821 -11920952 -12785067 -13469086 -13986680 -14381596 -14704819 -14999886 -15296636 -15611234 -15949566
32812 -15949566 -16310736 -16688700 -17072936 -17450509 -17810726 -18150941 -18479192 -18808301 -19139896
32803 -19139896 -19445549 -19658412 -19684660 -19431180 -18835496 -17883880 -16611650 -15088046 -13392735
32794 -13392735 -11592298 -9724276 -7793518 -5781016 -3660582 -1416390 944014 3383181
32786 3383181 5833651 8204631 10395243 12311410 13882076 15072322 15892251 16397747
32778 16397747 16677211 16824307 16907213 16948315 16920586 16757549 16371881 15680771 14635797 13249518
32768 13249518 11606875 9852857 8157878 6673305 5494506 4644644 4082029 3723552
32760 3723552 3471364 3231309 2919507 2464090 1812971 949703 -94213 -1244910 -2411236
32751 -2411236 -3516311 -4519488 -5420070 -6243336 -7017172 -7753354 -8445480 -9082399 -9662276
32742 -9662276 -10193324 -10681529 -11116796 -11466710 -11679399 -11694184 -11459551 -10955432 -10211189 -9309116
32732 -9309116 -8368857 -7517467 -6857512 -6447020 -6298308 -6390929 -6686300 -7134408 -7673042 -8227320
32722 -8227320 -8716258 -9066780 -9229564 -9189195 -8963588 -8592932 -8123243 -7590672 -7010311 -6371197
32712 -6371197 -5639968 -4775893 -3755332 -2595024 -1360238 -151881 919546 1758769 2300866
32703 2300866 2517714 2419176 2048944 1473757 768122 -846 -785077 -1561796 -2332172 -3111584
32693 -3111584 -3915335 -4746505 -5589753 -6410237 -7155928 -7763518 -8167887 -8312378 -8156092
32684 -8156092 -7676431 -6868256 -5743262 -4333405 -2698147 -928286 863536 2567314
32676 2567314 4103612 5438708 6579443 7553214 8384645 9078969 9617814 9968192 10099813
32667 10099813 10002301 9695349 9229234 8676107 8114108 7608902 7199712 6895269 6679470
32658 6679470 6522072 6389121 6249739 6077997 5851263 5548443 5150893 4645829 4030828
32649 4030828 3319075 2544385 1761659 1038422 440029 17730 -195407 -186919 25035 376347
32639 376347 751586 1001376 978375 574154 -258466 -1500468 -3073266 -4851750 -6683108
32630 -6683108 -8411554 -9905687 -11081452 -11912229 -12419754 -12645983 -12616726 -12316593 -11692483
32621 -11692483 -10686220 -9276997 -7507578 -5480711 -3332444 -1200529 797293 2571211
32613 2571211 4058540 5221449 6046740 6545204 6745903 6685584 6400287 5925815 5304498
32604 5304498 4587861 3828461 3065564 2316336 1580163 854058 149788 -497832 -1036920
32595 -1036920 -1414989 -1595068 -1562601 -1323601 -900123 -324911 368633 1160514 2051492 3052998
32585 3052998 4163815 5351740 6554511 7697206 8712234 9552051 10193710 10636584 10892112
32576 10892112 10966868 10847837 10501250 9887788 8984745 7801473 6380773 4788766 3101301
32567 3101301 1394463 -257657 -1780353 -3096984 -4134308 -4834950 -5172671 -5164710 -4876707
32558 -4876707 -4416863 -3917516 -3506637 -3278147 -3272840 -3477036 -3837087 -4281497 -4741943 -5167205
32548 -5167205 -5526764 -5804089 -5984933 -6050137 -5980042 -5767984 -5431355 -5009188 -4545883 -4072437
32538 -4072437 -3599227 -3125561 -2657492 -2217915 -1838776 -1540401 -1314376 -1123012 -914181
32529 -914181 -640006 -270387 199587 746853 1323852 1869714 2324435 2637414 2766793 2675479
32519 2675479 2333670 1732341 901586 -80022 -1097014 -2029146 -2789376 -3348601 -3736878
32510 -3736878 -4023992 -4290116 -4599105 -4985146 -5456835 -6011062 -6641102 -7328925 -8027836
32501 -8027836 -8652390 -9088531 -9222857 -8977668 -8334944 -7338368 -6074544 -4645235 -3144199
32492 -3144199 -1645106 -199382 1159377 2407360 3523493 4489779 5302015 5985726 6606093
32483 6606093 7261687 8060026 9083383 10359970 11853394 13472881 15095966 16592083
32475 16592083 17840738 18745255 19245854 19332650 19053480 18508913 17830388 17145226 16539259
32466 16539259 16030441 15564646 15037562 14334971 13373959 12128446 10633950 8977367 7279440
32457 7279440 5674265 4289924 3235265 2593346 2415603 2712905 3450008 4553818 5934695
32448 5934695 7505844 9186761 10893189 12530186 14002138 15237273 16209977 16944029
32440 16944029 17493052 17910419 18227264 18449977 18574280 18603277 18558012 18477075 18408347 18397140
32430 18397140 18473542 18641880 18876427 19126493 19330305 19434033 19411415 19278571 19096790 18957922
32420 18957922 18955100 19150325 19551387 20104095 20700256 21200963 21472961 21428605 21053062 20404723
32410 20404723 19587048 18704068 17819630 16938824 16019432 15005754 13864972 12605854 11272263
32401 11272263 9920972 8602322 7356469 6221955 5241222 4450649 3858373 3426384 3071891
32392 3071891 2689607 2184129 1498774 632303 -358401 -1367804 -2260171 -2893868 -3148068
32383 -3148068 -2947878 -2283850 -1221791 102192 1506192 2805486 3862128 4621789 5122648
32374 5122648 5474568 5819570 6289800 6977193 7922488 9122142 10543682 12138195 13844311
32365 13844311 15586109 17272559 18805650 20098562 21096789 21790799 22214086 22430883 22521840
32356 22521840 22570141 22645095 22784881 22988245 23222692 23443449 23608597 23681697 23626709 23405926
32346 23405926 22986035 22348746 21498879 20464758 19289850 18019120 16686587 15309544
32338 15309544 13889631 12417002 10876154 9256919 7572488 5876364 4263345 2847745
32330 2847745 1729673 969182 578881 530299 764679 1205774 1776178 2412832 3071618
32321 3071618 3717113 4306929 4785190 5090838 5173625 5006814 4591498 3954130 3139915 2202600
32311 2202600 1191395 139230 -941507 -2052803 -3197395 -4364246 -5519184 -6604933
32303 -6604933 -7552544 -8301402 -8818225 -9103479 -9181411 -9081590 -8824103 -8414380 -7845837 -7106640
32293 -7106640 -6189001 -5099403 -3866457 -2543538 -1205447 61420 1177129 2093477
32285 2093477 2818331 3425842 4042882 4812778 5848526 7193852 8808806 10586527 12392660
32276 12392660 14107242 15649780 16981582 18094754 19002203 19734921 20341547 20882094 21414372
32267 21414372 21978977 22588997 23226295 23844615 24380963 24774346 24983493 24991900 24797753 24401094
32257 24401094 23804724 23031583 22142767 21236183 20420839 19781624 19356025 19134111 19077057
32248 19077057 19139903 19285088 19481678 19696204 19888125 20019379 20073615 20068366 20045815 20044432
32238 20044432 20069205 20079080 19997816 19740480 19241393 18472079 17446197 16216196 14867929
32229 14867929 13513816 12279559 11281191 10597486 10249159 10194650 10344197 10585520 10810602
32220 10810602 10934653 10903297 10689237 10283277 9686203 8906899 7967410 6909588 5795507
32211 5795507 4697708 3682273 2792328 2039468 1406826 861771 371618 -83983 -505995
32202 -505995 -874209 -1153796 -1314351 -1356864 -1332065 -1333963 -1468996 -1818995 -2418745 -3256214
32192 -3256214 -4288405 -5459077 -6708000 -7970810 -9177005 -10254468 -11142188 -11805682
32184 -11805682 -12248465 -12515306 -12684388 -12847164 -13080173 -13419264 -13846346 -14291765 -14649963
32175 -14649963 -14805744 -14667332 -14195951 -13416354 -12399418 -11225922 -9955420 -8621286 -7252864
32166 -7252864 -5903879 -4660794 -3620254 -2848663 -2350535 -2066290 -1901233 -1769532 -1630318
32157 -1630318 -1499308 -1433328 -1498899 -1742427 -2175852 -2780894 -3523614 -4365578 -5262261 -6151799
32147 -6151799 -6948366 -7552978 -7879370 -7877295 -7536395 -6870324 -5896432 -4626540 -3072359
$$ [...]
##END NTUPLES=NMR SPECTRUM
##END=
