##TITLE=31Pdec_DE-36-oil_D2O
 D2O
 24 sc
 4.3.2024
##JCAMPDX= 6.0         $$ Bruker NMR JCAMP-DX V2.0
##DATA TYPE= NMR SPECTRUM
##DATA CLASS= NTUPLES
##ORIGIN= UXNMR, Bruker Analytische Messtechnik GmbH
##OWNER= root
$$ XWIN-NMR		Version 3.5
$$ Mon Mar  4 16:17:56 2024 Russian Standard Time (UT+4h)  she@DPX200
##.OBSERVE FREQUENCY= 81.013821
##.OBSERVE NUCLEUS= ^31P
##.ACQUISITION MODE= SIMULTANEOUS
##.ACQUISITION SCHEME= undefined
##.AVERAGES= 24
##.DIGITISER RES= 16
##SPECTROMETER/DATA SYSTEM= spect
##.PULSE SEQUENCE= zgpg30
##.SOLVENT NAME= D2O
##.SHIFT REFERENCE= (INTERNAL, D2O, 0, 248.564)
##AUDIT TRAIL= $$ (NUMBER, WHEN, WHO, WHERE, WHAT)
$$ ##TITLE= Audit trail, XWIN-NMR		Version 3.5
$$ ##JCAMPDX= 5.01
$$ ##ORIGIN= Bruker BioSpin GmbH
$$ ##OWNER= she
$$ F:/spectra/data/she/nmr/P31/1/pdata/1/auditp.txt
$$ ##AUDIT TRAIL=  $$ (NUMBER, WHEN, WHO, WHERE, WHAT)
(   1,<2024-03-04 16:16:45.03 +0400>,<she>,<DPX200>,
      <created by zg, POWCHK disabled, PULCHK disabled
       configuration hash MD5:
       00 E9 B6 7A A2 85 ED C7 34 08 36 98 17 FE 4E 26
       data hash MD5: 32K
       76 68 30 55 40 73 F1 DC 24 23 EE DD D9 73 AB 40>)
(   2,<2024-03-04 16:16:47.46 +0400>,<she>,<DPX200>,
      <Start of raw data processing
       efp BC_mod = 2 LB = 10 FT_mod = 6 PKNL = 1 PHC0 = -12766.82 PHC1 = -156.1166 SI = 64K 
       data hash MD5: 64K
       D2 49 BA F3 0C 32 AE B2 AA 88 76 35 69 B0 87 F2>)
(   3,<2024-03-04 16:17:09.93 +0400>,<she>,<DPX200>,
      <pk PHC0 = 34.77134 PHC1 = -133 
       data hash MD5: 64K
       D3 44 35 D4 A7 E7 55 6C AA 98 96 9E 05 E5 B0 87>)
(   4,<2024-03-04 16:17:13.71 +0400>,<she>,<DPX200>,
      <abs ABSG = 5 
       data hash MD5: 64K
       30 30 33 3F 8A 7E 05 92 70 A4 F2 F8 C0 0A AA 04>)
$$ ##END=
$$ 
$$ hash MD5
$$ E9 DC 27 09 8A 12 C5 1E 97 16 C0 69 DF E9 44 AC
##$RELAX= 
##$RELAX= 
##$RELAX= 
##$RELAX= 
##$RELAX= 
##$RELAX= 
##$RELAX= 
##$RELAX= 
##$RELAX= 
$$ Bruker specific parameters
$$ --------------------------
##$DU= <F:/spectra>
##$EXPNO= 1
##$NAME= <P31>
##$PROCNO= 1
##$TYPE= <nmr>
##$USER= <she>
##$AMP= (0..31)
100 100 100 100 100 100 100 100 100 100 100 100 100 100 100 100 100 100 
100 100 100 100 100 100 100 100 100 100 100 100 100 100 
##$AQSEQ= 0
##$AQ_mod= 1
##$AUNM= <au_zg>
##$AUTOPOS= <>
##$BF1= 81.014009
##$BF2= 200.13
##$BF3= 200.13
##$BF4= 200.13
##$BF5= 200.13
##$BF6= 200.13
##$BF7= 200.13
##$BF8= 200.13
##$BYTORDA= 1
##$CFDGTYP= 0
##$CFRGTYP= 5
##$CHEMSTR= <none>
##$CNST= (0..31)
1 1 145 1 1 1 1 1 1 1 1 1 1 1 1 1 1 1 1 1 1 1 1 1 1 1 1 1 1 1 1 1 
##$CPDPRG= <waltz16>
##$CPDPRG1= <>
##$CPDPRG2= <waltz16>
##$CPDPRG3= <>
##$CPDPRG4= <mlev>
##$CPDPRG5= <mlev>
##$CPDPRG6= <mlev>
##$CPDPRG7= <mlev>
##$CPDPRG8= <mlev>
##$CPDPRGB= <>
##$CPDPRGT= <>
##$D= (0..31)
0 1 0 0 0 0 0 0 0 0 0 0.03 2e-05 3e-06 0 0 0 0 0 0 0 0 0 0 0 0 0 0 0 0 
0 0 
##$DATE= 1709554604
##$DBL= (0..7)
120 120 120 11 120 120 24 19 
##$DBP= (0..7)
150 150 150 150 150 150 150 150 
##$DBP07= 0
##$DBPNAM0= <>
##$DBPNAM1= <>
$$ [...]
##$SUBNAM3= <"">
##$SUBNAM4= <"">
##$SUBNAM5= <"">
##$SUBNAM6= <"">
##$SUBNAM7= <"">
##$SUBNAM8= <"">
##$SUBNAM9= <"">
##$SW= 501.771253377433
##$SWIBOX= (0..15)
0 1 3 0 0 0 0 0 0 0 0 0 0 0 0 0 
##$SW_h= 40650.406504065
##$TD= 32768
##$TD0= 1
##$TE= 0
##$TE2= 300
##$TE3= 300
##$TEG= 300
##$TL= (0..7)
0 120 53 12 22 120 120 120 
##$TP= (0..7)
150 150 150 150 150 150 150 150 
##$TP07= 0
##$TPNAME0= <>
##$TPNAME1= <>
##$TPNAME2= <>
##$TPNAME3= <>
##$TPNAME4= <>
##$TPNAME5= <>
##$TPNAME6= <>
##$TPNAME7= <>
##$TPOAL= (0..7)
0.5 0.5 0.5 0.5 0.5 0.5 0.5 0.5 
##$TPOFFS= (0..7)
0 0 0 0 0 0 0 0 
##$TUNHIN= 0
##$TUNHOUT= 0
##$TUNXOUT= 0
##$USERA1= <user>
##$USERA2= <user>
##$USERA3= <user>
##$USERA4= <user>
##$USERA5= <user>
##$V9= 5
##$VALIST= <valist>
##$VCLIST= <CCCCCCCCCCCCCCC>
##$VD= 0
##$VDLIST= <DDDDDDDDDDDDDDD>
##$VPLIST= <PPPPPPPPPPPPPPP>
##$VTLIST= <TTTTTTTTTTTTTTT>
##$WBST= 1024
##$WBSW= 4
##$XGAIN= (0..3)
0 0 0 0 
##$XL= 0
##$YL= 0
##$YMAX_a= 1860
##$YMIN_a= -2060
##$ZGOPTNS= <>
##$ZL1= 120
##$ZL2= 120
##$ZL3= 120
##$ZL4= 120
##$ABSF1= 248.5645
##$ABSF2= -253.2056
##$ABSG= 5
##$ABSL= 3
##$ALPHA= 0
##$AQORDER= 0
##$ASSFAC= 0
##$ASSFACI= 0
##$ASSFACX= 0
##$ASSWID= 0
##$AUNMP= <proc_1d>
##$AZFE= 0.1
##$AZFW= 0.5
##$BCFW= 0
##$BC_mod= 2
##$BYTORDP= 0
##$COROFFS= 0
##$CY= -3
##$DATMOD= 1
##$DC= 0
##$DFILT= <>
##$DTYPP= 0
##$F1P= 0
##$F2P= 0
##$FCOR= 1
##$FTSIZE= 65536
##$FT_mod= 6
##$GAMMA= 0
##$GB= 0
##$INTBC= 1
##$INTSCL= 6.047779e-11
##$ISEN= 30
##$LB= 10
##$LEV0= 0
##$LPBIN= 0
##$MAXI= 10000
##$MC2= 0
##$MEAN= 0
##$ME_mod= 0
##$MI= 50
##$NCOEF= 0
##$NC_proc= -9
##$NLEV= 6
##$NOISF1= 182.463
##$NOISF2= 159.3651
##$NSP= 0
##$NTH_PI= 0
##$NZP= 0
##$OFFSET= 248.5645
##$PC= 4
##$PHC0= -12732.05
##$PHC1= -289.1166
##$PH_mod= 1
##$PKNL= yes
##$PPARMOD= 0
##$PSCAL= 0
##$PSIGN= 0
##$REVERSE= no
##$SF= 81.0140089999694
##$SI= 65536
##$SIGF1= 159.3651
##$SIGF2= -187.1042
##$SINO= 113.3802
##$SIOLD= 16384
##$SREGLST= <1H.CDCl3>
##$SSB= 0
##$STSI= 65536
##$STSR= 0
##$SW_p= 40650.406504065
##$SYMM= 0
##$S_DEV= 0
##$TDeff= 32768
##$TDoff= 0
##$TI= <>
##$TILT= no
##$TM1= 0
##$TM2= 0
##$TOPLEV= 0
##$USERP1= <user>
##$USERP2= <user>
##$USERP3= <user>
##$USERP4= <user>
##$USERP5= <user>
##$WDW= 1
##$XDIM= 65536
##$YMAX_p= 390981136
##$YMIN_p= -35053369
$$ End of Bruker specific parameters
$$ ---------------------------------
##NTUPLES= NMR SPECTRUM
##VAR_NAME=  FREQUENCY,     SPECTRUM/REAL,   SPECTRUM/IMAG
##SYMBOL=    X,             R,               I
##VAR_TYPE=  INDEPENDENT,   DEPENDENT,       DEPENDENT
##VAR_FORM=  AFFN,          ASDF,            ASDF
##VAR_DIM=   65536,         65536,           65536
##UNITS=     HZ,            ARBITRARY UNITS, ARBITRARY UNITS
##FACTOR=    0.620285442955139, 1,           1
##FIRST=     20137.2065510682, 0,            0
##LAST=      -20513.1999529968, 0,           0
##MIN=       -20513.1999529968, -35053369,   0
##MAX=       20137.2065510682, 390981136,    0
$$ Real data points
##PAGE= N=1
##DATA TABLE= (X++(R..R)), XYDATA
$$ [...]
$$ plain form
39615 -221077 -506162 -798446 -1100066 -1407444 -1709212 -1986729 -2217198 -2378372 -2453114 -2432646
39605 -2432646 -2318647 -2124867 -1877926 -1615708 -1381910 -1217181 -1149599 -1188203 -1322251 -1526412
39595 -1526412 -1769496 -2022978 -2266072 -2486242 -2676063 -2828230 -2930563 -2963216 -2900521 -2718150
39585 -2718150 -2402904 -1960046 -1414963 -809965 -199129 357635 802675 1091575 1204211
39576 1204211 1150376 966035 701441 407003 123508 -120471 -305790 -418152 -444233 -369890
39566 -369890 -181784 127282 552173 1073498 1662656 2290881 2936117 3584092 4225041 4849909
39556 4849909 5448487 6009245 6519692 6966682 7336960 7618564 7803458 7890889 7889858 7818463
39546 7818463 7699192 7552038 7389274 7214329 7023536 6807509 6550895 6232813 5830853
$$ packed form
39615b21077k85085k92284l01620l07378l01768k77517k30469j61174p4742K0468
39605b432646J13999J93780K46941K62218K33798J64729O7582l8604j34048k04161
39595a526412k43084k53482k43094k20170j89821j52167j02333l2653O2695J82371
39585b718150L15246M42858N45083O04998O10836N56764M45040K88900J12636
39576A204211n3835j84341k64594k94438k83495k43979j85319j12362k6081P4343
39566c69890J88106L09066M24891N21325N89158O28225O45236O47975O40949O24868
39556D849909N98578N60758N10447M46990L70278K81604J84894Q7431j031p1395
39546G818463j19271j47154j62764j74945j90793k16027k56614l18082m01960
$$ plain form
39537 5830853 5328191 4719933 4015053 3233549 2401166 1544161 685341 -158263 -975278
39528 -975278 -1756993 -2492735 -3166918 -3760520 -4256568 -4645858 -4929143 -5114943 -5214992 -5240137
39518 -5240137 -5198408 -5095436 -4935960 -4724760 -4466434 -4165002 -3824200 -3448012 -3040522 -2605855
39508 -2605855 -2149789 -1682395 -1218430 -773179 -355963 33451 402090 756066 1092803
39499 1092803 1397990 1649209 1824638 1912345 1915410 1850568 1742053 1614685 1489343 1381000
39489 1381000 1297562 1238482 1193944 1145951 1071616 948128 758869 499814 183894 -159593
39479 -159593 -491579 -773601 -978066 -1094916 -1132998 -1116114 -1075553 -1042027 -1039641 -1082826 -1175893
39468 -1175893 -1314398 -1487574 -1680609 -1875663 -2051673 -2184628 -2250079 -2227953 -2107290 -1887941
$$ packed form
39537E830853n02662o08258p04880p81504q32383q57005q58820q43604q17015
39528i75278p81715p35742o74183n93602m96048l89290k83285j85800j00049k5145
39518e240137M1729J02972J59476K11200K58326L01432L40802L76188M07490M34667
39508b605855M56066M67394M63965M45251M17216L89414L68639L53976L36737
39499A092803L05187K51219J75429Q7707L065o4842j08515j27368j25342j08343
39489A381000q3438n9080m4538m7993p4335j23488j89259k59055l15920l43487
39479a59593l31986k82022k04465j16850l8082J6884M0561L3526K386m3185r3067
39468a175893j38505j73176j93035j95054j76010j32955o5451K2126J20663K19349
$$ plain form
39458 -1887941 -1578226 -1190436 -737014 -228918 323819 909773 1512982 2111664 2681609
39449 2681609 3203493 3668872 4079509 4440136 4749901 4997954 5164842 5227983 5168457 4976877
39439 4976877 4657063 4227178 3718204 3169655 2622859 2113734 1667845 1299455 1013919
39430 1013919 811295 689032 642707 665506 748421 882550 1062310 1286417 1554680 1862158
39420 1862158 2194504 2527609 2831837 3078802 3247844 3330222 3330634 3266555 3165642 3061198
39410 3061198 2986189 2967000 3018368 3140693 3320793 3536382 3763056 3981489 4182705 4369931
39400 4369931 4555786 4754727 4973581 5205096 5427915 5612252 5727899 5751436 5670564 5484241
39390 5484241 5199059 4824741 4371795 3851599 3276632 2659447 2011515 1343446 666618
$$ packed form
39458a887941L09715L87790M53422N08096N52737N85954O03209N98682N69945
39449B681609N21884M65379M10637L60627L09765K48053J66888O3141n9526j91580
39439D976877l19814m29885n08974n48549n46796n09125m45889l68390k85536
39430A013919k02624j22263m6325K2799Q2915J34129J79760K24107K68263L07478
39420A862158L32346L33105L04228K46965J69042Q2378M12o4079j00913j04444
39410C061198p5009j9189N1368J22325J80100K15589K26674K18433K01216J87226
39400D369931J85855J98941K18854K31515K22819J84337J15647K3537q0872j86323
39390E484241k85182l74318m52946n20196n74967o17185o47932o68069o76828
$$ plain form
39381 666618 -5062 -654389 -1261607 -1806811 -2273337 -2650798 -2936821 -3137709 -3268327 -3350623
39371 -3350623 -3409929 -3469281 -3543458 -3634914 -3733323 -3819504 -3872922 -3880002 -3839352 -3761091 -3660729
39360 -3660729 -3551497 -3439991 -3327300 -3213510 -3101460 -2997433 -2909987 -2849406 -2828636 -2864087
39350 -2864087 -2974039 -3174145 -3472081 -3864773 -4340143 -4881768 -5472273 -6092264 -6715518
39341 -6715518 -7304322 -7808987 -8172862 -8341346 -8271873 -7942199 -7355473 -6541208 -5551339 -4451210
39331 -4451210 -3307442 -2176892 -1100740 -105072 793887 1583596 2251806 2787978 3188255
39322 3188255 3459770 3620580 3695037 3707769 3679105 3622488 3543641 3442025 3315111 3164098
39312 3164098 2998071 2834060 2692571 2590445 2534484 2519494 2532207 2558804 2591196 2628540
$$ packed form
39381F66618o71680o49327o07218n45204m66526l77461k86023k00888j30618q2296
39371c350623n9306n9352p4177r1456r8409q6181n3418p080M0650P8261J00362
39360c660729J09232J11506J12691J13790J12050J04027Q7446O0581K0770l5451
39350b864087j09952k00106k97936l92692m75370n41625n90505o19991o23254
39341f715518n88804n04665l63875j68484O9473L29674N86726Q14265R89869J100129
39331d451210J143768J130550J076152R95668Q98959P89709O68210N36172M00277
39322C188255K71515J60810P4457J2732k8664n6617p8847j01616j26914j51013
39312C164098j66027j64011j41489j02126n5961j4990J2713K6597L2392L7344
$$ plain form
39302 2628540 2674273 2731730 2801052 2877987 2953637 3014589 3043897 3024125 2942651 2797442 2599918
39291 2599918 2372468 2141417 1929290 1750205 1609399 1505209 1431454 1379451 1339506 1301269
39281 1301269 1252629 1178181 1059489 878424 622490 289588 -109860 -553890 -1012181 -1450238
39271 -1450238 -1833911 -2134338 -2333408 -2428687 -2435460 -2383832 -2310620 -2248248 -2214475 -2207237 -2207267 -2187554
39259 -2187554 -2124612 -2005681 -1829144 -1600022 -1324465 -1006309 -646931 -248280 182541 630028
39249 630028 1070786 1477869 1826779 2100730 2293894 2412119 2471127 2492939 2502032 2522115
39239 2522115 2572973 2666423 2802083 2965487 3130809 3267674 3348785 3354710 3274332 3102365
39229 3102365 2836713 2477869 2030920 1509037 936199 346811 -218718 -721265 -1130428
$$ packed form
39302B628540M5733N7457O9322P6935P5650O0952K9308j9772q1474j45209j97524
39291B599918k27450k31051k12127j79085j40806j04190p3755n2003l9945l8237
39281A301269m8640p4448j18692j81065k55934l32902l99448m44030m58291m38057
39271a450238l83673l00427j99070r5279o773N1628P3212O2372L3773P238l0J9713
39259b187554O2942J18931J76537K29122K75557L18156L59378L98651M30821M47487
39249F30028M40758M07083L48910K73951J93164J18225N9008K1812R093K0083
39239B522115N0858R3450J35660J63404J65322J36865Q1111N925q0378j71967
39229C102365k65652l58844m46949n21883n72838n89388n65529n02547m09163
$$ plain form
39220 -1130428 -1429558 -1616940 -1703313 -1707413 -1652115 -1562638 -1465539 -1385742 -1341012 -1337225 -1368834
39209 -1368834 -1425199 -1498542 -1588360 -1700328 -1841779 -2017489 -2228476 -2474182 -2755677 -3076154
39199 -3076154 -3436484 -3828037 -4228364 -4604346 -4922051 -5157542 -5302533 -5362835 -5351982 -5284185
39189 -5284185 -5169546 -5012396 -4812027 -4564588 -4265365 -3911526 -3505473 -3057814 -2587941
39180 -2587941 -2121162 -1683498 -1296462 -973163 -715847 -515387 -354148 -212479 -76027
39171 -76027 60349 193870 318202 427429 518099 589902 645543 689671 727119 761815 796880
39160 796880 834632 875059 913854 942722 952755 938217 897542 831187 738885 618862 469586
39149 469586 292758 95413 -110387 -310029 -488647 -631189 -721028 -740289 -674058 -516909
$$ packed form
39220a130428k99130j87382q6373m100N5298Q9477R7099P9797M4730L787l1609
39209a368834n6365p3343q9818j11968j41451j75710k10987k45706k81495l20477
39199c076154l60330l91553m00327l75982l17705k35491j44991o0302J0853O7797
39189e284185J14639J57150K00369K47439K99223L53839M06053M47659M69873
39180b587941M66779M37664L87036L23299K57316K00460J61239J41669J36452
39171g6027J36376J33521J24332J09227R0670P1803N5641M4128L7448L4696L5065
39160G96880L7752M0427L8795K8868J0033j4538m0675o6355r2302j20023j49276
39149D69586j76828j97345k05800j99642j78618j42542q9839j9261O6231J57149
$$ plain form
39139 -516909 -277904 18964 339221 645433 905131 1096757 1212230 1256021 1241685 1187600
39129 1187600 1113862 1041250 990947 982592 1029989 1136850 1295738 1490857 1702759 1912770
39119 1912770 2106488 2276074 2420505 2542989 2646270 2728019 2778856 2784247 2729418 2604668
39109 2604668 2408345 2146443 1829687 1469633 1075338 652158 203986 -261585 -728232
39100 -728232 -1169899 -1555622 -1858362 -2063556 -2173364 -2205309 -2187034 -2149995 -2123704 -2130522 -2181146
39089 -2181146 -2271849 -2384621 -2490443 -2555730 -2552093 -2467618 -2314179 -2124821 -1940753 -1795228
39079 -1795228 -1703907 -1666005 -1672971 -1718012 -1801558 -1931373 -2118567 -2371667 -2691050 -3065385
39069 -3065385 -3470709 -3871875 -4226098 -4488859 -4622214 -4603901 -4433842 -4135024 -3748570 -3325574
$$ packed form
39139e16909K39005K96868L20257L06212K59698J91626J15473M3791j4336n4085
39129A187600p3738p2612n0303q355M7397J06861J58888J95119K11902K10011
39119A912770J93718J69586J44431J22484J03281Q1749N0837N391n4829j24750
39109B604668j96323k61902l16756l60054l94295m23180m48172m65571m66647
39100g28232m41667l85723l02740k05194j09808l1945J8275L7039K6291o818n0624
39089b181146r0703j12772j05822o5287L637Q4475J53439J89358J84068J45525
39079a795228R1321L7902o966m5041q3546j29815j87194k53100l19383l74335
39069c065385m05324m01166l54223k62761j33355J8313J70059K98818L86454M22996
$$ plain form
39059 -3325574 -2918154 -2570333 -2308856 -2136287 -2030359 -1951505 -1855778 -1707542 -1487628 -1196132
39049 -1196132 -851115 -484313 -134345 161516 374849 490569 507563 436575 297381 116571
39039 116571 -74429 -242306 -356636 -395899 -353037 -238534 -79554 85140 212962 265238
39029 265238 212735 39024 -256874 -658362 -1131920 -1633138 -2117396 -2550391 -2912833 -3197036
39019 -3197036 -3398130 -3506037 -3503652 -3372723 -3103901 -2705126 -2203996 -1643515 -1073120 -537814
39009 -537814 -68331 324259 647061 917471 1152872 1362964 1547769 1700972 1815785 1889840
38999 1889840 1926572 1932711 1913973 1872392 1807737 1722561 1627803 1545191 1504376 1535184 1657647
38988 1657647 1873595 2163519 2490457 2809537 3079359 3271231 3374259 3396276 3361497 3305852
$$ packed form
39059c325574M07420L47821K61477J72569J05928P8854R5727J48236K19914K91496
39049a196132L45017L66802L49968K95861K13333J15720J6994p0988j39194j80810
39039A16571j91000j67877j14330l9263M2862J14503J58980J64694J27822N2276
39029B65238n2503j73711k95898m01488m73558n01218m84258m32995l62442k84203
39019c197036k01094j07907K385J30929K68822L98775N01130N60481N70395N35306
39009e37814M69483L92590L22802K70410K35401K10092J84805J53203J14813P4055
38999A889840L6732O139j8738m1581o4655q5176r4758q2612m0815L0808J22463
38988A657647K15948K89924L26938L19080K69822J91872J03028K2017l4779n5645
$$ plain form
38978 3305852 3270824 3296567 3414769 3642093 3975931 4394670 4863201 5341528 5792744 6187842
38968 6187842 6507719 6743942 6898622 6981925 7006428 6980202 6902243 6762430 6544774 6231169
38958 6231169 5804263 5250658 4566139 3762067 2868918 1932575 1003191 122019 -686176
38949 -686176 -1411800 -2053459 -2611861 -3088084 -3484556 -3805069 -4052363 -4225286 -4318572 -4326417
38939 -4326417 -4247807 -4089809 -3866372 -3593482 -3284173 -2946521 -2585029 -2203266 -1804899 -1391858
38929 -1391858 -961239 -504849 -14317 509693 1049856 1571706 2031180 2386205 2607206
38920 2607206 2683177 2622323 2447924 2191558 1886610 1563969 1249909 965199 725002 539595
38910 539595 415361 355125 358039 420329 537268 704245 914332 1152906 1393690 1600622
$$ packed form
38978C305852l5028K5743J18202K27324L33838M18739M68531M78327M51216L95098
38968F187842L19877K36223J54680Q3303K4503k6226p7959j39813k17656l13605
38958F231169m26906n53605o84519q04072q93149r36343r29384q81172q08195
38949f86176p25624o41659n58402m76223l96472l20513k47294j72923r3286p845
38939d326417P8610J57998K23437K72890L09309L37652L61492L81763L98367M13041
38929a391858M30619M56390M90532N24010N40163N21850M59474L55025K21001
38920B607206P5971o0854j74399k56366l04948l22641l14060k84710k40197j85407
38910E39595j24234o0236K914O2290J16939J66977K10087K38574K40784K06932
$$ plain form
38900 1600622 1735702 1768713 1684249 1484274 1187086 823775 432374 49984 -295124 -588386
38890 -588386 -828704 -1023964 -1185180 -1321874 -1439388 -1537597 -1611030 -1650968 -1649680 -1605283 -1524559
38879 -1524559 -1421648 -1312860 -1210459 -1119003 -1035615 -952466 -858819 -741987 -588654 -387567
38869 -387567 -132507 176549 535144 938090 1383136 1872111 2408051 2989274 3603762 4227442
38859 4227442 4827535 5369018 5821037 6161040 6376449 6464846 6433466 6297930 6080066 5805347
38849 5805347 5500828 5193222 4905959 4655108 4446166 4273880 4125253 3984140 3836013
38840 3836013 3672088 3491873 3303094 3119197 2956056 2829226 2751629 2730729 2764993 2840504
38830 2840504 2929575 2993309 2988937 2880097 2646145 2287193 1824145 1295014 748635 236591
$$ packed form
38900A600622J35080L3011q4464j99975k97188l63311l91401l82390l45108k93262
38890e88386k40318j95260j61216j36694j17514r8209p3433l9938J288M4397Q0724
38879a524559J02911J08788J02401R1456Q3388Q3149R3647J16832J53333K01087
38869c87567K55060L09056L58595M02946M45046M88975N35940N81223O14488O23680
38859D227442O00093N41483M52019L40003K15409Q8397l1380j35536k17864k74719
38849E805347l04519l07606k87263k50851k08942j72286j48627j41113j48127
38840C836013j63925j80215j88779j83897j63141j26830p7597k0900L4264P5511
38830B840504Q9071O3734m372j08840k33952l58952m63048n29131n46379n12044
$$ plain form
38820 236591 -195180 -512829 -697648 -746307 -669782 -491523 -244087 36206 315176 564649
38810 564649 763030 893880 944939 908480 781980 568182 275073 -83627 -488569 -917246
38800 -917246 -1348392 -1765112 -2154160 -2502831 -2797816 -3028540 -3192653 -3298589 -3362088 -3398023
38790 -3398023 -3411858 -3395107 -3327096 -3182564 -2941770 -2598604 -2163854 -1664350 -1140650 -644147
38780 -644147 -231577 45118 151941 83422 -134863 -453394 -812066 -1154089 -1435825 -1630821
38770 -1630821 -1729018 -1733122 -1654029 -1506740 -1307673 -1073737 -822760 -574138 -348207 -163287
38760 -163287 -31072 47056 80185 84103 75814 68900 70744 81615 96200 108298 117368 133124
38748 133124 174582 263393 415025 632218 903327 1205769 1513224 1804067 2067417 2303335
$$ packed form
38820B36591m31771l17649j84819m8659P6525J78259K47436K80293K78970K49473
38810E64649J98381J30850N1059l6459j26500k13798k93109l58700m04942m28677
38800i17246m31146m16720l89048l48671k94985k30724j64113j05936o3499l5935
38790c398023j3835J6751O8011J44532K40794L43166M34750M99504N23700M96503
38780f44147M12570K76695J06823o8519k18285l18531l58672l42023k81736j94996
38770a630821r8197m104P9093J47289J99067K33936K50977K48622K25931J84920
38760a63287J32215P8128L3129L918q289o914J844J0871J4585J2098R070J5756
38748A33124M1458Q8811J51632K17193K71109L02442L07455K90843K63350K35918
$$ plain form
38738 2303335 2516492 2706947 2864026 2967332 2993778 2925869 2757072 2493557 2153891 1767465
38728 1767465 1370655 1000383 687393 452779 309031 263283 319572 479283 741201 1101750
38718 1101750 1554037 2084416 2668169 3268392 3840782 4342786 4742125 5020607 5173047
38709 5173047 5204218 5126177 4955851 4711937 4411649 4069162 3696603 3306556 2914296 2538413
38699 2538413 2198965 1912952 1688541 1520866 1391567 1271702 1126395 920522 625703
38690 625703 227729 -268557 -839840 -1450324 -2060060 -2632028 -3136337 -3551937 -3866880 -4077809
38680 -4077809 -4189173 -4212700 -4166965 -4075680 -3963251 -3848047 -3736277 -3619718 -3478488 -3287528
38670 -3287528 -3024467 -2676784 -2246735 -1752646 -1225861 -704142 -223953 185375 504268
$$ packed form
38738B303335K13157J90455J57079J03306K6446o7909j68797k63515l39666l86426
38728A767465l96810l70272l12990k34614j43748m5748N6289J59711K61918L60549
38718A101750M52287N30379N83753O00223N72390N02004L99339K78482J52440
38709E173047L1171p8041j70326k43914l00288l42487l72559l90047l92260l75883
38699B538413l39448k86013k24411j67675j29299j19865j45307k05873k94819
38690F25703l97974m96286n71283o10484o09736n71968n04309m15600l14943k10929
38680d077809j11364k3527M5735R1285J12429J15204J11770J16559J41230J90960
38670c287528K63061L47683M30049M94089N26785N21719M80189M09328L18893
$$ plain form
38661 504268 723401 843803 876625 840793 757485 642891 502243 327520 100129 -201226
38651 -201226 -589181 -1057500 -1577589 -2103918 -2585204 -2975444 -3240592 -3360579 -3329121 -3154043
38641 -3154043 -2858701 -2482476 -2077167 -1697922 -1390722 -1180638 -1065000 -1014179 -980611 -913665
38631 -913665 -774466 -543985 -221604 182217 652619 1172615 1722495 2279704 2820267 3320444
38621 3320444 3757782 4112722 4371738 4530915 4597681 4589719 4531961 4453020 4381831 4344916 4364763
38610 4364763 4459388 4642450 4922912 5303351 5776867 6324070 6912872 7502819 8052321 8524741
38600 8524741 8890673 9127332 9217815 9151512 8925218 8544507 8025363 7395443 6693113 5962976
38590 5962976 5248460 4583605 3986956 3460296 2993342 2572020 2184912 1823776 1479145
$$ packed form
38661E04268K19133J20402L2822l5832q3308j14594j40648j74723k27391l01355
38651b01226l87955m68319n20089n26329m81286l90240k65148j19987L1458J75078
38641c154043K95342L76225M05309L79245L07200K10084J15638N0821L3568O6946
38631i13665J39199K30481L22381M03821M70402N19996N49880N57209N40563N00177
38621C320444M37338L54940K59016J59177O6766p962n7758p8941p1189l6915J9847
38610D364763R4625J83062K80462L80439M73516N47203N88802N89947N49502M72420
38600H524741L65932K36659R0483o6303k26294l80711n19144o29920p02330p30137
38590E962976p14516o64855n96649n26660m66954m21322l87108l61136l44631
$$ plain form
38581 1479145 1136381 776679 382634 -55633 -537231 -1050560 -1575119 -2083727 -2545039
38572 -2545039 -2926791 -3199842 -3342474 -3343905 -3205883 -2941676 -2572911 -2125645 -1626903 -1101819
38562 -1101819 -571063 -48992 456132 939188 1393777 1808810 2167696 2450222 2636460
38553 2636460 2712105 2674246 2535674 2325697 2086545 1866160 1709182 1648408 1698857 1856069
38543 1856069 2099044 2396716 2715517 3025459 3303133 3531986 3701371 3805844 3845244 3825567
38533 3825567 3760325 3671590 3589311 3547939 3580538 3711565 3950199 4286852 4695783 5144212
38523 5144212 5603728 6057131 6496833 6917254 7307446 7648530 7915922 8083566 8127890 8031228
38513 8031228 7785442 7395436 6880880 6274611 5618173 4956252 4330976 3775696 3308716
$$ packed form
38581A479145l42764l59702l94045m38267m81598n13329n24559n08608m61312
38572b545039l81752k73051j42632j431J38022K64207L68765M47266M98742N25084
38562a101819N30756N22071N05124M83056M54589M15033L58886K82526J86238
38553B636460P5645l7859j38572k09977k39152k20385j56978o0774N0449J57212
38543A856069K42975K97672L18801L09942K77674K28853J69385J04473L9400j9677
38533C825567o5242q8735q2279m1372L2599J31027K38634L36653M08931M48429
38523E144212M59516M53403M39702M20421L90192L41084K67392J67644M4324r6662
38513H031228k45786l90006n14556o06269o56438o61921o25276n55280m66980
$$ plain form
38504 3308716 2929814 2622730 2363421 2129754 1907256 1688509 1468353 1239787 994570
38495 994570 728207 444871 157530 -117224 -365608 -579410 -753491 -880383 -946250 -931360
38485 -931360 -815434 -585520 -243231 191090 679115 1171444 1620248 1993131 2281307 2497694
38475 2497694 2667148 2815846 2965733 3134396 3336487 3583014 3878322 4217573 4587198
38466 4587198 4968566 5343384 5699315 6034550 6359524 6694032 7060198 7474865 7945575
38457 7945575 8471518 9047189 9664961 10314406 10978971 11632845 12240984 12763664 13164732
38448 13164732 13421126 13530406 13512988 13407208 13258434 13106171 12973466 12861207 12748384
38439 12748384 12598632 12371704 12035838 11576043 10995964 10314793 9562164 8772714 7980936
$$ packed form
38504C308716l78902l07084k59309k33667k22498k18747k20156k28566k45217
38495I94570k66363k83336k87341k74754k48384k13802j74081j26892o5867J4890
38485i31360J15926K29914L42289M34321M88025M92329M48804L72883K88176K16387
38475B497694J69454J48698J49887J68663K02091K46527K95308L39251L69625
38466D587198L81368L74818L55931L35235L24974L34508L66166M14667M70710
38457G945575N25943N75671O17772O49445O64565O53874O08139N22680M01068
38448A3164732K56394J09280j7418j05780j48774j52263j32705j12259j12823
38439A2748384j49752k26928l35866m59795n80079o81171p52629p89450p91778
$$ plain form
38430 7980936 7217328 6507041 5870658 5324755 4879805 4535355 4275563 4069279 3876604
38421 3876604 3659796 3393411 3069762 2699366 2308511 1934851 1619795 1397302 1282509
38412 1282509 1266070 1317293 1393550 1450226 1447700 1356179 1161043 868830 510528 137998 -187226
38401 -187226 -409015 -489475 -415487 -198885 127302 514931 909140 1258875 1527103 1696952
38391 1696952 1771580 1768719 1712974 1628641 1534109 1438031 1337936 1222789 1080085 905039 706733
38380 706733 507066 332951 206546 138694 127315 159173 213185 265074 293688 287586 248740
38369 248740 190926 133057 90203 65912 48926 16185 -58552 -194187 -395058 -649943 -936161
38358 -936161 -1225076 -1486099 -1688691 -1803842 -1806888 -1682412 -1429596 -1064526 -616541 -119076
$$ packed form
38430G980936p63608p10287o36383n45903m44950l44450k59792k06284j92675
38421C876604k16808k66385l23649l70396l90855l73660l15056k22493j14793
38412A282509j6439N1223P6257N6676k526r1521j95136k92213l58302l72530l25224
38401a87226k21789q0460P3988K16602L26187L87629L94209L49735K68228J69849
38391A696952P4628k861n5745q4333r4532r6078j00095j15147j42704j75046j98306
38380G06733j99667j74115j26405o7852j1379L1858N4012N1889K8614o102l8846
38369B48740n7814n7869m2854k4291j6986l2741p4737j35635k00871k54885k86218
38358i36161k88915k61023k02592j15151l046J24476K52816L65070M47985M97465
$$ plain form
38348 -119076 400789 928721 1462067 2002075 2544010 3071334 3557647 3974901 4302371 4531376
38338 4531376 4664731 4713448 4693574 4623999 4524130 4410135 4290118 4160609 4007066 3809091
38328 3809091 3548168 3214319 2808873 2342628 1830745 1287370 723233 147649 -427067
38319 -427067 -982423 -1494023 -1934428 -2276514 -2496766 -2579487 -2522045 -2338958 -2061937 -1735222
38309 -1735222 -1408519 -1130449 -943059 -876151 -941017 -1126238 -1399165 -1713948 -2022749 -2285150
38299 -2285150 -2472723 -2568730 -2564466 -2454420 -2232932 -1894625 -1438248 -870720 -208412 523780
38289 523780 1293065 2058780 2774769 3396052 3887093 4226733 4407795 4433765 4315671 4069898
38279 4069898 3716335 3277045 2776039 2239531 1695137 1169886 688907 276262 -43183
$$ packed form
38348a19076N19865N27932N33346N40008N41935N27324M86313M17254L27470K29005
38338D531376J33355M8717j9874o9575r9869j13995j20017j29509j53543j97975
38328C809091k60923l33849m05446m66245n11883n43375n64137n75584n74716
38319d27067n55356n11600m40405l42086k20252q2721N7442J83087K77021L26715
38309a735222L26703K78070J87390O6908o4866j85221k72927l14783l08801k62401
38299b285150j87573r6007M264J10046K21488L38307M56377N67528O62308P32192
38289E23780P69285P65715P15989O21283M91041L39640J81062K5970j18094k45773
38279D069898l53563m39290n01006n36508n44394n25251m80979m12645l19445
$$ plain form
38270 -43183 -244010 -304657 -214655 19438 373385 810836 1292747 1786939 2274926 2754185
38260 2754185 3234658 3729481 4242972 4761666 5253647 5676776 5991224 6170010 6203931 6101238
38250 6101238 5884391 5585657 5241938 4889055 4556248 4261709 4009459 3788132 3573098
38241 3573098 3333034 3039389 2674378 2233799 1724926 1162823 567564 -38221 -633079
38232 -633079 -1201083 -1734056 -2229848 -2688175 -3107454 -3485046 -3820193 -4116663 -4382158 -4624094
38222 -4624094 -4843970 -5033724 -5176178 -5249706 -5235933 -5128715 -4941527 -4709363 -4482206 -4311216
38212 -4311216 -4233368 -4261462 -4382958 -4566293 -4770733 -4956278 -5091402 -5157064 -5146083 -5058833
38202 -5058833 -4898020 -4665413 -4361648 -3988442 -3551865 -3065141 -2548966 -2027903 -1524020
$$ packed form
38270d3183k00827o0647R0002K34093L53947M37451M81911M94192M87987M79259
38260B754185M80473M94823N13491N18694M91981M23129L14448J78786L3921j02693
38250F101238k16847k98734l43719l52883l32807k94539k52250k21327k15034
38241C573098k40064k93645l65011m40579n08873n62103n95259o05785n94858
38232f33079n68004n32973m95792m58327m19279l77592l35147k96470k65495k41936
38222d624094k19876j89754j42454p3528J3773J07218J87188K32164K27157J70990
38212d311216P7848k8094j21496j83335k04440j85545j35124o5662J0981Q7250
38202e058833J60813K32607L03765L73206M36577M86724N16175N21063N03883
$$ plain form
38193 -1524020 -1052079 -620261 -236038 88126 334811 488299 543464 511055 416220 291256
38183 291256 166298 62158 -12130 -57135 -78183 -80163 -63409 -21491 58354 191829 392103
38172 392103 664399 1003058 1392893 1815049 2254911 2707145 3173767 3655857 4144917 4620218
38162 4620218 5053635 5418154 5695379 5879976 5981108 6020617 6027159 6026826 6033482 6043326 6036592
38151 6036592 5985563 5864834 5659153 5366025 4993173 4552886 4056318 3510536 2919682 2289252
38141 2289252 1630868 965158 321465 -265941 -764639 -1151743 -1419167 -1573933 -1633631 -1619183
38131 -1619183 -1547257 -1424288 -1244251 -991948 -651271 -215263 306179 883988 1474301 2028825
38121 2028825 2507556 2887946 3166065 3350466 3454002 3488640 3464402 3390492 3276499 3132886
$$ packed form
38193a524020M71941M31818L84223L24164K46685J53488N5165l2409r4835j24964
38183B91256j24958j04140p4288m5005k1048j980J6754M1918P9845J33475K00274
38172C92103K72296L38659L89835M22156M39862M52234M66622M82090M89060M75301
38162D620218M33417L64519K77225J84597J01132L9509O542l33O656R844o734
38151F036592n1029j20729k05681k93128l72852m40287m96568n45782n90854o30430
38141B289252o58384o65710o43693n87406m98698l87104k67424j54766n9698J4448
38131a619183P1926J22969J80037K52303L40677M36008N21442N77809N90313N54524
38121B028825M78731L80390K78119J84401J03536L4638k4238p3910j13993j43613
$$ plain form
38111 3132886 2970649 2800287 2630985 2471135 2330104 2219595 2153006 2142964 2198541 2323178
38101 2323178 2513229 2757034 3035381 3324363 3600283 3844683 4047678 4209367 4340352
38092 4340352 4461521 4601445 4789581 5046628 5376648 5765475 6185762 6604863 6991450
38083 6991450 7319243 7568500 7726207 7785521 7745189 7609699 7390022 7103793 6773792 6424704
38073 6424704 6079208 5754723 5461905 5205295 4985736 4803296 4659003 4554410 4489525 4461313
38063 4461313 4464937 4497781 4563258 4670466 4828003 5034438 5270909 5500758 5677419 5757144
38053 5757144 5710706 5529469 5225023 4824831 4366994 3895370 3454459 3083236 2808559 2640165
38043 2640165 2569187 2570703 2609130 2645017 2642427 2576567 2440318 2246963 2026790 1817948 1655244
$$ packed form
38111C132886j62237j70362j69302j59850j41031j10509o6589j0042N5577J24637
38101B323178J90051K43805K78347K88982K75920K44400K02995J61689J30985
38092D340352J21169J39924J88136K57047L30020L88827M20287M19101L86587
38083F991450L27793K49257J57707N9314m0332j35490k19677k86229l30001l49088
38073F424704l45496l24485k92818k56610k19559j82440j44293j04593o4885k8212
38063D461313L624L2844O5477J07208J57537K06435K36471K29849J76661P9725
38053E757144m6438j81237l04446m00192m57837m71624m40911l71223k74677j68394
38043B640165p0978J516L8427L5887k590o5860j36249j93355k20173k08842j62704
$$ plain form
38032 1655244 1561385 1543268 1593159 1693042 1820367 1953608 2076515 2180913 2268722 2352794
38022 2352794 2454338 2594956 2785432 3017416 3263726 3487369 3653903 3740585 3739092 3652592
38012 3652592 3490128 3261399 2974041 2634182 2249327 1831041 1394655 955109 521155
38003 521155 91833 -342224 -793242 -1269517 -1770570 -2285840 -2796560 -3278961 -3706978 -4054364
37993 -4054364 -4298066 -4424320 -4435697 -4354434 -4218213 -4069344 -3942886 -3859733 -3826729 -3841183
37983 -3841183 -3895609 -3980510 -4085679 -4201128 -4317856 -4428252 -4526444 -4609230 -4677354 -4735918
37973 -4735918 -4792925 -4856543 -4933015 -5026823 -5142632 -5286800 -5466837 -5689684 -5960782 -6284360
37963 -6284360 -6663046 -7095308 -7571556 -8071217 -8562485 -9005263 -9357167 -9581387 -9653771 -9566612
$$ packed form
38032A655244r3859j8117M9891R9883J27325J33241J22907J04398Q7809Q4072
38022B352794J01544J40618J90476K31984K46310K23643J66534Q6682j493q6500
38012C652592j62464k28729k87358l39859l84855m18286m36386m39546m33954
38003E21155m29322m34057m51018m76275n01053n15270n10720m82401m28017l47386
37993d054364k43702j26254j1377Q1263J36221J48869J26458Q3153L3004j4454
37983c841183n4426q4901j05169j15449j16728j10396r8192q2786o8124n8564
37973d735918n7007o3618p6472r3808j15809j44168j80037k22847k71098l23578
37963f284360l78686m32262m76248m99661m91268m42778l51904k24220p2384Q7159
$$ plain form
37953 -9566612 -9328711 -8963129 -8503785 -7990798 -7464659 -6960733 -6506144 -6119921 -5815184
37944 -5815184 -5600895 -5481447 -5454578 -5509977 -5630545 -5796073 -5987709 -6191337 -6398374 -6603137
37934 -6603137 -6798429 -6973551 -7117798 -7226909 -7306094 -7366101 -7415241 -7453110 -7469066 -7445073
37924 -7445073 -7361502 -7204385 -6971460 -6673924 -6332911 -5972737 -5613939 -5268179 -4936301 -4610393
37914 -4610393 -4279315 -3935016 -3575886 -3205662 -2830017 -2454448 -2084820 -1728408 -1392728
37905 -1392728 -1082260 -795827 -527081 -268314 -16166 223276 433636 594388 692383 732134
37895 732134 738120 747866 800170 923732 1129097 1405077 1720934 2035199 2309578 2522966
37885 2522966 2678591 2799631 2915020 3043640 3186063 3327505 3448370 3535486 3588557 3619932
$$ packed form
37953i566612K37901L65582M59344N12987N26139N03926M54589L86223L04737
37944e815184K14289J19448K6869n5399j20568j65528j91636k03628k07037k04763
37934f603137j95292j75122j44247j09111p9185o0007m9140l7869j5956K3993
37924g445073Q3571J57117K32925K97536L41013L60174L58798L45760L31878L25908
37914d610393L31078L44299L59130L70224L75645L75569L69628L56412L35680
37905a392728L10468K86433K68746K58767K52148K39442K10360J60752R7995L9751
37895G32134N986R746N2304J23562K05365K75980L15857L14265K74379K13388
37885B522966J55625J21040J15389J28620J42423J41442J20865Q7116N3071L1375
$$ plain form
37875 3619932 3648907 3693650 3764069 3857766 3959876 4047012 4094878 4087688 4026313 3932234 3845557
37864 3845557 3816685 3892981 4104308 4452745 4909939 5421985 5919565 6331663 6601274 6699635
37854 6699635 6633332 6439951 6173134 5883650 5605234 5350642 5116728 4892443 4664084 4417088
37844 4417088 4137813 3818115 3461335 3085159 2717999 2389930 2123122 1926966 1799725
37835 1799725 1734041 1721734 1755310 1827154 1929020 2052816 2191440 2338169 2485017 2621761
37825 2621761 2736699 2818467 2857265 2844437 2770968 2626959 2404104 2100827 1726495 1300804
37815 1300804 847993 390072 -56404 -479047 -866484 -1206201 -1484321 -1686773 -1800894
37806 -1800894 -1816410 -1725441 -1522724 -1208221 -792300 -300119 229313 750819 1223916 1621126
$$ packed form
37875C619932K8975M4743P0419R3697J02110Q7136M7866p190o1375r4079q6677
37864C845557k8872P6296K11327L48437M57194N12046M97580M12098K69611R8361
37854F699635o6303j93381k66817k89484k78416k54592k33914k24285k28359k46996
37844D417088k79275l19698l56780l76176l67160l28069k66808j96156j27241
37835A799725o5684j2307L3576P1844J01866J23796J38624J46729J46848J36744
37825B621761J14938Q1768L8798j2828p3469j44009k22855l03277l74332m25691
37815A300804m52811m57921m46476m22643l87437l39717k78120k02452j14121
37806a800894j5516R0969K02717L14503M15921M92181N29432N21506M73097L97210
$$ plain form
37796 1621126 1929846 2148244 2278856 2324024 2285002 2163752 1965343 1700013 1385454 1049399
37786 1049399 730354 473178 318419 288793 379460 558098 776524 989738 1173827 1333978
37776 1333978 1498714 1704375 1979111 2334698 2768276 3269757 3828395 4434418 5076240
37767 5076240 5737129 6394614 7022570 7593134 8076848 8442963 8663247 8719695 8612185 8360806
37757 8360806 8000260 7568413 7094510 6592724 6063417 5500117 4898077 4261185 3605430
37748 3605430 2957389 2346664 1794438 1304212 860971 439569 16709 -421026 -876536
37739 -876536 -1346661 -1826585 -2310743 -2790521 -3251654 -3674150 -4035584 -4316713 -4507440 -4610947
37729 -4610947 -4644096 -4632974 -4604232 -4574925 -4544811 -4494414 -4390129 -4195289 -3883965 -3452595
$$ packed form
37796A621126L08720K18398J30612M5168l9022j21250j98409k65330l14559l36055
37786A049399l19045k57176j54759k9626R0667J78638K18426K13214J84089J60151
37776A333978J64736K05661K74736L55587M33578N01481N58638O06023O41822
37767E076240O60889O57485O27956N70564M83714L66115K20284N6448j07510k51379
37757H360806l60546m31847m73903n01786n29307n63300o02040o36892o55755
37748C605430o48041o10725n52226m90226m43241m21402m22860m37735m55510
37739h76536m70125m79924m84158m79778m61133m22496l61434k81129j90727j03507
37729d610947l3149J1122K8742K9307L0114N0397J04285J94840L11324M31370
$$ plain form
37719 -3452595 -2924042 -2341186 -1752632 -1197937 -699563 -263540 114752 444614 736191
37710 736191 998154 1235638 1448489 1631155 1775261 1874137 1926670 1937713 1914292 1859843
37700 1859843 1770754 1638598 1457883 1234726 990568 758426 574388 469249 463167 563585
37690 563585 765827 1055715 1412671 1811715 2225101 2626288 2997036 3333713 3647305 3955708
37680 3955708 4272961 4602298 4936602 5264392 5575990 5865552 6128861 6360487 6553815
37671 6553815 6703852 6809296 6870972 6887837 6855423 6770570 6640625 6490012 6357835 6286604
37661 6286604 6308107 6432822 6645709 6908278 7165883 7358191 7429608 7337139 7055453 6579643
37651 6579643 5924851 5121666 4208917 3227783 2219547 1225839 288671 -551021 -1256281
$$ packed form
37719c452595N28553N82856N88554N54695M98374M36023L78292L29862K91577
37710G36191K61963K37484K12851J82666J44106R8876N2533J1043k3421n4449
37700A859843q9089j32156j80715k23157k44158k32142j84038j05139o082J00418
37690E63585K02242K89888L56956L99044M13386M01187L70748L36677L13592L08403
37680C955708L17253L29337L34304L27790L11598K89562K63309K31626J93328
37671F553815J50037J05444O1676J6865l2414q4853j29945j50613j32177p1231
37661F286604K1503J24715K12887K62569K57605J92308P1417r2469k81686m75810
37651F579643o54792q03185r12749r81134j008236r93708r37168q39692p05260
$$ plain form
37642 -1256281 -1798130 -2159826 -2339194 -2346950 -2201146 -1920763 -1522437 -1022259 -441062 191330
37632 191330 837107 1457299 2020826 2510755 2925050 3272397 3565610 3815440 4026592 4196393
37622 4196393 4315559 4370650 4348380 4241083 4050728 3788591 3470548 3111367 2721621 2308061
37612 2308061 1875550 1428634 972423 513437 60611 -374224 -777497 -1136694 -1443120
37603 -1443120 -1692357 -1882090 -2009699 -2072259 -2068823 -2002287 -1878798 -1705324 -1487263 -1226939
37593 -1226939 -922885 -570115 -162263 304223 825103 1384683 1955311 2500516 2980692
37584 2980692 3359592 3610384 3720513 3693826 3547576 3303978 2980119 2582073 2106441 1547818
37574 1547818 907942 201993 -541460 -1287860 -2008067 -2687321 -3327087 -3940548 -4545770
$$ packed form
37642a256281n41849l61696j79368p756J45804K80383L98326N00178N81197O32392
37632A91330O45777O20192N63527M89929M14295L47347K93213K49830K11152J69801
37622D196393J19166N5091k2270j07297j90355k62137l18043l59181l89746m13560
37612B308061m32511m46916m56211m58986m52826m34835m03273l59197l06426
37603a443120k49237j89733j27609o2560L436O6536J23489J73474K18061K60324
37593a226939L04054L52770M07852M66486N20880N59580N70628N45205M80176
37584B980692L78900K50792J10129k6687j46250k43598l23859l98046m75632n58623
37574A547818o39876p05949p43453p46400p20207o79254o39766o13461o05222
$$ plain form
37565 -4545770 -5159173 -5789336 -6431373 -7064296 -7654252 -8163663 -8562545 -8836270 -8985809
37556 -8985809 -9021071 -8952514 -8787027 -8530364 -8193343 -7796687 -7370784 -6950272 -6566601 -6242759
37546 -6242759 -5992506 -5823019 -5737612 -5735978 -5812132 -5952524 -6136906 -6342614 -6550358 -6748069
37536 -6748069 -6930596 -7095980 -7241043 -7358478 -7435980 -7457394 -7406374 -7272547 -7058490 -6784086
37526 -6784086 -6484977 -6204018 -5978494 -5828924 -5755157 -5741141 -5764737 -5807102 -5858000 -5915984
37516 -5915984 -5983861 -6061523 -6140507 -6204818 -6238557 -6235084 -6200605 -6149315 -6093775 -6037279 -5972722
37505 -5972722 -5887567 -5770725 -5616497 -5423218 -5188466 -4905730 -4566593 -4167743 -3717861 -3239519
37495 -3239519 -2765267 -2330484 -1965860 -1691027 -1510556 -1413826 -1379018 -1379271 -1387980 -1381600 -1340277
$$ packed form
37565d545770o13403o30163o42037o32923n89956n09411l98882k73725j49539
37556h985809l5262O8557J65487K56663L37021L96656M25903M20512L83671L23842
37546f242759K50253J69487Q5407J634p6154j40392j84382k05708k07744j97711
37536f748069j82527j65384j45063j17435p7502k1414N1020J33827K14057K74404
37526f784086K99109K80959K25524J49570P3767J4016k3596m2365n0898n7984
37516e915984o7877p7662p8984o4311l3739L473L4479N1290N5540N6496O4557
37505e972722Q5155J16842J54228J93279K34752K82736L39137L98850M49882M78342
37495c239519M74252M34783L64624K74833J80471R6730L4808k53q709O380M1323
$$ plain form
37484 -1340277 -1247719 -1091768 -866724 -577130 -240740 112345 445780 726732 935581 1071502
37474 1071502 1150943 1198739 1235464 1267662 1286515 1275176 1219335 1114521 967099 790206 597635
37463 597635 398137 191885 -29783 -281242 -577329 -927919 -1333928 -1785847 -2265532 -2750814
37453 -2750814 -3220750 -3658739 -4052402 -4391787 -4668422 -4876082 -5011908 -5076245 -5071415 -5001449
37443 -5001449 -4874063 -4703285 -4509155 -4312615 -4128016 -3958288 -3795837 -3627890 -3442590
37434 -3442590 -3233224 -3000203 -2751356 -2500755 -2266249 -2066393 -1917497 -1831316 -1813806 -1865490
37424 -1865490 -1983103 -2160944 -2390331 -2657556 -2942692 -3220974 -3466009 -3652495 -3757514
37415 -3757514 -3761727 -3652301 -3427673 -3101757 -2704584 -2277958 -1867521 -1514416 -1249251 -1089030
$$ packed form
37484a340277R2558J55951K25044K89594L36390L53085L33435K80952K08849J35921
37474A071502P9441M7796L6725L2198J8853j1339n5841j04814j47422j76893j92571
37463E97635j99498k06252k21668k51459k96087l50590m06009m51919m79685m85282
37453b750814m69936m37989l93663l39385k76635k07660j35826o4337M830O9966
37443e001449J27386J70778J94130J96540J84599J69728J62451J67947J85300
37434c442590K09366K33021K48847K50601K34506J99856J48896Q6181J7510n1684
37424a865490j17613j77841k29387k67225k85136k78282k45035j86486j05019
37415c757514m213J09426K24628L25916L97173M26626M10437L53105K65165J60221
$$ plain form
37405 -1089030 -1036358 -1080490 -1200107 -1367112 -1550038 -1716298 -1834037 -1874926 -1818285 -1655329
37395 -1655329 -1391443 -1044548 -639358 -199910 255880 717336 1178619 1635278 2081662
37386 2081662 2509892 2910280 3272459 3586110 3841253 4029588 4147692 4199978 4197915 4155154
37376 4155154 4082308 3985495 3868542 3735258 3588994 3430124 3254470 3054823 2825037 2563901
37366 2563901 2275995 1969126 1650452 1324152 991919 655437 319049 -8878 -316573
37357 -316573 -591255 -822386 -1004077 -1135035 -1216017 -1246831 -1225318 -1148331 -1012675 -815182
37347 -815182 -554256 -234717 127005 503388 863973 1185821 1458670 1682466 1861093 1997267
37337 1997267 2090291 2135957 2127958 2061217 1936914 1767065 1575199 1391450 1244140 1152580
$$ packed form
37405a089030N2672m4132j19617j67005j82926j66260j17739m0889N6641J62956
37395a655329K63886L46895M05190M39448M55790M61456M61283M56659M46384
37386B081662M28230M00388L62179L13651K55143J88335J18104N2286k063m2761
37376D155154p2846r6813j16953j33284j46264j58870j75654j99647k29786k61136
37366B563901k87906l06869l18674l26300l32233l36482l36388l27927l07695
37357c16573k74682k31131j81691j30958q0982l0814K1513P6987J35656J97493
37347h15182K60926L19539L61722L76383L60585L21848K72849K23796J78627J36174
37337A997267R3024M5666p999o6741j24303j69849j91866j83749j47310r1560
$$ plain form
37327 1152580 1124571 1158372 1246762 1381200 1555159 1765760 2012841 2295846 2610314 2946042
37317 2946042 3288117 3620514 3930486 4211225 4461640 4684188 4882417 5058184 5207843
37308 5207843 5318803 5370214 5340253 5217738 5012117 4756044 4498247 4288712 4162160 4127538
37298 4127538 4169032 4257993 4368665 4488456 4617631 4760803 4917976 5082140 5244374 5401487
37288 5401487 5560029 5733995 5937829 6178269 6448452 6727025 6983618 7189122 7325918
37279 7325918 7392555 7400849 7368366 7311189 7239637 7156337 7055399 6923166 6741967 6496953 6183878
37268 6183878 5814787 5419090 5038978 4720315 4502279 4409965 4452285 4624410 4911865 5293524
37258 5293524 5742769 6228272 6716486 7176500 7585285 7930582 8210591 8432034 8608249
$$ packed form
37327A152580k8009L3801Q8390J34438J73959K10601K47081K83005L14468L35728
37317B946042L42075L32397L09972K80739K50415K22548J98229J75767J49659
37308E207843J10960N1411k9961j22515k05621k56073k57797k09535j26552l4622
37298D127538M1494Q8961J10672J19791J29175J43172J57173J64164J62234J57113
37288E401487J58542J73966K03834K40440K70183K78573K56593K05504J36796
37279G325918O6637Q294l2483n7177p1552q3300j00938j32233j81199k45014l13075
37268F183878l69091l95697l80112l18663k18036r2314M2320J72125K87455L81659
37258E293524M49245M85503M88214M60014M08785L45297K80009K21443J76215
$$ plain form
37249 8608249 8756904 8896146 9039772 9194223 9359340 9531644 9706742 9879126 10041028
37240 10041028 10183217 10298168 10382810 10437664 10461964 10447618 10376165 10221710 9959509 9575768
37230 9575768 9072700 8466374 7781066 7046026 6296021 5571463 4914018 4358810 3927536
37221 3927536 3624974 3438667 3341753 3299903 3281364 3265351 3243868 3216638 3183907 3142177 3084036
37210 3084036 2999397 2875771 2698456 2453461 2133993 1747078 1315444 872783 455270 93950
37200 93950 -189436 -383535 -486675 -504770 -447659 -324677 -141661 98581 392478 731032
37190 731032 1097355 1467973 1817534 2124956 2378348 2576394 2726115 2839340 2930379 3014639
37180 3014639 3105933 3211963 3330867 3452180 3562149 3650036 3712126 3752510 3781273 3811148
$$ packed form
37249H608249J48655J39242J43626J54451J65117J72304J75098J72384J61902
37240A0041028J42189J14951Q4642N4854K4300j4346p1453j54455k62201l83741
37230I575768n03068o06326o85308p35040p50005p24558o57445n55208m31274
37221C927536l02562j86307r6914m1850j8539j6013k1483k7230l2731m1730n8141
37210C084036q4639j23626j77315k44995l19468l86915m31634m42661m17513l61320
37200I3950k83386j94099j03140j8095N7111J22982J83016K40242K93897L38554
37190G31032L66323L70618L49561L07422K53392J98046J49721J13225R1039Q4260
37180C014639R1294J06030J18904J21313J09969Q7887O2090M0384K8763K9875
$$ plain form
37170 3811148 3853984 3918414 4009125 4126730 4267286 4421628 4575407 4710022 4804233 4836588
37160 4836588 4789025 4651216 4423941 4119648 3759252 3365949 2958669 2548692 2141216 1739963
37150 1739963 1350592 980578 637074 325527 49683 -188377 -388576 -552125 -678948
37141 -678948 -764857 -801000 -776386 -682219 -516164 -284940 -3805 307611 631661 958020
37131 958020 1285494 1620195 1971746 2348992 2755765 3187390 3629212 4058423 4449286 4780356
37121 4780356 5041202 5235608 5378908 5489550 5578463 5642015 5662989 5619282 5495119 5287932
37111 5287932 5007197 4667233 4279879 3852151 3389325 2899798 2398011 1904471 1443905
37102 1443905 1042169 721786 496793 369100 328425 355887 429545 529822 643229 763272
$$ packed form
37170C811148M2836O4430R0711J17605J40556J54342J53779J34615R4211L2355
37160D836588m7563j37809k27275l04293l60396l93303m07280m09977m07476m01253
37150A739963l89371l70014l43504l11547k75844k38060k00199j63549j26823
37141f78948q5909l6143K4614R4167J66055K31224K81135L11416L24050L26359
37131I58020L27474L34701L51551L77246M06773M31625M41822M29211L90863L31070
37121D780356K60846J94406J43300J10642Q8913O3552K0974m3707j24163k07187
37111E287932k80735l39964l87354m27728m62826m89527n01787m93540m60566
37102A443905m01736l20383k24993j27693m0675K7462P3658J00277J13407J20043
$$ plain form
37092 763272 888262 1017019 1144588 1260048 1347591 1390660 1377543 1305716 1182537 1021956
37082 1021956 839612 649568 464157 295503 156078 57183 6579 7092 56599 148315 270788
37071 270788 408089 541038 649567 715983 729090 688475 606922 508860 424676 383073 404036
37060 404036 494289 646572 843512 1064881 1294651 1524191 1750636 1972452 2185091 2378461
37050 2378461 2536767 2640397 2669426 2608010 2448780 2195952 1866112 1486427 1090879 715095
37040 715095 389940 134975 -45503 -161347 -230617 -272010 -298928 -316465 -320900 -301059 -241017
37029 -241017 -123590 65868 335519 683494 1096162 1549652 2014726 2463122 2872581 3228657
37019 3228657 3523593 3754646 3924105 4040729 4120010 4181344 4243261 4319594 4418133 4540995
$$ packed form
37092G63272J24990J28757J27569J15460Q7543M3069j3117p1827j23179j60581
37082A021956j82344j90044j85411j68654j39425r8895n0604N13M9507R1716J22473
37071B70788J37301J32949J08529O6416J3107m0615q1553r8062q4184m1603K0963
37060D04036R0253J52283J96940K21369K29770K29540K26445K21816K12639J93370
37050B378461J58306J03630K9029o1416j59230k52828l29840l79685l95548l75784
37040G15095l25155k54965j80478j15844o9270m1393k6918j7537m435J9841O0042
37029b41017J17427J89458K69651L47975M12668M53490M65074M48396M09459L56076
37019C228657K94936K31053J69459J16624P9281O1334O1917P6333R8539J22862
$$ plain form
37009 4540995 4685623 4846562 5018407 5199002 5390771 5598920 5827420 6075141 6334086
37000 6334086 6589770 6822653 7010094 7129819 7166011 7116930 7000302 6852282 6718627 6640978
36990 6640978 6644144 6729925 6879586 7062813 7248352 7411804 7538425 7621565 7659478 7653479 7608679
36979 7608679 7535849 7451960 7378364 7337569 7349591 7427564 7572353 7768101 7982566 8174596
36969 8174596 8306548 8355551 8317854 8205190 8037215 7835463 7620715 7411372 7219773 7047011
36959 7047011 6880426 6697215 6473461 6194290 5860909 5492804 5125255 4802746 4569249
36950 4569249 4457756 4482780 4638646 4903552 5246659 5634803 6036817 6425739 6780640 7089461
36940 7089461 7351950 7579750 7791405 8003827 8225362 8455393 8690919 8935282 9202418
$$ packed form
37009D540995J44628J60939J71845J80595J91769K08149K28500K47721K58945
37000F334086K55684K32883J87441J19725L6192m9081j16628j48020j33655p7649
36990F640978L166Q5781J49661J83227J85539J63452J26621Q3140L7913n999m4800
36979G608679p2830q3889p3596m0795J2022P7973J44789J95748K14465J92030
36969H174596J31952M9003l7697j12664j67975k01752k14748k09343j91599j72762
36959G047011j66585j83211k23754k79171l33381l68105l67549l22509k33497
36950D569249j11493K5024J55866K64906L43107L88144M02014L88922L54901L08821
36940G089461K62489K27800K11655K12422K21535K30031K35526K44363K67136
$$ plain form
36931 9202418 9513622 9889715 10344419 10882001 11497333 12175429 12890974 13610865 14300668
36922 14300668 14931907 15486685 15959081 16354670 16688712 16982871 17261589 17550005 17873571
36913 17873571 18257136 18721334 19276622 19917655 20621479 21352008 22070748 22750068 23382831
36904 23382831 23983263 24578441 25194705 25845750 26527945 27224350 27913787 28578549 29205793
36895 29205793 29782795 30291125 30705731 31001192 31161897 31189841 31105672 30943555 30744130 30549332
36885 30549332 30399417 30330288 30369908 30534668 30827722 31240600 31757995 32364089 33047814 33804560
36875 33804560 34633626 35533273 36496500 37509720 38554495 39611439 40665264 41709560
36867 41709560 42749312 43799752 44882182 46019104 47230664 48533136 49939405 51460968
$$ packed form
36931I202418L11204L76093M54704N37582O15332O78096P15545P19891O89803
36922A4300668O31239N54778M72396L95589L34042K94159K78718K88416L23566
36913A7873571L83565M64198N55288O41033P03824P30529P18740O79320O32763
36904B3382831O00432N95178O16264O51045O82195O96405O89437O64762O27244
36895B9205793N77002N08330M14606K95461J60705K7944q4169j62117j99425j94798
36885C0549332j49915o9129L9620J64760K93054M12878N17395O06094O83725P56746
36875C3804560Q29066Q99647R63227J013220J044775J056944J053825J044296
36867D1709560J039752J050440J082430J136922J211560J302472J406269J521563
$$ plain form
36859 51460968 53109989 54899535 56841343 58942729 61204756 63622515 66187506 68892102
36851 68892102 71735479 74728259 77892869 81259795 84863630 88742581 92940740 97508938
36843 97508938 102500885 107965521 113939877 120446514 127496643 135096986 143257573 151998602
36835 151998602 161354967 171376715 182123849 193655989 206019929 219238720 233303941
36828 233303941 248170020 263747988 279896666 296411359 313012016 329333194 344917803
36821 344917803 359218114 371611076 381436937 388065293 390981136 389871036 384684318 375649651
36813 375649651 363241799 348109389 330984912 312599319 293617215 274599183 255988736
36806 255988736 238115608 221206220 205396273 190745029 177252110 164875558 153548203
$$ packed form
36859E1460968J649021J789546J941808K101386K262027K417759K564991K704596
36851F8892102K843377K992780L164610L366926L603835L878951M198159M568198
36843I7508938M991947N464636N974356O506637P050129P600343Q160587Q741029
36835A51998602R356365J0021748J0747134J1532140J2363940J3218791J4065221
36828B33303941J4866079J5577968J6148678J6514693J6600657J6321178J5584609
36821C44917803J4300311J2392962R825861O628356K915843j110100n186718r034667
36813C75649651j2407852j5132410j7124477j8385593j8982104j9018032j8610447
36806B55988736j7873128j6909388j5809947j4651244j3492919j2376552j1327355
$$ plain form
36799 153548203 143190553 133720143 125058010 117132840 109883494 103260825 97228541 91761498
36791 91761498 86839948 82440553 78527761 75050245 71945105 69148527 66607783 64288862
36783 64288862 62176735 60269349 58569122 57076006 55784533 54684714 53764741 53013259
36775 53013259 52420215 51976634 51674109 51504717 51461792 51540973 51739486 52051579 52460783 52933176
36765 52933176 53416312 53845060 54151529 54275205 54171166 53815538 53207206 52364860 51320642
36756 51320642 50113744 48786599 47382850 45944034 44503562 43080056 41673949 40269907
36748 40269907 38844459 37375660 35850757 34269146 32640717 30981969 29312488 27652862
36740 27652862 26023716 24445143 22935879 21511835 20183854 18955081 17818740 16757147
$$ packed form
36799A53548203j0357650r470410q662133p925170p249346o622669o032284n467043
36791I1761498m921550m399395l912792l477516l105140k796578k540744k318921
36783F4288862k112127j907386j700227j493116j291473j099819r19973p51482
36775E3013259n93044m43581l02525j69392m2925P9181J98513L12093M09204M72393
36765E2933176M83136M28748L06469J23676j04039l55628o08332q42346j044218
36756E1320642j206898j327145j403749j438816j440472j423506j406107j404042
36748D0269907j425448j468799j524903j581611j628429j658748j669481j659626
36740B7652862j629146j578573j509264j424044j327981j228773j136341j061593
$$ plain form
36732 16757147 15742886 14742931 13725697 12669725 11571265 10447392 9332108 8265940
36724 8265940 7283438 6404691 5634404 4967268 4395070 3911218 3510604 3185636 2921900
36715 2921900 2697913 2491181 2288091 2091866 1923632 1815757 1800965 1902720 2130839 2482349
36705 2482349 2944157 3494484 4103392 4735049 5353044 5926927 6437197 6877302 7252717
36696 7252717 7577567 7869410 8143594 8409404 8669445 8921712 9161597 9381292 9566706
36687 9566706 9695222 9737790 9665815 9459955 9117210 8654110 8105079 7515779 6932440 6390147
36677 6390147 5904614 5471313 5072360 4687188 4301203 3909345 3516033 3134272 2783774
36668 2783774 2485638 2253336 2084151 1956353 1834280 1679179 1460976 1165835 796531
$$ packed form
36732A6757147j014261r99955j017234j055972j098460j123873j115284j066168
36724H265940r82502q78747p70287o67136n72198m83852m00614l24968k63736
36715B921900k23987k06732k03090j96225j68234j07875j4792J01755K28119L51510
36705B482349M61808N50327O08908O31657O17995N73883N10270M40105L75415
36696G252717L24850K91843K74184K65810K60041K52267K39885K19695J85414
36687I566706J28516M2568p1975k05860l42745m63100n49031n89300n83339n42293
36677F390147m85533m33301l98953l85172l85985l91858l93312l81761l50498
36668B783774k98136k32302j69185j27798j22073j55101k18203k95141l69304
$$ plain form
36659 796531 367118 -103032 -591544 -1071818 -1511956 -1877170 -2136519 -2271996 -2285561 -2199161
36649 -2199161 -2045875 -1856338 -1647816 -1420754 -1162300 -853668 -478970 -33942 467995
36640 467995 995397 1505389 1955168 2314128 2572084 2740870 2849107 2932358 3022082 3136656
36630 3136656 3276950 3427603 3563432 3658647 3695698 3670792 3594358 3486571 3370053 3263070
36620 3263070 3175826 3110449 3063531 3029700 3005199 2990727 2992733 3022374 3092303 3212783 3389345
36609 3389345 3623179 3913162 4256672 4647394 5071647 5507388 5929130 6317555 6668441
36600 6668441 6995077 7322098 7673519 8060439 8473318 8881370 9238945 9496728 9614332
36591 9614332 9570508 9367671 9029248 8591269 8092663 7569160 7052417 6571542 6152590 5814731
$$ packed form
36659G96531m29413m70150m88512m80274m40138l65214k59349j35477j3565Q6400
36649b199161J53286J89537K08522K27062K58454L08632L74698M45028N01937
36640D67995N27402N09992M49779L58960K57956J68786J08237Q3251Q9724J14574
36630C136656J40294J50653J35829R5215L7051k4906p6434j07787j16518j06983
36620C263070q7244o5377m6918l3831k4501j4472K006K9641O9929J20480J76562
36609C389345K33834K89983L43510L90722M24253M35741M21742L88425L50886
36600F668441L26636L27021L51421L86920M12879M08052L57575K57783J17604
36591I614332m3824k02837l38423m37979m98606n23503n16743m80875m18952l37859
$$ plain form
36581 5814731 5565807 5401147 5307069 5267357 5269574 5308354 5384373 5499936 5654144 5840654
36571 5840654 6048910 6267368 6486713 6702042 6913647 7125858 7343527 7567089 7788429
36562 7788429 7989819 8146631 8232617 8225438 8110621 7883713 7551576 7132986 6656898 6156951
36552 6156951 5664013 5201098 4783321 4420781 4120137 3883349 3706000 3577906 3485896 3416747
36542 3416747 3358971 3303905 3246876 3188335 3133903 3092365 3071668 3074647 3096947 3128805 3159971
36531 3159971 3184945 3205161 3226325 3252294 3279641 3297157 3291224 3253841 3188322 3109339 3037282
36520 3037282 2989759 2974343 2986044 3010698 3032581 3042468 3041740 3039823 3046016 3061121 3074852 3070600
36508 3070600 3033460 2956229 2841540 2701254 2554195 2422418 2326821 2283551 2301368 2378928
$$ packed form
36581E814731k48924j64660r4078l9712K217L8780P6019J15563J54208J86510
36571E840654K08256K18458K19345K15329K11605K12211K17669K23562K21340
36562G788429K01390J56812Q5986p179j14817k26908l32137m18590m76088m99947
36552F156951m92938m62915m17777l62540l00644k36788j77349j28094r2010o9149
36542C416747n7776n5066n7029n8541n4432m1538k0697K979K2300L1858L1166
36531C159971K4974K0216K1164K5969K7347J7516n933l7383o5519p8983p2057
36520C037282m7523j5416J1701K4654K1883R887p28j917O193J5105J3731m252
36508C070600l7140p7231j14689j40286j47059j31777r5597m3270J7817P7560
$$ plain form
36498 2378928 2502194 2644359 2770376 2845327 2843474 2754470 2584477 2351940 2080451 1792815
36488 1792815 1509012 1246988 1022489 845244 712487 604029 483643 308630 44683
36479 44683 -320602 -772044 -1271532 -1770550 -2224873 -2605405 -2901546 -3117431 -3264606 -3355290
36469 -3355290 -3398424 -3398291 -3354364 -3261225 -3108503 -2881826 -2565783 -2148384 -1625048 -1000641
36459 -1000641 -289739 483950 1288916 2088079 2841454 3508706 4052525 4444268 4671051
36450 4671051 4740401 4678581 4522131 4306154 4054507 3775956 3467456 3122204 2737962 2321905
36440 2321905 1891021 1469597 1085638 767155 538444 416631 408788 510094 703411 960673
36430 960673 1246178 1521320 1750094 1905109 1973969 1964666 1906817 1845633 1829112 1893621 2054309
$$ packed form
36498B378928J23266J42165J26017P4951j853q9004j69993k32537k71489k87636
36488A792815k83803k62024k24499j77245j32757j08458j20386j75013k63947
36479D4683l65285m51442m99488m99018m54323l80532k96141k15885j47175r0684
36469c355290m3134J33M3927R3139J52722K26677L16043M17399N23336O24407
36459a000641P10902P73689Q04966P99163P53375O67252N43819L91743K26783
36450D671051O9350o1820j56450k15977k51647k78551l08500l45252l84242m16057
36440B321905m30884m21424l83959l18483k28711j21813p843J01306J93317K57262
36430I60673K85505K75142K28774J55015O8860r303n7849o1184j6521O4509J60688
$$ plain form
36419 2054309 2303525 2615734 2955339 3284336 3567982 3777943 3893722 3904011 3808597 3619603
36409 3619603 3360588 3063383 2763675 2495517 2284305 2139328 2049575 1986809 1916479 1812115
36399 1812115 1666133 1491780 1315744 1165934 1060742 1004337 988781 1000720 1029266 1071933
36389 1071933 1136339 1236667 1386066 1588452 1833849 2099107 2352362 2558147 2681550 2692160
36379 2692160 2568820 2304615 1910317 1414702 860916 298979 -224001 -672545 -1027014
36370 -1027014 -1282491 -1444495 -1524570 -1537326 -1498778 -1425306 -1332945 -1237023 -1152107 -1091909 -1068425
36359 -1068425 -1089762 -1156937 -1261158 -1383381 -1497098 -1573905 -1590141 -1532585 -1401553 -1210376
36349 -1210376 -980944 -735989 -490813 -248763 -3849 250290 510747 761707 979876
$$ packed form
36419B054309K49216L12209L39605L28997K83646K09961J15779J0289r5414j88994
36409C619603k59015k97205k99708k68158k11212j44977q9753o2766p0330j04364
36399A812115j45982j74353j76036j49810j05192n6405j5556J1939K8546M2667
36389A071933O4406J00328J49399K02386K45397K65258K53255K05785J23403J0610
36379B692160j23340k64205l94298m95615n53786n61937n22980m48544l54469
36370a027014k55477j62004q0075j2756L8548P3472R2361R5922Q4916O0198K3484
36359a068425k1337o7175j04221j22223j13717p6807j6236N7556J31032J91177
36349a210376K29432K44955K45176K42050K44914K54139K60457K50960K18169
$$ plain form
36340 979876 1146248 1257712 1332178 1404344 1514024 1692529 1953335 2290837 2686662 3119216
36330 3119216 3570956 4030234 4488754 4938196 5368917 5770940 6135883 6458919 6740555
36321 6740555 6987685 7212884 7431521 7657747 7901457 8167883 8459864 8780823 9135687
36312 9135687 9528463 9958163 10416503 10889262 11359818 11811569 12227429 12587756 12869922
36303 12869922 13051643 13117372 13064825 12908714 12680230 12422426 12182568 12003532 11916863 11939447
36293 11939447 12073729 12309856 12628646 13005692 13416676 13842501 14272180 14702864 15138300
36284 15138300 15586958 16059530 16564731 17103742 17665879 18228619 18762710 19239571 19636523
36275 19636523 19937445 20129986 20202709 20144628 19947155 19606711 19126560 18517777 17800326 17004361
$$ packed form
36340I79876J66372J11464P4466P2166J09680J78505K60806L37502L95825M32554
36330C119216M51740M59278M58520M49442M30721M02023L64943L23036K81636
36321F740555K47130K25199K18637K26226K43710K66426K91981L20959L54864
36312I135687L92776M29700M58340M72759M70556M51751M15860L60327K82166
36303A2869922J81721O5729n2547j56111k28484k57804k39858j79036q6669K2584
36293A1939447J34282K36127L18790L77046M10984M25825M29679M30684M35436
36284A5138300M48658M72572N05201N39011N62137N62740N34091M76861L96952
36275A9636523L00922J92541P2723n8081j97473l40444m80151o08783p17451p95965
$$ plain form
36265 17004361 16170060 15343724 14570027 13883553 13303747 12835055 12470846 12198535 12004240
36256 12004240 11876306 11806998 11791693 11825788 11900856 12001838 12106324 12186057 12210581 12152750
36246 12152750 11994815 11732414 11373850 10934627 10430429 9872668 9268373 8622962 7943277
36237 7943277 7239692 6527815 5830223 5177028 4603029 4140483 3809625 3611312 3525413 3515398
36227 3515398 3536626 3545108 3504732 3392072 3198162 2926573 2587964 2193243 1749091 1259025
36217 1259025 729792 178556 -365090 -865243 -1291107 -1626961 -1874944 -2050020 -2171627
36208 -2171627 -2257464 -2321200 -2371626 -2410354 -2429093 -2410889 -2338045 -2203655 -2019243 -1812828 -1618001
36197 -1618001 -1460227 -1347210 -1266661 -1190965 -1086395 -923971 -688509 -382305 -22032 368827
$$ packed form
36265A7004361q34301q26336p73697o86474n79806m68692l64209k72311j94295
36256A2004240j27934o9308j5305L4095P5068J00982J04486P9733K4524n7831
36246A2152750j57935k62401l58564m39223n04198n57761o04295o45411o79685
36237G943277p03585p11877o97592o53195n73999m62546l30858j98313q5899j0015
36227C515398K1228Q482m0376j12660j93910k71589l38609l94721m44152m90066
36217A259025n29233n51236n43646n00153m25864l35854k47983j75076j21607
36208b171627q5837o3736n0426l8728j8739J8204P2844J34390J84412K06415J94827
36197a618001J57774J13017Q0549P5696J04570J62424K35462L06204L60273L90859
$$ plain form
36187 368827 767340 1154896 1517246 1842678 2119862 2336154 2477261 2529538 2485180 2348320
36177 2348320 2138238 1886549 1628639 1393576 1198246 1048862 947942 901379 920699 1019368
36167 1019368 1205857 1477850 1820753 2210941 2621764 3029536 3417406 3776194 4102306
36158 4102306 4393978 4647850 4857616 5014955 5111566 5140826 5098522 4982933 4794633 4536199
36148 4536199 4211610 3824999 3378688 2871515 2299241 1658076 950152 188104 -603641
36139 -603641 -1391099 -2135109 -2796351 -3340189 -3741165 -3987106 -4082467 -4049870 -3928474 -3768487
36129 -3768487 -3622646 -3536532 -3539566 -3638554 -3815851 -4033847 -4245123 -4404807 -4480606 -4457701
36119 -4457701 -4338252 -4137346 -3877838 -3585999 -3288204 -3007580 -2760144 -2551918 -2379424
$$ packed form
36187C68827L98513L87556L62350L25432K77184K16292J41107N2277m4358j36860
36177B348320k10082k51689k57910k35063j95330j49384j00920m6563J9320R8669
36167A019368J86489K71993L42903L90188M10823M07772L87870L58788L26112
36158D102306K91672K53872K09766J57339R6611K9260m2304j15589j88300k58434
36148D536199l24589l86611m46311n07173n72274o41165p07924p62048p91745
36139f03641p87458p44010o61242n43838m00976k45941r5361L2597J21396J59987
36129c768487J45841Q6114l034r8988j77297k17996k11276j59684p5799K2905
36119d457701J19449K00906K59508K91839K97795K80624K47436K08226J72494
$$ plain form
36110 -2379424 -2234205 -2109267 -2004091 -1925719 -1885555 -1894215 -1958158 -2080266 -2262452 -2505977
36100 -2505977 -2807767 -3155958 -3529439 -3902622 -4252306 -4562830 -4828076 -5050819 -5239654
36091 -5239654 -5403347 -5543594 -5649940 -5701626 -5677812 -5571026 -5394799 -5179793 -4961192 -4765785
36081 -4765785 -4605451 -4477931 -4371805 -4272369 -4166618 -4046739 -3912370 -3772038 -3643246 -3549768
36071 -3549768 -3515479 -3556192 -3672793 -3848613 -4052167 -4243927 -4384074 -4438342 -4381508 -4200175
36061 -4200175 -3895869 -3486914 -3006799 -2498681 -2007893 -1574561 -1227690 -982272 -841100
36052 -841100 -801135 -860882 -1023855 -1295623 -1676616 -2155879 -2710056 -3308134 -3918837 -4516592
36042 -4516592 -5083672 -5608810 -6084290 -6503955 -6863210 -7159981 -7394181 -7564679 -7665682
$$ packed form
36110b379424J45219J24938J05176P8372M0164q660o3943j22108j82186k43525
36100b505977l01790l48191l73481l73183l49684l10524k65246k22743j88835
36091e239654j63693j40247j06346n1686K3814J06786J76227K15006K18601J95407
36081d765785J60334J27520J06126R9436J05751J19879J34369J40332J28792R3478
36071c549768L4289m0713j16601j75820k03554j91760j40147n4268N6834J81333
36061d200175L04306M08955M80115N08118M90788M33332L46871K45418J41172
36052h41100L9965n9747j62973k71768l80993m79263n54177n98078o10703n97755
36042d516592n67080n25138m75480m19665l59255k96771k34200j70498j01003
$$ plain form
36033 -7665682 -7685793 -7611142 -7430999 -7143464 -6759706 -6305556 -5818661 -5340110 -4902584 -4520163
36023 -4520163 -4185130 -3873761 -3558461 -3220463 -2857375 -2483072 -2121449 -1797989 -1532997
36014 -1532997 -1338627 -1219818 -1177123 -1208446 -1307544 -1460148 -1640852 -1813635 -1936619 -1969844
36004 -1969844 -1884088 -1668348 -1333049 -906949 -428597 63903 540658 983254 1384152 1744068
35994 1744068 2068816 2366387 2644279 2907088 3154591 3380841 3574505 3719948 3798221 3787739
35984 3787739 3665666 3411442 3013042 2474523 1821584 1101520 375688 -294063 -860350
35975 -860350 -1300896 -1621113 -1848485 -2021628 -2177538 -2339729 -2509435 -2662695 -2755995 -2740105
35965 -2740105 -2576550 -2248418 -1760574 -1132126 -389173 436349 1303285 2159941 2949519
$$ packed form
36033g665682k0111P4651J80143K87535L83758M54150M86895M78551M37526L82421
36023d520163L35033L11369L15300L37998L63088L74303L61623L23460K64992
36014a532997J94370J18809M2695l1323r9098j52604j80704j72783j22984l3225
36004a969844Q5756K15740L35299M26100M78352M92500M76755M42596M00898L59916
35994A744068L24748K97571K77892K62809K47503K26250J93664J45443P8273j0482
35984C787739j22073k54224l98400n38519o52939p20064p25832o69751n66287
35975h60350m40546l20217k27372j73143j55910j62191j69706j53260r3300J5890
35965b740105J63555L28132M87844O28448P42953Q25522Q66936Q56656P89578
$$ plain form
35956 2949519 3620723 4137926 4486340 4671649 4716074 4652887 4520359 4355697 4189575 4041804
35946 4041804 3918845 3814276 3713447 3601843 3474040 3338425 3214579 3124246 3080474 3080065
35936 3080065 3102211 3113160 3074923 2955386 2737027 2421642 2029497 1593298 1149121 727077
35926 727077 344219 1465 -314681 -626662 -958990 -1332198 -1758394 -2238190 -2759366 -3298176
35916 -3298176 -3823474 -4302078 -4703274 -5001684 -5179183 -5226396 -5143058 -4936173 -4616879 -4198813
35906 -4198813 -3699989 -3146388 -2572600 -2016506 -1510256 -1073034 -709531 -413439 -172927
35897 -172927 23899 183953 304948 373680 368576 266746 53149 -272175 -692277 -1177044
35887 -1177044 -1689177 -2188832 -2636571 -2997075 -3244982 -3370471 -3380321 -3292351 -3125871 -2893985
$$ packed form
35956B949519O71204N17203L48414J85309M4425o3187j32528j64662j66122j47771
35946D041804j22959j04569j00829j11604j27803j35615j23846r0333m3772m09
35936C080065K2146J0949l8237j19537k18359l15385l92145m36199m44177m22044
35926G27077l82858l42754l16146l11981l32328l73208m26196m79796n21176n38810
35916c298176n25298m78604m01196k98410j77499m7213Q3338K06885L19294M18066
35906d198813M98824N53601N73788N56094N06250M37222L63503K96092K40512
35897a72927J96826J60054J20995O8732n104j01830k13597l25324m20102m84767
35887a177044n12133m99655m47739l60504k47907j25489r850Q7970J66480K31886
$$ plain form
35877 -2893985 -2603210 -2261229 -1887343 -1517254 -1197416 -972208 -872381 -911333 -1088953 -1397700
35867 -1397700 -1825823 -2356519 -2965140 -3617310 -4269475 -4872077 -5375146 -5735941 -5927333
35858 -5927333 -5944198 -5804813 -5545955 -5213324 -4850751 -4491705 -4155315 -3847369 -3565135 -3303516
35848 -3303516 -3059753 -2834933 -2632370 -2454412 -2299312 -2159000 -2018075 -1854797 -1645175
35839 -1645175 -1370004 -1022477 -612828 -167892 274200 672515 993186 1218233 1349919
35830 1349919 1407779 1418701 1404694 1374437 1322310 1234072 1095508 900240 654450 377485
35820 377485 98103 -152825 -350659 -482993 -551086 -566958 -548329 -513977 -481073 -464702 -478248
35809 -478248 -532630 -633506 -777974 -953841 -1143008 -1327139 -1491786 -1626674 -1723550 -1775168
$$ packed form
35877b893985K90775L41981L73886L70089L19838K25208R9827l8952j77620l08747
35867a397700m28123n30696o08621o52170o52165o02602n03069l60795j91392
35858e927333j6865J39385K58858L32631L62573L59046L36390L07946K82234K61619
35848c303516K43763K24820K02563J77958J55100J40312J40925J63278K09622
35839a645175K75171L47527M09649M44936M42092L98315L20671K25047J31686
35830A349919N7860J0922j4007l0257n2127q8238j38564j95268k45790k76965
35820C77485k79382k50928j97834j32334o8093j5872J8629L4352L2904J6371j3546
35809d78248n4382j00876j44468j75867j89167j84131j64647j34888r6876n1618
$$ plain form
35799 -1775168 -1777949 -1737298 -1671531 -1610431 -1587765 -1631327 -1755656 -1960210 -2231760 -2547776 -2879088
35788 -2879088 -3192897 -3458207 -3653712 -3775035 -3836815 -3867333 -3897777 -3951642 -4039047 -4156922
35778 -4156922 -4292563 -4427709 -4542140 -4617070 -4638223 -4597739 -4494015 -4329420 -4107068 -3828910
35768 -3828910 -3497155 -3118548 -2708025 -2288144 -1884324 -1519461 -1211065 -970495 -802029
35759 -802029 -701299 -654924 -642856 -642815 -635122 -607003 -555737 -489373 -424063 -378801 -370166 -409105
35747 -409105 -499893 -640211 -821675 -1030650 -1249250 -1456310 -1628390 -1741118 -1771159 -1698982
35737 -1698982 -1512507 -1210773 -805694 -320189 217001 777254 1336113 1874291 2376136
35728 2376136 2826715 3209179 3504245 3692856 3761347 3706901 3540809 3287855 2981738 2658527
$$ packed form
35799a775168k781M0651O5767O1100K2666m3562j24329k04554k71550l16016l31312
35788b879088l13809k65310j95505j21323o1780l0518l0444n3865q7405j17875
35778d156922j35641j35146j14431p4930k1153M0484J03724J64595K22352K78158
35768c828910L31755L78607M10523M19881M03820L64863L08396K40570J68466
35759h02029J00730M6375J2068M1P693K8119N1266O6364O5310M5262Q635l8939
35747d09105r0788j40318j81464k08975k18600k07060j72080j12728l0041P2177
35737a698982J86475L01734M05079M85505N37190N60253N58859N38178N01845
35728B376136M50579L82464K95066J88611O8491n4446j66092k52954l06117l23211
$$ plain form
35718 2658527 2351093 2086144 1882735 1750100 1684707 1668765 1672169 1657641 1587550 1431302
35708 1431302 1172466 813833 378259 -95742 -562329 -977772 -1308160 -1533450 -1647746
35699 -1647746 -1657326 -1578543 -1436516 -1263878 -1098170 -977564 -936079 -999655 -1183105 -1486908
35689 -1486908 -1893765 -2367449 -2857674 -3311740 -3688520 -3967547 -4148401 -4241627 -4257106 -4196359
35679 -4196359 -4052116 -3814064 -3476867 -3046377 -2542063 -1995900 -1448570 -943381 -518234
35670 -518234 -197329 14042 128444 168749 157775 110712 34036 -69548 -194101 -326178
35660 -326178 -446297 -535742 -584908 -598058 -591475 -586294 -600179 -641768 -709313 -792968 -879154 -955249
35648 -955249 -1012942 -1049753 -1069431 -1082350 -1105944 -1163806 -1281671 -1480083 -1766159 -2128632 -2538932
$$ packed form
35718B658527l07434k64949k03409j32635o5393j5942L404j4528p0091j56248
35708A431302k58836l58633m35574m74001m66587m15443l30388k25290j14296
35699a647746r580P8783J42027J72638J65708J20606M1485o3576j83450l03803
35689a486908m06857m73684m90225m54066l76780k79027j80854r3226j5479O0747
35679d196359J44243K38052L37197M30490N04314N46163N47330N05189M25147
35670e18234L20905K11371J14402M0305j0974m7063p6676j03584j24553j32077
35660c26178j20119q9445m9166j3150O583N181j3885m1589o7545q3655q6186p6095
35648i55249n7693l6811j9678j2919k3594n7862j17865j98412k86076l62473m10300
$$ plain form
35637 -2538932 -2957300 -3340308 -3647300 -3846000 -3917981 -3862317 -3694418 -3439373 -3122840 -2763838
35627 -2763838 -2372075 -1949957 -1498030 -1021814 -537192 -71488 341047 667832 886960
35618 886960 992802 996124 919239 788853 629976 462944 303038 160370 38617 -66422
35608 -66422 -166233 -276142 -410204 -575876 -769380 -973455 -1160295 -1300355 -1372697 -1370142
35598 -1370142 -1296300 -1157915 -958225 -694221 -357532 61756 568761 1157260 1807118 2488234
35588 2488234 3168948 3823466 4434024 4987832 5472546 5874680 6182765 6393228 6514651
35579 6514651 6567021 6576110 6566284 6555209 6551427 6553577 6550173 6520526 6437675 6272959 6000839 5603365
35567 5603365 5074519 4423721 3676194 2868681 2041741 1231694 464566 -246670 -900810
$$ packed form
35637b538932m18368l83008l06992j98700p1981N5664J67899K55045L16533L59002
35627b763838L91763M22118M51927M76216M84622M65704M12535L26785K19128
35618H86960J05842L322p6885j30386j58877j67032j59906j42668j21753j05039
35608f6422r9811j09909j34062j65672j93504k04075j86840j40060p2342K555
35598a370142P3842J38385J99690K64004L36689M19288N07005N88499O49858O81116
35588B488234O80714O54518O10558N53808M84714M02134L08085K10463J21423
35579F514651N2370R089r826j1075l782K150l404k9647q2851j64716k72120l97474
35567E603365n28846o50798p47527q07513q26940q10047p67128p11236o54140
$$ plain form
35558 -900810 -1503346 -2060325 -2574855 -3047162 -3475561 -3855880 -4180462 -4439565 -4625428 -4735894
35548 -4735894 -4774781 -4749447 -4668404 -4540957 -4378247 -4193408 -3999361 -3805352 -3614904 -3426477
35538 -3426477 -3235688 -3037487 -2828516 -2610505 -2393332 -2194611 -2034935 -1931982 -1897573 -1938348
35528 -1938348 -2057522 -2255380 -2528590 -2869549 -3266414 -3703584 -4162264 -4621027 -5056553
35519 -5056553 -5444928 -5763951 -5996334 -6132708 -6172917 -6124771 -6001247 -5818284 -5594292 -5349901
35509 -5349901 -5105361 -4875075 -4662037 -4455928 -4236642 -3982142 -3677687 -3322593 -2931147
35500 -2931147 -2527105 -2135395 -1776701 -1468193 -1228529 -1081835 -1055768 -1172641 -1437368 -1829198
35490 -1829198 -2303169 -2801749 -3270754 -3671207 -3982074 -4194935 -4306012 -4310934 -4203875 -3978917
$$ packed form
35558i00810o02536n56979n14530m72307m28399l80319l24582k59103j85863j10466
35548d735894l8887K5334Q1043J27447J62710J84839J94047J94009J90448J88427
35538c426477J90789J98201K08971K18011K17173J98721J59676J02953L4409m0775
35528a938348j19174j97858k73210l40959l96865m37170m58680m58763m35526
35519e056553l88375l19023k32383j36374m0209M8146J23524J82963K23992K44391
35509e349901K44540K30286K13038K06109K19286K54500L04455L55094L91446
35500b931147M04042L91710L58694L08508K39664J46694K6067j16873k64727l91830
35490a829198m73971m98580m69005m00453l10867k12861j11077m922J07059K24958
$$ plain form
35480 -3978917 -3630857 -3155308 -2550174 -1819629 -978481 -53260 921555 1910139 2880873
35471 2880873 3808276 4671270 5449733 6121691 6662987 7050370 7267589 7312196 7199556 6961225
35461 6961225 6637729 6268723 5884580 5502332 5126672 4754504 4380428 4000893 3616331
35452 3616331 3231417 2853378 2487910 2133820 1779758 1406466 994893 536387 39538
35443 39538 -469909 -955964 -1383120 -1726873 -1980456 -2155325 -2274924 -2364504 -2442506 -2518028
35433 -2518028 -2594123 -2672335 -2754322 -2840631 -2929413 -3016660 -3096958 -3163298 -3206218 -3213872 -3174200
35422 -3174200 -3078642 -2925607 -2722085 -2483388 -2232198 -1997212 -1810108 -1699706 -1684852 -1769105
35412 -1769105 -1938997 -2165172 -2405649 -2611890 -2738110 -2751323 -2637730 -2402451 -2063374 -1642631
$$ packed form
35480c978917L48060M75549O05134P30545Q41148R25221R74815R88584R70734
35471B880873R27403Q62994P78463O71958N41296L87383K17219M4607j12640k38331
35461F961225l23496l69006l84143l82248l75660l72168l74076l79535l84562
35452C616331l84914l78039l65468l54090l54062l73292m11573m58506m96849
35443C9538n09447m86055m27156l43753k53583j74869j19599q9580p8002p5522
35433b518028p6095p8212q1987q6309q8782q7247q0298o6340m2920p654L9672
35422c174200R5558J53035K03522K38697K51190K34986J87104J10402J4854q4253
35412a769105j69892k26175k40477k06241j26220j3213J13593K35279L39077M20743
$$ plain form
35402 -1642631 -1159746 -629340 -64009 519768 1096598 1631200 2082121 2408510 2577658
35393 2577658 2571601 2391758 2060997 1622398 1133653 656457 242477 -79089 -306069 -456986
35383 -456986 -556962 -623491 -659025 -652947 -590421 -462848 -274872 -45435 196430 418672 594010
35372 594010 707135 759709 771059 773375 802699 889356 1051646 1294909 1615144 2004205 2453279
35361 2453279 2953489 3495008 4066571 4655872 5249747 5833384 6388597 6891667 7311676
35352 7311676 7610972 7749734 7695232 7433704 6980527 6383760 5717935 5068921 4515067 4111683
35342 4111683 3883416 3824420 3903093 4068579 4258358 4407621 4460188 4378474 4148628 3778727
35332 3778727 3292166 2721096 2102853 1477579 883412 348904 -113057 -505166 -839059
$$ packed form
35402a642631M82885N30406N65331N83777N76830N34602M50921L26389J69148
35393B577658o057j79843l30761m38599m88745m77196m13980l21566k26980j50917
35383d56986r9976o6529l5534O078O2526J27573J87976K29437K41865K22242J75338
35372E94010J13125N2574J1350K316K9324Q6657J62290K43263L20235L89061M49074
35361B453279N00210N41519N71563N89301N93875N83637N55213N03070M20009
35352G311676K99296J38762n4502k61528m53177n96767o65825o49014n53854m03384
35342D111683k28267n8996P8673J65486J89779J49263N2567q1714k29846l69901
35332C778727m86561n71070o18243o25274n94167n34508m61961l92109l33893
$$ plain form
35323 -839059 -1126115 -1370361 -1565629 -1696815 -1744337 -1690850 -1528440 -1263560 -917683 -523865
35313 -523865 -121499 248292 545642 733945 782401 670323 392912 -33868 -572680 -1170173
35303 -1170173 -1766974 -2308796 -2755417 -3085584 -3297021 -3401891 -3419588 -3370103 -3270820 -3137368
35293 -3137368 -2986504 -2837753 -2711541 -2624216 -2582645 -2581631 -2605860 -2635920 -2656414 -2663231 -2667044
35282 -2667044 -2691094 -2763704 -2908425 -3135663 -3438820 -3795998 -4175993 -4545438 -4873635 -5133542
35272 -5133542 -5300522 -5352206 -5271502 -5051579 -4699448 -4235430 -3688520 -3090025 -2468235 -1845529
35262 -1845529 -1237648 -654249 -99986 424366 920851 1393133 1844537 2275259 2680084
35253 2680084 3048740 3369580 3634434 3841172 3992546 4093208 4148075 4163249 4148014 4115158
$$ packed form
35323h39059k87056k44246j95268j31186m7522N3487J62410K64880L45877L93818
35313e23865M02366L69791K97350J88303M8456j12078k77411m26780n38812n97493
35303a170173n96801n41822m46621l30167k11437j04870j7697M9485R9283J33452
35293c137368J50864J48751J26212Q7325M1571J014k4229l0060k0494o817l813
35282b667044k4050p2610j44721k27238l03157l57178l79995l69445l28197k59907
35272e133542j66980n1684Q0704K19923L52131M64018N46910N98495O21790O22706
35262a845529O07881N83399N54263N24352M96485M72282M51404M30722M04825
35253B680084L68656L20840K64854K06738J51374J00662N4867J5174j5235l2856
$$ plain form
35243 4115158 4077687 4042460 4004002 3943071 3832361 3646878 3373509 3015827 2594116 2142117
35233 2142117 1700884 1309862 997687 776814 643781 583009 571334 583193 598037 608894
35223 608894 627078 678160 789503 975933 1231897 1534615 1855807 2174278 2481450 2777016
35213 2777016 3059029 3316629 3531297 3685792 3774402 3807705 3809309 3807063 3823788 3871563 3950479
35202 3950479 4049892 4149827 4222204 4233258 4148148 3937251 3582971 3086156 2470302 1780369
35192 1780369 1073955 406772 -181457 -674199 -1075771 -1401559 -1665992 -1873924 -2018851
35183 -2018851 -2087609 -2068044 -1955731 -1757537 -1491698 -1184736 -865623 -558290 -274710 -11698
35173 -11698 246449 520341 826818 1173522 1557988 1969235 2389405 2794489 3154693 3435197
$$ packed form
35243D115158l7471l5227l8458o0931j10710j85483k73369l57682m21711m51999
35233B142117m41233l91022l12175k20873j33033o0772j1675J1859J4844J0857
35223F08894J8184N1082J11343J86430K55964L02718L21192L18471L07172K95566
35213B777016K82013K57600K14668J54495Q8610L3303J604k246J6725M7775P8916
35202C950479R9413R9935P2377J1054q5110k10897l54280m96815o15854o89933
35192A780369p06414o67183n88229m92742m01572l25788k64433k07932j44927
35183b018851o8758J9565J12313J98194K65839L06962L19113L07333K83580K63012
35173a1698K58147K73892L06477L46704L84466M11247M20170M05084L60204K80504
$$ plain form
35163 3435197 3598391 3608850 3440982 3086807 2560357 1896964 1148251 374790 -361856 -1006240
35153 -1006240 -1514201 -1855884 -2016978 -1998011 -1811087 -1474626 -1008556 -432570 232373 961568
35143 961568 1725572 2491465 3225672 3897421 4482265 4964938 5340610 5614148 5797769 5907590
35133 5907590 5959146 5962496 5919386 5825902 5681389 5499316 5312743 5169666 5119583 5197706 5413775
35122 5413775 5749136 6161601 6594928 6989601 7292963 7467663 7496801 7383538 7144391 6799315
35112 6799315 6364857 5855361 5291151 4706374 4148545 3667799 3301440 3062226 2935755
35103 2935755 2886830 2870855 2845383 2778215 2651156 2460828 2218057 1945692 1673756 1432159
35093 1432159 1242894 1113915 1036233 985684 930191 840798 701574 513757 293194 64202
$$ packed form
35163C435197J63194J0459j67868l54175n26450o63393p48713p73461p36646o44384
35153a006240n07961l41683j61094J8967J86924L36461M66070N75986O64943P29195
35143I61568P64004P65893P34207O71749N84844M82673L75672K73538J83621J09821
35133E907590N1556L350m3110r3484j44513j82073j86573j43077n0083P8123K16069
35122E413775L35361M12465M33327L94673L03362J74700K9138j13263k39147l45076
35112F799315m34458n09496n64210n84777n57829m80746l66359k39214j26471
35103B935755m8925j5975k5472o7168j27059j90328k42771k72365k71936k41597
35093A432159j89265j28979p7682n0549n5493q9393j39224j87817k20563k28992
$$ plain form
35083 64202 -146214 -312091 -410958 -426935 -355170 -205817 -4148 215143 417660 578730
35073 578730 688757 753386 789389 818192 859280 925395 1020210 1137931 1264267 1379094 1461264
35062 1461264 1494690 1472971 1399548 1282640 1127859 933371 690910 392321 38484 -353414
35052 -353414 -748307 -1100040 -1365457 -1519359 -1562167 -1516571 -1416648 -1296223 -1181082 -1085568
35042 -1085568 -1012325 -954100 -897016 -824737 -722795 -582104 -400207 -179357 77571 370407
35032 370407 701646 1073078 1481697 1917455 2363274 2796166 3188995 3513920 3748203 3880571
35022 3880571 3914795 3868285 3766215 3633940 3491050 3349727 3217690 3102556 3013173 2956196
35012 2956196 2930797 2925983 2922384 2896834 2827149 2695693 2491403 2210395 1855497 1435357 963479
$$ packed form
35083F4202k10416j65877r8867j5977P1765J49353K01669K19291K02517J61070
35073E78730J10027O4629L6003K8803M1088O6115R4815J17721J26336J14827Q2170
35062A461264L3426k1719p3423j16908j54781j94488k42461k98589l53837l91898
35052c53414l94893l51733k65417j53902m2808M5596R9923J20425J15141R5514
35042a085568P3243N8225N7084P2279J01942J40691J81897K20850K56928K92836
35032C70407L31239L71432M08619M35758M45819M32892L92829L24925K34283J32368
35022C880571L4224m6510j02070j32275j42890j41323j32037j15134q9383n6977
35012B956196k5399m814l599k5550o9685j31456k04290k81008l54898m20140m71878
$$ plain form
35001 963479 457006 -65099 -584262 -1084031 -1550254 -1969815 -2329951 -2620522 -2838981 -2994215
34991 -2994215 -3105295 -3195303 -3284107 -3383799 -3497527 -3620901 -3745162 -3861020 -3961155 -4040366
34981 -4040366 -4094841 -4122836 -4126497 -4111915 -4085589 -4049204 -3996541 -3914613 -3787981 -3603816 -3356038
34970 -3356038 -3047777 -2691696 -2307637 -1917796 -1540829 -1187051 -856520 -540858 -228546
34961 -228546 87870 405962 712533 988648 1217193 1387521 1494671 1535651 1507639 1410323
34951 1410323 1250452 1045031 820996 611118 447124 351818 333276 384074 485705 615117
34941 615117 749449 867779 951528 985531 960139 873585 734090 561070 383811 235499
34931 235499 142936 116386 145908 207266 273854 327084 359947 374607 378499 381727 394987 426744
$$ packed form
35001I63479n06473n22105n19163m99769m66223m19561l60136k90571k18459j55234
34991b994215j11080r0008q8804r9692j13728j23374j24261j15858j00135p9211
34981d040366n4475k7995l661J4582K6326L6385N2663Q1928J26632J84165K47778
34970c356038L08261L56081L84059L89841L76967L53778L30531L15662L12312
34961b28546L16416L18092L06571K76115K28545J70328J07150M0980k8012r7316
34951A410323j59871k05421k24035k09878j63994r5306j8542N0798J01631J29412
34941F15117J34332J18330Q3749L4003k5392q6554j39495j73020j77259j48312
34931B35499r2563k6550K9522O1358O6588N3230L2863J4660L892L228J3260L1757
$$ plain form
34919 426744 480976 557888 657460 782392 937326 1125020 1343231 1585132 1842512 2108650
34909 2108650 2378713 2648098 2910402 3155960 3371100 3538849 3642399 3671253 3627249 3526497
34899 3526497 3395422 3262532 3149507 3065079 3003677 2948938 2879970 2777380 2627193 2423208
34889 2423208 2169081 1879890 1580986 1302462 1070154 896561 775459 682507 581689 435219
34879 435219 213438 -98025 -494742 -953407 -1435270 -1893605 -2284464 -2577495 -2762185 -2846853
34869 -2846853 -2851754 -2800682 -2715053 -2611437 -2500858 -2388088 -2271030 -2141562 -1988454 -1801059
34859 -1801059 -1571587 -1294971 -967473 -586313 -151673 329711 841744 1359132 1851134
34850 1851134 2287552 2644558 2908031 3073542 3144125 3128039 3037548 2887370 2690893 2454880
$$ packed form
34919D26744N4232P6912R9572J24932J54934J87694K18211K41901K57380K66138
34909B108650K70063K69385K62304K45558K15140J67749J03550K8854m4004j00752
34899C526497j31075j32890j13025q4428o1402n4739o8968j02590j50187k03985
34889B423208k54127k89191k98904k78524k32308j73593j21102r2952j00818j46470
34879D35219k21781l11463l96717m58665m81863m58335l90859k93031j84690q4668
34869b846853m901N1072Q5629J03616J10579J12770J17058J29468J53108J87395
34859a801059K29472K76616L27498L81160M34640M81384N12033N17388M92002
34850A851134M36418L57006K63473J65511P0583j6086r0491j50178j96477k36013
$$ plain form
34840 2454880 2176237 1844021 1446115 976812 441566 -142747 -751907 -1361248 -1952496
34831 -1952496 -2517022 -3053749 -3563155 -4041106 -4475982 -4850314 -5145486 -5346397 -5443589 -5432746
34821 -5432746 -5313726 -5090800 -4773743 -4378311 -3925503 -3439848 -2946476 -2466592 -2012777
34812 -2012777 -1587641 -1188539 -816687 -484726 -216639 -38383 36086 15511 -67274 -163889
34802 -163889 -224489 -211436 -108040 79417 325939 596149 853874 1070494 1230435 1332735
34792 1332735 1387990 1411474 1415445 1404785 1378474 1335635 1281493 1228343 1190029 1173373 1172945 1173689
34780 1173689 1160162 1126035 1077354 1028072 992112 977889 988006 1022140 1079269 1157298 1251302
34769 1251302 1352759 1450658 1533525 1591221 1616748 1608833 1574591 1529939 1496029 1492861 1533421
$$ packed form
34840B454880k78643l32216l97906m69303n35246n84313o09160o09341n91248
34831a952496n64526n36727n09406m77951m34876l74332k95172k00911r7192J0843
34821e432746J19020K22926L17057L95432M52808M85655M93372M79884M53815
34812b012777M25136L99102L71852L31961K68087J78256P4469k0575q2785r6615
34802a63889o0600J3053J03396J87457K46522K70210K57725K16620J59941J02300
34792A332735N5255K3484L971j0660k6311m2839n4142n3150l8314j6656m28P44
34780A173689j3527l4127m8681m9282l5960j4223J0117L4134N7129P8029R4004
34769A251302J01457R7899Q2867N7696K5527p915l4242m4652l3910l168M0560
$$ plain form
34758 1533421 1620801 1747952 1898295 2046398 2159888 2203826 2147476 1971886 1676614 1284052
34748 1284052 839331 403572 40313 -201121 -298638 -261454 -124464 63992 256657 420310
34738 420310 543500 636224 721357 821135 943718 1074665 1177204 1203342 1113079 892816
34728 892816 561816 161748 -264969 -695300 -1133672 -1605649 -2142495 -2764568 -3469868 -4230820
34718 -4230820 -4999348 -5718008 -6333437 -6807889 -7125564 -7292535 -7331221 -7272025 -7145138 -6974767
34708 -6974767 -6776729 -6559290 -6326587 -6083430 -5839412 -5610291 -5415822 -5275153 -5201721 -5199135
34698 -5199135 -5259081 -5362157 -5482027 -5591704 -5669674 -5703698 -5691426 -5638364 -5554757 -5453108
34688 -5453108 -5346864 -5249174 -5170623 -5116916 -5088764 -5084540 -5103190 -5144512 -5206690 -5283629 -5364220
$$ packed form
34758A533421Q7380J27151J50343J48103J13490M3938n6350j75590k95272l92562
34748A284052m44721m35759l63259k41434r7517L7184J36990J88456J92665J63653
34738D20310J23190R2724Q5133R9778J22583J30947J02539K6138r0263k20263
34728H92816l31000m00068m26717m30331m38372m71977n36846o22073p05300p60952
34718d230820p68528p18660o15429m74452l17675j66971l8686N9196J26887J70371
34708f974767J98038K17439K32703K43157K44018K29121J94469J40669P3432K586
34698e199135n9946j03076j19870j09677p7970l4024J2272N3062Q3607J01649
34688e453108J06244R7690P8551N3707K8152M224j8650m1322o2178p6939q0591
$$ plain form
34677 -5364220 -5433375 -5473566 -5466368 -5394674 -5245869 -5014986 -4706313 -4332880 -3914633 -3476118
34667 -3476118 -3043328 -2638857 -2276109 -1955491 -1665398 -1387969 -1106389 -809979 -495470
34658 -495470 -165801 171263 503913 818151 1102788 1356861 1595239 1847539 2148978 2527065
34648 2527065 2990705 3526756 4104248 4682383 5218062 5671435 6010379 6214211 6275047 6195470
34638 6195470 5983944 5651126 5208694 4669581 4047900 3358569 2617975 1846029 1068018
34629 1068018 314127 -383768 -996273 -1499515 -1876624 -2118659 -2225455 -2205690 -2075807 -1858838
34619 -1858838 -1584036 -1286244 -1002744 -767114 -602203 -515173 -496175 -520819 -555660 -565278
34609 -565278 -518908 -394955 -182788 117866 498825 944956 1434157 1936769 2416821 2836279
$$ packed form
34677e364220o9155m0191P198P1694J48805K30883L08673L73433M18247M38515
34667c476118M32790M04471L62748L20618K90093K77429K81580K96410L14509
34658d95470L29669L37064L32650L14238K84637K54073K38378K52300L01439L78087
34648B527065M63640N36051N77492N78135N35679M53373L38944K03832O0836p9577
34638F195470k11526l32818m42432n39113o21681o89331p40594p71946p78011
34629A068018p53891o97895o12505n03242l77109k42035j06796J9765J29883K16969
34619a858838K74802K97792K83500K35630J64911Q7030J8998k4644l4841r618
34609e65278M6370J23953K12167L00654L80959M46131M89201N02612M80052M19458
$$ plain form
34599 2836279 3160552 3362832 3426865 3349345 3142049 2831562 2454803 2051289 1655733 1294370
34589 1294370 985910 744914 584129 513945 539988 661310 870166 1152243 1486045 1841972
34579 1841972 2183270 2470461 2668723 2755326 2723454 2580777 2344891 2039522 1693206 1338033
34569 1338033 1005339 718746 488863 313395 182591 86893 23521 -223 31569 136867
34559 136867 326387 596181 926263 1285549 1639351 1954991 2204017 2363166 2416941 2362165
34549 2362165 2211527 1992441 1740219 1488732 1263943 1083801 963418 920380 975060 1144668
34539 1144668 1434555 1832480 2309959 2830813 3362777 3886098 4394628 4889480 5369612
34530 5369612 5825033 6236254 6579913 6837291 7000772 7074709 7071036 7003683 6885811 6730762
$$ packed form
34599B836279L24273K02280O4033p7520k07296l10487l76759m03514l95556l61363
34589A294370l08460k40996j60785p0184K6043J21322K08856K82077L33802L55927
34579A841972L41298K87191J98262Q6603l1872j42677k35886l05369l46316l55173
34569A338033l32694k86593k29883j75468j30804r5698o3372k3744L1792J05298
34559A36867J89520K69794L30082L59286L53802L15640K49026J59149N3775n4776
34549B362165j50638k19086k52222k51487k24789j80142j20383m3038N4680J69608
34539A144668K89887L97925M77479N20854N31964N23321N08530M94852M80132
34530E369612M55421M11221L43659K57378J63481P3937l673o7353j17872j55049
$$ plain form
34520 6730762 6554485 6376781 6219395 6100244 6025362 5983451 5948329 5889554 5784863 5626850
34510 5626850 5421501 5181999 4922235 4652261 4376255 4093096 3798600 3487374 3153205
34501 3153205 2789458 2391599 1961353 1509096 1051790 607230 187997 -201995 -567450
34492 -567450 -918554 -1265760 -1614445 -1962167 -2299994 -2616269 -2899266 -3137042 -3316679 -3426422
34482 -3426422 -3461311 -3428525 -3347719 -3245268 -3145977 -3067239 -3017634 -2998163 -3003327 -3021486 -3035968
34471 -3035968 -3027737 -2978654 -2874028 -2704223 -2465347 -2158111 -1784511 -1344480 -836031 -259637
34461 -259637 376468 1054437 1749583 2435370 3087453 3685087 4210117 4644933 4971419 5172667
34451 5172667 5237837 5168516 4983516 4718762 4420384 4132444 3884514 3685329 3525308 3384930
$$ packed form
34520F730762j76277j77704j57386j19151p4882m1911l5122n8775j04691j58013
34510E626850k05349k39502k59764k69974k76006k83159k94496l11226l34169
34501C153205l63747l97859m30246m52257m57306m44560m19233l89992l65455
34492e67450l51104l47206l48685l47722l37827l16275k82997k37776j79637j09743
34482c426422l4889L2786Q0806J02451R9291P8738M9605J9471n164j8159j4482
34471c035968Q231M9083J04626J69805K38876L07236L73600M40031N08449N76394
34461b59637O36105O77969O95146O85787O52083N97634N25030M34816L26486K01248
34451E172667O5170o9321j85000k64754k98378k87940k47930j99185j60021j40378
$$ plain form
34441 3384930 3242952 3080355 2880606 2629487 2316912 1940261 1506975 1034495 547067
34432 547067 70639 -372247 -765988 -1103357 -1384935 -1616652 -1805621 -1955566 -2064353 -2125614
34422 -2125614 -2133934 -2090345 -2004458 -1891733 -1767758 -1643415 -1524056 -1412437 -1312047 -1227395
34412 -1227395 -1160956 -1109565 -1063365 -1008099 -929415 -817177 -668283 -487313 -284898 -74136
34402 -74136 134117 335445 533199 735515 949087 1173265 1398029 1607304 1786411 1930419
34392 1930419 2049007 2164249 2301557 2478717 2699572 2955366 3231363 3513410 3790410
34383 3790410 4052173 4285344 4471082 4586903 4612082 4533677 4350246 4072021 3718303 3313845
34373 3313845 2885919 2462738 2072283 1739712 1482862 1308257 1211313 1182136 1213429 1304236
$$ packed form
34441C384930j41978j62597j99749k51119l12575l76651m33286m72480m87428
34432E47067m76428m42886l93741l37369k81578k31717j88969j49945j08787o1261
34422b125614q320M3589Q5887J12725J23975J24343J19359J11619J00390Q4652
34412a227395O6439N1391M6200N5266P8684J12238J48894J80970K02415K10762
34402g4136K08253K01328J97754K02316K13572K24178K24764K09275J79107J44008
34392A930419J18588J15242J37308J77160K20855K55794K75997K82047K77000
34383C790410K61763K33171J85738J15821K5179p8405j83431k78225l53718m04458
34373C313845m27926m23181l90455l32571k56850j74605r6944k9177L1293R0807
$$ plain form
34363 1304236 1455916 1663282 1908232 2161175 2388606 2560520 2653334 2649684 2538896 2318965
34353 2318965 1996957 1585387 1096524 538944 -81657 -759493 -1486730 -2253477 -3048250
34344 -3048250 -3857309 -4662948 -5442179 -6167537 -6810540 -7346480 -7758013 -8035763 -8176229
34335 -8176229 -8178525 -8041416 -7761772 -7335604 -6762245 -6050308 -5222816 -4319447 -3394992 -2513211
34325 -2513211 -1735647 -1107581 -646687 -340027 -150961 -32724 56945 145606 243785 350284
34315 350284 460893 575203 699139 844152 1024267 1250724 1524564 1830491 2136525 2401213
34305 2401213 2585566 2664404 2632446 2502914 2299260 2043635 1747870 1412016 1030859 603190
34295 603190 136748 -353903 -853014 -1346845 -1822079 -2261804 -2642911 -2936922 -3114415 -3152186
$$ packed form
34363A304236J51680K07366K44950K52943K27431J71914R2814l650j10788k19931
34353B318965l22008m11570m88863n57580o20601o77836p27237p66747p94773
34344c048250q09059q05639p79231p25358o43003n35940m11533k77750j40466
34335h176229k296J37109K79644M26168N73359P11937Q27492R03369R24455Q81781
34325b513211P77564O28066M60894L06660J89066J18237Q9669Q8661R8179J06499
34315C50284J10609J14310J23936J45013J80115K26457K73840L05927L06034K64688
34305B401213J84353P8838l1958j29532k03654k55625k95765l35854l81157m27669
34295F03190m66442m90651m99111m93831m75234m39725l81107k94011j77493l7771
$$ plain form
34285 -3152186 -3040805 -2788925 -2421624 -1973477 -1480131 -972209 -473256 -1051 429666
34276 429666 805421 1114625 1350376 1513756 1615924 1678035 1728410 1796717 1906236 2067234
34266 2067234 2275195 2515434 2771668 3033302 3296907 3561324 3820242 4058026 4252588
34257 4252588 4384481 4447035 4451216 4422072 4388926 4375023 4392014 4440870 4517136 4616703 4739082
34246 4739082 4886880 5061950 5259930 5465762 5652886 5787387 5835546 5771234 5580130 5260499
34236 5260499 4821919 4282703 3665745 2993337 2283044 1546581 791585 24759 -745020
34227 -745020 -1504277 -2233813 -2909450 -3504695 -3994560 -4359448 -4587737 -4675915 -4626312 -4444280
34217 -4444280 -4137329 -3717254 -3204036 -2628978 -2034755 -1471318 -988380 -626530 -409335
$$ packed form
34285c152186J11381K51880L67301M48147M93346N07922M98953M72205M30717
34276D29666L75755L09204K35751J63380J02168O2111N0375O8307J09519J60998
34266B067234K07961K40239K56234K61634K63605K64417K58918K37784J94562
34257D252588J31893O2554M181k9144l3146j3903J6991M8856P6266R9567J22379
34246D739082J47798J75070J97980K05832J87124J34501M8159o4312j91104l19631
34236E260499m38580n39216o16958o72408p10293p36463p54996p66826p69779
34227g45020p59257p29536o75637n95245m89865l64888k28289q8178M9603J82032
34217d444280L06951M20075N13218N75058N94223N63437M82938L61850K17195
$$ plain form
34208 -409335 -338173 -391213 -527974 -699527 -861591 -985518 -1062955 -1103135 -1125095 -1148875 -1189568
34197 -1189568 -1255826 -1351354 -1476425 -1627938 -1798943 -1979062 -2155843 -2316127 -2446919 -2535772
34187 -2535772 -2570636 -2539316 -2429215 -2227972 -1924827 -1512480 -989893 -366237 335552 1078339
34177 1078339 1815110 2497451 3085949 3559396 3918896 4184082 4382830 4540289 4672877
34168 4672877 4787679 4883578 4951634 4976595 4942295 4839639 4671957 4453706 4204092 3941199
34158 3941199 3680655 3438011 3230561 3075517 2985187 2962292 2997954 3072621 3159067 3227088
34148 3227088 3250203 3213475 3119351 2987822 2849619 2735186 2664350 2640813 2653116 2681237 2705973
34137 2705973 2716828 2714484 2706929 2702294 2703197 2705664 2702389 2687748 2661668 2630414 2604172 2593237 2605253
$$ packed form
34208d09335P1162n3040j36761j71553j62064j23927p7437m0180k1960k3780m0693
34197a189568o6258r5528j25071j51513j71005j80119j76781j60284j30792q8853
34187b535772l4864L1320J10101K01243L03145M12347N22587O23656P01789P42787
34177A078339P36771O82341N88498M73447L59500K65186J98748J57459J32588
34168D672877J14802R5899O8056K4961l4300j02656j67682k18251k49614k62893
34158C941199k60544k42644k07450j55044r0330k2895L5662P4667Q6446O8021
34148C227088K3115l6728r4124j31529j38203j14433p0836k3537J2303K8121K4736
34137B705973J0855k344p555m635R03K467l275j4641k6080l1254k6242j0935J2016
$$ plain form
34124 2605253 2644353 2710468 2796396 2883280 2938784 2922466 2798069 2546614 2172668 1700684
34114 1700684 1164725 598311 29410 -518604 -1022829 -1457593 -1795357 -2012434 -2096887 -2053552
34104 -2053552 -1901993 -1667367 -1369129 -1013959 -596315 -104900 469285 1126434 1853446
34095 1853446 2621211 3384688 4087553 4671716 5089157 5312003 5337371 5185800 4894713 4509968
34085 4509968 4078294 3641841 3234689 2880951 2594225 2377912 2225615 2121625 2042535 1961010
34075 1961010 1851473 1696286 1490541 1243625 976315 713675 476207 272685 97397
34066 97397 -67051 -242090 -443842 -676865 -934136 -1201588 -1462114 -1696262 -1881885 -1996822
34056 -1996822 -2025053 -1962685 -1820246 -1620864 -1395837 -1178805 -999502 -878680 -825828 -839710
$$ packed form
34124B605253L9100O6115Q5928Q6884N5504j6318j24397k51455l73946m71984
34114A700684n35959n66414n68901n48014n04225m34764l37764k17077q4453M3335
34104b053552J51559K34626K98238L55170M17644M91415N74185O57149P27012
34095A853446P67765P63477P02865N84163M17441K22846K5368j51571k91087l84745
34085D509968m31674m36453m07152l53738k86726k16313j52297j03990p9090q1525
34075A961010j09537j55187k05745k46916k67310k62640k37468k03522j75288
34066I7397j64448j75039k01752k33023k57271k67452k60526k34148j85623j14937
34056a996822k8231O2368J42439J99382K25027K17032J79303J20822N2852j3882
$$ plain form
34046 -839710 -910121 -1019487 -1144673 -1260585 -1346291 -1391990 -1402948 -1397137 -1397057 -1420674 -1477029 -1567983
34034 -1567983 -1692450 -1848530 -2032278 -2235386 -2444362 -2641782 -2808700 -2927252 -2982949 -2966474
34024 -2966474 -2875034 -2713310 -2493487 -2233446 -1953166 -1670442 -1397299 -1137773 -887742 -637913
34014 -637913 -380007 -113145 154181 408610 639918 846739 1036195 1218408 1400475 1583996
34004 1583996 1766555 1943914 2109511 2251399 2350267 2382082 2325454 2170233 1922708 1604278
$$ packed form
34046h39710p0411j09366j25186j15912q5706m5699j0958N811Q0k3617n6355r0954
34034a567983j24467j56080j83748k03108k08976j97420j66918j18552n5697J6475
34024b966474R1440J61724K19823K60041K80280K82724K73143K59526K50031K49829
34014f37913K57906K66862K67326K54429K31308K06821J89456J82213J82067J83521
34004A583996J82559J77359J65597J41888R8868L1815n6628j55221k47525l18430
$$ [...]
##END NTUPLES=NMR SPECTRUM
##END=
