##TITLE=31Pdec_DE-36_NaOH
 D2O, 24 sc
 25.6.2024
##JCAMPDX= 6.0         $$ Bruker NMR JCAMP-DX V2.0
##DATA TYPE= NMR SPECTRUM
##DATA CLASS= NTUPLES
##ORIGIN= UXNMR, Bruker Analytische Messtechnik GmbH
##OWNER= root
$$ XWIN-NMR		Version 3.5
$$ Tue Jun 25 16:44:34 2024 Russian Standard Time (UT+4h)  she@DPX200
##.OBSERVE FREQUENCY= 81.013821
##.OBSERVE NUCLEUS= ^31P
##.ACQUISITION MODE= SIMULTANEOUS
##.ACQUISITION SCHEME= undefined
##.AVERAGES= 24
##.DIGITISER RES= 17
##SPECTROMETER/DATA SYSTEM= spect
##.PULSE SEQUENCE= zgpg30
##.SOLVENT NAME= D2O
##.SHIFT REFERENCE= (INTERNAL, D2O, 0, 182.463)
##AUDIT TRAIL= $$ (NUMBER, WHEN, WHO, WHERE, WHAT)
$$ ##TITLE= Audit trail, XWIN-NMR		Version 3.5
$$ ##JCAMPDX= 5.01
$$ ##ORIGIN= Bruker BioSpin GmbH
$$ ##OWNER= she
$$ F:/spectra/data/she/nmr/P31/2/pdata/1/auditp.txt
$$ ##AUDIT TRAIL=  $$ (NUMBER, WHEN, WHO, WHERE, WHAT)
(   1,<2024-06-25 16:44:02.14 +0400>,<she>,<DPX200>,
      <created by zg, POWCHK disabled, PULCHK disabled
       configuration hash MD5:
       00 E9 B6 7A A2 85 ED C7 34 08 36 98 17 FE 4E 26
       data hash MD5: 32K
       13 BD 03 CF 4B 0C 89 18 48 D6 AC 19 36 42 73 96>)
(   2,<2024-06-25 16:44:04.40 +0400>,<she>,<DPX200>,
      <Start of raw data processing
       efp BC_mod = 2 LB = 1.5 FT_mod = 6 PKNL = 1 PHC0 = 2688.336 PHC1 = 294.0862 SI = 64K 
       data hash MD5: 64K
       BC E1 86 4C 97 9D 78 86 8B F5 A7 40 9D E2 27 11>)
$$ ##END=
$$ 
$$ hash MD5
$$ 8C AE A4 52 4A 01 A3 E3 77 4F 3B DA 71 28 93 AD
##$RELAX= 
##$RELAX= 
##$RELAX= 
##$RELAX= 
##$RELAX= 
##$RELAX= 
##$RELAX= 
##$RELAX= 
$$ Bruker specific parameters
$$ --------------------------
##$DU= <F:/spectra>
##$EXPNO= 2
##$NAME= <P31>
##$PROCNO= 1
##$TYPE= <nmr>
##$USER= <she>
##$AMP= (0..31)
100 100 100 100 100 100 100 100 100 100 100 100 100 100 100 100 100 100 
100 100 100 100 100 100 100 100 100 100 100 100 100 100 
##$AQSEQ= 0
##$AQ_mod= 1
##$AUNM= <au_zg>
##$AUTOPOS= <>
##$BF1= 81.014009
##$BF2= 200.13
##$BF3= 200.13
##$BF4= 200.13
##$BF5= 200.13
##$BF6= 200.13
##$BF7= 200.13
##$BF8= 200.13
##$BYTORDA= 1
##$CFDGTYP= 0
##$CFRGTYP= 5
##$CHEMSTR= <none>
##$CNST= (0..31)
1 1 145 1 1 1 1 1 1 1 1 1 1 1 1 1 1 1 1 1 1 1 1 1 1 1 1 1 1 1 1 1 
##$CPDPRG= <waltz16>
##$CPDPRG1= <>
##$CPDPRG2= <waltz16>
##$CPDPRG3= <>
##$CPDPRG4= <mlev>
##$CPDPRG5= <mlev>
##$CPDPRG6= <mlev>
##$CPDPRG7= <mlev>
##$CPDPRG8= <mlev>
##$CPDPRGB= <>
##$CPDPRGT= <>
##$D= (0..31)
0 1 0 0 0 0 0 0 0 0 0 0.03 2e-05 3e-06 0 0 0 0 0 0 0 0 0 0 0 0 0 0 0 0 
0 0 
##$DATE= 1719319441
##$DBL= (0..7)
120 120 120 11 120 120 24 19 
##$DBP= (0..7)
150 150 150 150 150 150 150 150 
##$DBP07= 0
##$DBPNAM0= <>
##$DBPNAM1= <>
##$DBPNAM2= <>
##$DBPNAM3= <>
##$DBPNAM4= <>
##$DBPNAM5= <>
##$DBPNAM6= <>
##$DBPNAM7= <>
##$DBPOAL= (0..7)
0.5 0.5 0.5 0.5 0.5 0.5 0.5 0.5 
##$DBPOFFS= (0..7)
0 0 0 0 0 0 0 0 
##$DE= 6
##$DECBNUC= <off>
##$DECIM= 4
##$DECNUC= <off>
##$DECSTAT= 4
##$DIGMOD= 1
##$DIGTYP= 9
##$DL= (0..7)
0 0 52 120 120 21 21 25 
##$DP= (0..7)
$$ [...]
##$SUBNAM2= <"">
##$SUBNAM3= <"">
##$SUBNAM4= <"">
##$SUBNAM5= <"">
##$SUBNAM6= <"">
##$SUBNAM7= <"">
##$SUBNAM8= <"">
##$SUBNAM9= <"">
##$SW= 369.568048894756
##$SWIBOX= (0..15)
0 1 3 0 0 0 0 0 0 0 0 0 0 0 0 0 
##$SW_h= 29940.119760479
##$TD= 32768
##$TD0= 1
##$TE= 0
##$TE2= 300
##$TE3= 300
##$TEG= 300
##$TL= (0..7)
0 120 53 12 22 120 120 120 
##$TP= (0..7)
150 150 150 150 150 150 150 150 
##$TP07= 0
##$TPNAME0= <>
##$TPNAME1= <>
##$TPNAME2= <>
##$TPNAME3= <>
##$TPNAME4= <>
##$TPNAME5= <>
##$TPNAME6= <>
##$TPNAME7= <>
##$TPOAL= (0..7)
0.5 0.5 0.5 0.5 0.5 0.5 0.5 0.5 
##$TPOFFS= (0..7)
0 0 0 0 0 0 0 0 
##$TUNHIN= 0
##$TUNHOUT= 0
##$TUNXOUT= 0
##$USERA1= <user>
##$USERA2= <user>
##$USERA3= <user>
##$USERA4= <user>
##$USERA5= <user>
##$V9= 5
##$VALIST= <valist>
##$VCLIST= <CCCCCCCCCCCCCCC>
##$VD= 0
##$VDLIST= <DDDDDDDDDDDDDDD>
##$VPLIST= <PPPPPPPPPPPPPPP>
##$VTLIST= <TTTTTTTTTTTTTTT>
##$WBST= 1024
##$WBSW= 4
##$XGAIN= (0..3)
0 0 0 0 
##$XL= 0
##$YL= 0
##$YMAX_a= 2734
##$YMIN_a= -2083
##$ZGOPTNS= <>
##$ZL1= 120
##$ZL2= 120
##$ZL3= 120
##$ZL4= 120
##$ABSF1= 0
##$ABSF2= 0
##$ABSG= 0
##$ABSL= 0
##$ALPHA= 0
##$AQORDER= 0
##$ASSFAC= 0
##$ASSFACI= 0
##$ASSFACX= 0
##$ASSWID= 0
##$AUNMP= <proc_1d>
##$AZFE= 0.1
##$AZFW= 0.5
##$BCFW= 0
##$BC_mod= 2
##$BYTORDP= 0
##$COROFFS= 0
##$CY= -3
##$DATMOD= 1
##$DC= 0
##$DFILT= <>
##$DTYPP= 0
##$F1P= 0
##$F2P= 0
##$FCOR= 1
##$FTSIZE= 65536
##$FT_mod= 6
##$GAMMA= 0
##$GB= 0
##$INTBC= 1
##$INTSCL= 9.790993e-09
##$ISEN= 30
##$LB= 1.5
##$LEV0= 0
##$LPBIN= 0
##$MAXI= 10000
##$MC2= 0
##$MEAN= 0
##$ME_mod= 0
##$MI= 50
##$NCOEF= 0
##$NC_proc= -12
##$NLEV= 6
##$NOISF1= 182.463
##$NOISF2= 159.3651
##$NSP= 0
##$NTH_PI= 0
##$NZP= 0
##$OFFSET= 182.463
##$PC= 4
##$PHC0= 2688.336
##$PHC1= 294.0862
##$PH_mod= 1
##$PKNL= yes
##$PPARMOD= 0
##$PSCAL= 0
##$PSIGN= 0
##$REVERSE= no
##$SF= 81.0140089999434
##$SI= 65536
##$SIGF1= 159.3651
##$SIGF2= -187.1042
##$SINO= 113.3802
##$SIOLD= 16384
##$SREGLST= <1H.CDCl3>
##$SSB= 0
##$STSI= 65536
##$STSR= 0
##$SW_p= 29940.119760479
##$SYMM= 0
##$S_DEV= 0
##$TDeff= 32768
##$TDoff= 0
##$TI= <>
##$TILT= no
##$TM1= 0
##$TM2= 0
##$TOPLEV= 0
##$USERP1= <user>
##$USERP2= <user>
##$USERP3= <user>
##$USERP4= <user>
##$USERP5= <user>
##$WDW= 1
##$XDIM= 65536
##$YMAX_p= 406949820
##$YMIN_p= -199454785
$$ End of Bruker specific parameters
$$ ---------------------------------
##NTUPLES= NMR SPECTRUM
##VAR_NAME=  FREQUENCY,     SPECTRUM/REAL,   SPECTRUM/IMAG
##SYMBOL=    X,             R,               I
##VAR_TYPE=  INDEPENDENT,   DEPENDENT,       DEPENDENT
##VAR_FORM=  AFFN,          ASDF,            ASDF
##VAR_DIM=   65536,         65536,           65536
##UNITS=     HZ,            ARBITRARY UNITS, ARBITRARY UNITS
##FACTOR=    0.456856943014862, 1,           1
##FIRST=     14782.0589164792, 0,            0
##LAST=      -15158.0608439998, 0,           0
##MIN=       -15158.0608439998, -199454785,  0
##MAX=       14782.0589164792, 406949820,    0
$$ Real data points
##PAGE= N=1
##DATA TABLE= (X++(R..R)), XYDATA
$$ [...]
##PAGE= N=2
##DATA TABLE= (X++(I..I)), XYDATA
8358 -54498316 -13861206 -1452238 -12896786 -19695565 -5508101 24403168 53104244
8351 53104244 59847909 34794733 -2286381 -15473564 2152164 16128627 203459
8344 203459 -22931479 -16417291 11923457 20612382 312841 -8629234 23851113 68886463
8336 68886463 72350354 23593492 -31553162 -45211614 -19194312 2953368 -13208973
8329 -13208973 -59622617 -102624825 -122056041 -122633788 -111399199 -83163495 -37316379
8322 -37316379 5719285 20947689 5679636 -22743168 -49364734 -67869931 -72501627
8315 -72501627 -63370539 -56294926 -65898378 -78979099 -68014386 -34870984 -15009321 -27450003
8307 -27450003 -46350768 -40778133 -20204976 -14882315 -27330593 -34369676 -30002031 -33500084
8299 -33500084 -52398305 -67428036 -64207971 -55113971 -55644471 -59650442 -55864911 -53527651
8291 -53527651 -70481716 -103328759 -128349279 -129176155 -108334247 -74594662 -36000813
8284 -36000813 -6321509 -1552966 -22834327 -52616342 -72729687 -77951828 -69154656 -45614617
8276 -45614617 -12800512 11746853 12623304 -6561010 -29761369 -48169195 -61856682
8269 -61856682 -64203672 -41973795 1032160 34333851 30989041 2443058 -14416557
8262 -14416557 -6623959 -3090531 -33559834 -85741943 -120939633 -122565582 -107132816 -90451888
8254 -90451888 -69040556 -41540829 -22945031 -20959487 -17813384 2618670 23529818
8247 23529818 16620311 -12999358 -31710767 -26665762 -21057234 -32839826 -45796609 -37565032
8239 -37565032 -14962531 -730188 844878 3503494 12018696 15699635 5905090 -16044047
8231 -16044047 -45478725 -73658834 -84024870 -67000401 -38402280 -25549888 -33024594
8224 -33024594 -39919006 -34799081 -32896295 -48055825 -66453926 -65922314 -49255885 -38008804
8216 -38008804 -39191363 -39596145 -33603165 -35077321 -52947188 -71722948 -70458200 -51474774
8208 -51474774 -35077666 -30069057 -24993766 -9703057 8540090 16528105 12434737 3460010
8200 3460010 -7341188 -22934117 -43515663 -62674435 -71670429 -64897718 -45609503 -29483066
8192 -29483066 -33796474 -54353307 -61711916 -34795575 6447998 19771147 -7326629
8185 -7326629 -42677699 -51794392 -36627668 -21390835 -16632200 -14650315 -10285731 -6757712
8177 -6757712 -3624973 4406962 15580410 20969589 18339722 15190194 15004183 10257945
8169 10257945 -5126617 -22081546 -22308107 286721 26102023 23875729 -14979885 -59734016
8161 -59734016 -70918037 -48552792 -33056423 -51495496 -82998766 -92862971 -81339731
8154 -81339731 -72935473 -70220701 -51196201 -11381298 23669719 35819532 37172237 43387689
8146 43387689 47844897 38782147 23739748 18255766 22258310 24524331 21848782 19062655
8138 19062655 17530815 17332839 24032863 39318676 49866432 39374948 10011260 -18786106
8130 -18786106 -31563234 -28655545 -19057658 -9539759 -206762 13760172 34324600 53449958
8122 53449958 59381274 50759538 35758167 17182296 -7589406 -29709289 -31733446 -16529681
8114 -16529681 -12535267 -34505461 -58532203 -57542729 -44322910 -51067237 -77283681 -90145508
8106 -90145508 -73672144 -46021472 -25143805 -8186385 5898652 2009446 -26415769
8099 -26415769 -58982417 -71577545 -63379246 -46894312 -26104077 -760693 19505060
8092 19505060 23444505 14858362 7153349 6165894 9940905 19162698 33695675 41762404
8084 41762404 26950489 -11082733 -51198070 -69312458 -59682594 -38256938 -26482291
8077 -26482291 -29805296 -33006709 -21864441 -5922208 -6994856 -24949124 -33618948 -19305939
8069 -19305939 -4562458 -17039113 -48856020 -68034728 -61496131 -43724176 -27365954
8062 -27365954 -10772495 3724461 5623600 -411910 9094712 40437724 61411449 37639521
8054 37639521 -19367761 -62308782 -63750396 -42109444 -29753962 -33019208 -32616541 -12312945
8046 -12312945 23441270 56025408 69868001 66092362 63336701 81249656 118782445
8039 118782445 152238317 158534634 136242792 100544416 65658716 41048297 37433122
8032 37433122 60198792 94791722 112292330 96645525 59346631 24131070 6721312
8025 6721312 13052616 42762572 82232401 104518562 92894004 62282044 44977306
8018 44977306 57005922 89023388 124824480 152316933 158436785 134709202 95335632
8011 95335632 72580292 82141059 104016981 108620741 92508249 76430678 75081378 81690924
8003 81690924 79914622 60875797 29815433 3118107 -3847425 7463709 18568791
7996 18568791 15791484 6809238 7011437 15635675 18377344 11295227 7339576 15460535
7988 15460535 24978616 18348539 -5949821 -29420445 -31402354 -9286286 18279962 30002093
7980 30002093 25517069 25650327 44718783 70162307 80364411 76497894 79402793 94494757
7972 94494757 100087547 80610386 54719862 53014652 76419816 95742051 91034430 73323986
7964 73323986 62984271 62606249 61536452 55979306 50059421 41106695 19252646 -14508176
7956 -14508176 -40821518 -40571919 -16662353 8790481 16416236 4186285 -16375016 -31846629
7948 -31846629 -36046120 -33998228 -36876084 -47867660 -54709918 -43735022 -20044268 -3069136
7940 -3069136 -783189 -1651455 2127352 -1053146 -20710342 -39400346 -31126702 -1793756
7932 -1793756 11955625 -8986138 -38725715 -40412907 -13573229 10102596 10767400 497348
7924 497348 -1280401 5755445 9417987 5763277 601603 -4828275 -16707424 -34725265
7916 -34725265 -44247509 -29092519 9810258 52643145 77656635 78403504 65311474 52941607
7908 52941607 46755870 41767245 32887201 23653172 21137432 23376309 19127250 4319985
7900 4319985 -7959144 -3060231 12475428 15163573 -6465381 -38070001 -59994666 -71253878
7892 -71253878 -83405400 -97724253 -101395882 -85076725 -53035891 -14849620 22693749
7885 22693749 52555745 66465123 63620148 54018947 46384102 37366489 19761317 -2219884
7877 -2219884 -14803672 -11473304 661763 13519973 28447472 47839835 63112678
7870 63112678 61420139 43098814 21907010 5382786 -14503259 -43971494 -69343436
7863 -69343436 -68358232 -37508147 2220187 27027395 29110039 14731215 -4867540 -17610774
7855 -17610774 -16470376 -7270891 -3535899 -9893959 -19108444 -28701063 -47804581 -78981210
7847 -78981210 -104750934 -104606326 -77976357 -39241958 1150286 36600401 54527843
7840 54527843 46807918 27428292 19472958 23035776 16021968 -8715504 -28447029 -23571286
7832 -23571286 -6705192 -2511760 -12294003 -18104565 -13611302 -9186037 -8140847 103603
7824 103603 17267193 25246704 10126634 -14846607 -24524059 -13264379 3786027 17226715
7816 17226715 33006289 51461437 54645683 27700517 -17907925 -57364966 -81380716
7809 -81380716 -95462342 -96504725 -73768659 -36088867 -13609260 -20406221 -35224291
7802 -35224291 -34767501 -27571024 -33472608 -44569948 -35476325 -7790315 4828456 -18004749
7794 -18004749 -54357356 -65150862 -34873242 17593325 56175676 52976135 10363855
7787 10363855 -37918380 -57746459 -46313184 -22810198 2832551 28583891 34333838
7780 34333838 -6265189 -78162284 -123321349 -107811797 -64517913 -45630274 -56335555
7773 -56335555 -64826126 -58654632 -53901690 -55590272 -46428106 -20270665 2561204 3956108
7765 3956108 -8693216 -17902599 -18565331 -15123122 -8908808 1267272 12726580 20146395
7757 20146395 19998788 12602222 3895907 2358696 6839382 1561981 -25959679 -64810507
7749 -64810507 -90747338 -95004258 -90263691 -88749049 -89005871 -86386135 -81988960 -75945023
7741 -75945023 -63467458 -42955285 -18900111 6032007 31305682 48799082 46323259
7734 46323259 26669848 10762745 14041344 30189278 45847507 59359183 72845516
7727 72845516 75609065 53271771 13042459 -15544529 -12321212 8740402 14792221 -7784055
7719 -7784055 -38713044 -50498106 -42128943 -35693209 -41933832 -45158230 -29275883 -3713660
7711 -3713660 10945673 11836598 9206523 395451 -26928842 -64591025 -82537922 -68027431
7703 -68027431 -46230320 -47467641 -68562415 -82013452 -72144706 -45437702 -13129302
7696 -13129302 17177374 34100743 25543660 -3494475 -27062194 -22250815 5029807
7689 5029807 24996198 16790600 -7700339 -18437721 -4522155 13238674 12605716 1128316
7681 1128316 2609777 19475195 29123411 18722837 2634829 -2473171 -1371118 -7260746
7673 -7260746 -20218761 -33230293 -48631618 -73024652 -102420100 -125477846 -135979162
7666 -135979162 -131172089 -105351693 -58678685 -7012684 31031387 54436943 76215515
7659 76215515 102954833 128150076 141142451 132480848 98078485 52205647 28589690
7652 28589690 48742490 91278256 112521632 98331578 74996718 65415922 58294185
7645 58294185 33415289 -1724385 -19475788 -6708125 24383905 54118928 69257608
7638 69257608 64053484 44111591 29023302 34955413 50154975 42195696 -1570481 -52354317
7630 -52354317 -71639830 -57289218 -41541272 -44971261 -53193095 -47915011 -41175646 -57139813
7622 -57139813 -89176663 -102161200 -81438796 -55267669 -55265768 -72450158 -71238273 -37143602
7614 -37143602 8741084 38905014 45268362 35484772 19382588 4686662 -3457699 -4762072
7606 -4762072 -2820525 -2044371 -8167628 -26323622 -51766945 -68773017 -68736709 -63116749
7598 -63116749 -65325187 -65920373 -44666743 -6478566 15959803 2469877 -28956634 -46595663
7590 -46595663 -41410588 -28479852 -23859401 -32176333 -48639308 -61366002 -57714481 -38791132
7582 -38791132 -22289957 -21349687 -26660533 -20310564 -1772909 12469824 11740461 504092
7574 504092 -13574706 -27165917 -35488403 -32406094 -21161949 -14111774 -15512824 -13752155
7566 -13752155 1910848 25065186 42395881 54228950 71891693 95149809 105941266
7559 105941266 91292013 63425652 46837887 48999701 54855468 51039454 43650351 44561267
7551 44561267 48567330 37243322 5493139 -27381305 -38838138 -28355663 -14497415
7544 -14497415 -10769956 -12970016 -11007892 -5358314 -5818456 -15818706 -23702149 -13219631
7536 -13219631 17433313 49502411 59251403 40319978 8534325 -17111203 -35244718
7529 -35244718 -58383183 -88729826 -107022565 -93553565 -55123185 -19183568 -1709626
7522 -1709626 5286599 11212950 10088097 -1458429 -6869304 6886283 19046192 -2287143
7514 -2287143 -48104399 -70876301 -47728162 -10964306 -215 -12518977 -26906780
7507 -26906780 -44460563 -73554062 -91910835 -68920700 -19275401 9477487 5497762
7500 5497762 5534511 29087581 44180438 22082403 -12229148 -17979700 216305 6191988
7492 6191988 -10799866 -31756854 -50714790 -81000394 -116577892 -124022358 -86164396
7485 -86164396 -28406812 12130941 25061936 22626398 14729732 3851759 -5069608 -3926711
7477 -3926711 11980425 42254668 80991029 114995029 130613142 126123955 109154123
7470 109154123 80558923 34906968 -17430835 -45952218 -32706567 1570964 20731109
7463 20731109 15541175 4542789 -2899381 -20736605 -57074623 -91450935 -96781548 -73369674
7455 -73369674 -45541720 -30039439 -23551899 -20183446 -23862588 -36810188 -48947205 -50260195
7447 -50260195 -46708231 -51631057 -63900578 -67221224 -53891363 -38597625 -40681724 -57628403
7439 -57628403 -65504423 -47618777 -16722956 -2411257 -16226804 -35704627 -29187586
7432 -29187586 6615305 43108817 54171679 41970462 23017002 2578827 -22562254
7425 -22562254 -45129776 -51243879 -42650748 -36824161 -41845042 -47954955 -48590878 -51582323
7417 -51582323 -60465500 -62287053 -48193988 -32359585 -33275866 -45097946 -45066333 -25094267
7409 -25094267 -940119 7435304 -7505666 -39095740 -67414130 -66243997 -25186470
7402 -25186470 35287372 83433023 108416621 119551084 119295530 99289186 65735007
7395 65735007 45832000 57346180 86389499 105774787 103379731 83683028 55273097
7388 55273097 29636728 20839798 30575614 39550612 28087147 2020449 -14635707 -10757222
7380 -10757222 729744 3420397 -1733378 222749 20057306 51481211 73194687 65746041
7372 65746041 31531819 -4346858 -19045108 -14677122 -9094523 -9143810 -6108211 2968201
7364 2968201 5820826 -5525938 -18421721 -15153115 2127675 15599477 18350872 22219815
7356 22219815 35695146 46936580 38560694 12727202 -9717711 -14398291 -8329819 -7102594
7348 -7102594 -14773247 -22417559 -22413543 -16120809 -6786155 7285026 26158422 38889997
7340 38889997 31503265 8698998 -1530278 23219323 68315371 92842907 75614757
7333 75614757 38017191 13644278 8783474 7672523 5979826 15757990 37541481 51384574
7325 51384574 45350606 35249433 42211918 61456759 66689428 39918925 -12037417 -64894140
7317 -64894140 -94523568 -95827452 -90284412 -104042971 -132376920 -141511841 -116146281 -85590591
7309 -85590591 -83476802 -99416579 -98097766 -73859212 -52325548 -41623074 -19307673
7302 -19307673 24177584 62398099 69432063 54270582 41617422 39307576 42213681 49481344
7294 49481344 58662699 58872470 49369959 49981393 71799439 91336707 78575699 40790575
7286 40790575 11818238 3657390 -2859726 -20114177 -36385514 -43433981 -54116884 -78089583
7278 -78089583 -100366416 -101763268 -87492364 -77993264 -79393921 -79780666 -71314411 -60313030
7270 -60313030 -53113970 -43465843 -20267586 16456779 52044384 69811170 66084244 51874928
7262 51874928 39656063 31569778 23807899 18104413 19524035 22976333 14365224 -7704565
7254 -7704565 -21415058 -5432857 31296033 57403469 56955303 44724930 38805794 34531368
7246 34531368 20325372 7712224 21672434 60132643 86604014 74686153 41739585
7239 41739585 21491233 17823258 9393892 -7779871 -12048779 5290162 20907988 13603563
7231 13603563 -2993599 -1538754 18102009 30146857 19355083 -3232665 -20199182
7224 -20199182 -26709554 -26762646 -23277187 -16716303 -6454397 8392633 24440346 32448124
7216 32448124 27411781 17179963 11755021 6839376 -10201983 -38321681 -59183449 -58520091
7208 -58520091 -41058375 -20977993 -6621589 1791023 7446600 13693653 19217038 15584547
7200 15584547 -2160559 -22959534 -30498916 -28714152 -40192202 -70481661 -90359050
7193 -90359050 -70610349 -24633257 4291348 -3593192 -23839380 -25208834 -9902559
7186 -9902559 -4790846 -23948565 -54376134 -74455393 -73613268 -55203750 -32892523 -25809202
7178 -25809202 -43991823 -72707923 -82779766 -64891185 -42864871 -42114926 -56959656
7171 -56959656 -66102934 -69054824 -80058606 -89056031 -63431550 -988394 50167994 48431073
7163 48431073 12348902 -10749309 -11506322 -19006697 -44391665 -63438934 -57593715 -35784670
7155 -35784670 -6107380 39716200 96949608 132974715 124636320 88611880 53249357
7148 53249357 21725762 -12005935 -31975476 -19316143 8224373 11769749 -14630373
7141 -14630373 -37614061 -36147924 -29213060 -42117900 -71840366 -100314730 -120109108
7134 -120109108 -129343055 -118843182 -85677884 -49622731 -36052702 -46013706 -58489156
7127 -58489156 -59024682 -51376981 -42757201 -33602445 -25565637 -26831194 -41731258 -60924730
7119 -60924730 -68143133 -55679140 -31669956 -13094685 -10295870 -15889036 -11242762 12147880
7111 12147880 40269878 50811730 37597699 14225426 -5119058 -19346763 -32768039
7104 -32768039 -42690648 -42153675 -32201861 -24950027 -32405771 -53447338 -73384979 -78705590
7096 -78705590 -72866468 -72721940 -84894692 -91135739 -66988862 -13664241 39844220 68233361
7088 68233361 72180642 66033088 57868316 51795706 56869916 76127086 91838690 79904905
7080 79904905 40967276 3085962 -10587375 -5355518 -1974609 -11393738 -29343638 -47000572
7072 -47000572 -57854750 -58627763 -51553219 -44328435 -42323070 -41382892 -32226547 -12930069
7064 -12930069 3899547 -1540521 -36502053 -80459578 -97040420 -70098245 -22964520
7057 -22964520 9021029 19514213 28621637 43331731 45123066 24738973 6167204
7050 6167204 18265678 55981781 86873335 87614873 60656649 25150305 6505686 23989541
7042 23989541 69385309 105184954 103672050 82060048 77752390 93912532 96476928 67688813
7034 67688813 34638348 31942275 57168766 80394397 84395897 77248902 71598969 68607537
7026 68607537 63957746 58782387 59069152 66886767 75806139 76852246 67928047 53661840
7018 53661840 37210518 20771878 14881790 32120871 63419174 77551512 60228170
7011 60228170 38291404 42873904 62148383 60269562 34174877 14489124 10285533 -5174996
7003 -5174996 -41444014 -63975269 -44414635 -5741432 12618362 10161569 12753243 22658107
6995 22658107 17689678 -7287630 -32237268 -45589489 -56841892 -70861866 -74192300
6988 -74192300 -55985272 -25484162 215758 14960675 24171517 34193851 44674898
6981 44674898 48267326 39600442 26492920 24204067 34189221 41133885 39110731 44042358
6973 44042358 65468231 83375479 75771447 56149953 56262609 78923945 96027853 90059210
6965 90059210 69222021 42432644 10105853 -16003443 -14846253 11681319 35658557
6958 35658557 44011650 55594638 82307138 100618820 85690839 53639245 41956370
6951 41956370 58691128 77145005 76226783 62234249 50106762 43646401 39802135 37603060
6943 37603060 34917841 25347530 6888195 -9193424 -5831243 18954023 41145257 30751607
6935 30751607 -10356218 -39975762 -20134036 33960329 68815424 57525155 27247136
6928 27247136 14513391 18537019 17917143 12865431 21052826 39041662 39030167 10292461
6920 10292461 -19222730 -15228837 22434771 63570733 83082531 80391175 67870490
6913 67870490 53905261 41745673 35786980 39033416 46214302 49561680 53909767 74943264
6905 74943264 114225663 145998061 143012148 110091943 75855290 54074060 32803511
6898 32803511 3118646 -23870551 -37135607 -42314270 -45284643 -37139226 -11689347 17126369
6890 17126369 33479670 42752806 57144576 69808944 66072966 52153741 47348378 51368827
6882 51368827 46034841 30323319 26036625 41186940 53603873 44382155 25933816 19360957
6874 19360957 21323819 14824220 2126340 3622816 26120369 52031286 62852552 58183459
6866 58183459 47395704 35950996 26756930 24048775 26107208 20830638 -212620 -24715063
6858 -24715063 -26506080 7316426 61329881 106097623 123023040 113312595 89547877
6851 89547877 65866967 53307643 54995982 62374463 61524481 47635811 31184138 26849727
6843 26849727 37367258 50331559 50597360 34661878 12286818 -6066350 -20973750
6836 -20973750 -38938075 -56723403 -60011872 -42408753 -16575236 2231321 14571249
6829 14571249 25898176 26376097 2183520 -35782330 -58264042 -57009319 -54502918 -65562618
6821 -65562618 -73199056 -58011462 -29259204 -5291275 17399827 47479051 65335866
6814 65335866 41960661 -9925988 -37680221 -11808114 38000769 62407122 47873540
6807 47873540 19098893 3879889 13352201 45660632 88884762 121573934 125471061
6800 125471061 102477081 73065701 55352739 48156174 35599677 7482937 -26509354
6793 -26509354 -46195474 -44824998 -35944390 -30796501 -18657714 16335796 63696561 90453613
6785 90453613 80394656 54938864 47889254 68929268 97181182 102457566 69638157
6778 69638157 11412533 -39923367 -62317057 -66502622 -77576227 -96308251 -98969348
6771 -98969348 -79544035 -66609380 -82570807 -107426204 -105900924 -75958778 -44291017
6764 -44291017 -22619910 1892543 32989424 51542521 45096917 28234865 18850676
6757 18850676 10553378 -13553440 -48466148 -67437794 -55885388 -32889202 -32349427 -65498395
6749 -65498395 -106118367 -115227331 -80789963 -29689341 2367100 7862131 7892532 20876072
6741 20876072 43506789 63079640 74114615 75702666 64126933 39559954 13862174
6734 13862174 639505 425268 4690053 10855236 21814025 31587362 25404013 218305
6726 218305 -24388712 -25217576 -2069240 22400229 29150282 22603804 21202720 31989857
6718 31989857 40489278 28440553 -1757033 -26775739 -28212189 -12371313 898895
6711 898895 3121298 1244687 -349188 -8436385 -27410176 -48484107 -60880440 -66947080
6703 -66947080 -77367776 -94967950 -110143634 -109487798 -84820271 -40302990 2797406
6696 2797406 16617491 -6688289 -43112173 -61575484 -55786124 -41933720 -33802513 -35803585
6688 -35803585 -51718070 -77200955 -87641151 -61868187 -21338865 -15085566 -53989907
6681 -53989907 -90092849 -80581199 -43906767 -24295071 -24699902 -13259742 16296463 33047331
6673 33047331 18729967 -8640613 -30075084 -51305691 -77626175 -90804331 -73111367
6666 -73111367 -37110823 -10688327 -2896596 -1837901 1922812 6486082 8348976 6180802
6658 6180802 -4066214 -26733843 -58013439 -85731994 -97454516 -87094831 -58033191
6651 -58033191 -22725221 5431217 22343167 31454883 33859751 29908744 29387224 44638155
6643 44638155 69032815 78230643 61857724 39277473 32010878 34437705 27712448 11074163
6635 11074163 -839445 -5225589 -13366594 -26213636 -30346500 -25104049 -33631451 -71836253
6627 -71836253 -118005592 -131618316 -100795496 -55599896 -29744361 -22073185 -7388021
6620 -7388021 21886225 42177258 30559836 -4279340 -32717504 -36238471 -17958764
6613 -17958764 9425342 30814008 30110690 3406793 -29356191 -42127572 -31963137
6606 -31963137 -14521403 5884239 37148330 68337091 68076839 27949950 -17780675
6599 -17780675 -34442752 -27700233 -21695760 -17681582 -1632110 22475169 38130720 46879702
6591 46879702 62384346 76669099 63622285 20865647 -19252384 -29843470 -18770212
6584 -18770212 -7495408 202306 15173592 41595160 70662097 87232632 75435511
6577 75435511 27780152 -41813321 -100571156 -121246223 -102724009 -65194437 -30800004
6570 -30800004 -11129191 -6558073 -11839204 -22404853 -35095531 -43689265 -41532972 -33617162
6562 -33617162 -36807349 -58484690 -83568429 -94840904 -96641000 -101748690 -103826267 -86428958
6554 -86428958 -56599200 -43402963 -58209026 -79671113 -86291972 -82151293 -78806405 -71977658
6546 -71977658 -53117565 -29941307 -16972537 -12676519 -1350104 24795362 55483195
6539 55483195 72196279 62881796 32300446 3104124 74482 26518424 60339962
6532 60339962 77425621 74139470 64488218 61496384 64112782 57758463 28754832 -15613018
6524 -15613018 -46725739 -46419132 -33728996 -42062373 -72593292 -92955113 -83995008 -62334171
6516 -62334171 -48776080 -39997495 -25213353 -7927272 6323748 24964276 53139917
6509 53139917 79245227 91347151 91415037 79107041 43750536 -7849951 -40256249 -34269184
6501 -34269184 -21905634 -42776153 -82555397 -94364098 -70678751 -49854906 -53007044
6494 -53007044 -60190872 -57007860 -59707443 -75135322 -74936966 -37215868 14570685 42815012
6486 42815012 44148194 38652361 29784524 7967237 -16240206 -16801309 8987363 33756729
6478 33756729 37436372 29192207 24943103 23452845 17860666 16859690 36983259 76556121
6470 76556121 110031175 111766579 80646010 39220565 11296763 2098923 -1387628 -13900584
6462 -13900584 -37572627 -62724158 -79717709 -87838596 -92579701 -95935147 -91914461 -73376190
6454 -73376190 -42108561 -9426698 13035015 20822470 16839521 8987593 6091482 8472513
6446 8472513 2581377 -24783978 -64349308 -88472226 -83341277 -64438972 -50967594 -39102756
6438 -39102756 -15596341 14480021 34383483 43284243 54611752 68514239 68604069 49055351
6430 49055351 23862762 3268243 -19420543 -49023371 -73951135 -80794420 -69474801
6423 -69474801 -45344478 -11070815 24168484 43365392 42586660 39831858 49282657 59104399
6415 59104399 50415445 27682685 12427767 13258791 19373705 20167655 15319383 7018949
6407 7018949 -2904995 -6913029 5322554 34855752 70288420 96363529 103094373 92991057
6399 92991057 83960824 94281774 116144550 117783530 86464621 55243016 64558191 106878021
6391 106878021 137658055 138526681 137386302 158093328 181463305 175627972 142685933 110512141
6383 110512141 90515010 68321135 33035893 -5220314 -29472126 -33055399 -19994298
6376 -19994298 -165952 12464524 6895805 -14010563 -34725317 -41700813 -32716879 -12744997
6368 -12744997 10379865 23699475 13642776 -17492818 -45354967 -45850248 -23508662
6361 -23508662 -6669693 -11908330 -25089779 -24835815 -12648056 -5242572 -4665757 3613981
6353 3613981 22336742 33636125 26920698 16429635 17056861 18898494 4762455 -18685739
6345 -18685739 -29078831 -20568499 -4991945 15178395 49371374 92333378 120177993
6338 120177993 120580680 105819368 88707988 68523800 50649263 54135950 81387704
6331 81387704 102282723 91320238 63265760 47215932 40653485 18919873 -19500005
6324 -19500005 -49933585 -61055434 -64697641 -62762773 -37572437 11788901 50960219
6317 50960219 47614680 10561839 -24454300 -34387774 -20699808 3731728 22254531
6310 22254531 19274415 -4689337 -27431222 -28259707 -13054745 -5400089 -17735895 -41747753
6302 -41747753 -61464672 -63961963 -42175218 -1410778 36638312 47006724 21776794
6295 21776794 -24869689 -67869343 -85417678 -72390040 -48027063 -41052062 -57172583
6288 -57172583 -70538578 -58205792 -31126926 -14936977 -11315611 -812515 21572243
6281 21572243 38225458 37186324 26818143 19458282 20538361 36148094 68187282 96005161
6273 96005161 87943135 44156466 6435797 8663679 34755883 43780436 21821054 -11701876
6265 -11701876 -37761649 -54059328 -61758162 -57620412 -42153946 -21747583 -1342841
6258 -1342841 14637876 15915023 -6746194 -47330114 -86379050 -107418781 -106211798 -89081295
6250 -89081295 -71711769 -74498752 -105765619 -149246298 -177046352 -174147499 -144547046
6243 -144547046 -100935058 -60322415 -42977866 -57711022 -86975885 -100158780 -83998162
6236 -83998162 -50666926 -18575938 1370728 2199604 -19499776 -55875798 -91086721
6229 -91086721 -114377894 -120337588 -100251292 -51267614 5137212 34986890 30152908
6222 30152908 18087093 24814002 44805761 58196862 61078532 62957543 66247785 65784698
6214 65784698 62417679 62054908 64433013 63939961 57699620 43812386 18127817 -16155198
6206 -16155198 -41922187 -44403994 -31027112 -23463108 -32086403 -48186949 -57758439 -52013076
6198 -52013076 -28561203 4045192 24994538 19635399 694530 -3111113 16804408
6191 16804408 37778468 36806987 19593824 8964095 14115640 24247349 28339200 28016448
6183 28016448 29500151 33596457 38923901 47572031 59233746 62701673 43241920 1959500
6175 1959500 -38697498 -54252386 -39794472 -9252787 20000891 35047232 28722777
6168 28722777 7828854 -3272435 14565088 45963686 53075255 25290250 -1300659
6161 -1300659 10967836 51278523 75571479 64035649 41517622 40738290 64167455 87239794
6153 87239794 85409292 52286604 1857710 -40454181 -55292798 -43371278 -20619472
6146 -20619472 -1126675 10859251 16711123 19826123 22998650 20930883 1189301 -35293185
6138 -35293185 -61909255 -53855746 -25430542 -16673482 -39023848 -59210161 -48275585
6131 -48275585 -22018016 -12588469 -19416064 -16332092 1867469 10864633 -1840487 -12829670
6123 -12829670 7164731 53813301 93152245 98515867 73855702 43271412 25055365
6116 25055365 17908629 10798785 2322765 2351714 11159491 8688237 -20628842 -57669997
6108 -57669997 -63332090 -27719221 13084042 18805835 -10872804 -45098107 -60175275
6101 -60175275 -52579278 -25607997 13429317 44923575 48446225 27745923 7884944
6094 7884944 3134910 3882131 -627872 -6853612 -13558937 -32197703 -63492680 -81676511
6086 -81676511 -65252815 -31632911 -15689293 -20693146 -17891199 6715852 33914234
6079 33914234 44996877 47727835 58157034 78067553 101563834 124171075 134111248
6072 134111248 115512207 74503514 41289468 29045748 11833684 -34635640 -90533831
6065 -90533831 -118916233 -119750112 -122761686 -133748044 -124879416 -82048769 -29738305 1104749
6057 1104749 5097176 -6804352 -25160291 -39088641 -35369785 -13889100 9222911 21344655
6049 21344655 22295634 10996945 -15326835 -42101785 -42374673 -13494824 14841945 24977656
6041 24977656 38819435 78478831 122381766 131677707 106105190 80228822 70901506
6034 70901506 62352551 44104937 30702908 34152395 43004109 41859867 31332529 15009882
6026 15009882 -15810037 -67037734 -121562990 -150228710 -140281042 -104574928 -67106445
6019 -67106445 -45301978 -39186252 -30491525 150074 46484697 74739575 60408715
6012 60408715 22287498 6051679 34207313 85345777 125070106 142500062 147102810
6005 147102810 142491418 122150988 89932857 66153197 63889763 70312106 63391710 40465760
5997 40465760 17050704 1364359 -13496066 -30264420 -37374830 -26459022 -6912210
5990 -6912210 7912204 18862372 33041928 46431909 49687915 45887122 45053180 41885499
5982 41885499 17833391 -28450878 -68546349 -73875304 -48872682 -22567459 -12017866
5975 -12017866 -7332223 5780624 20840232 17565224 -9480448 -40246254 -52695849
5968 -52695849 -50387400 -56263215 -79428680 -99769099 -91507073 -53669983 -9525221 17550553
5960 17550553 19309599 1232786 -21585257 -31201284 -23485319 -17494540 -34587259 -67066290
5952 -67066290 -82641622 -65205122 -36604344 -28107127 -41535291 -51622656 -40662558
5945 -40662558 -17683765 -4875474 -15823298 -47672306 -85477941 -111361388 -115932529
5938 -115932529 -105052059 -93142074 -88240465 -85574561 -76150759 -58554619 -40270363
5931 -40270363 -28852695 -24562647 -23456530 -26757819 -42251332 -71547941 -98848467 -101752931
5923 -101752931 -76609094 -45145158 -29714724 -29271470 -29294680 -28340574 -37923483 -56031228
5915 -56031228 -61271609 -44479760 -29054296 -39572457 -59597049 -47146158 6176351
5908 6176351 58715406 73774951 66693227 74035532 93175791 85170569 34948933 -23920760
5900 -23920760 -54299235 -59660766 -67287945 -85679483 -97641883 -85959411 -50535566
5893 -50535566 -7061843 19809409 11618305 -21934613 -44706920 -31644172 3808934
5886 3808934 33127271 50870907 69302706 86196998 86153825 71291162 61570717 60576637
5878 60576637 48896257 20569443 -886490 2144932 13608048 11086058 1609883 6265807
5870 6265807 21943597 24492883 5105432 -19938131 -35189310 -40120945 -34405353 -10015293
5862 -10015293 31889631 70366873 83948782 74650710 62698156 59625734 55761655 37346562
5854 37346562 10100511 -2956897 9878754 30195377 29463984 5168181 -16861280
5847 -16861280 -18885171 -14138903 -23700231 -44861257 -58279699 -56769590 -47877408 -32976646
5839 -32976646 -5607821 27589168 45122160 37901545 22073000 14671936 10533084 -3201099
5831 -3201099 -19889261 -17517013 12190651 52003659 77804602 79912348 65148903 46968307
5823 46968307 37257240 41168177 53951736 64120821 62898699 51066074 36756623 27782286
5815 27782286 25865946 26738709 25691316 23408262 24363213 27752788 23651007 3962080
5807 3962080 -23739780 -40728369 -38235478 -27554073 -24005280 -26600163 -21985372 -5689177
5799 -5689177 11029803 16844631 12647838 3319300 -13369366 -39966950 -66174762 -73802154
5791 -73802154 -56764157 -29597426 -13673652 -18063941 -33859449 -43714643 -37608994 -23087130
5783 -23087130 -19141346 -36348320 -64846140 -85683980 -90046542 -81287037 -64039902 -43109248
5775 -43109248 -29652077 -31843997 -36476987 -17212178 29101009 68600565 67108492 30988864
5767 30988864 -4674587 -21631931 -31366820 -42261062 -38170665 -5094090 35050996
5760 35050996 40338749 295399 -46059334 -53043837 -17615452 27250723 59433232
5753 59433232 85944215 112681184 122039668 99078854 63218719 48403856 58470961
5746 58470961 68431873 68404545 76142665 98148599 108448070 85185275 46379911 26339678
5738 26339678 31511013 42766659 49602278 56498683 61644666 55138074 38422245 24336663
5730 24336663 16973683 10271180 6065433 12647951 23518980 19201097 -4078341 -26605006
5722 -26605006 -32462032 -26736991 -19268600 -10325212 -1111108 630663 -2614244 6992521
5714 6992521 37197433 69811341 84068721 81680469 74293183 61085805 36990655 10702719
5706 10702719 -5375775 -13444417 -19551994 -15954641 2503151 14789268 -3751868 -39212593
5698 -39212593 -52187930 -36239149 -29737323 -58403385 -98598368 -116927970 -117191921 -121101035
5690 -121101035 -125688092 -113473625 -90586084 -78518957 -73956156 -53515998 -19408462
5683 -19408462 -2854429 -13064191 -19681577 -3598237 9385752 -7554220 -34274361
5676 -34274361 -35010440 -16580616 -13803334 -28176129 -26396524 199613 20617210 19220580
5668 19220580 22029680 47018656 66989949 52209692 19253547 2126671 -1550905
5661 -1550905 -16379588 -38166543 -40147533 -22643616 -13206067 -16722343 -7606835 20725063
5653 20725063 39245645 30679715 15925315 12680681 2464011 -32716161 -68988486
5646 -68988486 -70601124 -43617220 -24855776 -26965618 -28065664 -12908784 7579242 21549965
5638 21549965 33085476 44495732 43864917 23770281 -1055383 -7465913 10767814 38951325
5630 38951325 58961257 66364654 71748135 85265346 99374378 93166252 58956692 16578585
5622 16578585 -8236806 -12685173 -12657878 -16933982 -20903640 -21519004 -21088580 -17018572 -4820454
5613 -4820454 7419164 4252835 -14494214 -32077571 -39005343 -42157630 -45298622 -39138316
5605 -39138316 -19854440 -763478 5842064 3807503 -1564374 -16930792 -42336047 -52677175
5597 -52677175 -21281005 41327030 92608786 103761472 84732476 61901172 47394183
5590 47394183 38241155 33953563 42205090 67400147 99427473 117247260 106590518 75264029
5582 75264029 46625954 34662769 31017603 22107501 11887425 16265074 37085758 53709786
5574 53709786 43861062 6403149 -38169331 -65311656 -65855427 -53413258 -49481043 -55507160
5566 -55507160 -48133123 -15159063 13338904 -4888722 -62079860 -98287865 -75552309
5559 -75552309 -26907529 -6259768 -12057805 491194 39684361 56211324 15280020
5552 15280020 -48565497 -76561470 -60749505 -40895223 -40471450 -42765867 -30797717 -16593289
5544 -16593289 -18318979 -33014997 -47677765 -58559423 -62141722 -43031228 6422761
5537 6422761 62336278 88072003 76323483 53327330 39699603 26861545 -624338
5530 -624338 -37163677 -63714719 -71950197 -66731675 -51343617 -25372744 3997417 22028246
5522 22028246 21272812 8408807 -5452933 -13257201 -9524469 9217942 34381018 45008905
5514 45008905 29409001 2824884 -9820047 -8558256 -20555095 -61626128 -109737055
5507 -109737055 -129195427 -111262525 -75523072 -39202369 -6621602 13460416 7962575
5500 7962575 -12919404 -13608591 21119347 56517348 49073193 5378877 -28503306 -29949838
5492 -29949838 -19688772 -17883520 -16058624 -5315008 894795 -5233220 -2921424 21752495
5484 21752495 38528579 9338528 -47483126 -70861299 -38804759 1665782 332858
5477 332858 -33806833 -58410532 -59114409 -53622806 -49568159 -33951950 -5656509 11348353
5469 11348353 -65116 -22133043 -20123755 18418269 71372797 105417734 105566947 83084470
5461 83084470 58876659 42177389 27945231 12679400 2049932 -3295127 -17801878
5454 -17801878 -51240035 -83933489 -81292298 -36685966 16685355 43691207 42732376 34706935
5446 34706935 31130384 27652224 20259844 11923389 5467240 1334265 818534 3032689
5438 3032689 1975793 -5554813 -14152637 -19551495 -25678909 -31387179 -22093542 6879570
5430 6879570 28479183 11627975 -31604606 -55649542 -43315779 -27750495 -39126080
5423 -39126080 -58642101 -49524369 -12134514 21582518 36712019 48211080 68755657
5416 68755657 91183952 105563484 111552853 109252626 95746271 75000771 56331065
5409 56331065 41587508 29035349 27845963 47224043 70047205 63611932 25416880
5402 25416880 -7180407 -7426452 4470393 -4442541 -30294495 -44333094 -40704878 -40367321
5394 -40367321 -50288393 -49889300 -25860234 3697194 13035202 993324 -13346180 -16356255
5386 -16356255 -8653907 4848813 20896187 34996876 41694508 39838486 33618585 27051847
5378 27051847 19117838 5496931 -13782949 -28101521 -21412387 11231783 53287990
5371 53287990 78756342 76413157 58509646 44613449 41021582 38013641 23977288 -814241
5363 -814241 -24062621 -34473088 -34539374 -37224073 -47600617 -52684898 -36971924 -6529356
5355 -6529356 12188558 1965625 -23150839 -32442935 -13801923 11369088 11151410 -20856627
5347 -20856627 -56070068 -59623247 -26600846 14417302 32801551 23863537 4331455
5340 4331455 -9526768 -11339147 -922735 15709485 25980893 23866063 22593806 39397216
5332 39397216 65016439 65362899 24019999 -29118843 -46072326 -12852655 38173809
5325 38173809 64656920 51842762 16180588 -14951523 -23212187 -9149382 10537500
5318 10537500 19224767 17643384 21392825 38781258 57154854 57649865 39820011 22726910
5310 22726910 21010798 28809979 32039182 28814776 28761397 36525564 47662942 60295792
5302 60295792 77169977 91949330 88352429 63966640 42705319 47190703 66143554
5295 66143554 68307724 45737527 21788600 13799377 10867851 -1406447 -14643734 -12380323
5287 -12380323 3171163 16290306 19644179 14817138 900627 -18389785 -23761275 1083771
5279 1083771 41631398 64579381 59082176 45874628 42780176 43584961 38703055 33962101
5271 33962101 34164353 26662694 946369 -27673534 -35358474 -25099121 -24300909 -46790864
5263 -46790864 -74584123 -82052514 -65703063 -43596669 -32262404 -29289795 -16724922
5256 -16724922 17841189 61323833 81832120 62693455 24340954 808740 -2184680
5249 -2184680 -10626800 -42222033 -78857830 -87031596 -55021573 -1315884 45126151 63938532
5241 63938532 51315108 22625585 5250041 16684215 46188806 64024746 50853557
5234 50853557 14377243 -22376736 -43324427 -48544070 -46755144 -42926769 -33011648 -10300834
5226 -10300834 22590916 50117537 56212735 41236645 23434760 21276155 35675889
5219 35675889 51744696 57247761 55522316 56991029 60272483 49991209 18932999 -13878601
5211 -13878601 -19771633 2667730 19121525 -3094000 -55958630 -99638595 -107258474
5204 -107258474 -89319831 -73155325 -70408599 -71237966 -62165564 -39696991 -8504224 24839573
5196 24839573 53296568 69417373 69468283 59030368 52069032 59886104 78418277 89490908
5188 89490908 79519207 55960199 39547930 39998202 46643669 45954440 39899440 39015652
5180 39015652 42996120 40049676 25970775 12866542 14106281 28444639 44843259 55956858
5172 55956858 59151457 51005345 33135598 20723895 29932257 53192969 61860726 42890535
5164 42890535 20313369 25235228 52275309 64949830 43985975 11025859 -2391561
5157 -2391561 6611983 16097744 10589150 -4875443 -16322236 -14755058 -1359647 12152137
5149 12152137 11493453 -4172010 -19097570 -22453217 -25342130 -42294557 -61591700 -54150931
5141 -54150931 -14179972 28580708 45518164 41383626 37283309 35074741 17352209 -21315916
5133 -21315916 -60633389 -75774552 -61810968 -32656616 -3083331 22343178 45407838
5126 45407838 64985184 74189728 66971538 46382445 24153167 11109537 8392357 7398334
5118 7398334 -2177374 -21192747 -35433306 -26219832 6653358 36879083 37092850 11399613
5110 11399613 -8997447 -3499518 17497806 32768306 35086833 27315948 8629368 -20211804
5102 -20211804 -46179961 -54017712 -43828699 -27343326 -11162003 4280695 13861525
5095 13861525 10858546 -48185 -6866788 -8325405 -14672770 -28224512 -36202497 -28133473
5087 -28133473 -9761423 6599415 17163615 25319369 31265492 30436495 20518084 5455864
5079 5455864 -8123091 -17986845 -29080988 -45801078 -61051405 -61156502 -46923504 -39777509
5071 -39777509 -55344788 -78666709 -81610172 -61425749 -44283026 -49046135 -63613852
5064 -63613852 -61636500 -30886550 16438016 49681355 38985297 -12494470 -56444997
5057 -56444997 -44225890 10880583 43389782 18926200 -21662381 -22671391 9084655
5050 9084655 19607566 -15702646 -66135304 -91037652 -79278366 -43409078 -3428768
5043 -3428768 19341019 16737901 7052074 12573288 22501465 4020069 -45617537 -87597095
5035 -87597095 -92773152 -75481764 -60706011 -47273032 -28209906 -21411470 -45207641
5028 -45207641 -78368461 -82506184 -60852736 -57858200 -93088782 -127495722 -111972194
5021 -111972194 -47935547 18473001 48399556 39060783 10221368 -18572367 -36587284
5014 -36587284 -40800318 -32757730 -15754810 4341352 16777051 11414618 -9540074 -29912772
5006 -29912772 -33206806 -14848187 18665221 54667441 76797597 74269110 56216916
4999 56216916 47456177 59914143 75430736 68611379 41427092 20617053 20823104 24141143
4991 24141143 2142005 -48947409 -99930351 -113340781 -77579929 -20759185 12445619
4984 12445619 4236160 -19515469 -23539513 -7366848 -288952 -16103386 -35036352 -37046897
4976 -37046897 -31919226 -40796565 -61902265 -73301285 -63281783 -41247894 -20859969
4969 -20859969 -6695470 2429858 8716436 15492586 24407104 33101653 41214621 53732842
4961 53732842 70379424 78519229 68407279 49663276 38603130 34198586 23210766
4954 23210766 5764999 -3890196 -2305528 -1479923 -4679776 757543 18018143 28636530
4946 28636530 18175184 -3203371 -19243585 -29762323 -37858394 -30974847 2708026
4939 2708026 47203389 69767936 56742797 22430285 -12931707 -36373610 -37678572
4932 -37678572 -13604002 19297480 32696174 14326350 -20807186 -48061592 -52822283
4925 -52822283 -34827275 -5966999 15628587 20523770 16689785 14228960 8542735 -5137789
4917 -5137789 -9069284 17974192 58983427 67655366 30135692 -11327853 -14745209 8150814
4909 8150814 20479067 19387262 30553157 54334684 57934719 26822181 -9545450 -17345335
4901 -17345335 1117011 22212937 34623241 37685639 23195563 -13497682 -49197790
4894 -49197790 -46846406 -809515 50369913 66719141 49699413 31558368 32564053
4887 32564053 44545606 53392807 60170210 72607661 86361505 86720243 68033819 43356631
4879 43356631 31764418 39567912 57165028 73226813 87737735 107267926 128735778
4872 128735778 135705469 117083339 84529505 60625085 50168630 35846151 6644049
4865 6644049 -23090852 -33403832 -26344018 -18505365 -12756519 3973657 35189741 65523184
4857 65523184 81874189 88477300 93660375 94920542 86211945 69079438 47286801 20731307
4849 20731307 -5329160 -15986617 -4997277 11373845 14065397 7946245 11262468 22614925
4841 22614925 19703240 -6113849 -33946903 -40740368 -28955430 -16191058 -10077893 -6932154
4833 -6932154 -6508425 -13094129 -25165330 -35978858 -42576193 -44166070 -34711428 -9468563
4825 -9468563 21913562 41881453 46460055 47888201 52974214 53075843 42330140 30780339
4817 30780339 26510251 17240287 -11346648 -44988146 -50299220 -16998846 28730505 59576047
4809 59576047 77364420 96108951 111034082 104183615 74578750 43907593 31472401
4802 31472401 37357920 51631022 66684750 76558026 76096203 67785857 61453537 60860322
4794 60860322 57214246 42699822 25169248 21205476 35888141 56077856 65492961 62885141
4786 62885141 61806619 71708331 82979000 77424464 54264429 35390866 37054371 46231756
4778 46231756 39985175 22292346 20438128 42304942 60101966 49205935 25186341
4771 25186341 23112580 50300023 80132687 88982506 79452528 65822502 55157551 49750916
4763 49750916 53623996 65758335 75093328 72387211 62976814 59729194 65841385 71915755
4755 71915755 69354157 60056109 51382784 46644761 44196268 43464403 46857235 53965811
4747 53965811 57298264 48518766 29349502 12252430 8046432 15409098 24412925 26857659
4739 26857659 19793303 2915329 -20423289 -39567137 -40873622 -20115441 11276547
4732 11276547 34691028 38092404 21283324 -8145971 -39730670 -62867803 -71033031
4725 -71033031 -66324114 -56787232 -46633446 -32316122 -11675309 7633861 16154358 16471177
4717 16471177 19287470 25842613 26254207 18670693 16512204 28660119 45288955 54741784
4709 54741784 61922918 74388640 81670966 69409387 47030917 38011327 45789872 53990878
4701 53990878 59162761 73963839 92899283 86791259 45647910 -815087 -24018167
4694 -24018167 -32960103 -48069867 -62153113 -55405548 -32218636 -13277617 -2624883
4687 -2624883 8666693 15809604 7720184 -5216440 -2128924 11888840 11274195 -7260674
4679 -7260674 -18543164 -10047525 1341093 2466643 4996483 19882816 34845146 32948804
4671 32948804 15770981 -4118907 -16921873 -12482634 16786625 57734755 79781412
4664 79781412 69663864 46629141 32062030 23208090 10704971 2152295 9670235 29042880
4656 29042880 48114164 61835329 64088163 42077716 -2232021 -41260991 -53070067
4649 -53070067 -48879799 -49034947 -48970057 -35097272 -18259748 -18467378 -26129458 -14024695
4641 -14024695 15163797 28810668 14360340 -5295927 -13977218 -25411010 -49419484
4634 -49419484 -65588639 -52928475 -24060671 -6657271 -5928798 -7579898 -6668732 -10816632
4626 -10816632 -20473674 -27159460 -30621927 -39837528 -54615456 -61713434 -55552114 -51608318
4618 -51608318 -69656033 -107669888 -140362771 -144395892 -120170863 -86504472 -58479317
4611 -58479317 -36679634 -15841485 5888438 28710841 51439052 64216693 52764958
4604 52764958 20277600 -6255725 -6684086 4381816 -1532532 -25616616 -44715851 -51571838
4596 -51571838 -63383787 -85008612 -92482207 -67662743 -26184521 6897145 30013705
4589 30013705 53188952 69641760 64488002 43178760 26571334 20193330 10113961
4582 10113961 -10193674 -28891400 -35465777 -34590049 -34636577 -36001869 -37579237 -44005717
4574 -44005717 -58489425 -74488718 -80502026 -70574642 -48781901 -26881319 -16587491
4567 -16587491 -18743944 -21056089 -12012908 5194770 19236375 27395365 35696703 44226104
4559 44226104 44660017 34318151 21312595 11633892 1078470 -14198132 -26901857 -25147842
4551 -25147842 -5709441 23369197 49824222 64740867 67548966 65216535 62603138 54659630
4543 54659630 35043119 11172503 69302 6861547 17642130 17562667 6291526 -8578065
4535 -8578065 -22342798 -31179696 -30739386 -25490470 -29008208 -44451386 -54340534 -42046679
4527 -42046679 -15022332 6992062 18811919 28482338 36168879 35546823 34584788 51555139
4519 51555139 84638032 106662773 101034050 85538904 86618798 104200666 118755116
4512 118755116 122642670 124290633 125229102 114043870 88173579 66159699 67797523 88248662
4504 88248662 99891960 79214589 29225384 -23679178 -53835370 -57611596 -50375969
4497 -50375969 -44069233 -34453281 -14219640 8768083 16267420 1310855 -23202866 -38183298
4489 -38183298 -34698459 -17533999 317081 6539622 378260 -4221198 6214540 24809544
4481 24809544 28302798 5086012 -28773676 -48439518 -49164255 -46829685 -52011683 -55087694
4473 -55087694 -42845874 -22863451 -20014389 -45830122 -79923054 -90784042 -71377890
4466 -71377890 -42804215 -23153870 -8163056 10838301 26470240 28290671 24399667
4459 24399667 29344652 36086899 23084592 -10234652 -38272893 -44677736 -40028154 -34981937
4451 -34981937 -20279450 8597713 27435412 9768082 -33184296 -64751462 -70697698
4444 -70697698 -69819628 -75911369 -75028529 -51307097 -16165886 4695123 4275075 -1062870
4436 -1062870 2528084 9221571 6667163 -2382034 -2095100 12017697 21279844 6294706
4428 6294706 -23916022 -39450220 -27183543 -5986250 524526 -9394941 -24909432 -41241504
4420 -41241504 -53759762 -48327395 -18438032 16870541 33287437 33207367 36230067 43930228
4412 43930228 40211986 25830093 24080380 45225808 70252980 80208386 79172990 75609552
4404 75609552 62462818 33538375 4010064 -4350476 10182704 31001370 42778892
4397 42778892 38097494 15259791 -17229689 -42496233 -53259303 -59451058 -68529326 -71220196
4389 -71220196 -60248127 -49418896 -55098404 -68211073 -64949951 -39547920 -6853921
4382 -6853921 23225848 53281122 82161518 101801696 111626199 117013463 110963826 77513363
4374 77513363 20566855 -28280179 -41557286 -24014378 -607623 12410436 15299951
4367 15299951 13748255 11378755 8441296 -508792 -23488197 -57926433 -83981291 -79868081
4359 -79868081 -45514192 -6542813 7821877 -9232265 -38121778 -54783038 -55216555
4352 -55216555 -54922997 -64809555 -76045252 -73709585 -56981332 -35876612 -13513585 15760698
4344 15760698 51852656 84455532 104591776 111327249 106340778 91678767 74643601
4337 74643601 65205899 64782749 63973323 53029761 28949479 -6137813 -44838305 -73911575
4329 -73911575 -84361124 -82724763 -82873164 -87454973 -88105221 -81309874 -69436763 -48643394
4321 -48643394 -16295793 7970539 -5498073 -51364735 -80327872 -55427098 -1248818
4314 -1248818 25330362 3112697 -36950829 -56378869 -46679157 -23295722 -4212294
4307 -4212294 321838 -7489374 -13531526 -8591717 -5624128 -25993064 -66323965 -95499571
4299 -95499571 -91558114 -67281897 -49744469 -46980626 -47616628 -44572247 -43124960 -46863569
4291 -46863569 -49559992 -45477540 -39094076 -37984842 -40029881 -35159544 -20859339 -9358065
4283 -9358065 -13140566 -26167558 -29015760 -15092803 -1673639 -7315770 -26733122 -39891786
4275 -39891786 -40644473 -41101137 -48296083 -53617436 -51048929 -50410256 -61285921 -74802975
4267 -74802975 -75375317 -64684141 -59419371 -66125546 -71641136 -62133640 -41752464 -26185891
4259 -26185891 -22925166 -23832770 -15849977 4517338 27370212 38200079 29387003 2943458
4251 2943458 -34933140 -75782265 -104635034 -104242842 -73953898 -39886351 -32799328 -53395700
4243 -53395700 -70384658 -57089317 -19439099 18453465 44527166 62529382 74787252
4236 74787252 79012380 80630745 89990612 102214579 95652016 59998488 13630790 -18850287
4228 -18850287 -35888469 -50762561 -62395502 -55564027 -31029544 -14159342 -23123787
4221 -23123787 -43134314 -46050958 -26647158 -4464899 6113279 11667385 23534348
4214 23534348 39352711 48379266 47417537 42254196 35487330 21469816 -3132547 -27705752
4206 -27705752 -32900824 -10982611 20836150 32828007 11663616 -25434640 -48368821
4199 -48368821 -43994393 -24955770 -11239627 -9481388 -12438940 -13344343 -14099065 -17893029
4191 -17893029 -18094485 -1302227 34677502 70065016 79574642 62352152 46642719 56474765
4183 56474765 79177104 77427522 33479044 -28963706 -69701231 -70332564 -44469562 -18992302
4175 -18992302 -11541372 -19560626 -23597371 -5272765 31734011 62761768 70175207 64118050
4167 64118050 65981046 76932607 77117791 55641287 26293215 8693706 6409676 10873119
4159 10873119 15814847 17872085 11224408 -6876215 -29778851 -50126879 -69972728 -92230151
4151 -92230151 -107629284 -103337073 -81476490 -55027941 -27688388 4653764 31643674
4144 31643674 30175122 -580875 -24666697 -8203980 37660571 70990163 70033493 51416044
4136 51416044 40305523 42481515 49181595 51327633 40855146 12869265 -22000589 -38275958
4128 -38275958 -22876319 3067269 3277848 -32029285 -73603114 -85134357 -60242819
4121 -60242819 -22820074 4018462 20504890 39624951 60939050 65052586 37634108
4114 37634108 -8192611 -42383662 -49957981 -44121302 -45336582 -55183034 -57185437 -39607334
4106 -39607334 -10275948 11738889 14816942 3587728 -8073991 -9587663 839770
4099 839770 19045749 37757206 46534251 36042796 7989979 -22782926 -41977351 -49269918
4091 -49269918 -52754940 -54027808 -48158114 -37502191 -34285601 -44786940 -58281845 -57854524
4083 -57854524 -39791048 -19169860 -16654392 -38014560 -64168525 -66334513 -37844226
4076 -37844226 -5787569 -499973 -18174127 -29074981 -20730729 -12325818 -21339138 -37914542
4068 -37914542 -45517547 -48648639 -61441215 -81542992 -95977490 -104777511 -116965727 -126813499
4060 -126813499 -117232296 -89944494 -71949769 -83132556 -111179196 -127756830 -119968331
4053 -119968331 -97538308 -76491170 -65335107 -64946363 -74052050 -90705473 -107954855
4046 -107954855 -111539871 -90014114 -50704774 -17224427 -3804833 -275632 7697404
4039 7697404 13615908 2413013 -18498394 -22971174 -3621781 15142112 10094621 -11192162
4031 -11192162 -24209096 -17955374 -397221 15626907 19826146 6159722 -19557948
4024 -19557948 -37282053 -28710160 4345937 41517092 59723209 45226362 42305
4017 42305 -55118110 -91763743 -97650186 -86220432 -75762277 -66584565 -48314516 -22375535
4009 -22375535 -3472836 -971742 -10692983 -24271776 -35230023 -35183210 -15628500 21372915
4001 21372915 59859295 80401068 72515028 40829012 5255069 -9436149 5022495
3994 5022495 29544094 37297186 24091695 9914782 10733986 20837845 25670514 19478775
3986 19478775 4230041 -17252875 -37735780 -44241467 -31902514 -14491682 -10693466
3979 -10693466 -22523855 -36315404 -41927551 -40401969 -34192595 -22091588 -6051769 8033741
3971 8033741 20681650 40123075 67665679 91063274 99652124 96777824 87531250 64197096
3963 64197096 20223462 -26092417 -41869499 -17383227 22674407 50977346 63664233
3956 63664233 66160301 53065563 21901072 -6318960 -6342585 13821946 19197317 -4042954
3948 -4042954 -29006647 -26130206 -817870 22139076 35882810 52060467 71580111
3941 71580111 78156187 64449712 46302763 41071193 43305637 34834070 14277311 2276677
3933 2276677 13853748 37335404 51345271 56013777 70859956 100332719 121032537
3926 121032537 115397939 101028600 104507704 116320095 101333097 55330906 20551054
3919 20551054 32323674 74859089 106848781 109372128 87865499 47417808 -4388245
3912 -4388245 -42383461 -44361905 -24087611 -14323474 -16967414 -1536519 40703191 74342896
3904 74342896 68493339 40878762 29743114 40210363 44543395 25318863 -6704455
3897 -6704455 -32877238 -41464235 -23776444 20137302 65971738 75857795 36928686 -21890892
3889 -21890892 -60689777 -66820692 -55084218 -41810182 -32336488 -27370337 -25721682 -20332929
3881 -20332929 -4401192 15555241 23192195 12770340 -3748594 -14927696 -23908055
3874 -23908055 -34996250 -37028788 -16243320 18381520 40440568 39197891 31840144 37209307
3866 37209307 51726938 60106761 57245397 47832663 34212277 18044849 7341546 8519111
3858 8519111 15506495 17794405 14111162 7002439 -8462134 -35141974 -59221150 -63812573
3850 -63812573 -54244105 -50458726 -56123280 -57573572 -53960538 -61348290 -78800743 -78158297
3842 -78158297 -44655254 -5398034 3956179 -15552216 -35758957 -41544677 -37089973 -23667597
3834 -23667597 189225 20686071 19221337 2724920 -1350135 15564005 32476495
3827 32476495 33698240 29924622 33284286 34225249 20351113 494553 -10035638 -15661137
3819 -15661137 -30618359 -50529966 -56237637 -44606818 -34983499 -41372601 -55401934 -63428933
3811 -63428933 -65730616 -68457699 -67256539 -52481738 -27435833 -9555217 -11049681 -25449040
3803 -25449040 -37066853 -39401994 -38904299 -41872793 -44898811 -43481484 -45772406 -66947741
3795 -66947741 -105523446 -133674657 -121485911 -69783778 -10759564 24466675 31258735
3788 31258735 23779497 12625394 -2337772 -22711003 -44346030 -59115997 -59143907 -41446512
3780 -41446512 -14013932 5132275 2958817 -13968274 -26969238 -28036807 -26536337 -30516758
3772 -30516758 -32023054 -19505446 2657945 18308645 19405968 10044011 -7120279 -33151709
3764 -33151709 -57897772 -58586937 -25363289 20672079 48006724 48497331 37665029 24926621
3756 24926621 1319975 -38041972 -74753815 -82837934 -57008508 -15100954 22364148
3749 22364148 44104720 44281237 22897832 -6229074 -21261491 -15121853 -4796903 -9336535
3741 -9336535 -25215475 -34158966 -30672926 -28177429 -37853116 -55093638 -70480834 -80705037
3733 -80705037 -81781722 -65540288 -35680325 -16022724 -24589143 -44914363 -43411801 -14969233
3725 -14969233 10588112 12809946 8113604 19140354 37241747 37955659 20893021 7773249
3717 7773249 5985301 1969132 -7364108 -5411882 11405602 17674060 -5841518 -40469736
3709 -40469736 -54805297 -46966463 -37135814 -28690233 -6668903 26836769 46407940 39839236
3701 39839236 24787406 17391710 8466073 -12327006 -30099051 -25698960 -8557194 -3386679
3693 -3386679 -12485661 -16542376 -8792342 -2436892 -3552153 -2479005 2482514 -2314058
3685 -2314058 -19453502 -29212772 -19007840 -5339196 -9982040 -29690899 -46416694 -53160285
3677 -53160285 -50661738 -32209898 4000097 35526845 34351842 2782349 -31837433
3670 -31837433 -55923935 -77906483 -97133307 -94391621 -64790623 -35509783 -33938855
3663 -33938855 -54673715 -72805443 -74802858 -61540617 -36474800 -9816277 -2571775
3656 -2571775 -25417293 -59901533 -78875333 -79549645 -78015694 -77906698 -67722828 -47453510
3648 -47453510 -32870904 -28420432 -18540222 4587227 24541036 25400801 17508521 22562687
3640 22562687 42836398 60400217 60650451 42881648 12517868 -22354739 -47811492
3633 -47811492 -51466386 -37275834 -25083000 -31293847 -52733970 -69782588 -63942523 -36001434
3625 -36001434 -9226584 -7424511 -24866699 -28400167 477954 37885250 50053496
3618 50053496 43559684 54813467 89483221 106377766 76745777 29253933 8693495
3611 8693495 12148916 2525008 -25254559 -33829147 -4642811 28968285 28725311 3199900
3603 3199900 -11398659 -3152632 8432835 6007040 -9147518 -28501624 -42623523 -38937764
3595 -38937764 -12419435 22134857 44089267 50242877 48681028 36369976 5295388
3588 5295388 -32749269 -54573904 -60825118 -73702757 -91997505 -81218743 -27966577
3581 -27966577 24971682 28606205 -5018656 -20283323 4257127 31386178 23914746
3574 23914746 -4105487 -12917653 6311353 24643344 20615069 10666048 24245436 58109677
3566 58109677 72087458 36856820 -25533189 -64344221 -58976215 -34273417 -14439929
3559 -14439929 10479934 53637152 91061581 86108952 46225004 19765839 31029813
3552 31029813 50059247 41474519 17113887 16757180 51265828 90052189 101846586 87645515
3544 87645515 69787595 62344933 59468977 47267593 21987051 -3407798 -11100308 2350926
3536 2350926 21351130 28050303 20592014 11405259 10638558 16453354 21000399 21276147
3528 21276147 21773823 27081295 33106905 27958229 4525104 -27884853 -48237861 -43014677
3520 -43014677 -20385254 -3757824 -10355564 -35653324 -59388759 -67297061 -64300002 -63622769
3512 -63622769 -68071718 -71181962 -73984996 -85591478 -103414757 -109273625 -94930302 -75742721
3504 -75742721 -64465363 -47406638 -8825993 32725472 41688354 16824506 -4310499
3497 -4310499 2556275 19081012 17099716 -4288261 -29266372 -51671976 -72453463 -86284026
3489 -86284026 -88631555 -84629266 -76339395 -54722475 -20488355 1527248 -10275405 -42781301
3481 -42781301 -65203367 -69103561 -69135471 -71351336 -67390049 -58915764 -60690723 -73794154
3473 -73794154 -79212677 -66830849 -50640281 -44626630 -41906365 -31497440 -20823089 -24854285
3465 -24854285 -41760414 -54962009 -54446950 -42406918 -21217908 9484565 42295479
3458 42295479 61168991 57347827 39740025 23715508 13341185 708228 -18511954
3451 -18511954 -36217782 -42429210 -39954240 -41483410 -52802944 -66168083 -71849588 -68666273
3443 -68666273 -59643644 -45458150 -28592288 -16739747 -13443122 -10810656 -915706 10612756
3435 10612756 14065121 15856341 35579976 80515312 133372957 168717111 174235695 154733542
3427 154733542 123998052 95562159 74465404 56079786 38539954 33818671 55073542
3420 55073542 92313591 114350025 100949120 62604418 22721642 -7989919 -30315429
3413 -30315429 -41459075 -36959908 -24368180 -20321457 -30416925 -40477655 -32296630 -4409983
3405 -4409983 25228866 35778715 22831091 3130522 -630289 18544834 46278032
3398 46278032 63105039 62962258 53386284 42644629 34015499 31764383 43367667 69141953
3390 69141953 93401489 95079836 70560702 39910517 24112488 19949092 6592230
3383 6592230 -23840617 -54247180 -65207135 -57810526 -44826774 -29263634 -5623889
3376 -5623889 22686860 42556466 47812379 43926567 34994331 18390583 -4395853 -22387024
3368 -22387024 -25214603 -11489254 13782892 40768316 53613526 40966511 12211176
3361 12211176 -8887521 -12885815 -15607125 -32814478 -55207753 -60004823 -40578100 -13335402
3353 -13335402 1823981 -973666 -14231959 -28344829 -40646893 -53890145 -65261950
3346 -65261950 -62410300 -39148980 -10979923 -389999 -6687118 -7630373 5754388 16416583
3338 16416583 11828980 5266721 10731371 16497533 5816466 -11237950 -13014241 -3716500
3330 -3716500 -6263575 -20222696 -16985117 16425567 53763686 61578118 37143696 3365631
3322 3365631 -19149348 -22574653 -6251005 24175201 54519495 68258921 57115433
3315 57115433 26790605 -3843250 -13079592 3883434 25747643 25730310 1682359 -24030061
3307 -24030061 -32904138 -25631869 -10460671 6785195 18070534 15459901 4053092 -2321352
3299 -2321352 -3581746 -14708345 -37615886 -50800904 -38950286 -15492617 -1295914
3292 -1295914 2623154 4171762 -1613405 -20736816 -38398108 -35513839 -22704042 -31398608
3284 -31398608 -68024569 -99297362 -90960952 -45867383 3399452 27970328 23049509
3277 23049509 4744716 -7314627 -8274634 -8870709 -14561299 -12240760 10781458 42863030
3269 42863030 60560110 60147851 56674748 54787575 45005507 30955439 33018157 54966452
3261 54966452 71208247 60934514 33642365 5964132 -24272442 -60326026 -83380282
3254 -83380282 -74259400 -45585303 -25109568 -16055097 -2584502 11190847 988647
3247 988647 -34414834 -59933463 -46972820 -7812431 26042841 41736140 45825650 41045710
3239 41045710 21549809 -11204370 -40791503 -48008077 -29986988 -8135302 -12239222
3232 -12239222 -48549380 -88110919 -98709370 -83282641 -68959893 -62001234 -40353337
3225 -40353337 3038046 37840615 34169553 1163866 -32486434 -58733638 -86816074
3218 -86816074 -112203724 -116116956 -93319665 -58993884 -28508165 -7304791 1329872
3211 1329872 -4430988 -18389476 -32577896 -46459080 -56930494 -48478743 -13650827 23756855
3203 23756855 30781782 7741996 -17166640 -33793435 -58956397 -94256539 -109437942
3196 -109437942 -84790235 -42528665 -14727270 -1879302 13827147 32345406 38979835
3189 38979835 32640640 27019035 30518200 44475148 71972762 106561873 121133239 94711171
3181 94711171 47700049 23815381 34193574 44089797 21458986 -24455294 -63313813
3174 -63313813 -80843701 -79433157 -57890375 -13139767 41702320 79662736 84966670
3167 84966670 66392729 42406363 20713808 -1855665 -24050612 -34221255 -23047451
3160 -23047451 3356733 29466570 47079857 59238648 70047705 81205623 98616956
3153 98616956 128194396 159629887 168879012 147619656 118733253 109853618 121229682
3146 121229682 133142943 134600043 127024591 107870308 72615692 31228513 2298286
3139 2298286 -10347896 -17390638 -20730237 -11403164 6006395 9117850 -12610451 -41446290
3131 -41446290 -54549235 -48645223 -32606893 -11396722 10557826 23536160 23305655 17256898
3123 17256898 8364767 -15312451 -61138665 -111515138 -138860047 -136160848 -119639442
3116 -119639442 -105342437 -95700660 -87035888 -79576974 -80187018 -100092808 -143911168 -193891198
3108 -193891198 -213691652 -180484082 -110271560 -41931614 249841 20125863 32471655
3101 32471655 44448404 51957493 44866485 17812513 -17391565 -35433749 -22255538
3094 -22255538 8907350 34027838 43012570 38410484 20761334 -7773335 -32033309
3087 -32033309 -35604970 -22449359 -10008807 -2571347 10371897 29760229 41244432
3080 41244432 37536971 27832732 19600611 8964708 -4000334 -8498870 -1120960 5527594
3072 5527594 2725977 -1642153 -1841267 -8712404 -29053172 -45667143 -39218373 -20202445
3064 -20202445 -15703416 -28225120 -31514840 -9689206 21425643 39817256 45724511 52038872
3056 52038872 59321044 56435541 41405003 27304052 25834979 34786438 45511216 55923321
3048 55923321 70030165 87718613 102098052 108273268 109387700 110713941 111852845 108973082
3040 108973082 100761464 86570303 63643871 35949501 22397600 41277029 82660371
3033 82660371 110164514 99063539 62965706 33841988 25356501 27405982 28173963 25815672
3025 25815672 21381205 15184081 11060423 12311691 12266116 -275132 -24639866 -47179305
3017 -47179305 -57735694 -57432863 -49448101 -33863456 -15096904 -3655373 -5285931 -15891243
3009 -15891243 -29465557 -42076398 -46680207 -36092244 -15083134 2050697 9648070
3002 9648070 13178610 10269440 -11515272 -47525195 -66866161 -49731628 -19577462 -15120921
2994 -15120921 -39153556 -60042702 -60341946 -57100325 -69460313 -89743297 -97704830 -87688459
2986 -87688459 -70919279 -61394366 -66917176 -84502763 -98641723 -92827624 -67341311 -38257133
2978 -38257133 -18936459 -13302281 -24161984 -48922491 -65608362 -47398744 -1078864
2971 -1078864 31531306 25607408 6702094 13493959 45309187 70077538 70837134 57818150
2963 57818150 42034979 24033600 7677075 1437064 3956663 6803492 10861182 21238482
2955 21238482 28498198 18039588 -571271 2571058 38903082 86753723 120234586
2948 120234586 131717683 120796945 86155939 40348806 10820611 11017682 26498543
2941 26498543 40489043 53729169 66538635 64559867 42846043 24781406 32410768
2934 32410768 51797420 52923568 33390330 16674565 14867065 19868557 26917202 39027927
2926 39027927 48145191 38879893 14923677 -2765234 -9154541 -21712834 -46027242 -60835166
2918 -60835166 -51979072 -38805563 -46484582 -67745722 -74216869 -56451598 -30777302 -10275873
2910 -10275873 9595463 33351915 50510957 46800910 22419076 -6555121 -21074452
2903 -21074452 -12537984 10679354 28885691 29964785 24954788 37806063 75309166 113673036
2895 113673036 122157427 96457980 60791924 38553492 29995447 20258705 87536
2888 87536 -26190010 -45646544 -44198804 -17488045 17461366 30128997 8578114 -22732635
2880 -22732635 -32417551 -24253878 -29386510 -56922573 -77627006 -66556580 -38655317 -23955685
2872 -23955685 -24619742 -19303120 -456742 16915821 22524286 26336483 42002308 67451751
2864 67451751 86763499 85057637 61431788 31936677 16232212 16711756 17845976 11030250
2856 11030250 7218078 14586067 19089990 5783344 -11961844 -7125255 23076603 55895859
2848 55895859 75339022 83241455 81313240 67064907 48288282 37118676 27020703
2841 27020703 242318 -37699787 -57276034 -47002316 -31036461 -33181948 -46564026
2834 -46564026 -52744429 -49057178 -40762496 -25884158 -6614570 357654 -15315936 -37797306
2826 -37797306 -42847968 -25403056 4443304 40056200 76207772 100116774 103853258
2819 103853258 99031574 102322519 111151371 108143261 85271100 50957701 17284450 -9366065
2811 -9366065 -29486655 -50569351 -80114595 -112295367 -130083482 -125694705 -107301048
2804 -107301048 -81501514 -46785585 -11712453 2429392 -9114021 -23485684 -24117780
2797 -24117780 -23193871 -31267451 -30580273 -7109351 13653052 -1124712 -38841980 -57915922
2789 -57915922 -46085947 -24136522 -193376 36098671 74286583 82534417 55658791
2782 55658791 26061609 16256702 15913787 16392051 28835308 50302932 50365656 17967984
2774 17967984 -9980941 2247577 35555843 43573572 15836346 -19188559 -41591237
2767 -41591237 -56106037 -64194764 -52327500 -15945926 25475218 47004526 42413144
2760 42413144 25946935 16173485 18772443 22441053 15069415 3774399 7867898 29176834
2752 29176834 45966888 45938162 47771058 72932568 109391946 124586599 107980971 80706068
2744 80706068 65605315 66050315 73997740 81068233 77624938 55104370 16344429 -23411567
2736 -23411567 -49286989 -56280911 -47235523 -28205489 -5840253 16312535 38827338
2729 38827338 60324575 73352063 70892146 53973240 29231289 3677652 -14718719
2722 -14718719 -19101838 -12858236 -8995318 -12244061 -9296845 12714412 43767767 58727086
2714 58727086 45436469 16101497 -7131750 -10718262 2266830 14798143 10172745
2707 10172745 -9769948 -25910702 -27546292 -28261405 -46770904 -81221965 -114794545 -136969003
2699 -136969003 -142878021 -121603871 -70200234 -17967229 -8636915 -47160715 -84990300
2692 -84990300 -74806541 -27106693 5096079 -8909445 -46103210 -63367279 -45922444
2685 -45922444 -13452207 11672778 26674531 37274339 38826554 22124077 -5645380
2678 -5645380 -20648916 -8084741 21213502 44653330 49963588 39171758 21330897
2671 21330897 9299904 14646682 36232261 60276482 77911413 91888585 98011553
2664 98011553 76604334 20807643 -38639573 -60826535 -42822994 -18038201 -8436017
2657 -8436017 -2968835 13318756 34435872 48651261 57712282 66315065 68035752 57210522
2649 57210522 42951955 35776558 29746974 14340077 -3002723 -4748919 8474012 16294576
2641 16294576 8738681 862991 8326266 22277876 23362686 13086091 12540858 28664628
2633 28664628 40192300 27082203 -340569 -16928070 -17303254 -14742762 -10323291 11490858
2625 11490858 51373274 83367357 87473563 75126600 67391764 65135948 58630488 50498826
2617 50498826 46628459 36917900 10880870 -15587175 -16681797 2803067 10710129 -7079831
2609 -7079831 -30225039 -37649966 -33420930 -31049089 -33477416 -38436437 -45794551 -50622192
2601 -50622192 -44826508 -32396848 -26386264 -25542737 -13948906 9035513 21336261 12332951
2593 12332951 1556188 6416747 11922493 -5154360 -36182792 -48602631 -27635425
2586 -27635425 8873874 33177858 30287641 3182748 -29510582 -43727006 -30304582
2579 -30304582 -4473220 11104945 7560709 -10288160 -34171736 -53758414 -58612689
2572 -58612689 -49449092 -38853835 -32798543 -22757267 -4109274 13020979 22847218 36945029
2564 36945029 62136336 80991843 73758541 46808295 19250769 -6277449 -37142971
2557 -37142971 -65978104 -77104185 -70772261 -58197348 -39782462 -11971378 12170233
2550 12170233 16362332 9497222 11461240 13719161 -13711677 -72721665 -124893324 -136409156
2542 -136409156 -110397308 -70156901 -36827433 -27983807 -47558629 -67573755 -50213705
2535 -50213705 -1230321 27779291 6041025 -35695777 -48803623 -22468561 25541650
2528 25541650 83986713 143809700 181231130 178579489 149083779 115224770 79997621
2521 79997621 47004623 44035520 83049675 112892454 66889599 -39967611 -114048158
2514 -114048158 -99045642 -42335447 -20895443 -44035649 -68273665 -76898654 -93209610
2507 -93209610 -123687612 -137166266 -111412612 -65529733 -28972555 -3127354 26433993
2500 26433993 56971535 71039688 64027332 47696982 28293574 1939957 -24750581
2493 -24750581 -30759946 -10234905 9383923 -2331632 -37034158 -55449377 -36480727
2486 -36480727 -47453 23356693 28430694 30817153 40993222 55392480 64961515 60357633
2478 60357633 35183646 -3761649 -34149903 -37901077 -20576722 -1662669 9403264
2471 9403264 16270782 20647513 19518426 15231911 13039101 8804134 -5740153 -25411998
2463 -25411998 -36247714 -39367709 -50212459 -68023378 -68125817 -37943939 -983033 14634735
2455 14634735 16567139 32997126 65352934 83283109 67768747 35229276 12009676
2448 12009676 4838280 6279795 12202773 20380897 24278004 22820053 27779777 46911401
2440 46911401 65818746 62023381 34669763 5715671 -8039602 -9591627 -7024458 -601732
2432 -601732 8109900 8248977 -7007844 -27509201 -38837254 -42383638 -49903221 -61389335
2424 -61389335 -63045245 -48734175 -29968273 -19691931 -17371005 -16261491 -14291654 -8607705
2416 -8607705 10115409 43561576 71499076 68065747 33116417 -6545373 -29394575
2409 -29394575 -38124421 -41780914 -36315845 -16389961 5672279 10960976 -368951 -10797575
2401 -10797575 -10478164 -3402966 11677189 46356296 100460994 150608554 171748913 159231074
2393 159231074 122223607 71027303 23195136 4493069 21679121 44550101 38975692
2386 38975692 12190147 528195 15844962 33562578 36102500 34469439 34071091 12425781
2378 12425781 -43783258 -103410096 -123129165 -101205176 -70229247 -47185178 -23305677
2371 -23305677 553809 4330185 -16842644 -37222471 -33726373 -14266332 1203744
2364 1203744 10833004 25343699 43230596 48522845 31062840 -656879 -25950959 -28107030
2356 -28107030 -9205295 8403390 1659446 -29457242 -62931864 -78298761 -70877187
2349 -70877187 -46195868 -15608726 2217898 -5995577 -27983724 -35241946 -19610886
2342 -19610886 -3047961 -1924700 -1611996 18129264 50168476 71996293 76903610 71567678
2334 71567678 53445444 15917168 -28114246 -52761279 -52139674 -47037641 -54060152 -65033638
2326 -65033638 -64149008 -52985475 -49795553 -68539996 -101303164 -119161353 -95237701 -34016430
2318 -34016430 27528929 56552806 55557668 47737111 42354076 32126003 17135331 8659699
2310 8659699 9395232 9739318 5774191 3777527 6081154 10029207 20709748 44571563
2302 44571563 69810527 75813119 64433009 56764250 55082374 38568668 6906235 -6381829
2294 -6381829 14790440 35908785 20074281 -15531423 -27430065 -12178540 -3458838
2287 -3458838 -11027824 -7086401 21564722 48746161 51611361 44755495 50347927 60274983
2279 60274983 54126385 37722197 35314177 49919845 56960395 39601713 11914270 975258
2271 975258 17199039 47370359 69598432 71376697 57966808 45631653 43600827 42651096
2263 42651096 25165520 -14368466 -63355077 -104088469 -126514032 -128825368 -114332196
2256 -114332196 -91451465 -69712831 -50307833 -25734633 6462889 36877548 58939595
2249 58939595 81389272 110386035 124143590 89457425 11356158 -56463693 -69659965
2242 -69659965 -46675073 -40985374 -69415305 -96224223 -87651224 -52041021 -16097047
2235 -16097047 11895271 37077681 55624189 59065900 50892031 40878505 30103697
2228 30103697 15910064 2499477 -8811228 -29661994 -66534166 -101676397 -113550515
2221 -113550515 -109440701 -113244543 -124081126 -114304399 -71695353 -17645262 23420429
2214 23420429 47933706 57485110 45855575 18519374 2803040 16596470 41904480
2207 41904480 50901841 45906447 49930139 65404895 67776884 40372807 -5017823 -45058713
2199 -45058713 -65346956 -61262779 -35478082 -1844866 20328393 23761665 18384438 15616562
2191 15616562 14761143 7830785 -9337441 -33754195 -57503113 -72661389 -80040170 -91047901
2183 -91047901 -111132852 -122948618 -100610629 -45374554 6090769 17932520 -8821375
2176 -8821375 -43588746 -60279467 -54353542 -34404223 -11543897 3114727 1947297 -13764926
2168 -13764926 -36015534 -58325066 -78185089 -92298892 -94783016 -82093768 -58374573
2161 -58374573 -36107240 -30666748 -48515782 -76735232 -89160590 -69734411 -28028326
2154 -28028326 13332001 42673390 62452695 71503703 58110414 17973042 -28963365
2147 -28963365 -50820449 -34526255 779857 23170901 17958075 -4039871 -25238733
2140 -25238733 -40679926 -54150898 -61408284 -49981543 -18624684 14305061 29802775
2133 29802775 27371573 16597282 -431683 -23206589 -36431612 -21580693 12685580
2126 12685580 32571574 20470740 -3432679 -12230920 -7059047 -3319400 2436586 26263334
2118 26263334 62845115 83897024 74439009 50485857 35000164 33696276 40138499 46041344
2110 46041344 38117166 4573840 -41362531 -62625065 -42553207 -14306448 -22724790
2103 -22724790 -64969490 -94770314 -83305745 -48418432 -18674635 3262566 26070310
2096 26070310 41263479 33458691 9516649 -5086650 2014496 18599476 28625184
2089 28625184 29715615 26922019 21591967 12070261 -2563013 -23258745 -48133111 -66169108
2081 -66169108 -63051640 -38978809 -13024661 -2591718 -4075421 -1306634 11518734 24200045
2073 24200045 25682947 16135592 3616659 -3828287 -1204971 11525287 26988733 33912811
2065 33912811 26712687 10378759 -4781222 -10926904 -5455153 9566235 28245108 43272398
2057 43272398 49741033 47268273 40317191 37523546 45919723 60347845 62816768 41710838
2049 41710838 10380608 -4382509 5830832 21890819 23193432 10319897 -4804400
2042 -4804400 -17513836 -27149105 -26901113 -13628595 -1265842 -6847720 -25988801 -39471914
2034 -39471914 -42906192 -50627447 -67568499 -77520991 -67982502 -49649888 -39231280 -35643938
2026 -35643938 -25859071 -4808687 22165379 48133707 64495093 60736624 37436483
2019 37436483 13007377 4249654 5421668 -252108 -13878837 -21769661 -20432028 -22928757
2011 -22928757 -37049364 -51606126 -50422714 -30170814 137800 28960300 47875061
2004 47875061 54968623 55475472 52988032 40939074 12669501 -21064021 -39675659 -41911631
1996 -41911631 -50731798 -78074289 -99228918 -80553339 -26024346 24227088 43273449
1989 43273449 46071900 59999861 83483243 92735974 82617998 76343603 87081893 91302430
1981 91302430 60634193 9133052 -17731177 -2230917 23614876 25376332 11702102
1974 11702102 13863078 38543923 65887143 83024312 91915109 89048990 66865735 37582392
1966 37582392 27327177 38131974 40429755 14752504 -21501476 -42761749 -49758032
1959 -49758032 -57776542 -68429341 -74120983 -77832197 -86804187 -94770414 -90470585 -77256612
1951 -77256612 -64740717 -47259126 -13080537 27014696 43893820 27378614 380824
1944 380824 -10478488 -2028657 14351961 31935486 46985063 50273846 35961833 15213613
1936 15213613 8278622 21508216 39787466 44254886 32752145 18994393 13690415 12497042
1928 12497042 6126597 -2584124 -1199794 11682033 18878448 4974065 -22320949 -39925164
1920 -39925164 -35585105 -18875594 -7211907 -6436955 -5287095 12156742 45126327 67746651
1912 67746651 51292158 -1559859 -55120998 -79123199 -77326814 -70509564 -66215018 -59966480
1904 -59966480 -53365180 -50587874 -44027739 -24607325 -3789196 -5012900 -31975384 -62255361
1896 -62255361 -73775399 -63102886 -38967084 -14442862 -4606995 -13529252 -23162370 -13975767
1888 -13975767 3024174 -3658651 -41052259 -79259026 -89629875 -73252323 -44546335
1881 -44546335 -10786333 20306965 35325703 33177734 30755450 37987708 46103641 52337189
1873 52337189 71722505 105670898 123164914 99177076 52937884 20361366 5439598
1866 5439598 -9258407 -18325513 303637 37759573 52923895 28767918 -913452
1859 -913452 4261530 42088951 76526943 79531692 52838156 20699827 9899153 26957573
1851 26957573 49917739 51945136 32959761 13946590 1516418 -20185681 -56665694
1844 -56665694 -84352409 -78021775 -42117804 -2469395 21250833 24538205 12371835
1837 12371835 -3184057 -9396841 -7367190 -10912026 -22766424 -24890488 -4568476 22244575
1829 22244575 29461473 14494779 -1839895 -2337363 14676968 43808397 74941584 89253845
1821 89253845 70691298 24722473 -26155629 -66320598 -94578614 -108609750 -98247483
1814 -98247483 -60501407 -9289828 37354271 71395857 90459011 89721101 69031687
1807 69031687 43072376 32345318 41876084 55627678 55361555 41396432 30731943 35456719
1799 35456719 47516939 48214548 30628692 6862684 -8015306 -12743417 -16250646 -23061710
1791 -23061710 -30022568 -35045550 -40573465 -47349120 -51142859 -47414484 -34907124 -14786335
1783 -14786335 8215775 24155205 24978837 15213368 8521385 11061447 15552776 14759677
1775 14759677 11489166 8924275 430937 -20423042 -45808394 -61577607 -65689122 -65934157
1767 -65934157 -61200247 -40234000 -1937271 37378984 63053569 76084368 81418663
1760 81418663 75791865 58205825 40861002 35354870 36074703 31894633 27007501 32975078
1752 32975078 45340337 48201722 40932862 39314486 47162039 48016234 32304570 12955053
1744 12955053 3364698 -2130834 -12253617 -19089508 -10959881 6394500 18049803 21400035
1736 21400035 24847438 32027492 40623646 49834485 56528098 52029127 35630912 22486661
1728 22486661 24383806 32052538 30739534 22362324 16629651 13583625 13899871 30956443
1720 30956443 67738592 96430583 91232965 69016128 63614706 73264122 75807298 82624058
1712 82624058 117485659 140149061 63557412 -121274797 -297927099 -349114545 -285401206
1705 -285401206 -202794083 -154103845 -123266521 -97442618 -89938009 -93153995 -73284697
1698 -73284697 -25508203 13453100 20664081 13024268 6625033 -7342741 -29645032 -36763766
1690 -36763766 -20876927 -11706730 -32031682 -59640846 -61049643 -39117139 -18041203
1683 -18041203 -952283 24962707 52914451 58654020 36176728 5712258 -15473142
1676 -15473142 -30197470 -46230229 -60209341 -63049863 -53569171 -42328000 -42013545 -51103333
1668 -51103333 -49878798 -24445413 5952573 5595880 -26906993 -48442371 -28949735 3382652
1660 3382652 1259493 -33238194 -52961245 -33323876 -1011849 9993910 -325485
1653 -325485 -14126943 -27495133 -46279600 -66611250 -81081653 -96439099 -124976505
1646 -124976505 -158822567 -169487481 -139528697 -86389048 -47420198 -42593228 -56726973
1639 -56726973 -60601683 -46008060 -31953948 -33488858 -35030162 -8194010 46434411 91577988
1631 91577988 93812705 60716375 28816965 22731107 36866210 52143983 57375129 53043753
1623 53043753 45056235 40044717 40883052 42519124 36410033 21939644 8168284 540364
1615 540364 -7329004 -21154880 -31187541 -22176887 2611788 20853707 19280732 10376886
1607 10376886 12646742 24066620 26775853 12253122 -10059985 -25816240 -26640451 -11647720
1599 -11647720 9856430 19993603 9724382 -7161426 -11041072 -4774399 -7734150 -22498857
1591 -22498857 -29196221 -17416963 -544162 11651057 31370426 67308828 100798242
1584 100798242 108164944 91697673 67233168 36072353 -4541633 -34828194 -28765900
1577 -28765900 4888860 28033099 23048753 9697208 6826640 6464477 -1080448 -2901587
1569 -2901587 14869885 38466833 41233932 17721021 -14343777 -38746280 -51442303
1562 -51442303 -52211716 -41597265 -24798846 -7424452 10165606 25076607 24257993 -1989203
1554 -1989203 -41378305 -68257575 -71953280 -65233132 -63136103 -65057988 -62079475 -51586857
1546 -51586857 -36950202 -19454755 40447 13539259 9634899 -11287528 -31314703
1539 -31314703 -31709765 -14677819 -642510 -344712 2210459 29436343 76716786 111645261
1531 111645261 108557327 73468745 31368095 -518012 -20633643 -34411057 -47390265
1524 -47390265 -61130719 -67672319 -53687679 -18738719 16547099 31393502 29939825
1517 29939825 33366802 48917774 60206623 50645548 24650553 379187 -9759746
1510 -9759746 -5736718 5633280 16197576 20763961 21163597 23074176 26302393 24220413
1502 24220413 17176085 18344926 36017411 54464300 46528480 8434497 -30124089 -39074740
1494 -39074740 -22761072 -9914826 -13203063 -14171411 8015998 46862401 77292767 84351149
1486 84351149 70510568 41248898 569264 -39092563 -60375821 -61813109 -61711848 -71964457
1478 -71964457 -80238970 -71078908 -53938582 -50902928 -59734278 -50747210 -7439818 46488866
1470 46488866 73711799 67646395 56085905 63487700 83207208 90549422 73703609 44494689
1462 44494689 22040792 12454908 6047316 -7930036 -25635999 -29047593 -4037632 42055737
1454 42055737 84788615 106780666 113390111 119932825 128238483 125420558 104778290 75589462
1446 75589462 47801513 19411243 -10799337 -27777050 -13211649 27685849 65779650
1439 65779650 76162683 57551608 24517555 -7800616 -29823871 -40201134 -45814713
1432 -45814713 -49731867 -38692889 3669661 67551403 115970198 120971152 89002054
1425 89002054 44173762 2024371 -29445805 -39567344 -24831715 -249831 16617944
1418 16617944 27669312 45338542 67973558 81059054 79021482 68754966 53855027
1411 53855027 32929612 13517348 10265205 25861270 47090654 61601440 66382780
1404 66382780 60715969 46289540 34778156 38086355 47793478 40938941 11286262 -20389089
1396 -20389089 -32172938 -22295972 -572677 23748947 38394620 30000976 650785
1389 650785 -30519280 -49855739 -58698817 -54748864 -25813797 24037258 62690201 64564831
1381 64564831 42501547 25491980 18422257 6561323 -11214311 -20080341 -15678876 -8775075
1373 -8775075 -4779056 16024 3027810 -1795158 -5089578 11875115 48781406 84084084
1365 84084084 104744334 117278471 124827130 117256124 94094075 73776701 64116174 44202130
1357 44202130 -2609629 -52699215 -65459374 -37116799 -6226555 -3547281 -18749325
1350 -18749325 -25211462 -19032108 -17379159 -27946712 -39282478 -42678495 -47625675 -66208899
1342 -66208899 -91707462 -105563873 -102117913 -92885596 -86094665 -77254514 -65211988 -61535517
1334 -61535517 -72000425 -80975664 -69314097 -39803868 -10366830 10393071 25300332
1327 25300332 34685308 39497511 51224298 76008290 93967464 81305109 51698729
1320 51698729 44448958 66483843 79980139 60560235 33440772 28977788 32892281 13181271
1312 13181271 -24215344 -42765981 -28411439 -2303360 15246470 23763019 26614539
1305 26614539 23495500 20669549 24880886 26258427 11473069 -5264254 8082712 54487586
1297 54487586 97208112 106651092 94129498 85467374 83041312 72837294 53696980 38788379
1289 38788379 34346776 32426784 23014426 5724127 -7488391 98479 30928756 61965596
1281 61965596 67228584 52624241 47904347 58840980 53923144 14193488 -29250698 -33562303
1273 -33562303 -2662483 22293448 21308449 13369623 18075486 29855985 36658849 39211167
1265 39211167 40673302 35447652 20189834 3595314 -4496787 -4669047 -2278448 52698
1257 52698 -1852619 -15775046 -42804934 -71056107 -85962950 -83261276 -69367149 -53835992
1249 -53835992 -42598670 -33289538 -17958447 3262080 15155342 5618221 -11832747
1242 -11832747 -9589404 18240307 47530483 55619611 44596770 27479105 9949759
1235 9949759 -3450298 -3196240 9230773 13809608 -1523045 -18782925 -14211719 5301344
1227 5301344 12941751 2617195 -7017687 -7975707 -14094234 -29600940 -33099640 -9066476
1219 -9066476 23682933 34779007 22454872 11301061 14698377 17801605 -80288 -38988024
1211 -38988024 -78895651 -100462102 -102508166 -101551241 -113197162 -132235668 -136064674 -112250609
1203 -112250609 -76035544 -52028962 -44219112 -36624713 -21610515 -12112738 -20565601 -38202916
1195 -38202916 -45293512 -35521039 -20709507 -14592908 -20808426 -36255798 -57681870 -81350310
1187 -81350310 -100544441 -107639598 -99011473 -77630770 -51054897 -25839533 -2905851
1180 -2905851 20598407 44518152 63313995 71524405 68034917 53264913 28336326 2757296
1172 2757296 -3458851 22888860 69002564 105498149 117624922 116151313 113377569 103336763
1164 103336763 78440523 54041071 55802328 83770110 108082918 105210334 82043769
1157 82043769 56446880 31125479 2248478 -18066164 -9415395 27735628 67756917
1150 67756917 87266692 83005003 60635471 23433954 -18681844 -43677391 -36312980
1143 -36312980 -6630702 21647643 35234756 33459264 16029785 -13219236 -35014740
1136 -35014740 -29768561 -7777898 -2691572 -25364351 -44894624 -31625736 -897854
1129 -897854 9546003 -6049828 -19047812 -16216309 -19722098 -46149571 -72788313 -67254748
1121 -67254748 -35844341 -17863798 -35865940 -72423497 -98110362 -104303375 -100011317
1114 -100011317 -88928787 -63969740 -24350068 12000347 21791082 3502302 -15590653
1107 -15590653 -7362058 24339394 48283511 43162246 18393418 -4658127 -16750507
1100 -16750507 -17974103 -7239712 10140491 16852561 4737196 -6578506 7064626
1093 7064626 37539697 53375242 43668141 28344853 21443972 10026181 -19749380 -57285111
1085 -57285111 -82656380 -90888995 -87727488 -75605774 -57437167 -41708506 -30944849
1078 -30944849 -17224285 -266827 5719163 -2922081 -5869996 9412886 20013342 -931594
1070 -931594 -37033821 -45126474 -15438938 16470723 20538662 4496560 -11931138 -24736891
1062 -24736891 -32410170 -21093890 14568250 51816562 63552050 53526701 48810921
1055 48810921 61783890 76733144 73978555 53864501 33575080 27282697 32304857 33848970
1047 33848970 24787672 18169763 31382190 58100275 70116926 53317970 27683141
1040 27683141 20044643 28649012 29643255 10383933 -20580153 -51638952 -77596923 -91550543
1032 -91550543 -86305968 -69123380 -58806270 -59303816 -49879632 -14265517 30023888 47997429
1024 47997429 30688939 6723735 6836117 30482853 55804944 70004869 73915990 63304585
1016 63304585 28734088 -19877715 -49299977 -39590959 -11663324 437136 -4222407
1009 -4222407 2452345 30988744 58416752 64621051 60202178 65607492 82224683 99274787
1001 99274787 111978040 114639809 91306682 37114833 -20314754 -46499349 -44339803
994 -44339803 -47860642 -70186956 -83788098 -62454028 -20631131 6390703 7597907 1860090
986 1860090 3865066 3615817 -16057055 -54101485 -91661101 -112809054 -116748646 -109370691
978 -109370691 -90755652 -58231085 -19430605 7500788 11619630 1851598 -2866526 7882312
970 7882312 30840026 55716459 70106628 64051109 39952069 15178329 5005726 4628389
962 4628389 -2173636 -18340356 -29833668 -28019838 -22779688 -26924062 -36958140 -37958745
954 -37958745 -23063468 -757221 15943609 22607035 24919563 28729990 30193316 19156059
946 19156059 -6070965 -32768294 -48177698 -54620996 -61401513 -65730679 -54791999 -27606063
938 -27606063 -1324710 9845437 10966604 13579205 15161725 2173849 -29470756 -66261463
930 -66261463 -89982598 -92706348 -77502872 -49222409 -10032973 34279617 67973020
923 67973020 74058871 53447612 28845098 22336645 33488736 47051322 55485639 60190625
915 60190625 54301166 24444964 -23454324 -56701086 -48424017 -10851860 15930927 6387183
907 6387183 -27137039 -51609988 -47089493 -23320592 -6752216 -12382600 -29565690 -37383507
899 -37383507 -29516104 -15878526 -2859397 14089223 35064887 47657897 43949445 34888056
891 34888056 35148737 39676782 28657617 -4544532 -40425223 -50808286 -24829869 22209996
883 22209996 61485051 71916952 52552435 17306810 -17901145 -39690776 -36390953
876 -36390953 -6166743 33294637 56902353 59333616 58902333 69427230 82149648 84396419
868 84396419 81341034 84051785 86618588 73843533 47344103 26286750 21745885 24555240
860 24555240 20464895 5720492 -14652306 -34329844 -48703026 -56784654 -60459163 -57469116
852 -57469116 -40366115 -11281767 8333818 -3120402 -40232045 -76867520 -99427546
845 -99427546 -117573538 -138216575 -146645626 -125635130 -82758868 -44922792 -28957875
838 -28957875 -27739517 -24542516 -12579761 2097757 11754831 15935385 18912481 21891518
830 21891518 22163252 19347088 16292775 11792235 -362043 -20213121 -36655500 -40665308
822 -40665308 -36916699 -33555272 -27303325 -10840320 9778875 19735444 16752434 13732174
814 13732174 18124579 21190084 11320379 -12432718 -43054339 -71290354 -85355897 -75886924
806 -75886924 -47317503 -17329166 -881791 5395 -8921626 -20351276 -26557478 -25792616
798 -25792616 -28501361 -44218129 -60886034 -54111552 -23079245 651868 -7991974 -35359123
790 -35359123 -51457404 -52343317 -59908806 -84530550 -108920959 -112615622 -97134789 -79800420
782 -79800420 -72045478 -71459251 -70972847 -69170375 -70397726 -76767350 -82700844 -79596119 -64558328
773 -64558328 -41115116 -13581194 12472425 25571390 15200002 -12778999 -37040209
766 -37040209 -42767799 -34620478 -22791301 -6996681 15966345 37476345 42693945 27317360
758 27317360 -996860 -33269400 -60233249 -67324870 -43919818 -80219 37386354
751 37386354 50386678 43970604 32616496 20423925 1450395 -24302854 -42899248
744 -42899248 -37859871 -9350028 20186007 23521025 -5777668 -46652065 -70674812 -67277560
736 -67277560 -49181922 -37146353 -41607377 -56311421 -67410594 -68792484 -65739765 -60859650
728 -60859650 -44085175 -8509659 27983456 35103875 8473919 -21156557 -25099472 -7288771
720 -7288771 13146559 32862244 59574105 87572316 99434477 89606245 69972061 53424261
712 53424261 44876406 45048708 49395123 46738097 33189406 24021332 36591384 64125084
704 64125084 81965733 77961239 61714821 46909735 40798666 46485886 55407931 42146310
696 42146310 -7002686 -60347344 -66378788 -21000653 21246684 17862192 -8737390 -10958461
688 -10958461 16469835 38348855 32910749 13143398 1040203 7605403 35083715 73543338
680 73543338 95475348 78419985 37318898 13835013 28130835 58977928 76014695
673 76014695 72485126 58795309 43214390 31838949 32704984 44589561 51044857 39643213
665 39643213 20895766 15404457 26955938 40431590 42792995 33521422 15691839 -10035241
657 -10035241 -39636538 -64238935 -78963210 -86306304 -87533472 -78343330 -58358055 -38696093
649 -38696093 -32791799 -42078609 -56281715 -65995246 -69632787 -69119494 -64404543 -53200598
641 -53200598 -32860039 -2895447 30791387 55300530 59576283 44665223 21661751
634 21661751 626762 -13312966 -15374705 -2903268 15992642 25806047 21306541 13613157
626 13613157 12647757 12745114 4457731 -8385081 -15954791 -20252689 -30488614 -43193885
618 -43193885 -42883330 -24315671 51984 18644715 34174524 53388197 74911354 93861037
610 93861037 108956618 118033326 114362695 94154749 61627793 22639052 -18134103 -49114820
602 -49114820 -52813405 -25819711 9019064 21625029 3827594 -26631209 -46260114
595 -46260114 -42981347 -18978003 13216375 38159878 48115068 47400448 44853709 45063787
587 45063787 47484643 47600821 37766179 15963084 -4527166 -6884190 3402777 -93179
579 -93179 -29036554 -62783760 -79029880 -83417447 -89358268 -86712703 -59825321 -26145682
571 -26145682 -22095892 -49733662 -69803606 -55188478 -22532695 -489970 5439131 1693691
563 1693691 -12692373 -32984594 -38092467 -18095705 2974594 -2862777 -26631761 -37670358
555 -37670358 -30461316 -26460500 -32459316 -29183127 -7509714 12977189 15094450 10447373
547 10447373 16913005 27279976 21828985 2205229 -9752750 -5059942 704541 -6675163
539 -6675163 -18454516 -17473578 -5403680 -3178505 -24566660 -57886683 -78343096 -75375624
531 -75375624 -62867081 -61317784 -73795228 -84011398 -77712608 -60169933 -48174597 -48054928
523 -48054928 -49535687 -44010676 -41522976 -59770271 -96073206 -120993775 -108205212 -65841100
515 -65841100 -27941034 -15609471 -17757132 -12867010 3058345 19403937 31229073 41286927
507 41286927 45300802 32395517 4892034 -15717231 -11684353 9936806 27951793 32819081
499 32819081 31546670 29923484 22290115 2981974 -20400718 -32786657 -28782166 -17995959
491 -17995959 -11781306 -9066028 -214451 15943114 25973361 17574711 -3499041 -20920439
483 -20920439 -30615735 -44698893 -69021413 -88647024 -85708131 -64096821 -43561683 -32395206
475 -32395206 -19796052 3056948 27112956 36559867 27254377 7825771 -11313763 -23842774
467 -23842774 -26944524 -20982415 -8301669 9596195 30107280 44626013 43898024 32201898
459 32201898 27431773 39470859 54740131 50666828 21572329 -16659452 -43085516 -46413820
451 -46413820 -29941205 -10869853 -8552431 -23065424 -31532732 -17090790 6632390 16154502
443 16154502 15548822 29827900 62378986 86308188 85535765 77637606 80242268 78439330
435 78439330 49476480 4540091 -21285006 -15281602 572813 3079605 -6716266 -13758933
427 -13758933 -7407066 14411752 45912096 74658644 92319844 104074649 115731990
420 115731990 114809362 83017565 29571579 -8625755 -9335608 8945680 14493456 1506783
412 1506783 -12129615 -14456135 -9473547 -3229035 3250795 7313931 4616112 -1548055
404 -1548055 -873486 9973825 20617440 18468070 3835580 -9312539 -7070449 10356015
396 10356015 28505178 34007152 29035147 26031225 28421969 24663765 5423303 -21216020
388 -21216020 -39277661 -44303463 -44539681 -46240081 -47997990 -49477471 -55456586 -67116964
380 -67116964 -76408149 -74944301 -65215063 -57479684 -56035301 -53283136 -40045363 -19575584
372 -19575584 -6542303 -10042506 -21561306 -24901002 -16309039 -8258774 -12861225 -28384011
364 -28384011 -44220912 -52047067 -48157762 -31720337 -7071405 16534879 32989215 43468636
356 43468636 48404227 41461744 18607222 -11726639 -35783919 -48528839 -53118579 -51005496
348 -51005496 -42679371 -34894707 -34842873 -37736445 -32881559 -23003351 -22846190 -33702598 -34854862
339 -34854862 -11613213 19820197 30570836 15813408 -2905686 -10176183 -14064559 -26069968
331 -26069968 -39159180 -37471040 -19517143 921505 13415249 18106166 15012654 -210683
323 -210683 -24418329 -41854755 -40766284 -29565080 -26538246 -35994485 -44176431 -38485672
315 -38485672 -21673410 -5409670 2236849 492528 -5588292 -7088123 1799413 15207165
307 15207165 19388289 7776357 -12985194 -32950744 -46888137 -50915274 -41953169 -25352768
299 -25352768 -12610986 -5794884 4017713 15970551 12851492 -11528736 -34077644 -31883217
291 -31883217 -18043303 -22360127 -43080263 -48959278 -31440897 -21431569 -40212612 -62279936
283 -62279936 -50097197 -6864987 30610197 40233848 30752756 15797148 -2135785 -19698664
275 -19698664 -27108865 -23329055 -22637341 -37135159 -60897729 -77277751 -75716275 -58182489
267 -58182489 -35606048 -20564181 -16959593 -14690874 -1157554 20069439 29705925 15370218
259 15370218 -12924631 -34053350 -37128483 -27574926 -16711943 -9809197 -1974818 16232518
251 16232518 46221447 74381316 83391080 71532514 53815782 42251930 34258129 25079768
243 25079768 20829150 28845131 42128614 45958750 37449048 27008424 21538529 18492720
235 18492720 17688017 25398847 41077592 52105360 50849120 47060031 51353370 54282100
227 54282100 38724341 11330249 2147871 25201766 54988662 56085074 26594544 -4477274
219 -4477274 -18320862 -24448451 -34235763 -37303420 -19437202 8484897 19485135 5767170
211 5767170 -13115581 -19720271 -18778159 -19717202 -15191624 6953047 38675055 57318368
203 57318368 56007744 51788772 58282220 64635796 52337186 23619053 -666167 -8893601
195 -8893601 -11404170 -22548108 -39878592 -47822717 -37167817 -14242023 7684287 20209176
187 20209176 22294788 16493317 7363275 2170082 7418742 21012263 30203315 22509885
179 22509885 -148041 -21843660 -28804834 -21489228 -8444306 6155727 22246562 34649096
171 34649096 34276770 21251971 8995600 9585563 19433946 25222345 21309039 15059958
163 15059958 15527252 22801407 30462894 34397968 35678327 35945932 33332993 25058473 13616218
154 13616218 7247822 10875831 17463307 13376965 -5643657 -28342552 -41588704 -46462240
146 -46462240 -54878718 -71651684 -86634023 -86510054 -69759196 -47336154 -31521523 -26427390
138 -26427390 -27188786 -26003364 -19909386 -13704258 -13749973 -18508706 -18468296 -7766041 7240329
129 7240329 15407150 15279482 15842885 20680731 17739159 -7357212 -48543118 -78358029
121 -78358029 -74861926 -45135263 -16264871 -6394479 -12625207 -25595897 -43258496 -63742521
113 -63742521 -74455162 -61238422 -27657896 4552457 16761888 9268650 -5117510
106 -5117510 -16030355 -20464728 -19209219 -15519026 -15763727 -25200764 -41151046 -53137668
98 -53137668 -51885005 -37686007 -19185996 -4795441 3029200 4936954 -627059 -15696357
90 -15696357 -35939690 -50780068 -53507052 -47572552 -38732363 -24692790 285044 31291956
82 31291956 51751607 50526359 34835734 20954992 15023753 9223524 -3120919 -15389536
74 -15389536 -15736488 -4881380 1433436 -8615596 -26439771 -32767569 -22769272 -12574939
66 -12574939 -17519791 -32619767 -42529487 -44834668 -51765255 -68856791 -82997299 -77309679
58 -77309679 -52486973 -27941245 -23372357 -41530628 -67168832 -80882711 -75356437 -59867425
50 -59867425 -49269050 -49559476 -55063912 -57280425 -53089201 -45246874 -38572542 -36497871
42 -36497871 -39722945 -47841608 -61350867 -78739584 -91754351 -90354342 -76076440 -63800762
34 -63800762 -64021238 -69079838 -64588882 -49372318 -34869264 -28412679 -26677768 -22992081
26 -22992081 -11857895 10583258 40484350 64223281 73589091 78776099 92628128 106303448
18 106303448 98373806 67067689 34229234 15499125 6343722 687092 618939 181610
10 181610 -16378194 -46784477 -63111839 -49454887 -28189011 -28287592 -43764416 -47253827
2 -47253827 -32911924 -19854965
0 -19854965
##END NTUPLES=NMR SPECTRUM
##END=
