##TITLE=31Pdec_DE-35_oil_TFAA2
 CDCl3
 64 sc
 5.3.2024
##JCAMPDX= 6.0         $$ Bruker NMR JCAMP-DX V2.0
##DATA TYPE= NMR SPECTRUM
##DATA CLASS= NTUPLES
##ORIGIN= UXNMR, Bruker Analytische Messtechnik GmbH
##OWNER= root
$$ XWIN-NMR		Version 3.5
$$ Tue Mar  5 14:55:53 2024 Russian Standard Time (UT+4h)  she@DPX200
##.OBSERVE FREQUENCY= 81.013821
##.OBSERVE NUCLEUS= ^31P
##.ACQUISITION MODE= SIMULTANEOUS
##.ACQUISITION SCHEME= undefined
##.AVERAGES= 64
##.DIGITISER RES= 16
##SPECTROMETER/DATA SYSTEM= spect
##.PULSE SEQUENCE= zgpg30
##.SOLVENT NAME= DMSO
##.SHIFT REFERENCE= (INTERNAL, DMSO, 0, 248.564)
##AUDIT TRAIL= $$ (NUMBER, WHEN, WHO, WHERE, WHAT)
$$ ##TITLE= Audit trail, XWIN-NMR		Version 3.5
$$ ##JCAMPDX= 5.01
$$ ##ORIGIN= Bruker BioSpin GmbH
$$ ##OWNER= she
$$ F:/spectra/data/she/nmr/P31/1/pdata/1/auditp.txt
$$ ##AUDIT TRAIL=  $$ (NUMBER, WHEN, WHO, WHERE, WHAT)
(   1,<2024-03-05 14:54:45.29 +0400>,<she>,<DPX200>,
      <continue with go, POWCHK disabled, PULCHK disabled
       configuration hash MD5:
       00 E9 B6 7A A2 85 ED C7 34 08 36 98 17 FE 4E 26
       data hash MD5: 32K
       52 EB 49 31 5F FD C0 CD 68 CC B4 EB 91 ED 1F BE>)
(   2,<2024-03-05 14:54:47.75 +0400>,<she>,<DPX200>,
      <Start of raw data processing
       efp BC_mod = 2 LB = 10 FT_mod = 6 PKNL = 1 PHC0 = -12618.68 PHC1 = -515.3166 SI = 64K 
       data hash MD5: 64K
       43 96 3E 6E A3 19 F4 C8 5F F2 F7 01 AE 42 7B C6>)
(   3,<2024-03-05 14:55:12.04 +0400>,<she>,<DPX200>,
      <pk PHC0 = 177.8928 PHC1 = -24.2 
       data hash MD5: 64K
       22 EC 30 3C 53 96 B1 65 36 03 61 3A B9 AB DA A1>)
(   4,<2024-03-05 14:55:19.98 +0400>,<she>,<DPX200>,
      <abs ABSG = 5 
       data hash MD5: 64K
       37 AA C8 58 08 80 1A 04 B3 5B 33 D8 9F B5 BB 9C>)
$$ ##END=
$$ 
$$ hash MD5
$$ C4 57 38 5A DD 21 A4 28 31 1B C4 2F B6 8F 43 17
##$RELAX= 
##$RELAX= 
##$RELAX= 
##$RELAX= 
##$RELAX= 
##$RELAX= 
##$RELAX= 
##$RELAX= 
##$RELAX= 
$$ Bruker specific parameters
$$ --------------------------
##$DU= <F:/spectra>
##$EXPNO= 1
##$NAME= <P31>
##$PROCNO= 1
##$TYPE= <nmr>
##$USER= <she>
##$AMP= (0..31)
100 100 100 100 100 100 100 100 100 100 100 100 100 100 100 100 100 100 
100 100 100 100 100 100 100 100 100 100 100 100 100 100 
##$AQSEQ= 0
##$AQ_mod= 1
##$AUNM= <au_zg>
##$AUTOPOS= <>
##$BF1= 81.014009
##$BF2= 200.13
##$BF3= 200.13
##$BF4= 200.13
##$BF5= 200.13
##$BF6= 200.13
##$BF7= 200.13
##$BF8= 200.13
##$BYTORDA= 1
##$CFDGTYP= 0
##$CFRGTYP= 5
##$CHEMSTR= <none>
##$CNST= (0..31)
1 1 145 1 1 1 1 1 1 1 1 1 1 1 1 1 1 1 1 1 1 1 1 1 1 1 1 1 1 1 1 1 
##$CPDPRG= <waltz16>
##$CPDPRG1= <>
##$CPDPRG2= <waltz16>
##$CPDPRG3= <>
##$CPDPRG4= <mlev>
##$CPDPRG5= <mlev>
##$CPDPRG6= <mlev>
##$CPDPRG7= <mlev>
##$CPDPRG8= <mlev>
##$CPDPRGB= <>
##$CPDPRGT= <>
##$D= (0..31)
0 1 0 0 0 0 0 0 0 0 0 0.03 2e-05 3e-06 0 0 0 0 0 0 0 0 0 0 0 0 0 0 0 0 
0 0 
##$DATE= 1709636007
##$DBL= (0..7)
120 120 120 11 120 120 24 19 
##$DBP= (0..7)
150 150 150 150 150 150 150 150 
##$DBP07= 0
##$DBPNAM0= <>
$$ [...]
##$SUBNAM3= <"">
##$SUBNAM4= <"">
##$SUBNAM5= <"">
##$SUBNAM6= <"">
##$SUBNAM7= <"">
##$SUBNAM8= <"">
##$SUBNAM9= <"">
##$SW= 501.771253377433
##$SWIBOX= (0..15)
0 1 3 0 0 0 0 0 0 0 0 0 0 0 0 0 
##$SW_h= 40650.406504065
##$TD= 32768
##$TD0= 1
##$TE= 0
##$TE2= 300
##$TE3= 300
##$TEG= 300
##$TL= (0..7)
0 120 53 12 22 120 120 120 
##$TP= (0..7)
150 150 150 150 150 150 150 150 
##$TP07= 0
##$TPNAME0= <>
##$TPNAME1= <>
##$TPNAME2= <>
##$TPNAME3= <>
##$TPNAME4= <>
##$TPNAME5= <>
##$TPNAME6= <>
##$TPNAME7= <>
##$TPOAL= (0..7)
0.5 0.5 0.5 0.5 0.5 0.5 0.5 0.5 
##$TPOFFS= (0..7)
0 0 0 0 0 0 0 0 
##$TUNHIN= 0
##$TUNHOUT= 0
##$TUNXOUT= 0
##$USERA1= <user>
##$USERA2= <user>
##$USERA3= <user>
##$USERA4= <user>
##$USERA5= <user>
##$V9= 5
##$VALIST= <valist>
##$VCLIST= <CCCCCCCCCCCCCCC>
##$VD= 0
##$VDLIST= <DDDDDDDDDDDDDDD>
##$VPLIST= <PPPPPPPPPPPPPPP>
##$VTLIST= <TTTTTTTTTTTTTTT>
##$WBST= 1024
##$WBSW= 4
##$XGAIN= (0..3)
0 0 0 0 
##$XL= 0
##$YL= 0
##$YMAX_a= 2770
##$YMIN_a= -1723
##$ZGOPTNS= <>
##$ZL1= 120
##$ZL2= 120
##$ZL3= 120
##$ZL4= 120
##$ABSF1= 248.5645
##$ABSF2= -253.2056
##$ABSG= 5
##$ABSL= 3
##$ALPHA= 0
##$AQORDER= 0
##$ASSFAC= 0
##$ASSFACI= 0
##$ASSFACX= 0
##$ASSWID= 0
##$AUNMP= <proc_1d>
##$AZFE= 0.1
##$AZFW= 0.5
##$BCFW= 0
##$BC_mod= 2
##$BYTORDP= 0
##$COROFFS= 0
##$CY= -3
##$DATMOD= 1
##$DC= 0
##$DFILT= <>
##$DTYPP= 0
##$F1P= 0
##$F2P= 0
##$FCOR= 1
##$FTSIZE= 65536
##$FT_mod= 6
##$GAMMA= 0
##$GB= 0
##$INTBC= 1
##$INTSCL= 6.047779e-11
##$ISEN= 30
##$LB= 10
##$LEV0= 0
##$LPBIN= 0
##$MAXI= 10000
##$MC2= 0
##$MEAN= 0
##$ME_mod= 0
##$MI= 50
##$NCOEF= 0
##$NC_proc= -10
##$NLEV= 6
##$NOISF1= 182.463
##$NOISF2= 159.3651
##$NSP= 0
##$NTH_PI= 0
##$NZP= 0
##$OFFSET= 248.5645
##$PC= 4
##$PHC0= -12440.79
##$PHC1= -539.5166
##$PH_mod= 1
##$PKNL= yes
##$PPARMOD= 0
##$PSCAL= 0
##$PSIGN= 0
##$REVERSE= no
##$SF= 81.0140089999694
##$SI= 65536
##$SIGF1= 159.3651
##$SIGF2= -187.1042
##$SINO= 113.3802
##$SIOLD= 16384
##$SREGLST= <1H.CDCl3>
##$SSB= 0
##$STSI= 65536
##$STSR= 0
##$SW_p= 40650.406504065
##$SYMM= 0
##$S_DEV= 0
##$TDeff= 32768
##$TDoff= 0
##$TI= <>
##$TILT= no
##$TM1= 0
##$TM2= 0
##$TOPLEV= 0
##$USERP1= <user>
##$USERP2= <user>
##$USERP3= <user>
##$USERP4= <user>
##$USERP5= <user>
##$WDW= 1
##$XDIM= 65536
##$YMAX_p= 287756710
##$YMIN_p= -59305178
$$ End of Bruker specific parameters
$$ ---------------------------------
##NTUPLES= NMR SPECTRUM
##VAR_NAME=  FREQUENCY,     SPECTRUM/REAL,   SPECTRUM/IMAG
##SYMBOL=    X,             R,               I
##VAR_TYPE=  INDEPENDENT,   DEPENDENT,       DEPENDENT
##VAR_FORM=  AFFN,          ASDF,            ASDF
##VAR_DIM=   65536,         65536,           65536
##UNITS=     HZ,            ARBITRARY UNITS, ARBITRARY UNITS
##FACTOR=    0.620285442955139, 1,           1
##FIRST=     20137.2065510682, 0,            0
##LAST=      -20513.1999529968, 0,           0
##MIN=       -20513.1999529968, -59305178,   0
##MAX=       20137.2065510682, 287756710,    0
$$ Real data points
##PAGE= N=1
##DATA TABLE= (X++(R..R)), XYDATA
$$ [...]
$$ plain form
12457 -2644329 -2356922 -2401570 -2726784 -3283008 -4020243 -4878380 -5778950 -6627814 -7332031 -7822975
12447 -7822975 -8071398 -8085662 -7897077 -7544554 -7069154 -6520838 -5970244 -5511353 -5243159 -5233385
12437 -5233385 -5485841 -5935806 -6478789 -7013894 -7475968 -7843130 -8123040 -8330514 -8470131
12428 -8470131 -8532959 -8506782 -8389480 -8194214 -7943787 -7660539 -7359008 -7044349 -6716715 -6380827
12418 -6380827 -6057432 -5790466 -5644326 -5690274 -5985885 -6555070 -7377813 -8396878 -9541401
12409 -9541401 -10757157 -12027016 -13368178 -14805531 -16336445 -17909888 -19433847 -20804526
12401 -20804526 -21936265 -22775270 -23297024 -23499057 -23398090 -23030625 -22450452 -21719122 -20891409
12392 -20891409 -20001592 -19055832 -18032365 -16887576 -15565131 -14007372 -12170387 -10042725
$$ packed form
12457b644329K87407m4648l25214n56224p37235q58137r00570q48864p04217m90944
12447g822975k48423j4264J88585L52523M75400N48316N50594M58891K68194R774
12437e233385k52456m49965n42983n35105m62074l67162k79910k07474j39617
12428h470131o2828K6177J17302J95266K50427K83248L01531L14659L27634L35888
12418f380827L23395K66966J46140m5948k95611n69185q22743j019065j144523
12409i541401j215756j269859j341162j437353j530914j573443j523959j370679
12401b0804526j131739q39005n21754k02033J00967L67465N80173P31330Q27713
12392b0891409Q89817R45760J023467J144789J322445J557759J836985K127662
$$ plain form
12384 -10042725 -7662028 -5118239 -2534239 -27604 2327702 4518028 6577989 8561738
12376 8561738 10515836 12462493 14390029 16246262 17937852 19342985 20339474 20840058
12368 20840058 20820343 20327572 19467587 18376716 17189691 16013291 14910970 13899053 12951997
12359 12951997 12013203 11008326 9859042 8496365 6873442 4977890 2841561 542817
12351 542817 -1803329 -4066886 -6129666 -7907984 -9364291 -10505343 -11369107 -12006117 -12461611
12342 -12461611 -12762293 -12908582 -12873001 -12606585 -12054048 -11174655 -9962148 -8456322 -6740682
12333 -6740682 -4925574 -3123739 -1430751 80252 1350833 2326958 2956011 3192975 3011102
12324 3011102 2411564 1429121 132537 -1381334 -2999870 -4610915 -6118302 -7452565
$$ packed form
12384a0042725K380697K543789K584000K506635K355306K190326K059961J983749
12376H561738J954098J946657J927536J856233J691590J405133R96489N00584
12368B0840058j9715m92771q59985j090871j187025j176400j102321j011917r47056
12359A2951997r38794j004877j149284j362677j622923j895552k136329k298744
12351E42817k346146k263557k062780j778318j456307j141052q63764o37010m55494
12342a2461611l00682j46289L5581K66416N52537Q79393J212507J505826J715640
12333f740682J815108J801835J692988J511003J270581R76125O29053K36964j81873
12324C011102n99538r82443j296584j513871j618536j611045j507387j334263
$$ plain form
12316 -7452565 -8575901 -9483122 -10200371 -10781429 -11299690 -11833806 -12447983 -13173365 -14000162
12307 -14000162 -14885088 -15767464 -16581385 -17258476 -17728258 -17926202 -17810575 -17379201 -16676250
12298 -16676250 -15784607 -14805180 -13829231 -12914314 -12075613 -11298548 -10567079 -9891402 -9316313
12289 -9316313 -8901915 -8688104 -8668854 -8796261 -9010518 -9272407 -9577697 -9950966 -10429376 -11045915
12279 -11045915 -11815244 -12723191 -13721869 -14732154 -15653877 -16383449 -16836789 -16971037 -16795391
12270 -16795391 -16365032 -15761355 -15069273 -14361929 -13695787 -13110975 -12629326 -12247863 -11934000
12261 -11934000 -11632839 -11291086 -10889280 -10464417 -10107767 -9936757 -10054095 -10511936 -11293188
12252 -11293188 -12313407 -13440280 -14524070 -15430110 -16064419 -16385925 -16403369 -16160821 -15721361
$$ packed form
12316g452565j123336r07221p17249n81058n18261n34116o14177p25382q26797
12307a4000162q84926q82376q13921o77091m69782j97944J15627M31374P02951
12298a6676250Q91643R79427R75949R14917Q38701P77065P31469O75677N75089
12289i316313M14398K13811J9250j27407k14257k61889l05290l73269m78410o16539
12279a1045915p69329r07947r98678j010285r21723p29572m53340j34248J75646
12270a6795391M30359O03677O92082P07344O66142N84812M81649L81463L13863
12261a1934000L01161L41753M01806M24863L56650J71010j17338m57841p81252
12252a1293188j020219j126873j083790r06040o34309l21506j7444K42548M39460
$$ plain form
12243 -15721361 -15158902 -14560129 -14027160 -13668440 -13574584 -13788552 -14284265 -14963173 -15671184
12234 -15671184 -16232097 -16488206 -16335285 -15741345 -14746180 -13446173 -11972049 -10465928 -9061227
12225 -9061227 -7866829 -6957012 -6369224 -6109621 -6161427 -6489648 -7041779 -7751904 -8554300
12216 -8554300 -9402104 -10278807 -11194851 -12172773 -13229643 -14361620 -15530987 -16658561 -17629365
12207 -17629365 -18316714 -18617996 -18485537 -17938670 -17055652 -15952895 -14758714 -13585686 -12507665
12198 -12507665 -11550013 -10696810 -9908537 -9139246 -8347706 -7504552 -6598292 -5638511 -4652651
12189 -4652651 -3676186 -2741480 -1872172 -1085392 -396763 179735 639199 993291 1268752
12180 1268752 1495995 1695516 1869770 2002152 2062400 2019560 1862044 1615980 1347409 1140568
$$ packed form
12243a5721361N62459N98773N32969L58720R3856k13968m95713o78908p08011
12234a5671184n60913k56109J52921N93940R95165J300007J474124J506121J404701
12225i061227J194398R09817N87788K59603n1806l28221n52131p10125q02396
12216h554300q47804q76703r16044r77922j056870j131977j169367j127574r70804
12207a7629365o87349l01282J32459N46867Q83018J102757J194181J173028J078021
12198a2507665R57652Q53203P88273P69291P91540Q43154R06260R59781R85860
12189d652651R76465R34706Q69308P86780O88629N76498M59464L54092K75461
12180A268752K27243J99521J74254J32382O0248m2840j57516k46064k68571k06841
$$ plain form
12170 1140568 1060444 1119804 1269129 1414663 1454757 1316513 977430 467026 -145887 -770757
12160 -770757 -1311777 -1682859 -1821855 -1701793 -1334287 -762069 -43315 764034 1610004 2451220
12150 2451220 3246952 3960110 4564264 5051391 5435350 5750669 6048713 6391834 6844021
12141 6844021 7456459 8248921 9193641 10213897 11206190 12078556 12780991 13307054 13669349
12132 13669349 13873041 13909922 13775178 13491192 13119609 12752078 12483426 12382029 12473777 12745220
12122 12745220 13156528 13649787 14147160 14546484 14726434 14567057 13979964 12934224 11464786
12113 11464786 9660147 7637553 5518073 3408797 1392077 -480450 -2188382 -3734036
12105 -3734036 -5123561 -6344110 -7350324 -8070582 -8430348 -8377493 -7895189 -7000040 -5733518
$$ packed form
12170A140568q0124N9360J49325J45534M0094j38244l39083n10404o12913o24870
12160g70757n41020l71082j38996J20062L67506N72218P18754Q07349Q45970Q41216
12150B451220P95732P13158O04154M87127L83959L15319K98044L43121M52187
12141F844021O12438P92462R44720J020256R92293Q72366P02435N26063L62295
12132A3669349K03692L6881j34744k83986l71583l67531k68652j01397R1748K71443
12122A2745220M11308M93259M97373L99324J79950j59377n87093j045740j469438
12113A1464786j804639k022594k119480k109276k016720j872527j707932j545654
12105c734036j389525j220549j006214p20258l59766N2855M82304Q95149J266522
$$ plain form
12096 -5733518 -4154771 -2337066 -366449 1658924 3630013 5430823 6947868 8086563
12088 8086563 8791650 9063435 8959842 8580071 8035371 7418838 6785773 6151652 5507895
12079 5507895 4846664 4179582 3539232 2966000 2493351 2142287 1925129 1852131 1935531 2189038
12069 2189038 2622442 3232688 3995433 4861729 5762038 6616915 7353153 7923235 8322022
12060 8322022 8590491 8799082 9014611 9266869 9532932 9746589 9826153 9706739 9364729 8827570
12050 8827570 8167302 7480789 6863372 6384150 6070108 5903911 5836203 5807811 5773285 5717749
12040 5717749 5662368 5656939 5761718 6026096 6475019 7108833 7912259 8863787 9941317 11124519
12030 11124519 12392992 13718192 15052137 16321703 17434546 18293505 18811349 18920285
$$ packed form
12096e733518J578747J817705J970617K025373J971089J800810J517045J138695
12088H086563P05087K71785j03593l79771n44700o16533o33065o34121o43757
12079E507895o61231o67082o40350n73232m72649l51064k17158p2998Q3400K53507
12069B189038M33404O10246P62745Q66296R00309Q54877P36238N70082L98787
12060H322022K68469K08591K15529K52258K66063K13657P9564j19414l42010n37159
12050H827570o60268o86513o17417m79222l14042j66197o7708k8392l4526n5536
12040E717749n5381n429J04779K64378M48923O33814Q03426R51528J077530J183202
12030A1124519J268473J325200J333945J269566J112843Q58959N17844J08936
$$ plain form
12022 18920285 18575446 17753985 16453732 14697277 12544316 10105116 7539343 5028717
12014 5028717 2730246 734993 -942800 -2342891 -3523365 -4537360 -5429735 -6242028
12006 -6242028 -7011471 -7761022 -8487256 -9154608 -9701116 -10055342 -10157122 -9970756 -9484600
11997 -9484600 -8702425 -7638282 -6322451 -4816299 -3225684 -1698839 -398636 545960
11989 545960 1085689 1265640 1199274 1020426 843158 744870 765540 908094 1135773 1375703
11979 1375703 1538122 1548067 1374657 1043110 624988 213161 -106820 -278501 -283967 -141460
11969 -141460 104317 395152 674558 904964 1082393 1239956 1434380 1719953 2123555 2633801
11959 2633801 3207562 3786680 4314658 4747036 5054068 5216715 5218747 5039997 4656949 4053211
$$ packed form
12022A8920285l44839q21461j300253j756455k152961k439200k565773k510626
12014E028717k298471j995253j677793j400091j180474j013995q92375q12293
12006f242028p69443p49551p26234o67352n46508l54226j01780J86366M86156
11997i484600P82175J064143J315831J506152J590615J526845J300203R44596
11989E45960N39729J79951o6366j78848j77268r8288K0670J42554K27679K39930
11979A375703J62419R945j73410l31547m18122m11827l19981j71681n466J42507
11969a41460K45777K90835K79406K30406J77429J57563J94424K85573M03602N10246
11959B633801N73761N79118N27978M32378L07032J62647K032j78750l83048o03738
$$ plain form
11949 4053211 3236143 2251111 1185479 159177 -695295 -1256722 -1435330 -1183622 -495540
11940 -495540 603880 2071645 3854057 5884004 8073313 10311290 12476787 14460228
11932 14460228 16184246 17613500 18752613 19637347 20323864 20877710 21362734 21831026 22315437
11923 22315437 22825967 23352166 23874155 24380621 24884026 25420218 26028418 26721860 27466661
11914 27466661 28181662 28760625 29107520 29169197 28950531 28506640 27919043 27268148 26611583
11905 26611583 25973848 25350464 24724476 24084660 23432943 22779136 22133270 21505654 20913682
11896 20913682 20386206 19958201 19655223 19473246 19363344 19231775 18960868 18444727 17623159
11887 17623159 16495493 15106444 13513403 11756568 9849258 7788643 5573171 3214208
$$ packed form
11949D053211q17068r85032j065632j026302q54472n61427j78608K51708O88082
11940d95540J099420J467765J782412K029947K189309K237977K165497J983441
11932A4460228J724018J429254J139113Q84734O86517N53846M85024M68292M84411
11923B2315437N10530N26199N21989N06466N03405N36192O08200O93442P44801
11914B7466661P15001N78963L46895O1677k18666m43891n87597o50895o56565
11905B6611583o37735o23384o25988o39816o51717o53807o45866o27616n91972
11896B0913682n27476m28005l02978j81977j09902j31569k70907n16141q21568
11887A7623159j127666j389049j593041j756835j907310k060615k215472k358963
$$ plain form
11879 3214208 740431 -1799534 -4332653 -6756544 -8939056 -10728741 -11979798 -12586677
11871 -12586677 -12515199 -11816680 -10618721 -9094532 -7420432 -5738579 -4141960 -2683897
11863 -2683897 -1395378 -291494 634167 1413646 2099149 2754602 3452873 4275692 5305489
11854 5305489 6605129 8194527 10039583 12063168 14173885 16295228 18376377 20379850
11846 20379850 22259431 23947899 25363666 26430092 27094859 27341280 27191458 26705644 25981110
11837 25981110 25149194 24364576 23781005 23515439 23614469 24042282 24699420 25461091 26211046
11828 26211046 26855247 27320482 27554762 27538128 27296433 26903781 26466354 26091844 25856442
11819 25856442 25782864 25837721 25946762 26017560 25958497 25690093 25152209 24311353 23167390 21755357
$$ packed form
11879C214208k473777k539965k533119k423891k182512j789685j251057o06879
11871a2586677P1478O98519J197959J524189J674100J681853J596619J458063
11863b683897J288519J103884R25661P79479O85503O55453O98271Q22819J029797
11854E305489J299640J589398J845056K023585K110717K121343K081149K003473
11846B0379850J879581J688468J415767J066426O64767K46421j49822m85814p24534
11837B5981110q31916p84618n83571k65566R9030M27813O57138P61671P49955
11828B6211046O44201M65235K34280j6634k41695l92652m37427l74510k35402
11819B5856442p3578N4857J09041P0798n9063k68404n37884q40856j143963j412033
$$ plain form
11809 21755357 20140404 18409532 16665518 15022934 13598851 12491673 11752930 11369070
11801 11369070 11270124 11366392 11593925 11940755 12437007 13116340 13975293 14956356 15962065
11792 15962065 16887163 17648419 18198184 18520116 18615912 18495622 18179422 17707976 17150007
11783 17150007 16597084 16145826 15877642 15847291 16083819 16598033 17387639 18435704 19705013
11774 19705013 21133531 22634324 24100973 25418923 26482630 27215956 27590505 27635027 27429449
11765 27429449 27081098 26689165 26312137 25953751 25573312 25112816 24525563 23792741 22923418
11756 22923418 21943852 20886337 19782475 18657293 17520586 16360342 15146682 13845215
11748 13845215 12427909 10873228 9161514 7277710 5223514 3028931 753864 -1518952
$$ packed form
11809B1755357j614953j730872j744014j642584j424083j107178p38743l83860
11801A1369070r8946R6268K27533L46830M96252O79333Q58953R81063J005709
11792A5962065R25098P61256N49765L21932R5796j20290l16200m71446n57969
11783A7150007n52923m51258k68184l0351K36528N14214P89606J048065J269309
11774A9705013J428518J500793J466649J317950J063707P33326L74549M4522k05578
11765B7429449l48351l91933l77028l58386l80439m60496n87253p32822q69323
11756B2923418r79566j057515j103862j125182j136707j160244j213660j301467
11748A3845215j417306j554681j711714j883804k054196k194583k275067k272816
$$ plain form
11740 -1518952 -3691831 -5657034 -7302048 -8519678 -9222155 -9354401 -8903330 -7904035 -6443312
11731 -6443312 -4656763 -2714907 -799306 924792 2333566 3364816 4028744 4401269
11723 4401269 4596600 4728764 4880139 5089360 5357633 5663724 5977522 6265835 6489394
11714 6489394 6596585 6523479 6205943 5599585 4696055 3526608 2152194 646264 -922029
11705 -922029 -2498686 -4047684 -5546729 -6978636 -8321087 -9537720 -10574595 -11365700
11697 -11365700 -11846724 -11970628 -11718092 -11101346 -10164661 -8983960 -7664603 -6335343 -5136551
11688 -5136551 -4200233 -3621546 -3430300 -3578582 -3955242 -4421267 -4848317 -5146559 -5279192
11679 -5279192 -5266323 -5178568 -5119333 -5198021 -5501589 -6074478 -6914384 -7982511 -9217233 -10539916
$$ packed form
11740a518952k172879j965203j645014j217630p02477j32246M51071R99295J460723
11731f443312J786549J941856J915601J724098J408774J031250O63928L72525
11723D401269J95331J32164J51375K09221K68273L06091L13798K88313K23559
11714F489394J07191p3106l17536o06358r03530j169447j374414j505930j568293
11705i22029j576657j548998j499045j431907j342451j216633j036875p91105
11697a1365700m81024j23904K52536O16746R36685J180701J319357J329260J198792
11688e136551R36318N78687J91246j48282l76660m66025m27050k98242j32633
11679e279192J2869Q7755N9235p8688l03568n72889q39906j068127j234722j322683
$$ plain form
11669 -10539916 -11853935 -13049596 -14023961 -14708639 -15088769 -15202468 -15123708 -14939050 -14726960
11660 -14726960 -14542871 -14409978 -14316473 -14222462 -14078909 -13854054 -13555047 -13232727 -12966882 -12839765
11650 -12839765 -12909214 -13190062 -13648115 -14207218 -14766597 -15223035 -15491360 -15517741 -15283886 -14804825
11640 -14804825 -14124435 -13309137 -12436014 -11573787 -10762625 -10003180 -9261580 -8488891 -7646484
11631 -7646484 -6725434 -5750474 -4767908 -3826663 -2963428 -2195746 -1521240 -923031 -383242
11622 -383242 99781 503117 789522 931693 934593 842272 727227 669915 738567 976626
11612 976626 1400038 2001690 2757744 3631777 4575891 5531734 6436792 7239910 7923031 8516801
11602 8516801 9094892 9741559 10504268 11355496 12185330 12830091 13122303 12936789 12213542
$$ packed form
11669a0539916j314019j195661r74365o84678l80130j13699P8760J84658K12090
11660a4726960J84089J32893R3505R4011J43553K24855K99007L22320K65845J27117
11650a2839765o9449k80848m58053n59103n59379m56438k68325k6381K33855M79061
11640a4804825O80390Q15298Q73123Q62227Q11162P59445P41600P72689Q42407
11631g646484R21050R74960R82566R41245Q63235P67682O74506N98209N39789
11622c83242M83023M03336K86405J42171K900r2321j15045n7312O8652K38059
11612I76626M23412O01652P56054Q74033R44114R55843R05058Q03118O83121N93770
11602H516801N78091O46667P62709Q51228Q29834O44761K92212j85514p23247
$$ plain form
11593 12213542 10955541 9214690 7079899 4670388 2127772 -398441 -2770196 -4879201
11585 -4879201 -6659001 -8086791 -9172182 -9935659 -10388093 -10524879 -10338646 -9840740 -9076573
11576 -9076573 -8126152 -7091029 -6074393 -5161887 -4409092 -3838346 -3443086 -3194702 -3047689
11567 -3047689 -2942965 -2811998 -2583190 -2188398 -1567555 -674136 513063 1972983 3632211
11558 3632211 5374850 7071772 8613350 9928857 10988070 11792256 12363594 12737388 12956535
11549 12956535 13065445 13102118 13091630 13046179 12971448 12871848 12748677 12594501 12391871 12118780
11539 12118780 11755619 11288603 10709567 10014332 9201066 8270443 7229749 6100009 4921343
11530 4921343 3752121 2661679 1719645 986125 506421 310571 412446 802257 1434517
$$ packed form
11593A2213542j258001j740851k134791k409511k542616k526213k371755k109005
11585d879201j779800j427790j085391p63477m52434j36786J86233M97906P64167
11576i076573R50421J035123J016636R12506P52795N70746L95260K48384J47013
11567c047689J04724J30967K28808L94792O20843Q93419J187199J459920J659228
11558C632211J742639J696922J541578J315507J059213Q04186N71338L73794K19147
11549A2956535J08910L6673j0488m5451p4731r9600j23171j54176k02630k73091
11539A2118780l63161m67016n79036o95235q13266r30623j040694j129740j178666
11530D921343j169222j090442r42034p33520m79704j95850J01875L89811O32260
$$ plain form
11521 1434517 2222640 3048882 3785832 4317670 4553934 4437417 3949832 3114424 1991634
11512 1991634 666305 -770119 -2235663 -3666355 -5016209 -6252703 -7352812 -8301224
11504 -8301224 -9089450 -9715076 -10182885 -10509757 -10732183 -10910713 -11122873 -11440146 -11896331
11495 -11896331 -12465911 -13069018 -13602407 -13978618 -14153926 -14137940 -13988549 -13796758 -13663255
11486 -13663255 -13670337 -13857854 -14212711 -14676088 -15164793 -15597469 -15914860 -16087325 -16110493 -15996510
11476 -15996510 -15767884 -15454931 -15092672 -14714349 -14344172 -13995254 -13675345 -13395791 -13175407
11467 -13175407 -13035808 -12994042 -13061310 -13248209 -13566891 -14022103 -14595930 -15239796 -15881324 -16440993
11457 -16440993 -16848698 -17055924 -17044096 -16827391 -16445072 -15942630 -15350770 -14676073 -13909871
$$ packed form
11521A434517P88123Q26242P36950N31838K36264j16517m87585q35408j122790
11512A991634j325329j436424j465544j430692j349854j236494j100109r48412
11504h301224p88226o25626m67809l26872k22426j78530k12160l17273m56185
11495a1896331n69580o03107n33389l76211j75308J5986J49391J91791J33503
11486a3663255p082j87517l54857m63377m88705m32676l17391j72465k3168J13983
11476a5996510K28626L12953L62259L78323L70177L48918L19909K79554K20384
11467a3175407J39599M1766o7268j86899l18682m55212n73827o43866o41528n59669
11457a6440993m07705k07226J1828K16705L82319N02442N91860O74697P66202
$$ plain form
11448 -13909871 -13047066 -12097574 -11080098 -10005534 -8867692 -7650400 -6343137 -4952205
11440 -4952205 -3504898 -2053047 -677012 518686 1424957 1957173 2079861 1817735 1252114
11431 1252114 505951 -278405 -962901 -1432709 -1607466 -1445591 -943087 -127732 948593
11422 948593 2214771 3580778 4938015 6166651 7151901 7803265 8067553 7930600 7410346
11413 7410346 6548874 5408953 4072999 2636956 1194959 -179329 -1442576 -2576180
11405 -2576180 -3571834 -4422796 -5129584 -5713958 -6224991 -6725550 -7262874 -7839839 -8403707
11396 -8403707 -8857920 -9090208 -9004915 -8548962 -7725270 -6592250 -5252713 -3838079 -2492104
11387 -2492104 -1354852 -546612 -153383 -216348 -726040 -1621764 -2800198 -4137757 -5523421
$$ packed form
11448a3909871Q62805R49492J017476J074564J137842J217292J307263J390932
11440d952205J447307J451851J376035J195698R06271N32216J22688k62126n65621
11431A252114p46163p84356o84496m69808j74757J61875N02504Q15355J076325
11422I48593J266178J366007J357237J228636R85250O51364K64288j36953n20254
11413G410346q61472j139921j335954j436043j441997j374288j263247j133604
11405b576180r95654q50962p06788n84374n11033n00559n37324n76965n63868
11396h403707m54213k32288Q5293M55953Q23692J133020J339537J414634J345975
11387b492104J137252Q08240L93229o2965n09692q95724j178434j337559j385664
$$ plain form
11378 -5523421 -6887493 -8209662 -9501403 -10773678 -12008738 -13150872 -14120407 -14843960
11370 -14843960 -15286138 -15466556 -15453210 -15335377 -15189747 -15055777 -14929352 -14773159 -14535186
11361 -14535186 -14167104 -13638579 -12946407 -12117813 -11207895 -10292442 -9456737 -8779674 -8314758
11352 -8314758 -8075009 -8030259 -8118519 -8264335 -8395555 -8455320 -8410429 -8256254 -8015897 -7731177
11342 -7731177 -7445378 -7181418 -6924049 -6617508 -6184746 -5561493 -4728172 -3724815 -2646261
11333 -2646261 -1625140 -810974 -348365 -353654 -891345 -1956446 -3471762 -5305469 -7304595
11324 -7304595 -9329997 -11277201 -13077065 -14683056 -16057213 -17162601 -17963201 -18429066
11316 -18429066 -18544937 -18320165 -17796226 -17047180 -16169715 -15263239 -14406021 -13637899 -12958450
$$ packed form
11378e523421j364072j322169j291741j272275j235060j142134r69535p23553
11370a4843960m42178j80418J3346J17833J45630J33970J26425J56193K37973
11361a4535186L68082N28525O92172Q28594R09918R15453Q35705O77063M64916
11352h314758K39749M4750q8260j45816j31220n9765M4891J54175K40357K84720
11342g731177K85799K63960K57369L06541M32762O23253Q33321J003357J078554
11333b646261J021121Q14166M62609n289n37691j065101j515316j833707j999126
11324g304595k025402j947204j799864j605991j374157j105388q00600m65865
11316a8429066j15871K24772N23939P49046Q77465R06476Q57218P68122O79449
$$ plain form
11307 -12958450 -12341021 -11754119 -11180081 -10625963 -10125814 -9734009 -9509955 -9498569 -9714814
11298 -9714814 -10139642 -10728978 -11431178 -12204601 -13027216 -13894538 -14808559 -15764656 -16743182
11289 -16743182 -17708658 -18614830 -19411178 -20048157 -20483643 -20695169 -20695540 -20538920 -20305105 -20065795
11279 -20065795 -19853255 -19651190 -19410913 -19079693 -18624649 -18041840 -17349402 -16571950 -15728700
11270 -15728700 -14834752 -13913755 -13009762 -12186325 -11511132 -11034225 -10769647 -10686466 -10712452 -10753311
11260 -10753311 -10726556 -10598544 -10404125 -10233297 -10190023 -10348504 -10732929 -11327061 -12098242 -13014992
11250 -13014992 -14048898 -15165514 -16313745 -17420080 -18391450 -19130106 -19559734 -19651772 -19435167
11241 -19435167 -18982397 -18383307 -17725665 -17088649 -16539010 -16120625 -15844101 -15691610 -15640268
$$ packed form
11307a2958450O17429N86902N74038N54118N00149L91805K24054J1386k16245
11298i714814m24828n89336p02200p73423q22615q67322r14021r56097r78526
11289a6743182r65476r06172p96348o36979m35486k11526l71J56620K33815K39310
11279b0065795K12540K02065K40277L31220M55044N82809O92438P77452Q43250
11270a5728700Q93948R20997R03993Q23437O75193M76907K64578Q3181k5986m0859
11260a0753311K6755J28012J94419J70828M3274j58481l84425n94132p71181r16750
11250a3014992j033906j116616j148231j106335r71370p38656m29628r2038K16605
11241a9435167M52770N99090O57642O37016N49639M18385K76524J52491N1342
$$ plain form
11232 -15640268 -15688310 -15863400 -16206083 -16740104 -17449298 -18274615 -19131246 -19933992 -20615581
11223 -20615581 -21128489 -21432301 -21478674 -21207886 -20563082 -19515917 -18090080 -16372026 -14505802
11214 -14505802 -12673532 -11064144 -9835608 -9081894 -8817692 -8986577 -9485910 -10194951 -10995974
11205 -10995974 -11786494 -12485786 -13037671 -13408136 -13576724 -13526078 -13238867 -12708576 -11959963
11196 -11959963 -11064505 -10135908 -9302942 -8672882 -8305230 -8206936 -8344541 -8660082 -9081578
11187 -9081578 -9528927 -9921165 -10188652 -10287764 -10210967 -9984829 -9654446 -9262267 -8834329 -8381119
11177 -8381119 -7908293 -7425796 -6948024 -6487246 -6048475 -5631774 -5239981 -4882979 -4571943
11168 -4571943 -4307450 -4072950 -3839385 -3574083 -3243515 -2809951 -2233086 -1485140 -574278
$$ packed form
11232a5640268m8042j75090l42683n34021p09194q25317q56631q02746o81589
11223b0615581n12908l03812m6373K70788O44804J047165J425837J718054J866224
11214a4505802J832270J609388J228536P53714K64202j68885m99333p09041q01023
11205a0995974p90520o99292n51885l70465j68588N0646K87211N30291P48613
11196a1959963Q95458R28597Q32966O30060L67652R8294j37605l15541m21496
11187i081578m47349l92238k67487r9112P6797K26138L30383L92179M27938M53210
11177h381119M72826M82497M77772M60778M38771M16701L91793L57002L11036
11168d571943K64493K34500K33565K65302L30568M33564N76865P47946R10862
$$ plain form
11159 -574278 439315 1448747 2328891 2975184 3332051 3396372 3198751 2780148 2180577
11150 2180577 1442348 616861 -236983 -1064774 -1830329 -2520528 -3137954 -3687707 -4167904
11141 -4167904 -4568492 -4876719 -5085720 -5204077 -5264084 -5324603 -5464142 -5762650 -6275256 -7006559
11131 -7006559 -7898001 -8838431 -9696766 -10361720 -10769038 -10906125 -10799124 -10495000 -10047244
11122 -10047244 -9505977 -8910683 -8286764 -7648600 -7007736 -6379766 -5784223 -5237359 -4742002
11113 -4742002 -4279218 -3806692 -3268905 -2619529 -1846115 -980529 -85293 777691 1577143
11104 1577143 2323587 3056594 3817258 4622582 5454865 6268181 7003758 7603479 8014707
11095 8014707 8186490 8064655 7598434 6766538 5613434 4270424 2939311 1840149 1148111
$$ packed form
11159e74278J013593J009432Q80144O46293L56867O4321j97621m18603n99571
11150B180577p38229q25487q53844q27791p65555o90199o17426n49753m80197
11141d167904m00588l08227k09001j18357o0007o0519j39539k98508n12606p31303
11131g006559q91442r40430q58335o64954m07318j37087J07001L04124M47756
11122a0047244N41267N95294O23919O38164O40864O27970N95543N46864M95357
11113d742002M62784M72526N37787O49376P73414Q65586Q95236Q62984P99452
11104A577143P46444P33007P60664Q05324Q32283Q13316P35577N99721M11228
11095H014707J71783j21835m66221q31896j153104j343010j331113j099162o92038
$$ plain form
11086 1148111 948633 1226820 1890287 2812427 3875751 4995691 6117800 7199351 8194826
11077 8194826 9056988 9750983 10271821 10657177 10990215 11388243 11977031 12858727 14086650
11068 14086650 15655746 17507525 19542869 21638989 23671045 25537136 27179510 28591672
11060 28591672 29805096 30858726 31764691 32488309 32954119 33074061 32780610 32047823 30895150
11051 30895150 29379341 27581016 25589598 23490952 21363606 19284591 17336362 15602946
11043 15602946 14151880 13011554 12159355 11530543 11045761 10644370 10307408 10060241 9957160
11034 9957160 10059122 10415063 11049501 11954269 13083760 14356690 15666401 16897050 17940264
11025 17940264 18708894 19148259 19246206 19040359 18616604 18092624 17586973 17184986 16918444
$$ packed form
11086A148111j99478K78187O63467R22140J063324J119940J122109J081551R95475
11077H194826Q62162O93995N20838L85356L33038L98028N88788Q81696J227923
11068A4086650J569096J851779K035344K096120K032056J866091J642374J412162
11060B8591672J213424J053630R05965P23618M65810J19942k93451p32787j152673
11051C0895150j515809j798325j991418k098646k127346k079015j948229j733416
11043A5602946j451066j140326q52199o28812m84782m01391l36962k47167j03081
11034I957160J01962L55941O34438R04768J129491J272930J309711J230649J043214
11025A7940264P68630M39365R7947k05847m23755n23980n05651m01987k66542
$$ plain form
11016 16918444 16769029 16689831 16627953 16534238 16360070 16053057 15563451 14862481 13962023 12921815
11006 12921815 11837958 10818339 9957020 9316606 8920065 8749294 8749014 8837291 8923279 8928818
10996 8928818 8806770 8549368 8185047 7768293 7368340 7058081 6900564 6933261 7156618 7533670
10986 7533670 7999541 8473233 8867324 9098476 9101758 8844480 8331904 7602663 6718516 5753245
10976 5753245 4782120 3872721 3078301 2432284 1940680 1574496 1271536 954604 560530
10967 560530 65927 -500277 -1058812 -1495277 -1688060 -1543399 -1023822 -155908 985594
10958 985594 2307304 3724902 5176690 6619357 8012667 9305885 10435949 11337960
10950 11337960 11961271 12283434 12316651 12103844 11705509 11183321 10587342 9949408 9281529
$$ packed form
11016A6918444j49415p9198o1878r3715j74168l07013m89606p00970r00458j040208
11006A2921815j083857j019619q61319o40414l96541j70771k80Q8277Q5988N539
10996H928818j22048k57402l64321m16754l99953l10259j57517L2697K23357L77052
10986G533670M65871M73692L94091K31152L282k57278n12576p29241q84147r65271
10976E753245r71125r09399p94420o46017m91604l66184l02960l16932l94074
10967E60530m94603n66204n58535m36465j92783J44661N19577Q67914J141502
10958I85594J321710J417598J451788J442667J393310J293218J130064R02011
10950A1337960O23311L22163L3217k12807l98335n22188n95979o37934o67879
$$ plain form
10941 9281529 8579402 7832973 7043073 6237656 5479363 4859072 4474317 4396404 4636959 5130139
10931 5130139 5743487 6316377 6709214 6840292 6695615 6313690 5760263 5108053 4426508
10922 4426508 3777462 3212385 2771761 2488230 2391481 2510638 2872738 3499136 4400709 5569942
10912 5569942 6969334 8521449 10109656 11594680 12842750 13754603 14285134 14448395 14307014
10903 14307014 13949129 13461236 12908744 12331436 11750062 11173542 10600498 10018015 9403991
10894 9403991 8735468 8000331 7208039 6394910 5619992 4950730 4443490 4128086 4003443
10885 4003443 4044869 4217087 4485529 4822319 5208678 5637114 6113395 6655405 7287804 8035277
10875 8035277 8917109 9942030 11100618 12355821 13636145 14836909 15832798 16501522 16753100
$$ packed form
10941I281529p02127p46429p89900q05417p58293o20291l84755p7913K40555M93180
10931E130139O13348N72890L92837J31078j44677l81925n53427o52210o81545
10922D426508o49046n65077m40624k83531r6749J19157L62100O26398R01573J169233
10912E569942J399392J552115J588207J485024J248070R11853N30531J63261j41381
10903A4307014l57885m87893n52492n77308n81374n76520n73044n82483o14024
10894I403991o68523p35137p92292q13129p74918o69262n07240l15404j24643
10885D003443M1426J72218K68442L36790L86359M28436M76281N42010O32399P47473
10875H035277Q81832J024921J158588J255203J280324J200764R95889O68724K51578
$$ plain form
10866 16753100 16554209 15936986 14989116 13831309 12591643 11382621 10282660 9324014 8491826
10857 8491826 7737869 7005523 6255751 5484457 4729008 4066828 3606565 3468541 3755486
10848 3755486 4524256 5771760 7438629 9422021 11587582 13779003 15830753 17588531
10840 17588531 18935690 19818858 20264144 20376222 20316059 20259638 20348550 20649870 21141906 21732128
10830 21732128 22298261 22732783 22971501 22997522 22825428 22479332 21978394 21335077 20561394
10821 20561394 19674483 18697189 17655551 16576384 15485312 14403985 13346448 12315831
10813 12315831 11302123 10281992 9222566 8090405 6863563 5542267 4154515 2755263
10805 2755263 1419693 232805 -720822 -1364850 -1639289 -1513588 -1003539 -182381 824010
$$ packed form
10866A6753100j98891o17223r47870j157807j239666j209022j099961r58646q32188
10857H491826p53957p32346p49772p71294p55449o62180m60263j38024K86945
10848C755486P68770J247504J666869J983392K165561K191421K051750J757778
10840A7588531J347159Q83168M45286J12078o0163n6421Q8912L01320M92036N90222
10830B1732128N66133M34522K38718K6021j72094l46096n00938o43317p73683
10821B0561394q86911r77294j041638j079167j091072j081327j057537j030617
10813A2315831j013708j020131j059426j132161j226842j321296j387752j399252
10805B755263j335570j186888r53627o44028k74439J25701N10049Q21158J006391
$$ plain form
10796 824010 1859460 2770583 3441894 3825095 3953661 3934610 3916956 4047302 4428515 5094432
10786 5094432 6006815 7073462 8178488 9209946 10072886 10687745 10984602 10903991 10406387
10777 10406387 9485089 8175618 6556714 4740913 2856497 1026908 -644900 -2082707
10769 -2082707 -3234514 -4065854 -4554922 -4694218 -4498992 -4016772 -3329063 -2539700 -1752589
10760 -1752589 -1048531 -471768 -31935 280356 472830 537497 451753 193417 -241454 -830683
10750 -830683 -1531900 -2295112 -3071592 -3815295 -4481523 -5029977 -5434386 -5693226 -5832931 -5899740
10740 -5899740 -5945018 -6011850 -6125421 -6284706 -6457047 -6584267 -6604775 -6480570 -6209405 -5814005
10730 -5814005 -5320659 -4747027 -4106972 -3423539 -2734955 -2085275 -1502891 -978937 -458743
$$ packed form
10796H24010J035450R11123O71311L83201J28566j9051j7654J30346L81213O65917
10786E094432R12383J066647J105026J031458Q62940O14859K96857q0611m97604
10777A0406387r21298j309471j618904j815801j884416j829589j671808j437807
10769b082707j151807q31340m89068j39296J95226M82220O87709P89363P87111
10760a752589P04058N76763M39833L12291J92474O4667q5744k58336m34871n89229
10750h30683p01217p63212p76480p43703o66228n48454m04409k58840j39705o6809
10740e899740m5278o6832j13571j59285j72341j27220k0508J24205K71165L95400
10730e814005M93346N73632O40055O83433O88584O49680N82384N23954N20194
$$ plain form
10721 -458743 147148 935391 1974843 3275715 4775528 6352141 7862972 9192656 10283375
10712 10283375 11133768 11774935 12244983 12576684 12796930 12929031 12993887 13012738 13013028 13032545
10702 13032545 13115413 13299796 13605220 14029240 14556639 15174136 15877290 16661278 17501538
10693 17501538 18341804 19102587 19706272 20102531 20281021 20269526 20121992 19900519 19655385
10684 19655385 19408930 19148006 18825478 18369527 17701561 16762875 15543295 14098153 12542151
10675 12542151 11020592 9671308 8594134 7836881 7395267 7220118 7230015 7332365 7452246
10666 7452246 7559747 7683245 7902284 8323715 9051460 10160243 11679128 13585785 15811521
10657 15811521 18257987 20822929 23424441 26010727 28551241 31016376 33355454 35480080
$$ packed form
10721d58743O05891P88243J039452J300872J499813J576613J510831J329684J090719
10712A0283375Q50393O41167M70048L31701K20246J32101O4856J8851K90J9517
10702A3032545Q2868J84383L05424M24020N27399O17497P03154P83988Q40260
10693A7501538Q40266P60783O03685L96259J78490j1495j47534k21473k45134
10684A9655385k46455k60924l22528m55951o67966r38686j219580j445142j556002
10675A2542151j521559j349284j077174p57253m41614j75149R897J02350J19881
10666G452246J07501J23498K19039M21431P27745J108783J518885J906657K225736
10657A5811521K446466K564942K601512K586286K540514K465135K339078K124626
$$ plain form
10649 35480080 37261348 38550360 39219919 39206248 38525673 37260555 35530552 33467365 31198468
10640 31198468 28837347 26479745 24206218 22086197 20176308 18512128 17101155 15925585
10632 15925585 14955826 14167422 13551911 13116382 12872900 12823818 12951319 13218772 13585198
10623 13585198 14023698 14528921 15106590 15754475 16451802 17164988 17862967 18530520 19173811
10614 19173811 19818211 20500099 21255406 22109662 23073200 24140093 25286269 26465713 27609851
10605 27609851 28636775 29470926 30065064 30412889 30545882 30517294 30381733 30177814 29918220
10596 29918220 29589232 29158729 28587602 27839213 26887149 25725753 24383189 22928292 21462298
10587 21462298 20097544 18935281 18053001 17501391 17303665 17451714 17900130 18563752 19324504
$$ packed form
10649C5480080J781268J289012O69559j3671o80575j265118j730003k063187k268897
10640C1198468k361121k357602k273527k120021j909889j664180j410973j175570
10632A5925585r69759p88404o15511m35529k43482m9082J27501K67453L66426
10623A3585198M38500N05223N77669O47885O97327P13186O97979O67553O43291
10614A9173811O44400O81888P55307Q54256R63538J066893J146176J179444J144138
10605B7609851J026924Q34151N94138L47825J32993k8588j35561k03919k59594
10596B9918220l28988m30503n71127p48389r52064j161396j342564j454897j465994
10587B1462298j364754j162263q82280n51610j97726J48049M48416O63622P60752
$$ plain form
10578 19324504 20049235 20614057 20925325 20928072 20601342 19949836 19002226 17816285 16480956
10569 16480956 15106754 13806225 12673582 11771241 11125999 10734063 10571800 10606879 10805233
10560 10805233 11133511 11560058 12056764 12601688 13181109 13789329 14424536 15081596 15747348
10551 15747348 16404888 17047141 17692045 18389181 19212637 20242080 21539050 23126563 24977724
10542 24977724 27016220 29129459 31191747 33088952 34733349 36063932 37038995 37631633
10534 37631633 37831883 37651590 37127405 36319833 35307014 34173959 33003216 31874793 30876153
10525 30876153 30113748 29715676 29821165 30559879 32028180 34269992 37266789 40937378 45147046
10516 45147046 49726017 54493631 59280231 63941875 68371739 72513491 76372891 80018656
$$ packed form
10578A9324504P24731N64822L11268K747l26730o51506r47610j185941j335329
10569A6480956j374202j300529j132643r02341o45242l91936j62263L5079J98354
10560A0805233L28278M26547M96706N44924N79421O08220O35207O57060O65752
10551A5747348O57540O42253O44904O97136Q23456J029443J296970J587513J851161
10542B4977724K038496K113239K062288J897205J644397J330583R75063N92638
10534C7631633K00250j80293n24185q07572j012819j133055j170743j128423r98640
10525C0876153p62405l98072J05489P38714J468301K241812K996797L670589M209668
10516D5147046M578971M767614M786600M661644M429864M141752L859400L645765
$$ plain form
10508 80018656 83570118 87176265 90989451 95135542 99688636 104662567 110023504 115717032
10500 115717032 121700779 127973708 134587963 141629022 149164547 157178030 165503433 173768123
10492 173768123 181348086 187342283 190584525 189742245 183572670 171341467 153245552 130565802
10484 130565802 105380452 79958716 56168127 35171933 17450873 2999615 -8460121
10477 -8460121 -17321588 -23997555 -28875532 -32306817 -34611171 -36085418 -37009994 -37645262
10469 -37645262 -38211636 -38861360 -39660964 -40596869 -41600417 -42578751 -43438989 -44101015 -44504743
10460 -44504743 -44621393 -44467919 -44109472 -43638347 -43139735 -42668252 -42247256 -41881221 -41564411
10451 -41564411 -41279327 -40989968 -40639040 -40155641 -39473139 -38548909 -37375182 -35976231 -34395295
$$ packed form
10508H0018656L551462L606147L813186M146091M553094M973931N360937N693528
10500A15717032N983747O272929O614255P041059P535525Q013483Q325403Q264690
10492A73768123P579963N994197L242242q42280o169575j2231203j8095915k2679750
10484A30565802k5185350k5421736k3790589k0996194j7721060j4451258j1459736
10477h460121q861467o675967m877977l431285k304354j474247r24576o35268
10469c7645262n66374o49724p99604r35905j003548r78334q60238o62026m03728
10460d4504743j16650J53474L58447M71125M98612M71483M20996L66035L16810
10451d1564411K85084K89359L50928M83399O82502R24230J173727J398951J580936
$$ plain form
10442 -34395295 -32678831 -30866773 -28995489 -27110953 -25277566 -23567553 -22033393 -20684191
10434 -20684191 -19485456 -18382476 -17330567 -16314668 -15350975 -14474147 -13719076 -13105406 -12628517
10425 -12628517 -12257531 -11941193 -11621963 -11253738 -10813715 -10301426 -9726867 -9096561 -8406635
10416 -8406635 -7647017 -6814438 -5926313 -5026283 -4177408 -3446557 -2887584 -2529404 -2371663
10407 -2371663 -2387695 -2531453 -2743782 -2956675 -3099940 -3115437 -2976264 -2699312 -2340393 -1972627
10397 -1972627 -1660389 -1442462 -1329924 -1315369 -1386329 -1536164 -1767039 -2082856 -2475692 -2914998
10387 -2914998 -3349296 -3724100 -4009809 -4224429 -4434937 -4731877 -5188851 -5827936 -6605778
10378 -6605778 -7421057 -8136072 -8606203 -8712683 -8391958 -7652944 -6576056 -5292934 -3951227
$$ packed form
10442c4395295J716464J812058J871284J884536J833387J710013J534160J349202
10434b0684191J198735J102980J051909J015899R63693Q76828P55071O13670M76889
10425a2628517L70986L16338L19230L68225M40023N12289N74559O30306O89926
10416h406635P59618Q32579Q88125R00030Q48875P30851N58973L58180J57741
10407b371663j6032j43758k12329k12893j43265j5497J39173K76952L58919L67766
10397a972627L12238K17927J12538J4555p0960j49835k30875l15817l92836m39306
10387b914998m34298l74804k85709k14620k10508k96940m56974o39085p77842
10378f605778q15279p15015m70131j06480L20725P39014J076888J283122J341707
$$ plain form
10369 -3951227 -2674428 -1530657 -522410 398613 1296272 2206159 3100566 3880318 4401227
10360 4401227 4523874 4161490 3303516 2009403 385211 -1437518 -3309751 -5065939 -6533793
10351 -6533793 -7560445 -8045173 -7961999 -7364711 -6377392 -5173814 -3945529 -2862056 -2033982
10342 -2033982 -1490755 -1179114 -982245 -754720 -362452 285580 1221516 2417786 3797645
10333 3797645 5254315 6673295 7948454 8986476 9704941 10034390 9928827 9380529 8431450
10324 8431450 7174114 5737995 4263723 2874424 1654117 637607 -187622 -867261
10316 -867261 -1456625 -1997764 -2508634 -2986105 -3414294 -3769750 -4021963 -4131325 -4046880 -3708734
10306 -3708734 -3061760 -2080453 -792419 716097 2318557 3880382 5287701 6460153
$$ packed form
10369c951227J276799J143771J008247R21023Q97659R09887Q94407P79752N20909
10360D401227J22647l62384q57974j294113j624192j822729j872233j756188j467854
10351f533793j026652m84728Q3174N97288R87319J203578J228285J083473Q28074
10342b033982N43227L11641J96869K27525L92268O48032R35936J196270J379859
10333C797645J456670J418980J275159J038022P18465L29449j05563n48298r49079
10324H431450j257336j436119j474272j389299j220307j016510q25229o79639
10316h67261n89364n41139n10870m77471m28189l55456k52213j09362Q4445L38146
10306c708734O46974R81307J288034J508516J602460J561825J407319J172452
$$ plain form
10298 6460153 7346857 7915335 8145963 8037351 7616772 6944731 6108239 5205996 4332051
10289 4332051 3562500 2948143 2515467 2274401 2224984 2354410 2625517 2968950 3290714 3493667
10279 3493667 3499995 3263709 2773243 2050202 1146179 134054 -907231 -1907252 -2808094
10270 -2808094 -3555714 -4088561 -4337108 -4239470 -3765181 -2933325 -1816092 -527738 796038
10261 796038 2022567 3045586 3803146 4286531 4537038 4628452 4638682 4623507 4608788 4605574
10251 4605574 4633471 4729797 4933800 5255200 5648613 6013101 6221078 6161052 5767713 5022701
10241 5022701 3933548 2513521 777558 -1248036 -3512320 -5929794 -8379013 -10716215
10233 -10716215 -12804964 -14549848 -15916302 -16928182 -17649747 -18164471 -18558333 -18908358 -19273641
$$ packed form
10298F460153Q86704N68478K30628j08612m20579o72041q36492r02243q73945
10289D332051p69551o14357m32676k41066m9417J29426K71107L43433L21764K02953
10279C493667O328k36286m90466p23041r04023j012125j041285j000021r00842
10270b808094p47620n32847k48547R7638M74289Q31856J117233J288354J323776
10261G96038J226529J023019P57560M83385K50507R1414J0230j5175j4719l214
10251D605574K7897R6326K04003L21400L93413L64488K07977o0026l93339p45012
10241E022701j089153j420027j735963k025594k264284k417474k449219k337202
10233a0716215k088749j744884j366454j011880p21565n14724l93862l50025l65283
$$ plain form
10224 -19273641 -19686043 -20140994 -20594016 -20970455 -21189874 -21196366 -20980766 -20585482 -20092602 -19602381
10214 -19602381 -19208738 -18975421 -18917587 -18997241 -19138729 -19258126 -19288960 -19190104 -18938696 -18523742
10204 -18523742 -17951552 -17258535 -16516487 -15818558 -15246863 -14836314 -14555413 -14317923 -14021523
10195 -14021523 -13592751 -13014318 -12322900 -11582410 -10848164 -10137671 -9417956 -8612628 -7626888
10186 -7626888 -6383631 -4857998 -3094622 -1197547 702788 2487337 4071195 5403741
10178 5403741 6455450 7208886 7664091 7851621 7835810 7697708 7505902 7294831 7063367
10169 7063367 6790246 6453392 6042473 5561263 5021869 4435778 3807107 3130348 2390953
10160 2390953 1566927 633022 -429621 -1619934 -2906485 -4227198 -5500133 -6639531
$$ packed form
10224a9273641m12402m54951m53022l76439k19419o492K15600L95284M92880M90221
10214a9602381L93643K33317N7834p9654j41488j19397l0834R8856K51408M14954
10204a8523742N72190O93017P42048O97929N71695M10549K80901K37490K96400
10195a4021523M28772N78433O91418P40490P34246P10493P19715Q05328R85740
10186g626888J243257J525633J763376J897075J900335J784549J583858J332546
10178E403741J051709P53436M55205J87530j5811j38102j91806k11071k31464
10169G063367k73121l36854m10919m81210n39394n86091o28671o76759p39395
10160B390953q24026r33905j062643j190313j286551j320713j272935j139398
$$ plain form
10152 -6639531 -7569722 -8233421 -8595594 -8645274 -8395529 -7880415 -7148904 -6257417 -5263161 -4221111
10142 -4221111 -3187706 -2230369 -1434079 -893711 -690090 -861529 -1386674 -2185986 -3138902
10133 -3138902 -4110278 -4979577 -5664156 -6127143 -6366717 -6394538 -6217176 -5830600 -5228686 -4419131
10123 -4419131 -3437881 -2354586 -1264542 -267090 562902 1196980 1654385 1978897 2203778
10114 2203778 2326898 2312097 2115035 1716147 1140809 457299 -243730 -877874 -1393276 -1784921
10104 -1784921 -2088677 -2354788 -2614311 -2858549 -3040866 -3092476 -2938165 -2508140 -1751938 -656895
10094 -656895 736208 2330611 3987809 5553477 6885057 7871427 8441221 8564429 8253652
10085 8253652 7564113 6584561 5415289 4141294 2814910 1456277 68209 -1345492
$$ packed form
10152f639531r30191o63699l62173m9680K49745N15114P31511Q91487R94256J042050
10142d221111J033405R57337P96290N40368K03621j71439n25145p99312r52916
10133c138902r71376q69299o84579m62987k39574k7821J77362L86576O01914Q09555
10123d419131R81250J083295J090044R97452Q29992O34078M57405L24512K24881
10114B203778J23120j4801j97062l98888n75338o83510p01029o34144n15402l91645
10104a784921l03756k66111k59523k44238j82317n1610J54311M30025P56202J095043
10094f56895J393103J594403J657198J565668J331580R86370N69794J23208l10777
10085H253652o89539r79552j169272j273995j326384j358633j388068j413701
$$ plain form
10077 -1345492 -2768998 -4175079 -5534164 -6824440 -8037052 -9174464 -10242943 -11242291
10069 -11242291 -12158431 -12964965 -13634759 -14155614 -14541500 -14833736 -15090147 -15363312 -15674447
10060 -15674447 -15995692 -16252626 -16348446 -16199391 -15766427 -15070494 -14183269 -13193905 -12166099
10051 -12166099 -11110884 -9994337 -8775375 -7445936 -6045122 -4640538 -3294277 -2038573
10043 -2038573 -875174 205389 1200719 2086483 2826187 3393331 3790457 4054204 4247342
10034 4247342 4445630 4724043 5141399 5723836 6454220 7276687 8118134 8917458 9647807
10025 9647807 10321277 10975993 11655046 12388559 13184199 14024610 14869428 15663163 16350542
10016 16350542 16894622 17286877 17541193 17674933 17689836 17564992 17264770 16755628 16023197
$$ packed form
10077a345492j423506j406081j359085j290276j212612j137412j068479r99348
10069a1242291r16140q06534o69794n20855l85886k92236k56411k73165l11135
10060a5674447l21245k56934r5820J49055M32964O95933Q87225R89364J027806
10051a2166099J055215J116547J218962J329439J400814J404584J346261J255704
10043b038573J163399J080563R95330Q85764P39704N67144L97126K63747J93138
10034D247342J98288K78413M17356N82437P30384Q22467Q41447P99324P30349
10025I647807O73470O54716O79053P33513P95640Q40411Q44818P93735O87379
10016A6350542N44080L92255K54316J33740J4903j24844l00222n09142p32431
$$ plain form
10007 16023197 15083707 13986797 12808939 11639545 10564799 9654174 8951096 8466220 8172863
9998 8172863 8007485 7878719 7684904 7335025 6765908 5951180 4902183 3663736 2306600
9989 2306600 916526 -419643 -1628444 -2662023 -3506261 -4182621 -4740511 -5239499 -5726150
9980 -5726150 -6213394 -6668541 -7013413 -7139278 -6936487 -6330467 -5308239 -3922041 -2269745
9971 -2269745 -465182 1385029 3189705 4870673 6360866 7609792 8592659 9313687 9798824
9962 9798824 10081571 10189228 10134702 9916095 9524271 8955207 8219938 7344665 6359385 5281917
9952 5281917 4109182 2824869 1422198 -71023 -1580698 -2994807 -4185864 -5035824
9944 -5035824 -5455616 -5398031 -4865332 -3910686 -2629665 -1139303 451008 2064997 3669297
$$ packed form
10007A6023197r39490j096910j177858j169394j074746r10625p03078m84876k93357
9998H172863j65378j28766j93815l49879n69117q14728j048997j238447j357136
9989B306600j390074j336169j208801j033579q44238o76360n57890m98988m86651
9980e726150m87244m55147l44872j25865K02791O06020J022228J386198J652296
9971b269745J804563J850211J804676J680968J490193J248926R82867P21028M85137
9962I798824K82747J07657n4526k18607l91824n69064p35269q75273r85280j077468
9952E281917j172735j284313j402671j493221j509675j414109j191057q49960
9944e035824m19792N7585N32699R54646J281021J490362J590311J613989J604300
$$ plain form
9935 3669297 5264025 6861217 8463607 10054806 11604697 13083513 14471476 15756162
9927 15756162 16924056 17960176 18861389 19654606 20406340 21216686 22199841 23459153 25067738
9918 25067738 27063348 29457462 32250111 35441847 39039797 43058557 47518495 52447360
9910 52447360 57891533 63935180 70715046 78418042 87259430 97450811 109171893 122556297
9902 122556297 137689164 154598604 173218032 193308441 214347516 235410827 255100912
9895 255100912 271615512 283029858 287756710 285003337 275002600 258914017 238473732
9888 238473732 215572805 191916854 168833791 147224072 127608757 110218473 95079096
9881 95079096 82078141 71016279 61650179 53726995 47008629 41283968 36367978 32092268
$$ packed form
9935C669297J594728J597192J602390J591199J549891J478816J387963J284686
9927A5756162J167894J036120R01213P93217P51734Q10346R83155J259312J608585
9918B5067738J995610K394114K792649L191736L597950M018760M459938M928865
9910E2447360N444173O043647O779866P702996Q841388J0191381J1721082J3384404
9902A22556297J5132867J6909440J8619428K0090409K1039075K1063311J9690085
9895B55100912J6514600J1414346M726852k753373j0000737j6088583k0440285
9888B38473732k2900927k3655951k3083063k1609719j9615315j7390284j5139377
9881I5079096j3000955j1061862r366100p923184o718366n724661m915990m275710
$$ plain form
9873 32092268 28298884 24845677 21618649 18539944 15566953 12686307 9906228 7247998
9865 7247998 4739238 2413094 312152 -1509706 -2992589 -4082284 -4745282 -4983821 -4845640
9856 -4845640 -4421834 -3831008 -3196460 -2627235 -2209759 -2007937 -2063401 -2390071 -2967001 -3740048
9846 -3740048 -4637088 -5588728 -6541408 -7457672 -8308839 -9068390 -9710865 -10216598 -10578842 -10808419
9836 -10808419 -10933532 -10996305 -11046997 -11133557 -11286782 -11509467 -11779218 -12063019 -12330147 -12552821
9826 -12552821 -12697497 -12718140 -12559095 -12166242 -11500367 -10548291 -9331002 -7908042 -6373562
9817 -6373562 -4839310 -3409261 -2160727 -1142930 -387521 83506 258462 138842 -260906
9808 -260906 -913577 -1775760 -2785030 -3864133 -4931790 -5914118 -6752582 -7408105 -7862226
$$ packed form
9873C2092268l793384l453207l227028l078705k972991k880646k780079k658230
9865G247998k508760k326144k100942j821858j482883j089695o62998k38539J38181
9856d845640M23806N90826O34548N69225M17476K01822n5464l26670n76930p73047
9846c740048q97040r51640r52680r16264q51167p59551o42475n05733l62244k29577
9836a0808419j25113o2773n0692q6560j53225k22685k69751k83801k67128k22674
9826a2552821j44676k0643J59045L92853O65875R52076J217289J422960J534480
9817f373562J534252J430049J248534J017797P55409M71027J74956j19620l99748
9808b60906o52671q62183j009270j079103j067657r82328q38464o55523m54121
$$ plain form
9799 -7862226 -8116934 -8195548 -8143945 -8026684 -7913853 -7863088 -7907015 -8052198 -8286222 -8584775
9789 -8584775 -8913377 -9224882 -9459004 -9550601 -9448801 -9141921 -8677625 -8165886 -7755669 -7587286
9779 -7587286 -7738419 -8190914 -8836625 -9518718 -10087664 -10449003 -10587797 -10564261 -10484770 -10461784
9769 -10461784 -10580084 -10880685 -11362649 -11994597 -12725557 -13488871 -14201379 -14767994 -15100378
9760 -15100378 -15146181 -14912976 -14470988 -13930908 -13406956 -12982249 -12691678 -12528075 -12464266 -12474682
9750 -12474682 -12542738 -12652413 -12773916 -12856085 -12832262 -12637373 -12227096 -11589980 -10750237 -9765833
9740 -9765833 -8725500 -7740968 -6928354 -6380580 -6142683 -6201397 -6490233 -6903198 -7311724 -7584431
9730 -7584431 -7609556 -7315058 -6679222 -5728841 -4528631 -3168043 -1749181 -376055 854926
$$ packed form
9799g862226k54708p8614N1603J17261J12831N0765m3927j45183k34024k98553
9789h584775l28602l11505k34122r1597J01800L06880M64296N11739M10217J68383
9779g587286j51133m52495o45711o82093n68946l61339j38794K3536P9491K2986
9769a0461784j18300l00601m81964o31948p30960p63314p12508n66615l32384
9760a5100378m5803K33205M41988N40080N23952M24707K90571J63603O3809j0416
9750a2474682o8056j09675j21503q2169K3823J94889M10277O37116Q39743R84404
9740i765833J040333R84532Q12614N47774K37897n8714k88836m12965m08526k72707
9730g584431k5125K94498O35836R50381J200210J360588J418862J373126J230981
$$ plain form
9721 854926 1861463 2577001 2949260 2941237 2538545 1759394 657304 -690401 -2204576
9712 -2204576 -3823492 -5507058 -7224968 -8940370 -10604089 -12165060 -13588597 -14867677
9704 -14867677 -16019009 -17067047 -18025071 -18880829 -19590699 -20083569 -20272405 -20069100 -19400332
9695 -19400332 -18226260 -16561623 -14489354 -12152690 -9722416 -7353412 -5151779 -3164793
9687 -3164793 -1391261 198770 1645847 2989713 4262769 5482735 6642172 7699874
9679 7699874 8582994 9204790 9494213 9425341 9030847 8388893 7587942 6690281 5716932 4659974
9669 4659974 3508109 2265997 958733 -374043 -1686052 -2929548 -4057661 -5026515
9661 -5026515 -5800548 -6362564 -6725305 -6937140 -7075742 -7230022 -7477427 -7865556 -8403898 -9066755
$$ packed form
9721H54926J006537P15538L72259q023m02692p79151j102090j347705j514175
9712b204576j618916j683566j717910j715402j663719j560971j423537j279080
9704a4867677j151332j048038r58024q55758p09870m92870j88836K03305O68768
9695a9400332J174072J664637K072269K336664K430274K369004K201633J986986
9687c164793J773532J590031J447077J343866J273056J219966J159437J057702
9679G699874Q83120O21796K89423o8872l94494o41954q00951q97661r73349j056958
9669D659974j151865j242112j307264j332776j312009j243496j128113r68854
9661e026515p74033n62016l62741k11835j38602j54280k47405l88129n38342o62857
$$ plain form
9651 -9066755 -9804957 -10562004 -11288975 -11953231 -12539510 -13046663 -13484549 -13872442 -14235966 -14598574
9641 -14598574 -14967471 -15320149 -15601164 -15734698 -15648453 -15297271 -14678080 -13836301 -12865579 -11896066
9631 -11896066 -11064401 -10470279 -10140082 -10018357 -9990691 -9922621 -9694344 -9219455 -8447653 -7358784
9621 -7358784 -5956600 -4266378 -2335085 -231188 1956499 4120050 6134757 7864756
9613 7864756 9172690 9933000 10050170 9482659 8266317 6523829 4449484 2271335 204433
9604 204433 -1589277 -3024149 -4093512 -4853540 -5394233 -5806175 -6152357 -6453534 -6692265
9595 -6692265 -6833457 -6850799 -6746063 -6554083 -6333872 -6149779 -6047844 -6036362 -6082628 -6131190
9585 -6131190 -6133757 -6070339 -5947273 -5776134 -5552271 -5250715 -4842861 -4322154 -3721865 -3114629
$$ packed form
9651i066755p38202p57047p26971o64256n86279n07153m37886l87893l63524l62608
9641a4598574l68897l52678k81015j33534Q6245L51182O19191Q41779R70722R69513
9631a1896066Q31665N94122L30197J21725K7666O8070K28277M74889P71802J088869
9621g358784J402184J690222J931293K103897K187687K163551K014707J729999
9613G864756J307934P60310J17170n67511j216342j742488k074345k178149k066902
9604B04433j793710j434872j069363p60028n40693m11942l46182l01177k38731
9595f692265j41192j7342J04736J91980K20211J84093J01935J1482m6266m8562
9585f131190k567O3418J23066J71139K23863L01556M07854N20707O00289O07236
$$ plain form
9575 -3114629 -2594571 -2250780 -2143004 -2288231 -2662184 -3213802 -3885109 -4626805 -5402806 -6183764
9565 -6183764 -6936817 -7621927 -8200671 -8653246 -8992112 -9263333 -9535917 -9885015 -10372861 -11029210
9555 -11029210 -11837048 -12733637 -13631523 -14450752 -15145578 -15714052 -16190602 -16628604 -17079652
9546 -17079652 -17574258 -18108507 -18640774 -19099786 -19400942 -19464657 -19230447 -18663716 -17757376 -16533059
9536 -16533059 -15043724 -13372830 -11622605 -9890273 -8242598 -6704834 -5272455 -3937721
9528 -3937721 -2711999 -1629482 -733824 -61327 367535 547035 480829 176061 -362086
9519 -362086 -1132394 -2130249 -3329640 -4664383 -6025199 -7282003 -8323331 -9091519 -9594449
9510 -9594449 -9889370 -10049349 -10128412 -10138789 -10047956 -9796357 -9327948 -8619074 -7693108 -6617967
$$ packed form
9575c114629N20058L43791J07776j45227l73953n51618o71307p41696p76001p80958
9565f183764p53053o85110n78744m52575l38866k71221k72584l49098m87846o56349
9555a1029210q07838q96589q97886q19229o94826n68474m76550m38002m51048
9546a7079652m94606n34249n32267m59012l01156o3715K34210N66731R06340J224317
9536a6533059J489335J670894J750225J732332J647675J537764J432379J334734
9528c937721J225722J082517Q95658O72497M28862J79500o6206l04768n38147
9519c62086p70308r97855j199391j334743j360816j256804j041328p68188n02930
9510i594449k94921j59979p9063j0377R0833K51599M68409P08874R25966J075141
$$ plain form
9500 -6617967 -5492102 -4425467 -3518985 -2845558 -2437242 -2282299 -2332260 -2516177 -2757775
9491 -2757775 -2990211 -3164081 -3249038 -3234030 -3129593 -2969308 -2804339 -2688799 -2659445 -2716142
9481 -2716142 -2810110 -2846492 -2703834 -2265494 -1452653 -249918 1281148 3004110 4730159
9472 4730159 6261977 7448338 8226858 8632196 8763793 8731954 8613720 8438984 8203115
9463 8203115 7888073 7479234 6976977 6404990 5813345 5274339 4873622 4700026 4833630 5330387
9453 5330387 6205800 7422941 8888641 10460379 11966874 13242239 14164210 14679943 14807138
9444 14807138 14611269 14171492 13551247 12784923 11882245 10842485 9667200 8365269 6952494
9435 6952494 5452071 3899312 2347424 867125 -464804 -1584758 -2458532 -3084197 -3480268
$$ packed form
9500f617967J125865J066635R06482O73427M08316J54943m9961j83917k41598
9491b757775k32436j73870q4957J5008J04437J60285J64969J15540K9354n6697
9481b716142r3968l6382J42658M38340Q12841J202735J531066J722962J726049
9472D730159J531818J186361P78520M05338J31597l1839j18234j74736k35869
9463H203115l15042m08839n02257n71987n91645n39006m00717j73596J33604M96757
9453E330387Q75413J217141J465700J571738J506495J275365R21971N15733J27195
9444A4807138j95869m39777o20245p66324r02678j039760j175285j301931j412775
9435F952494j500423j552759j551888j480299j331929j119954q73774o25665l96071
$$ plain form
9426 -3480268 -3668138 -3661526 -3471186 -3123046 -2677103 -2230574 -1897850 -1776881 -1920937 -2326868
9416 -2326868 -2935960 -3639297 -4289609 -4729821 -4840348 -4587388 -4043472 -3362579 -2719462 -2245364
9406 -2245364 -1993298 -1945758 -2052558 -2273465 -2604148 -3076967 -3740716 -4630869 -5744462 -7030753
9396 -7030753 -8400328 -9744888 -10955836 -11936358 -12611717 -12943766 -12945697 -12685176 -12269935
9387 -12269935 -11823546 -11463459 -11284608 -11344314 -11648912 -12151852 -12771317 -13421284 -14038292 -14589105
9377 -14589105 -15059151 -15434630 -15692316 -15801219 -15729890 -15451379 -14943989 -14191653 -13187613
9368 -13187613 -11941250 -10484710 -8874066 -7180882 -5476001 -3815238 -2237016 -771929
9360 -771929 546354 1679518 2594668 3280342 3759351 4088821 4342358 4580186 4822564
$$ packed form
9426c480268j87870O612J90340L48140M45943M46529L32724J20969j44056m05931
9416b326868o09092p03337o50312m40212j10527K52960N43916O80893O43117M74098
9406b245364K52066M7540j06800k20907l30683m72819o63749q90153j113593j286291
9396g030753j369575j344560j210948r80522o75359l32049j931K60521M15241
9387a2269935M46389L60087J78851n9706l04598n02940o19465o49967o17008n50813
9377a4589105m70046l75479k57686j08903P1329K78511N07390P52336J004040
9368a3187613J246363J456540J610644J693184J704881J660763J578222J465087
9360g71929J318283J133164R15150O85674M79009L29470K53537K37828K42378
$$ plain form
9351 4822564 5039317 5156840 5076565 4700066 3956745 2825757 1342771 -409196 -2315565
9342 -2315565 -4243666 -6053760 -7613233 -8817011 -9611318 -10013456 -10117982 -10080562 -10078445
9333 -10078445 -10259445 -10701586 -11403424 -12309086 -13351520 -14486719 -15699370 -16980756 -18297270
9324 -18297270 -19570780 -20681606 -21491438 -21874986 -21747953 -21083416 -19915168 -18330816 -16458194
9315 -16458194 -14448219 -12457633 -10634082 -9102643 -7950999 -7214594 -6869738 -6843078 -7036257
9306 -7036257 -7352951 -7713262 -8050781 -8302041 -8403772 -8305027 -7986238 -7469192 -6807693 -6062615
9296 -6062615 -5275019 -4450574 -3560853 -2558881 -1401426 -69815 1416999 2999712 4585550
9287 4585550 6061842 7312909 8237679 8765966 8870218 8567915 7911021 6964893 5785603
$$ packed form
9351D822564K16753J17523q0275l76499p43321j130988j482986j751967j906369
9342b315565j928101j810094j559473j203778p94307m02138j04526L7420K117
9333a0078445j81000m42141p01838r05662j042434j135199j212651j281386j316514
9324a8297270j273510j110826q09832l83548J27033O64537J168248J584352J872622
9315a6458194K009975J990586J823551J531439J151644P36405L44856K6660j93179
9306g036257l16694l60311l37519k51260j01731R8745L18789N17046O61499P45078
9296f062615P87596Q24445Q89721J001972J157455J331611J486814J582713J585838
9287D585550J476292J251067R24770N28287J04252l02303o56894r46128j179290
$$ plain form
9278 5785603 4405646 2832068 1053706 -948569 -3192961 -5690966 -8444189 -11440659
9270 -11440659 -14646009 -17988733 -21347490 -24553738 -27416721 -29763288 -31475047 -32508400
9262 -32508400 -32894094 -32720997 -32109815 -31181443 -30027066 -28691056 -27176568 -25473617 -23594792
9253 -23594792 -21596311 -19571010 -17620586 -15829126 -14254533 -12935011 -11894887 -11140088
9245 -11140088 -10649604 -10376895 -10266736 -10277929 -10395772 -10626361 -10979601 -11454593 -12033933 -12682652
9235 -12682652 -13347084 -13958251 -14447462 -14770637 -14925195 -14946996 -14891976 -14817928 -14775241 -14802837
9225 -14802837 -14922916 -15135751 -15421255 -15750155 -16099821 -16465738 -16861575 -17306661 -17806970
9216 -17806970 -18341003 -18859978 -19301504 -19605128 -19717797 -19589170 -19168590 -18414829 -17316809
$$ packed form
9278E785603j379957j573578j778362k002275k244392k498005k753223k996470
9270a1440659l205350l342724l358757l206248k862983k346567j711759j033353
9262c2508400l85694J73097O11182R28372J154377J336010J514488J702951J878825
9253b3594792J998481K025301J950424J791460J574593J319522J040124P54799
9245a1140088M90484K72709J10159j1193j17843k30589l53240m74992n79340o48719
9235a2682652o64432o11167m89211l23175j54558k1801N5020P4048M2687k7596
9225a4802837j20079k12835k85504l28900l49666l65917l95837m45086n00309
9216a7806970n34033n18975m41526l03624j12669J28627M20580P53761J098020
$$ plain form
9207 -17316809 -15912713 -14296375 -12608868 -11018493 -9691651 -8758260 -8281945 -8249172 -8584085
9198 -8584085 -9180702 -9934452 -10758268 -11579773 -12326719 -12913453 -13240793 -13214700 -12776853 -11930715
9188 -11930715 -10747643 -9349102 -7873147 -6438357 -5116404 -3920025 -2808312 -1705512
9180 -1705512 -525274 807139 2337470 4069393 5956476 7902624 9773907 11420867
9172 11420867 12707005 13537670 13882134 13780110 13326630 12639192 11822743 10950409 10066574
9163 10066574 9202999 8391835 7666032 7049549 6546668 6138556 5789188 5456815 5104986
9154 5104986 4710195 4267959 3799222 3353703 3003925 2829309 2897981 3254296 3912402 4851701
9144 4851701 6014263 7309191 8625768 9849813 10876475 11618750 12014856 12034483 11679789
$$ packed form
9207a7316809J404096J616338J687507J590375J326842R33391M76315L2773l34913
9198h584085n96617p53750q23816q21505p46946n86734l27340K6093M37847Q46138
9188a1930715J183072J398541J475955J434790J321953J196379J111713J102800
9180a705512J180238J332413J530331J731923J887083J946148J871283J646960
9172A1420867J286138Q30665L44464j02024m53480o87438q16449q72334q83835
9163A0066574q63575q11164p25803o16483n02881m08112l49368l32373l51829
9154E104986l94791m42236m68737m45519l49778j74616O8672L56315O58106R39299
9144D851701J162562J294928J316577J224045J026662P42275L96106J9627l54694
$$ plain form
9135 11679789 10979064 9976792 8725734 7283197 5709998 4070447 2431974 862023
9127 862023 -579424 -1848168 -2917147 -3767893 -4380208 -4732652 -4816601 -4652619 -4294912
9118 -4294912 -3819859 -3305722 -2812805 -2369255 -1964710 -1553484 -1067564 -436470 391889 1436016
9108 1436016 2675763 4057246 5503088 6923171 8225104 9326037 10164323 10705686 10940595
9099 10940595 10876556 10532568 9939674 9145669 8218807 7245368 6317923 5515585 4883454 4420576
9089 4420576 4081620 3790933 3464849 3038252 2489625 1854989 1221928 703846 405735 396448
9079 396448 695899 1275559 2065155 2961043 3838397 4572785 5070976 5299729 5295852 5149384
9069 5149384 4968106 4840830 4812490 4874470 4969525 5011119 4914473 4629849 4164653 3584836
$$ packed form
9135A1679789p00725j002272j251058j442537j573199j639551j638473j569951
9127H62023j441447j268744j068979q50746o12315l52444q3949J63982L57707
9118d294912M75053N14137M92917M43550M04545M11226M85920O31094Q28359J044127
9108A436016J239747J381483J445842J420083J301933J100933Q38286N41363K34909
9099A0940595o4039l43988n92894p94005r26862r73439r27445q02338o32131m62878
9089D420576l38956k90687l26084m26597n48627o34636o33061n18082k98111r287
9079C96448K99451N79660P89596Q95888Q77354P34388M98191K28753l877j46468
9069E149384j81278j27276k8340O1980R5055M1594r6646k84624m65196n79817
$$ plain form
9059 3584836 2995097 2506376 2204198 2129949 2278827 2608790 3052189 3526230 3942291 4212966
9049 4212966 4255110 3991719 3360497 2333414 940669 -715384 -2468565 -4122395 -5501076
9040 -5501076 -6500835 -7119204 -7445068 -7611035 -7732190 -7863716 -7995958 -8080949 -8069540 -7940464
9030 -7940464 -7712577 -7438044 -7178355 -6972622 -6815162 -6656392 -6425935 -6062584 -5534686 -4844876
9020 -4844876 -4023457 -3117852 -2182838 -1272539 -433401 301701 916457 1409410 1787357 2054848
9010 2054848 2201792 2193772 1972497 1470603 635451 -550574 -2061989 -3833098 -5765709
9001 -5765709 -7738309 -9616573 -11263692 -12547606 -13345496 -13550915 -13088647 -11935520 -10137494
8992 -10137494 -7811494 -5127040 -2273415 574832 3282551 5763787 7977210 9909888
$$ packed form
9059C584836n89739m88721l02178p4249J48878L29963M43399M74041M16061K70675
9049D212966M2144k63391o31222j027083j392745j656053j753181j653830j378681
9040e501076r99759o18369l25864j65967j21155j31526j32242q4991J1409J29076
9030g940464K27887K74533K59689K05733J57460J58770K30457L63351N27898O89810
9020d844876Q21419R05605R35014R10299Q39138P35102O14756M92953L77947K67491
9010B054848J46944q020k21275n01894q35152j186025j511415j771109j932611
9001e765709j972600j878264j647119j283914p97890k05419M62268J153127J798026
8992a0137494K326000K684454K853625K848247K707719K481236K213423J932678
$$ plain form
8984 9909888 11554493 12889567 13874793 14468131 14659162 14500195 14112956 13659440 13286100
8975 13286100 13068425 12984485 12929725 12762663 12357533 11641884 10609240 9309618 7827919
8966 7827919 6261469 4705036 3245364 1960317 914997 152210 -317478 -518303 -502155
8957 -502155 -335966 -89702 170567 381319 471867 353289 -81635 -939794 -2295458 -4158736
8947 -4158736 -6458185 -9044145 -11713159 -14248070 -16461653 -18228225 -19493205 -20262423
8939 -20262423 -20581741 -20517123 -20139081 -19511235 -18683475 -17692040 -16565897 -15333051 -14019741
8930 -14019741 -12643605 -11210939 -9726913 -8216001 -6739206 -5394820 -4298976 -3553490
8922 -3553490 -3215310 -3281025 -3690913 -4345823 -5126548 -5911549 -6595421 -7107656 -7423621 -7559677
$$ packed form
8984I909888J644605J335074R85226N93338J91031j58967l87239m53516l73340
8975A3286100k17675q3940n4760j67062m05130p15649j032644j299622j481699
8966G827919j566450j556433j459672j285047j045320p62787m69688k00825J6148
8957e02155J66189K46264K60269K10752R0548j18578m34924q58159j355664j863278
8947d158736k299449k585960k669014k534911k213583j766572j264980p69218
8939b0262423l19318O4618L78042O27846Q27760R91435J126143J232846J313310
8930a4019741J376136J432666J484026J510912J476795J344386J095844P45486
8922c553490L38180o5715m09888o54910p80725p85001o83872n12235l15965j36056
$$ plain form
8912 -7559677 -7554593 -7448629 -7270371 -7033572 -6741507 -6396796 -6014149 -5629863 -5300864 -5092024
8902 -5092024 -5058512 -5231594 -5611089 -6163601 -6827045 -7523522 -8178389 -8737372 -9174152 -9488422
8892 -9488422 -9700214 -9845207 -9971315 -10134414 -10390656 -10783556 -11327599 -11995646 -12718404 -13397381
8882 -13397381 -13925094 -14206372 -14179618 -13836735 -13233780 -12481655 -11714891 -11050568 -10556280 -10240729
8872 -10240729 -10067820 -9983412 -9939252 -9902854 -9851588 -9757741 -9574519 -9231777 -8646038 -7742612
8862 -7742612 -6480210 -4865930 -2954136 -832123 1399223 3642324 5812710 7839570
8854 7839570 9659115 11208598 12430237 13286899 13780013 13955815 13893648 13682915 13401860
8845 13401860 13106647 12829185 12576978 12332081 12053368 11687790 11190044 10542294 9763625
$$ packed form
8912g559677N084J05964J78258K36799K92065L44711L82647L84286L28999K08840
8902e092024L3512j73082l79495n52512o63444o96477o54867n58983m36780l14270
8892i488422k11792j44993j26108j63099k56242l92900n44043o68047p22758o78977
8882a3397381n27713k81278K6754L42883O02955P52125P66764O64323M94288L15551
8872a0240729J72909Q4408M4160L6398N1266R3847J83222L42742N85739R03426
8862g742612J262402J614280J911794K122013K231346K243101K170386K026860
8854G839570J819545J549483J221639Q56662M93114J75802o2167k10733k81055
8845A3401860k95213k77462k52207k44897k78713l65578m97746o47750p78669
$$ plain form
8836 9763625 8904420 8029451 7199575 6461262 5845627 5370733 5041392 4849232 4781232 4837314
8826 4837314 5044033 5448669 6091849 6973975 8035073 9158080 10193101 10993187 11450581
8817 11450581 11523078 11242412 10701420 10023727 9326982 8693839 8160612 7723269 7351699 7002267
8807 7002267 6624592 6164863 5570070 4795369 3812935 2618514 1233613 -295186 -1897774
8798 -1897774 -3484437 -4955519 -6215955 -7188601 -7821729 -8093122 -8016014 -7646148 -7081529
8789 -7081529 -6447027 -5865407 -5426255 -5166056 -5066096 -5066317 -5088790 -5063939 -4951645 -4748255 -4475268
8778 -4475268 -4156827 -3801348 -3397881 -2925327 -2365747 -1716324 -998883 -264576 410769 941633
8768 941633 1252631 1295673 1060358 576979 -88150 -846066 -1605728 -2294885 -2870958 -3316856
$$ packed form
8836I763625q59205q74969q29876p38313o15635m74894l29341j92160o8000N6082
8826D837314K06719M04636O43180Q82126J061098J123007J035021Q00086M57394
8817A1450581P2497k80666n40992o77693o96745o33143n33227m37343l71570l49432
8807G002267l77675m59729n94793p74701r82434j194421j384901j528799j602588
8798a897774j586663j471082j260436r72646o33128k71393P7108L69866N64619
8789g081529O34502N81620M39152K60199R9960k21k2473K4851J12294K03390K72987
8778d475268L18441L55479M03467M72554N59580O49423P17441P34307O75345N30864
8768I41633L10998M3042k35315m83379o65129p57916p59662o89157n76073m45898
$$ plain form
8758 -3316856 -3628068 -3804050 -3850204 -3783921 -3634863 -3438650 -3231120 -3047038 -2919436 -2875780
8748 -2875780 -2932897 -3094452 -3350678 -3678361 -4043079 -4408306 -4750953 -5074253 -5406669 -5784156
8738 -5784156 -6226154 -6721353 -7231750 -7709514 -8114439 -8424448 -8639413 -8779896 -8879983 -8974745
8728 -8974745 -9087982 -9226763 -9383682 -9542554 -9683317 -9785001 -9827434 -9792893 -9669234 -9454343
8718 -9454343 -9157972 -8795666 -8374722 -7880876 -7277687 -6523523 -5597878 -4520444 -3350463
8709 -3350463 -2167373 -1045511 -36664 833795 1559908 2142815 2577876 2845479 2910326
8700 2910326 2732365 2286447 1580238 657927 -414293 -1571306 -2764877 -3964621 -5150680
8691 -5150680 -6309073 -7432427 -8519979 -9572557 -10586074 -11549136 -12444470 -13249768 -13937673
$$ packed form
8758c316856l11212j75982m6154O6283J49058J96213K07530J84082J27602M3656
8748b875780n7117j61555k56226l27683l64718l65227l42647l23300l32416l77487
8738e784156m41998m95199n10397m77764m04925l10009k14965j40483j00087r4762
8728h974745j13237j38781j56919j58872j40763j01684m2433L4541J23659K14891
8718i454343K96371L62306M20944M93846O03189P54164R25645J077434J169981
8709c350463J183090J121862J008847Q70459P26113N82907M35061K67603O4847
8700B910326j77961m45918p06209r22311j072220j157013j193571j199744j186059
8691e150680j158393j123354j087552j052578j013517r63062q95334q05298o87905
$$ plain form
8682 -13937673 -14479706 -14855827 -15062720 -15111983 -15017952 -14784116 -14397139 -13831043 -13059946 -12076629
8672 -12076629 -10910760 -9635854 -8356435 -7179059 -6182978 -5406798 -4856634 -4527785 -4424753
8663 -4424753 -4567270 -4980705 -5679778 -6656346 -7875559 -9279212 -10795412 -12353667 -13899646
8654 -13899646 -15400799 -16840460 -18208149 -19494819 -20692788 -21793403 -22778574 -23610200
8646 -23610200 -24225226 -24541919 -24477021 -23967260 -22985799 -21547672 -19704752 -17534081 -15122971
8637 -15122971 -12555152 -9904063 -7236169 -4617886 -2114555 222736 2373313 4351830
8629 4351830 6196294 7946605 9626555 11236562 12754869 14141089 15340226 16290407
8621 16290407 16935640 17238133 17182620 16771877 16020505 14954134 13613822 12059397 10366485
$$ packed form
8682a3937673n42033l76121k06893m9263R4031K33836L86977N66096P71097R83317
8672a2076629J165869J274906J279419J177376R96081P76180N50164L28849J03032
8663d424753j42517m13435o99073r76568j219213j403653j516200j558255j545979
8654a3899646j501153j439661j367689j286670j197969j100615r85171q31626
8646b3610200o15026l16693O4898N09761R81461J438127J842920K170671K411110
8637a5122971K567819K651089K667894K618283K503331K337291K150577J978517
8629D351830J844464J750311J679950J610007J518307J386220J199137R50181
8621A6290407O45233L02493n5513m10743p51372j066371j340312j554425j692912
$$ plain form
8612 10366485 8617815 6893476 5263832 3785276 2497478 1422231 564678 -84181
8604 -84181 -545723 -851780 -1039080 -1139676 -1172881 -1144817 -1055267 -905664 -702223 -452523
8594 -452523 -158545 187086 594925 1062346 1556163 2005986 2313752 2377016 2119303 1516862
8584 1516862 607424 -528191 -1802649 -3152102 -4539190 -5930494 -7268375 -8457906
8576 -8457906 -9377436 -9908072 -9969481 -9547444 -8702427 -7556686 -6265897 -4986693 -3851589
8567 -3851589 -2956973 -2360879 -2082304 -2097829 -2340055 -2706372 -3081437 -3367397 -3509124 -3502407
8557 -3502407 -3381874 -3197304 -2992105 -2791642 -2600148 -2403975 -2183733 -1935330 -1688842 -1508597
8547 -1508597 -1469356 -1622222 -1970891 -2468644 -3031457 -3557026 -3944474 -4115464 -4036274 -3733969
$$ packed form
8612A0366485j748670j724339j629644j478556j287798j075247q57553o48859
8604h4181m61542l06057j87300j00596l3205K8064Q9550J49603K03441K49700
8594d52523K93978L45631M07839M67421M93817M49823L07766O3264k57713o02441
8584A516862r09438j135615j274458j349453j387088j391304j337881j189531
8576h457906r19530n30636o1409M22037Q45017J145741J290789J279204J135104
8567c851589Q94616N96094K78575j5525k42226l66317l75065k85960j41727O717
8557c502407J20533J84570K05199K00463J91494J96173K20242K48403K46488J80245
8547a508597L9241j52866l48669m97753n62813n25569l87448j70990P9190L02305
$$ plain form
8537 -3733969 -3297330 -2859526 -2569208 -2560250 -2926709 -3705724 -4870832 -6337609 -7980460
8528 -7980460 -9656463 -11232047 -12607565 -13732102 -14602207 -15247089 -15711636 -16046910 -16307528
8519 -16307528 -16548463 -16816283 -17136315 -17501585 -17870366 -18177580 -18359267 -18381921 -18266118 -18098238
8509 -18098238 -18027958 -18247840 -18951623 -20277448 -22256436 -24790655 -27671435 -30628920 -33391469
8500 -33391469 -35734032 -37504222 -38626269 -39091542 -38945865 -38278532 -37210886 -35880105 -34417920
8491 -34417920 -32929959 -31483602 -30108876 -28810427 -27583336 -26424910 -25338854 -24333887
8483 -24333887 -23421313 -22613826 -21923496 -21355476 -20897565 -20511990 -20137680 -19704700 -19151956
8474 -19151956 -18435874 -17527272 -16406592 -15069289 -13540703 -11887009 -10209762 -8624140
$$ packed form
8537c733969M36639M37804K90318Q958l66459p79015j165108j466777j642851
8528g980460j676003j575584j375518j124537q70105o44882m64547l35274k60618
8519a6307528k40935k67820l20032l65270l68781l07214j81687k2654J15803J67880
8509a8098238P0280k19882p03783j325825j978988k534219k880780k957485k762549
8500c3391469k342563j770190j122047m65273J45677O67333J067646J330781J462185
8491c4417920J487961J446357J374726J298449J227091J158426J086056J004967
8483b4333887R12574Q07487O90330N68020M57911L85575L74310M32980N52744
8474a9151956P16082R08602J120680J337303J528586J653694J677247J585622
$$ plain form
8466 -8624140 -7231799 -6099694 -5249841 -4659096 -4265911 -3981932 -3708087 -3355216 -2866463
8457 -2866463 -2234435 -1505510 -769247 -138343 272300 362401 59587 -667893 -1799015 -3253419
8447 -3253419 -4897767 -6568858 -8109158 -9402611 -10396337 -11099193 -11558864 -11829244 -11943292
8438 -11943292 -11901495 -11676627 -11228496 -10520822 -9534887 -8277844 -6785956 -5123399 -3375662
8429 -3375662 -1635901 13796 1518467 2855236 4026968 5052999 5964200 6799772 7597852
8420 7597852 8378936 9132310 9817067 10378671 10770056 10964101 10951963 10732217 10302096 9660959
8410 9660959 8827558 7861294 6871161 6000807 5391990 5142794 5281027 5764208 6501421 7380794
8400 7380794 8287652 9110371 9741912 10085978 10068821 9650620 8830787 7647510 6176122
$$ packed form
8466h624140J392341J132105Q49853N90745L93185K83979K73845L52871M88753
8457b866463O32028P28925P36263O30904M10643R0101l02814p27480j131122j454404
8447c253419j644348j671091j540300j293453r93726p02856m59671k70380j14048
8438a1943292M1797K24868M48131P07674R85935J257043J491888J662557J747737
8429c375662J739761J649697J504671J336769J171732J026031R11201Q35572P98080
8420G597852P81084P53374O84757N61604L91385J94045j2138k19746m30121o41137
8410I660959q33401r66264r90133q70354o08817k49196J38233M83181P37213Q79373
8400G380794R06858Q22719O31541L44066j7157m18201q19833j183277j471388
$$ plain form
8391 6176122 4528412 2848524 1297941 27551 -854567 -1305187 -1347912 -1055771 -523049
8382 -523049 162683 938434 1767513 2626844 3489652 4314432 5044025 5611789 5951875 6013654
8372 6013654 5778504 5271736 4561811 3745920 2928889 2203769 1637771 1262772 1069502 1008148
8362 1008148 1000287 963389 840312 620310 341942 79267 -79616 -53229 217627 761545
8352 761545 1576853 2638453 3905648 5327629 6848387 8412698 9968857 11462109 12821139
8343 12821139 13950263 14738981 15087839 14937676 14287833 13196402 11765119 10118977 8392062
8334 8392062 6722834 5249010 4088497 3306480 2887190 2731237 2682446 2570256 2250894
8325 2250894 1638596 723538 -426964 -1686092 -2900295 -3927669 -4670492 -5092051 -5213199
$$ packed form
8391F176122j647710j679888j550583j270390q82118m50620m2725K92141N32722
8382e23049O85732P75751Q29079Q59331Q62808Q24780P29593N67764L40086O1779
8372F013654k35150n06768p09925q15891q17031p25120n65998l74999j93270o1354
8362A008148p861l6898j23077k20002k78368k62675j58883K6387K70856N43918
8352G61545Q15308J061600J267195J421981J520758J564311J556159J493252J359030
8343A2821139J129124P88718L48858j50163o49843j091431j431283j646142j726915
8334H392062j669228j473824j160513p82017m19290j55953m8791j12190l19362
8325B250894o12298r15058j150502j259128j214203j027374p42823m21559j21148
$$ plain form
8316 -5213199 -5092792 -4803446 -4412800 -3973197 -3518398 -3067911 -2639776 -2266015 -1998962 -1901814
8306 -1901814 -2029735 -2414370 -3058698 -3939299 -5010797 -6211957 -7475484 -8739412 -9953283
8297 -9953283 -11075109 -12064367 -12881301 -13496910 -13906560 -14136056 -14236179 -14271093 -14307090 -14402426
8287 -14402426 -14596171 -14898191 -15286570 -15715901 -16132419 -16488431 -16751710 -16909788 -16968887 -16945295
8277 -16945295 -16849598 -16671613 -16377487 -15923698 -15280494 -14451231 -13479401 -12444211 -11449084
8268 -11449084 -10604885 -10008231 -9718516 -9741176 -10024398 -10471678 -10966967 -11404433 -11712348 -11861744
8258 -11861744 -11856267 -11708314 -11413487 -10937352 -10223098 -9217266 -7899313 -6298527 -4491575
8249 -4491575 -2586960 -706624 1031102 2528259 3722230 4592843 5157869 5460532 5555578
$$ packed form
8316e213199J20407K89346L90646M39603M54799M50487M28135L73761K67053R7148
8306a901814j27921l84635o44328q80601j071498j201160j263527j263928j213871
8297i953283j121826r89258q16934o15609m09650k29496j00123l4914l5997r5336
8287a4402426j93745l02020l88379m29331m16518l56012k63279j58078n9099K3592
8277a6945295R5697J77985K94126M53789O43204Q29263R71830J035190R95127
8268a1449084Q44199N96654K89715k2660k83222m47280m95289m37466l07915j49396
8258a1861744N477J47953K94827M76135P14254J005832J317953J600786J806952
8249d491575J904615J880336J737726J497157J193971Q70613N65026L02663R5046
$$ plain form
8240 5555578 5497321 5330678 5087729 4792070 4467622 4143825 3852400 3618833 3454983 3355835
8230 3355835 3299765 3251860 3170905 3018880 2769046 2408269 1932299 1337633 617507 -231222
8220 -231222 -1191323 -2209911 -3198938 -4056448 -4698003 -5079178 -5196039 -5066279 -4706907 -4124857
8210 -4124857 -3325035 -2326994 -1177375 48670 1255704 2341453 3212148 3797244 4060845
8201 4060845 4007209 3679133 3149579 2508516 1847917 1247156 759339 399410 137826 -94783
8191 -94783 -390120 -836778 -1495909 -2386379 -3483818 -4732168 -6060647 -7397180 -8674555
8182 -8674555 -9833094 -10825230 -11621507 -12212548 -12604302 -12810263 -12846338 -12730524 -12486158 -12147243
8172 -12147243 -11764036 -11404638 -11147192 -11061746 -11188690 -11524669 -12022572 -12603890 -13177418 -13659853
$$ packed form
8240E555578n8257j66643k42949k95659l24448l23797k91425k33567j63850r9148
8230C355835n6070m7905q0955j52025k49834l60777m75970n94666p20126q48729
8220b31222r60101j018588r89027q57510o41555l81175j16861J29760L59372N82050
8210d124857P99822R98041J149619J226045J207034J085749Q70695N85096K63601
8201D060845n3636l28076n29554o41063o60599o00761m87817l59929k61584k32609
8191i4783k95337m46658o59131q90470j097439j248350j328479j336533j277375
8182h674555j158539r92136p96277n91041l91754k05961l6075J15814K44366L38915
8172a2147243L83207L59398K57446Q5446j26944l35979m97903n81318n73528m82435
$$ plain form
8162 -13659853 -13995401 -14168756 -14203604 -14145445 -14039346 -13916796 -13794997 -13679482 -13562338 -13420237
8152 -13420237 -13221368 -12941007 -12574834 -12140853 -11671011 -11199193 -10750010 -10330522 -9928052
8143 -9928052 -9516114 -9064798 -8548484 -7948268 -7253462 -6466746 -5610307 -4724668 -3855071 -3030228
8133 -3030228 -2246597 -1470751 -661301 202625 1105127 1999054 2826014 3534341 4084787 4447752
8123 4447752 4603191 4548638 4308930 3935779 3492311 3030769 2578563 2141569 1720149 1324800
8113 1324800 980869 720644 568470 527188 572852 660509 737823 759248 694720 532515 280189
8102 280189 -33543 -357946 -625551 -766165 -725261 -477072 -25534 604616 1377379 2249126
8092 2249126 3168090 4075150 4907202 5600198 6091042 6322543 6254696 5878451 5223083 4351286
$$ packed form
8162a3659853l35548j73355l4848N8159J06099J22550J21799J15515J17144J42101
8152a3420237J98869K80361L66173M33981M69842M71818M49183M19488M02470
8143i928052M11938M51316N16314O00216O94806P86716Q56439Q85639Q69597Q24843
8133c030228P83631P75846Q09450Q63926R02502Q93927Q26960P08327N50446L62965
8123D447752J55439n4553k39708l73151m43468m61542m52206m36994m21420l95349
8113A324800l43931k60225j52174m1282M5664Q7657P7314K1425o4528j62205k52326
8102B80189l13732l24403k67605j40614M0904K48189M51538O30150P72763Q71747
8092B249126R18964R07060Q32052O92996M90844K31501o7847l76245o55368q71797
$$ plain form
8082 4351286 3344065 2283322 1240685 277458 -545812 -1158612 -1480018 -1434886 -981905
8073 -981905 -139233 1006854 2316240 3626952 4792296 5709978 6334728 6673435 6768472
8064 6768472 6677661 6457704 6154542 5801963 5427928 5064172 4750437 4525889 4409418 4380654
8054 4380654 4375200 4298630 4051975 3555485 2760211 1645544 210396 -1530424 -3538760
8045 -3538760 -5740922 -8024159 -10249739 -12277318 -13987455 -15292878 -16138796 -16498051 -16365735
8036 -16365735 -15754880 -14694632 -13233410 -11446808 -9443672 -7360636 -5341949 -3513447
8028 -3513447 -1965101 -749810 106156 591794 707385 469824 -77481 -859480 -1777125
8019 -1777125 -2725895 -3613262 -4364709 -4920706 -5235340 -5281141 -5053218 -4564080 -3829587 -2855047
$$ packed form
8082D351286j007221j060743j042637r63227q23270o12800l21406M5132M52981
8073i81905Q42672J146087J309386J310712J165344R17682O24750L38707R5037
8064F768472r0811k19957l03162l52579l74035l63756l13735k24548j16471k8764
8054D380654n454p6570k46655m96490p95274j114667j435148j740820k008336
8045c538760k202162k283237k225580k027579j710137j305423q45918l59255J32316
8036a6365735O10855J060248J461222J786602K003136K083036K018687J828502
8028c513447J548346J215291Q55966M85638J15591k37561n47305p81999r17645
8019a777125r48770q87367p51447n55997l14634m5801K27923M89138P34493R74540
$$ plain form
8009 -2855047 -1631235 -145345 1595756 3541631 5590503 7607543 9462529 11067199
8001 11067199 12394830 13477377 14386433 15206566 16007239 16818832 17619626 18339748 18882067
7992 18882067 19151885 19083569 18656661 17901188 16894210 15746850 14579979 13492786 12536491
7983 12536491 11706959 10961550 10252763 9562021 8916730 8382638 8036186 7930616 8070822
7974 8070822 8406684 8846994 9288547 9648536 9886041 10003001 10025747 9978966 9867713 9677383
7964 9677383 9390463 9009250 8570500 8141858 7798891 7592230 7521957 7534770 7547092 7481432
7954 7481432 7296187 6995675 6620736 6229395 5877294 5603071 5420419 5317537 5263228 5215615
7944 5215615 5127883 4949212 4626018 4110668 3377706 2438158 1341088 159788 -1030867
$$ packed form
8009b855047J223812J485890J741101J945875K048872K017040J854986J604670
8001A1067199J327631J082547R09056Q20133Q00673Q11593Q00794P20122N42319
7992A8882067K69818o8316m26908p55473j006978j147360j166871j087193r56295
7983A2536491q29532p45409p08787o90742o45291n34092l46452j05570J40206
7974H070822L35862M40310M41553L59989K37505J16960K2746m6781j11253j90330
7964I677383k86920l81213m38750m28642l42967k06661p0273J2813J2322o5660
7954G481432j85245l00512l74939l91341l52101k74223j82652j02882n4309m7613
7944E215615q7732j78671l23194n15350p32962r39548j097070j181300j190655
$$ plain form
7935 -1030867 -2176317 -3255501 -4280244 -5280004 -6278080 -7271363 -8225041 -9085810 -9806890
7926 -9806890 -10371748 -10804251 -11160771 -11509126 -11903831 -12365472 -12869670 -13350976 -13724778 -13920754
7916 -13920754 -13910627 -13713491 -13377297 -12952453 -12476721 -11977655 -11482701 -11022768 -10623865 -10292541
7906 -10292541 -10004082 -9698790 -9288503 -8674553 -7774724 -6549606 -5016066 -3242693 -1332350
7897 -1332350 599718 2447315 4130991 5606527 6859532 7889547 8695127 9270387 9613935
7888 9613935 9742248 9698267 9551077 9387594 9298402 9358953 9609658 10043468 10609833 11234510
7878 11234510 11842789 12372380 12773090 13001449 13019165 12798129 12330046 11636650 10773555 9820165
7868 9820165 8855759 7934386 7074707 6268837 5498144 4741440 3974182 3170152 2314298 1420543
$$ packed form
7935a030867j145450j079184j024743r99760r98076r93283r53678q60769p21080
7926i806890n64858m32503l56520l48355l94705m61641n04198m81306l73802j95976
7916a3920754J0127J97136L36194M24844M75732M99066M94954M59933L98903L31324
7906a0292541K88459L05292M10287O13950Q99829J225118J533540J773373J910343
7897a332350J932068J847597J683676J475536J253005J030015Q05580N75260L43548
7888I613935J28313m3981j47190j63483q9192O0551K50705M33810N66365O24677
7878A1234510O08279N29591M00710K28359J7716k21036m68083o93396q63095r53390
7868I820165r64406r21373q59679q05870p70693p56704p67258q04030q55854q93755
$$ plain form
7858 1420543 538993 -255968 -889334 -1305084 -1471494 -1374089 -1006360 -368071 525808 1631873
7848 1631873 2872501 4145372 5344603 6381449 7195516 7757306 8067754 8156243 8073078
7839 8073078 7873935 7600550 7266206 6852737 6320348 5626644 4748205 3696989 2524928
7830 2524928 1313935 154810 -875170 -1724426 -2363565 -2772043 -2927973 -2810241 -2410595
7821 -2410595 -1745165 -856875 191738 1330039 2489761 3611919 4649745 5568193 6341051
7812 6341051 6947010 7366329 7580244 7575150 7351517 6934352 6379807 5772662 5211779 4785669
7802 4785669 4547298 4500954 4608463 4809968 5046341 5273345 5466121 5617276 5731550 5819897
7792 5819897 5896568 5980473 6096523 6270377 6514924 6814604 7118119 7348090 7427898 7313698
$$ packed form
7858A420543q81550p94961o33366m15750j66410R7405L67729O38289Q93879J106065
7848A631873J240628J272871J199231J036846Q14067N61790L10448Q8489q3165
7839H073078j99143k73385l34344m13469n32389o93704q78439j051216j172061
7830B524928j210993j159125j029980q49256o39139m08478j55930J17732L99646
7821b410595O65430Q88290J048613J138301J159722J122158J037826R18448P72858
7812F341051O05959M19319K13915n094k23633m17165n54545o07145n60883m26110
7802D785669k38371m6344J07509K01505K36373K27004J92776J51155J14274Q8347
7792E819897P6671Q3905J16050J73854K44547K99680L03515K29971P9808j14200
$$ plain form
7782 7313698 7011604 6566310 6027260 5415848 4715768 3889825 2907504 1763652 479774
7773 479774 -905878 -2347194 -3791404 -5176710 -6435109 -7504101 -8342055 -8938836 -9316622
7764 -9316622 -9521103 -9605844 -9613559 -9558994 -9418547 -9131122 -8612692 -7782757 -6594725 -5057784
7754 -5057784 -3239951 -1250740 788438 2773198 4633070 6331629 7853587 9189174
7746 9189174 10326272 11254996 11981287 12540703 13002224 13455259 13981272 14621994 15361753
7737 15361753 16135430 16857749 17455584 17885145 18130407 18194698 18098818 17886386 17624781 17391343
7727 17391343 17246420 17204639 17217240 17174483 16931659 16353270 15358995 13950847 12210075 10268987
7717 10268987 8273911 6354686 4608328 3096980 1856009 906423 266229 -42958 4239
$$ packed form
7782G313698l02094m45294n39050o11412p00080q25943r82321j143852j283878
7773D79774j385652j441316j444210j385306j258399j068992q37954n96781l77786
7764i316622k04481q4741p715N4565J40447K87425N18430Q29935J188032J536941
7754e057784J817833J989211K039178J984760J859872J698559J521958J335587
7746I189174J137098R28724P26291N59416M61521M53035N26013O40722P39759
7737A5361753P73677P22319N97835M29561K45262O4291r5880k12432k61605k33438
7727A7391343j44923m1781J2601m2757k42824n78389r94275j408148j740772j941088
7717A0268987j995076j919225j746358j511348j240971r49586o40194l09187M7197
$$ plain form
7708 4239 430781 1246387 2435497 3948037 5696193 7558317 9388699 11031048 12334298
7699 12334298 13170272 13451506 13145045 12277944 10933884 9243865 7373138 5503486 3809675
7690 3809675 2432761 1456881 896396 697832 757645 952631 1174948 1361029 1505714 1658644
7680 1658644 1905389 2338573 3025515 3980116 5147566 6408607 7604470 8575438 9199261
7671 9199261 9414987 9225234 8681508 7864264 6866113 5777421 4670056 3581808 2511952
7662 2511952 1435064 326988 -812328 -1950871 -3032707 -3996623 -4797789 -5424564 -5903851
7653 -5903851 -6293503 -6666435 -7092316 -7620434 -8267224 -9013727 -9815175 -10616807 -11365859 -12015095
7643 -12015095 -12521528 -12845729 -12953025 -12814779 -12409027 -11722334 -10755576 -9534444 -8120642
$$ packed form
7708D239M26542Q15606J189110J512540J748156J862124J830382J642349J303250
7699A2334298Q35974K81234l06461q67101j344060j690019j870727j869652j693811
7690C809675j376914r75880n60485j98564N9813J94986K22317J86081J44685J52930
7680A658644K46745M33184O86942R54601J167450J261041J195863R70968O23823
7671I199261K15726j89753n43726q17244r98151j088692j107365j088248j069856
7662B511952j076888j108076j139316j138543j081836r63916q01166o26775m79287
7653e903851l89652l72932m25881n28118o46790p46503q01448q01632p49052o49236
7643a2015095n06433l24201j07296J38246M05752O86693R66758J221132J413802
$$ plain form
7634 -8120642 -6615160 -5146427 -3844553 -2811234 -2095917 -1684406 -1502717 -1436963 -1365518
7625 -1365518 -1193059 -874235 -420171 111379 636934 1072473 1355555 1457893 1385180 1165540
7615 1165540 832118 407986 -99239 -691266 -1367504 -2117250 -2920686 -3756165 -4607274 -5465372
7605 -5465372 -6328215 -7197957 -8079443 -8975116 -9873186 -10733559 -11484207 -12037558 -12321842 -12309645
7595 -12309645 -12027831 -11547109 -10962199 -10374869 -9883703 -9576160 -9517685 -9738949 -10227526 -10928322
7585 -10928322 -11751177 -12582924 -13304940 -13816932 -14059642 -14023545 -13737592 -13246594 -12592593 -11808722
7575 -11808722 -10923339 -9967673 -8981881 -8016406 -7126767 -6362743 -5757143 -5320804 -5046396
7566 -5046396 -4916940 -4911332 -5002052 -5146657 -5279503 -5310914 -5139141 -4675975 -3878699 -2772375
$$ packed form
7634h120642J505482J468733J301874J033319P15317M11511J81689O5754P1445
7625a365518J72459L18824M54064N31550N25555M35539K83082J02338p2713k19640
7615A165540l33422m24132n07225n92027o76238p49746q03436q35479q51109q58098
7605e465372q62843q69742q81486q95673q98070q60373p50648n53351k84284J2197
7595a2309645K81814M80722N84910N87330M91166L07543N8475k21264m88577p00796
7585a0928322q22855q31747p22016n11992k42710L6097K85953M90998O54001P83871
7575a1808722Q85383R55666R85792R65475Q89639P64024O05600M36339K74408
7566e046396J29456N608r0720j44605j32846l1411J71773M63166P97276J106324
$$ plain form
7556 -2772375 -1446508 -23747 1383817 2707892 3932175 5076117 6166267 7210990
7548 7210990 8190536 9063851 9781986 10295580 10554704 10512112 10140081 9454642 8525907 7457595
7538 7457595 6342068 5218997 4065647 2824360 1447727 -65855 -1662001 -3244002
7530 -3244002 -4699376 -5928187 -6865170 -7490332 -7826090 -7924769 -7855004 -7694241 -7526598 -7438546
7520 -7438546 -7507021 -7783772 -8285006 -8990498 -9848195 -10779435 -11685823 -12462157 -13015462 -13284067
7510 -13284067 -13249095 -12934161 -12393314 -11690977 -10880322 -9987398 -9006410 -7907574 -6654333
7501 -6654333 -5223009 -3617638 -1876690 -72751 1693895 3309299 4667454 5693200
7493 5693200 6356476 6671448 6680976 6432123 5952512 5239916 4272910 3037191 1550217 -131666
$$ packed form
7556b772375J325867J422761J407564J324075J224283J143942J090150J044723
7548G210990R79546Q73315P18135N13594K59124m2592l72031o85439r28735j068312
7538G457595j115527j123071j153350j241287j376633j513582j596146j582001
7530c244002j455374j228811r36983o25162l35758r8679O9765J60763J67643Q8052
7520g438546o8475k76751n01234p05492q57697r31240r06388p76334n53305k68605
7510a3284067L4972L14934N40847P02337Q10655Q92924R80988J098836J253241
7501f654333J431324J605371J740948J803939J766646J615404J358155J025746
7493E693200O63276L14972R528k48853m79611p12596r67006j235719j486974j681883
$$ plain form
7483 -131666 -1925900 -3746075 -5521381 -7205127 -8770391 -10196215 -11451699 -12485700
7475 -12485700 -13226884 -13595164 -13522644 -12978759 -11991254 -10654692 -9121921 -7578468 -6204198
7466 -6204198 -5132035 -4418205 -4036543 -3899163 -3893555 -3919859 -3913994 -3849940 -3724499 -3536047
7456 -3536047 -3269606 -2894012 -2369761 -1664323 -771840 269956 1377289 2438749 3345728
7447 3345728 4015954 4398856 4469667 4227514 3702978 2965173 2114871 1261220 493186 -139031
7437 -139031 -623868 -972081 -1195574 -1294531 -1259953 -1088689 -800643 -447246 -105399 141441
7427 141441 227271 122993 -155615 -553474 -994191 -1406510 -1750161 -2027671 -2273611 -2528158
7417 -2528158 -2814178 -3132389 -3470818 -3811927 -4126480 -4360227 -4430307 -4242764 -3726632 -2867553
$$ packed form
7483a31666j794234j820175j775306j683746j565264j425824j255484j034001
7475a2485700p41184l68280P2520N43885R87505J336562J532771J543453J374270
7466f204198J072163P13830L81662J37380N608k6304N865O4054J25441J88452
7456c536047K66441L75594N24251P05438Q92483J041796J107333J061460R06979
7447C345728O70226L82902P0811k42153n24536p37805q50302q53651p68034o32217
7437a39031m84837l48213k23493r8957L4578J71264K88046L53397L41847K46840
7427A41441Q5830j04278k78608l97859m40717m12319l43651k77510k45940k54547
7417b528158k86020l18211l38429l41109l14553k33747p0080J87543N16132Q59079
$$ plain form
7407 -2867553 -1724177 -421319 875824 1998501 2814518 3261599 3360959 3202611 2907391
7398 2907391 2583731 2298939 2074207 1897871 1743107 1579148 1375695 1107425 761943 345463
7388 345463 -121409 -616877 -1130869 -1669654 -2251048 -2893243 -3601314 -4357539 -5122161 -5844689
7378 -5844689 -6476667 -6976437 -7306229 -7429561 -7313555 -6933535 -6276909 -5348520 -4179878
7369 -4179878 -2837875 -1423423 -55165 1156056 2129634 2825615 3243829 3419970 3425189
7360 3425189 3366714 3379855 3604392 4148947 5056139 6282793 7704060 9141741 10407957
7351 10407957 11348672 11872699 11960645 11657588 11054982 10264056 9383579 8471640 7535273 6545030
7341 6545030 5467216 4295898 3067741 1853513 734149 -222271 -969262 -1476290 -1721051
$$ packed form
7407b867553J143376J302858J297143J122677Q16017M47081R9360j58348k95220
7398B907391l23660k84792k24732j76336j54764j63959k03453k68270l45482m16480
7388C45463m66872m95468n13992n38785n81394o42195p08071p56225p64622p22528
7378e844689o31978m99770l29792j23332J16006L80020O56626R28389J168642
7369d179878J342003J414452J368258J211221R73578O95981M18214J76141N219
7360C425189n8475J3141K24537N44555R07192J226654J421267J437681J266216
7351A0407957R40715N24027Q7946l03057o02606p90926q80477r11939r36367r90243
7341F545030j077814j171318j228157j214228j119364r56420p46991n07028k44761
$$ plain form
7332 -1721051 -1690945 -1391981 -853205 -119555 760601 1741560 2776671 3812355 4787562
7323 4787562 5638763 6306375 6741747 6916745 6833904 6529458 6063817 5503483 4904085 4300231
7313 4300231 3701097 3090481 2434337 1697473 862348 -62622 -1050792 -2073107 -3108443
7304 -3108443 -4141956 -5155701 -6120173 -6992716 -7724638 -8275149 -8626769 -8795192 -8830068
7295 -8830068 -8809145 -8829858 -8998019 -9409663 -10126004 -11150020 -12417091 -13806393 -15168945
7286 -15168945 -16360077 -17264412 -17808019 -17959518 -17724055 -17132515 -16228618 -15059997 -13679220
7277 -13679220 -12152087 -10560402 -8988122 -7495574 -6100696 -4783610 -3512244 -2269826
7269 -2269826 -1065042 78657 1141265 2114854 2997083 3779171 4442978 4972959 5375284
$$ packed form
7332a721051L0106K98964N38776P33650Q80156R80959J035111J035684R75207
7323D787562Q51201O67612M35372J74998q2841l04446m65641n60334n99398o03854
7313D300231n99134o10616o56144p36864q35125r24970r88170j022315j035336
7304c108443j033513j013745r64472q72543p31922n50511l51620j68423l4876
7295h830068K0923k0713j68161m11644p16341j024016j267071j389302j362552
7286a5168945j191132r04335n43607j51499K35463N91540R03897J168621J380777
7277a3679220J527133J591685J572280J492548J394878J317086J271366J242418
7269b269826J204784J143699J062608R73589Q82229P82088O63807N29981M02325
$$ plain form
7260 5375284 5690094 5987514 6347847 6834367 7469382 8221790 9009884 9719191 10231290 10455590
7250 10455590 10353344 9945544 9304064 8533304 7751638 7077402 6618058 6459393 6655244
7241 6655244 7222515 8144442 9377473 10853046 12472765 14107818 15614873 16866832 17782218
$$ packed form
7260E375284L14810K97420L60333M86520O35015P52408P88094P09307N12099K24300
7250A0455590j02246m07800o41480p70760p81666o74236m59344j58665J95851
7241F655244N67271R21927J233031J475573J619719J635053J507055J251959R15386
$$ [...]
##END NTUPLES=NMR SPECTRUM
##END=
