##TITLE=31Pdec_DE-35EXT2
 D2O
 64 sc
 6.3.2024
##JCAMPDX= 6.0         $$ Bruker NMR JCAMP-DX V2.0
##DATA TYPE= NMR SPECTRUM
##DATA CLASS= NTUPLES
##ORIGIN= UXNMR, Bruker Analytische Messtechnik GmbH
##OWNER= root
$$ XWIN-NMR		Version 3.5
$$ Wed Mar  6 17:48:49 2024 Russian Standard Time (UT+4h)  she@DPX200
##.OBSERVE FREQUENCY= 81.013821
##.OBSERVE NUCLEUS= ^31P
##.ACQUISITION MODE= SIMULTANEOUS
##.ACQUISITION SCHEME= undefined
##.AVERAGES= 24
##.DIGITISER RES= 16
##SPECTROMETER/DATA SYSTEM= spect
##.PULSE SEQUENCE= zgpg30
##.SOLVENT NAME= CDCl3
##.SHIFT REFERENCE= (INTERNAL, CDCl3, 0, 248.564)
##AUDIT TRAIL= $$ (NUMBER, WHEN, WHO, WHERE, WHAT)
$$ ##TITLE= Audit trail, XWIN-NMR		Version 3.5
$$ ##JCAMPDX= 5.01
$$ ##ORIGIN= Bruker BioSpin GmbH
$$ ##OWNER= she
$$ F:/spectra/data/she/nmr/P31/1/pdata/1/auditp.txt
$$ ##AUDIT TRAIL=  $$ (NUMBER, WHEN, WHO, WHERE, WHAT)
(   1,<2024-03-06 17:47:05.73 +0400>,<she>,<DPX200>,
      <created by zg, POWCHK disabled, PULCHK disabled
       configuration hash MD5:
       00 E9 B6 7A A2 85 ED C7 34 08 36 98 17 FE 4E 26
       data hash MD5: 32K
       E0 6D 77 5E 4A EA DF 61 E2 30 6E 57 D6 E4 B2 1E>)
(   2,<2024-03-06 17:47:08.60 +0400>,<she>,<DPX200>,
      <Start of raw data processing
       efp BC_mod = 2 LB = 10 FT_mod = 6 PKNL = 1 PHC0 = -12785.3 PHC1 = -227.1165 SI = 64K 
       data hash MD5: 64K
       33 2D 26 95 21 1E F5 DE A1 1F 2D 4A F3 B0 FF AC>)
(   3,<2024-03-06 17:47:24.70 +0400>,<she>,<DPX200>,
      <pk PHC0 = 25.27729 PHC1 = 0 
       data hash MD5: 64K
       1E BF 75 AE 4A E9 7E 8D FD C3 33 C8 C9 32 1B EE>)
(   4,<2024-03-06 17:47:29.10 +0400>,<she>,<DPX200>,
      <abs ABSG = 5 
       data hash MD5: 64K
       CB F2 7D 30 B9 7F 04 FA 11 54 18 A4 86 57 19 79>)
$$ ##END=
$$ 
$$ hash MD5
$$ 96 18 8D FA D9 A6 17 FA BD D2 0E 6B 2A 93 59 80
##$RELAX= 
##$RELAX= 
##$RELAX= 
##$RELAX= 
##$RELAX= 
##$RELAX= 
##$RELAX= 
##$RELAX= 
##$RELAX= 
$$ Bruker specific parameters
$$ --------------------------
##$DU= <F:/spectra>
##$EXPNO= 1
##$NAME= <P31>
##$PROCNO= 1
##$TYPE= <nmr>
##$USER= <she>
##$AMP= (0..31)
100 100 100 100 100 100 100 100 100 100 100 100 100 100 100 100 100 100 
100 100 100 100 100 100 100 100 100 100 100 100 100 100 
##$AQSEQ= 0
##$AQ_mod= 1
##$AUNM= <au_zg>
##$AUTOPOS= <>
##$BF1= 81.014009
##$BF2= 200.13
##$BF3= 200.13
##$BF4= 200.13
##$BF5= 200.13
##$BF6= 200.13
##$BF7= 200.13
##$BF8= 200.13
##$BYTORDA= 1
##$CFDGTYP= 0
##$CFRGTYP= 5
##$CHEMSTR= <none>
##$CNST= (0..31)
1 1 145 1 1 1 1 1 1 1 1 1 1 1 1 1 1 1 1 1 1 1 1 1 1 1 1 1 1 1 1 1 
##$CPDPRG= <waltz16>
##$CPDPRG1= <>
##$CPDPRG2= <waltz16>
##$CPDPRG3= <>
##$CPDPRG4= <mlev>
##$CPDPRG5= <mlev>
##$CPDPRG6= <mlev>
##$CPDPRG7= <mlev>
##$CPDPRG8= <mlev>
##$CPDPRGB= <>
##$CPDPRGT= <>
##$D= (0..31)
0 1 0 0 0 0 0 0 0 0 0 0.03 2e-05 3e-06 0 0 0 0 0 0 0 0 0 0 0 0 0 0 0 0 
0 0 
##$DATE= 1709732825
##$DBL= (0..7)
120 120 120 11 120 120 24 19 
##$DBP= (0..7)
150 150 150 150 150 150 150 150 
##$DBP07= 0
##$DBPNAM0= <>
##$DBPNAM1= <>
$$ [...]
##$SUBNAM3= <"">
##$SUBNAM4= <"">
##$SUBNAM5= <"">
##$SUBNAM6= <"">
##$SUBNAM7= <"">
##$SUBNAM8= <"">
##$SUBNAM9= <"">
##$SW= 501.771253377433
##$SWIBOX= (0..15)
0 1 3 0 0 0 0 0 0 0 0 0 0 0 0 0 
##$SW_h= 40650.406504065
##$TD= 32768
##$TD0= 1
##$TE= 0
##$TE2= 300
##$TE3= 300
##$TEG= 300
##$TL= (0..7)
0 120 53 12 22 120 120 120 
##$TP= (0..7)
150 150 150 150 150 150 150 150 
##$TP07= 0
##$TPNAME0= <>
##$TPNAME1= <>
##$TPNAME2= <>
##$TPNAME3= <>
##$TPNAME4= <>
##$TPNAME5= <>
##$TPNAME6= <>
##$TPNAME7= <>
##$TPOAL= (0..7)
0.5 0.5 0.5 0.5 0.5 0.5 0.5 0.5 
##$TPOFFS= (0..7)
0 0 0 0 0 0 0 0 
##$TUNHIN= 0
##$TUNHOUT= 0
##$TUNXOUT= 0
##$USERA1= <user>
##$USERA2= <user>
##$USERA3= <user>
##$USERA4= <user>
##$USERA5= <user>
##$V9= 5
##$VALIST= <valist>
##$VCLIST= <CCCCCCCCCCCCCCC>
##$VD= 0
##$VDLIST= <DDDDDDDDDDDDDDD>
##$VPLIST= <PPPPPPPPPPPPPPP>
##$VTLIST= <TTTTTTTTTTTTTTT>
##$WBST= 1024
##$WBSW= 4
##$XGAIN= (0..3)
0 0 0 0 
##$XL= 0
##$YL= 0
##$YMAX_a= 3996
##$YMIN_a= -3561
##$ZGOPTNS= <>
##$ZL1= 120
##$ZL2= 120
##$ZL3= 120
##$ZL4= 120
##$ABSF1= 248.5645
##$ABSF2= -253.2056
##$ABSG= 5
##$ABSL= 3
##$ALPHA= 0
##$AQORDER= 0
##$ASSFAC= 0
##$ASSFACI= 0
##$ASSFACX= 0
##$ASSWID= 0
##$AUNMP= <proc_1d>
##$AZFE= 0.1
##$AZFW= 0.5
##$BCFW= 0
##$BC_mod= 2
##$BYTORDP= 0
##$COROFFS= 0
##$CY= -3
##$DATMOD= 1
##$DC= 0
##$DFILT= <>
##$DTYPP= 0
##$F1P= 0
##$F2P= 0
##$FCOR= 1
##$FTSIZE= 65536
##$FT_mod= 6
##$GAMMA= 0
##$GB= 0
##$INTBC= 1
##$INTSCL= 6.047779e-11
##$ISEN= 30
##$LB= 10
##$LEV0= 0
##$LPBIN= 0
##$MAXI= 10000
##$MC2= 0
##$MEAN= 0
##$ME_mod= 0
##$MI= 50
##$NCOEF= 0
##$NC_proc= -8
##$NLEV= 6
##$NOISF1= 182.463
##$NOISF2= 159.3651
##$NSP= 0
##$NTH_PI= 0
##$NZP= 0
##$OFFSET= 248.5645
##$PC= 4
##$PHC0= -12760.02
##$PHC1= -227.1165
##$PH_mod= 1
##$PKNL= yes
##$PPARMOD= 0
##$PSCAL= 0
##$PSIGN= 0
##$REVERSE= no
##$SF= 81.0140089999694
##$SI= 65536
##$SIGF1= 159.3651
##$SIGF2= -187.1042
##$SINO= 113.3802
##$SIOLD= 16384
##$SREGLST= <1H.CDCl3>
##$SSB= 0
##$STSI= 65536
##$STSR= 0
##$SW_p= 40650.406504065
##$SYMM= 0
##$S_DEV= 0
##$TDeff= 32768
##$TDoff= 0
##$TI= <>
##$TILT= no
##$TM1= 0
##$TM2= 0
##$TOPLEV= 0
##$USERP1= <user>
##$USERP2= <user>
##$USERP3= <user>
##$USERP4= <user>
##$USERP5= <user>
##$WDW= 1
##$XDIM= 65536
##$YMAX_p= 492383929
##$YMIN_p= -82118680
$$ End of Bruker specific parameters
$$ ---------------------------------
##NTUPLES= NMR SPECTRUM
##VAR_NAME=  FREQUENCY,     SPECTRUM/REAL,   SPECTRUM/IMAG
##SYMBOL=    X,             R,               I
##VAR_TYPE=  INDEPENDENT,   DEPENDENT,       DEPENDENT
##VAR_FORM=  AFFN,          ASDF,            ASDF
##VAR_DIM=   65536,         65536,           65536
##UNITS=     HZ,            ARBITRARY UNITS, ARBITRARY UNITS
##FACTOR=    0.620285442955139, 1,           1
##FIRST=     20137.2065510682, 0,            0
##LAST=      -20513.1999529968, 0,           0
##MIN=       -20513.1999529968, -82118680,   0
##MAX=       20137.2065510682, 492383929,    0
$$ Real data points
##PAGE= N=1
##DATA TABLE= (X++(R..R)), XYDATA
$$ [...]
41814 178559 129757 53332 -46590 -166120 -301517 -449119 -605987 -771092 -945839 -1132982
41804 -1132982 -1334185 -1547612 -1766831 -1981419 -2178813 -2346714 -2475386 -2559534 -2599486 -2601277
41794 -2601277 -2575151 -2532476 -2482117 -2427797 -2367436 -2294465 -2200553 -2078961 -1927361 -1748733 -1549732
41783 -1549732 -1337498 -1116939 -889969 -656735 -417796 -175911 63384 292593 503798
41774 503798 690172 847157 973602 1073002 1154257 1230807 1317550 1426268 1561603 1719522
41764 1719522 1888785 2054141 2199387 2309458 2372041 2379542 2331268 2234721 2104734 1960262
41754 1960262 1820025 1698910 1606456 1547267 1522066 1528100 1558680 1602775 1646112 1674440 1677834
41743 1677834 1653570 1605437 1539916 1461860 1372529 1270762 1155963 1030836 902394 780970
41733 780970 677945 603465 564854 565522 603886 672487 758466 846163 921249 974521 1003744 1013116
41721 1013116 1011131 1007776 1011471 1026085 1048781 1070045 1076520 1055700 1000123 908649 784413 631319
41709 631319 452244 250499 32988 -188410 -399475 -588849 -752066 -891793 -1014773 -1128239
41699 -1128239 -1238128 -1349264 -1465971 -1591753 -1728219 -1874653 -2029099 -2190113 -2357334
41690 -2357334 -2529977 -2704159 -2871058 -3017371 -3127965 -3189414 -3193041 -3136810 -3026262 -2874591
41680 -2874591 -2701408 -2529773 -2381860 -2274500 -2215798 -2203571 -2226089 -2265192 -2301089 -2317237
41670 -2317237 -2303736 -2258451 -2185898 -2094501 -1993226 -1889037 -1786029 -1686014 -1589393 -1495617
41660 -1495617 -1403230 -1309968 -1212941 -1108698 -993329 -863205 -716712 -556084 -387675 -219733
41650 -219733 -58748 93415 239979 387249 540995 702284 864517 1013594 1131975 1204730
41640 1204730 1224240 1191340 1113330 1000785 864925 716331 564795 419517 288687 178399
41630 178399 91705 28789 -11948 -32995 -37808 -31308 -19404 -6934 4999 20432 47394 94595
41618 94595 167281 263806 374277 482311 569810 622785 635062 607892 546201 454092 331938
41607 331938 175785 -21343 -266761 -564290 -909944 -1288754 -1674894 -2036157 -2341484 -2568492
41597 -2568492 -2708432 -2767609 -2765585 -2730604 -2692969 -2678168 -2702214 -2770849 -2882239 -3030929 -3210525
41586 -3210525 -3413645 -3629660 -3842347 -4029780 -4167318 -4232680 -4211081 -4098550 -3902457 -3639258
41576 -3639258 -3330449 -2998415 -2663575 -2343117 -2050593 -1795506 -1582853 -1413258 -1284321
41567 -1284321 -1192702 -1135583 -1110361 -1112844 -1135607 -1168061 -1198327 -1215779 -1213262 -1188861 -1147014 -1098006
41555 -1098006 -1054988 -1029399 -1027476 -1049794 -1093043 -1151321 -1215678 -1273607 -1311052 -1317096 -1288596 -1231694
41543 -1231694 -1159597 -1088299 -1032359 -1001764 -1000006 -1023330 -1061311 -1098990 -1120482 -1113230 -1071420 -996970
41531 -996970 -897622 -783218 -662097 -539140 -415633 -290183 -159780 -20750 130232 294982
41521 294982 472738 659508 847896 1027594 1186951 1315748 1408264 1465003 1492086 1498735
41511 1498735 1494104 1484436 1471398 1452660 1425240 1390139 1355116 1333239 1337958 1377860 1453931 1560084
41499 1560084 1686007 1820658 1954700 2080615 2190669 2274886 2321570 2321010 2270157 2174816 2047648
41488 2047648 1903267 1753520 1605212 1460298 1317176 1172019 1020053 857131 681409
41479 681409 494506 301557 110156 -71288 -234993 -374480 -484561 -561222 -601811 -605374
41469 -605374 -572863 -507501 -415782 -308716 -201785 -112368 -55258 -38711 -63290 -123806 -212627
41458 -212627 -322139 -445219 -574079 -698894 -807747 -888570 -932619 -937913 -910776 -864254 -813661
41447 -813661 -771143 -742150 -725745 -718130 -716402 -719775 -728093 -740033 -753208 -766030 -779122 -794302
41435 -794302 -811283 -824409 -822048 -789642 -714987 -592931 -427225 -229148 -14169 201664 404434
41424 404434 583653 732213 845356 919327 950625 936570 877184 777307 647365 502011
41414 502011 357340 228033 125507 57250 27200 36965 87411 179922 316563 498940 726123
41403 726123 992707 1288161 1597839 1905026 2192882 2445873 2651096 2799726 2887933 2916371
41393 2916371 2888415 2808377 2680918 2511657 2308013 2079457 1837136 1593246 1360408 1150886
41383 1150886 975755 844211 763038 735638 760563 830538 933482 1055492 1183911 1308311
41373 1308311 1419201 1506053 1556496 1557349 1497132 1369146 1173974 920316 623644 303235
41363 303235 -21325 -333049 -619279 -872227 -1088714 -1269601 -1418960 -1542701 -1646599 -1734375
41353 -1734375 -1806750 -1861839 -1896446 -1907669 -1894349 -1858132 -1803829 -1738853 -1671689 -1609630 -1556454
41342 -1556454 -1511364 -1470480 -1430773 -1394041 -1367621 -1360856 -1379837 -1424448 -1489431 -1567752 -1653363
41331 -1653363 -1742282 -1832849 -1925986 -2024999 -2134106 -2256144 -2391064 -2536360 -2688798 -2845616
41321 -2845616 -3003987 -3159253 -3303756 -3427709 -3521872 -3580291 -3601365 -3586954 -3540742 -3467098
41311 -3467098 -3370775 -3256835 -3130283 -2995374 -2855003 -2710612 -2563091 -2414593 -2270351 -2138920
41301 -2138920 -2030036 -1951029 -1903882 -1884418 -1883552 -1889587 -1890683 -1877089 -1842887 -1786992 -1713138 -1628732
41289 -1628732 -1542680 -1462694 -1393006 -1333361 -1279477 -1224537 -1161044 -1082461 -984249 -864124 -721877
41278 -721877 -559563 -382517 -200660 -28600 116923 222236 282565 305373 309062 317407 352377
41267 352377 428400 549661 710294 896533 1090064 1272340 1429379 1555765 1655920 1741588
41257 1741588 1826537 1921154 2029340 2148232 2269790 2383148 2477177 2542964 2575533 2574142 2541025
41246 2541025 2479299 2391119 2276929 2135956 1967516 1772606 1555256 1323099 1086491 856193
41236 856193 640669 444323 267239 106133 -43796 -186195 -320912 -442933 -543824 -614724
41226 -614724 -649079 -644334 -603079 -533786 -450341 -369798 -309176 -282729 -300534 -368257 -487773
41215 -487773 -658255 -877086 -1139918 -1439828 -1766331 -2105201 -2439651 -2752888 -3031274 -3266670
41205 -3266670 -3456661 -3602924 -3709514 -3782590 -3831237 -3867443 -3903796 -3949424 -4006194 -4067158 -4117761
41194 -4117761 -4138885 -4110207 -4013066 -3833220 -3564247 -3211317 -2793483 -2342144 -1894984 -1487354
41184 -1487354 -1144707 -878901 -688729 -563223 -486061 -440067 -411061 -390034 -372756 -357240
41174 -357240 -340784 -318683 -285537 -238211 -178231 -111736 -46863 9750 55262 91038 121935
41163 121935 155477 200734 265980 355190 465189 585604 701964 799983 868652 901518 897109
41152 897109 859051 795244 715510 628494 539640 451367 364969 282918 210288 154487 123280
41141 123280 121934 150789 204110 270250 332889 373258 373261 318956 203448 28475 -195602 -451166
41129 -451166 -715576 -963906 -1172026 -1319997 -1395282 -1394893 -1325893 -1204224 -1052257 -895332
41119 -895332 -757813 -659468 -613005 -622935 -685588 -790332 -922016 -1063732 -1198586 -1310003
41109 -1310003 -1381865 -1399991 -1355008 -1245040 -1076645 -863554 -623818 -376394 -138162 78046
41099 78046 264474 418928 544727 649442 741854 827627 905504 966135 994782 976898 903912
41088 903912 776443 604157 403497 194924 81 -161536 -276210 -338651 -352442 -328253
41078 -328253 -280876 -226171 -178507 -148793 -143135 -162373 -202730 -257452 -318776 -379364 -432682 -472591
41066 -472591 -492786 -486821 -449131 -376834 -271419 -139131 10502 167225 322127 468161
41056 468161 599280 709422 792405 842703 856283 830972 766731 666621 538409 395726
41046 395726 257564 145803 81365 79861 147826 280750 463821 675200 890640 1088180
41036 1088180 1252071 1375234 1459511 1513350 1547637 1571196 1587644 1594798 1586900 1558761 1509616
41025 1509616 1444334 1371150 1297574 1227396 1160664 1096068 1033562 975483 925988 889731 870598
41014 870598 870830 890488 927218 976237 1030640 1082299 1123476 1148694 1155914 1146311 1122650 1086888
41002 1086888 1037985 971279 880600 762875 622958 475550 342543 246747 204993 223546
40992 223546 297499 413855 556373 709689 861171 1000740 1120185 1213276 1276754 1311106
40982 1311106 1320185 1309761 1286094 1255494 1224689 1200807 1190136 1196083 1217678 1249529 1283133 1308890
40970 1308890 1318530 1307817 1278883 1240621 1205978 1186794 1188940 1210619 1244522 1281842 1315341 1340119
40958 1340119 1352827 1350875 1332711 1299163 1255123 1210520 1179677 1178872 1222762 1320798 1474583 1676848
40946 1676848 1912371 2160719 2399959 2610049 2775073 2884236 2932165 2919116 2851477 2742285
40936 2742285 2610696 2479277 2369241 2295320 2262292 2264025 2284842 2302902 2295275 2243520 2137566
40925 2137566 1976354 1765647 1515059 1235959 940561 641431 350771 79422 -164089
40916 -164089 -374283 -549313 -691297 -805787 -899742 -978303 -1041969 -1085871 -1101466 -1079624 -1013799
40905 -1013799 -902727 -752398 -576767 -396296 -233961 -109476 -33716 -5611 -12964 -36857
40895 -36857 -57790 -61060 -39515 6872 73570 154245 242284 331291 415692 491619 556942 609610
40883 609610 645732 660069 649709 618255 576617 539150 517690 517292 535539 564518 593629 612298
40871 612298 612354 589725 544855 481697 405885 322774 235644 144420 45581 -66286 -195621 -342742
40859 -342742 -501529 -658851 -796343 -894292 -936160 -911975 -819753 -665362 -461341 -224700
40849 -224700 26033 273470 502767 702082 862929 980607 1053810 1083142 1069333 1012296
40839 1012296 911247 765427 575165 343227 76142 -215375 -517446 -815292 -1095724
40830 -1095724 -1348708 -1567422 -1747094 -1883552 -1972566 -2010427 -1995581 -1930403 -1821897 -1680354
40820 -1680354 -1516088 -1335706 -1140014 -925165 -686982 -426529 -153670 114020 357100
40811 357100 561655 724041 850567 952883 1041863 1122591 1192010 1239664 1251230 1213953 1122340
40800 1122340 981942 809139 626435 455204 309382 192872 100955 23930 -49159 -128012
40790 -128012 -219929 -329519 -458598 -606030 -767822 -937783 -1108510 -1272152 -1420839 -1547129
40780 -1547129 -1644942 -1710873 -1745200 -1751728 -1736093 -1702989 -1653743 -1585841 -1495017 -1378921 -1240396
40769 -1240396 -1088634 -937930 -804937 -705690 -652860 -653277 -706007 -802066 -926390 -1061548 -1191573
40758 -1191573 -1304478 -1393003 -1453928 -1486559 -1491081 -1467340 -1414354 -1330464 -1213934 -1063876 -881439
40747 -881439 -671046 -441399 -205857 18419 213067 362472 457518 497198 487429 438073
40737 438073 359980 263192 156410 47404 -55798 -143327 -202528 -218933 -179397 -76263 89278
40726 89278 305994 554066 808883 1046071 1246175 1397596 1497309 1549679 1563791 1549644
40716 1549644 1514183 1458837 1379899 1271423 1128887 951832 745027 518840 289328 77413
40706 77413 -94008 -205099 -244504 -212536 -120745 11491 161442 306841 428430 511570
40696 511570 547550 534802 479314 393408 292623 191585 100217 21551 -48116 -116817 -193263
40685 -193263 -283332 -387677 -500695 -611013 -703674 -763730 -780035 -747776 -669001 -551283 -405256
40674 -405256 -242159 -72548 93603 246422 376518 476189 540277 565990 552258 499508
40664 499508 409854 286882 134502 -44707 -250574 -484747 -748197 -1037888 -1344526 -1652763
40654 -1652763 -1943672 -2198037 -2399137 -2534390 -2595903 -2580170 -2487596 -2322861 -2096674 -1827957
40644 -1827957 -1544287 -1278809 -1063776 -922830 -864649 -880044 -943658 -1020404 -1075273 -1083260 -1035752
40633 -1035752 -941028 -819050 -692842 -579865 -486807 -409765 -339258 -267157 -191942 -120008 -63036
40622 -63036 -33249 -39221 -84187 -167012 -284312 -432115 -606479 -803174 -1016284 -1235541 -1443526
40611 -1443526 -1615264 -1722241 -1740143 -1656893 -1477219 -1222024 -923362 -617023 -334781 -98181
40601 -98181 84267 215377 303834 357951 381996 376596 342072 282055 205219 124506 54504
40590 54504 8147 -6371 12218 57742 118340 180376 232948 270568 292443 298980 287996 253229
40578 253229 186096 79723 -66528 -243652 -431741 -601943 -722101 -765043 -716538 -579368
40568 -579368 -371862 -122088 139219 384175 590541 742361 830014 850745 809266 716850
40558 716850 587958 435742 269090 92917 -89116 -271598 -445586 -598339 -714618 -779726
40548 -779726 -783937 -726520 -617095 -472940 -313025 -151327 7088 164862 326592 492547
40538 492547 656558 809774 947150 1071496 1192114 1319381 1459088 1609766 1763816 1911355
40528 1911355 2044779 2162182 2268352 2372946 2486571 2616196 2761717 2914846 3060416
40519 3060416 3179232 3251427 3259785 3192812 3046983 2827491 2547157 2224052 1878666 1531294
40509 1531294 1199990 899105 638163 420737 243474 96385 -34467 -162198 -294169
40500 -294169 -429154 -557484 -663595 -730009 -741757 -690136 -574721 -403510 -192101 37205
40490 37205 256912 437942 555795 597214 564041 472012 345068 208095 81334 -21748
40480 -21748 -93542 -129997 -128614 -87154 -2538 130503 320160 575955 904100 1301572 1752591
40469 1752591 2230361 2703570 3143991 3531110 3852382 4101015 4274505 4375564 4414361 4409237
40459 4409237 4383779 4360771 4355787 4373288 4406168 4437870 4445906 4406176 4297403 4104452 3819465
40448 3819465 3441306 2974985 2432184 1832258 1202204 574650 -15863 -537519 -965829
40439 -965829 -1287339 -1501328 -1618668 -1657826 -1639362 -1581165 -1496429 -1394650 -1283891 -1171990
40429 -1171990 -1065709 -968860 -881258 -799486 -718804 -634962 -545156 -448354 -345330 -238354 -130407
40418 -130407 -24301 77527 172341 256226 323958 370067 390974 387480 366230 338628 317133
40407 317133 311041 324563 357854 409015 474726 549325 624053 688155 731868 749835 743087 718266
40395 718266 684288 648167 612260 574173 528747 470643 396273 304796 198386 82122 -36350
40384 -36350 -147272 -239414 -301241 -323014 -299725 -233980 -137330 -28857 69052 136187 158733
40373 158733 130379 50590 -77720 -248991 -454407 -681806 -917475 -1149057 -1367527 -1567069
40363 -1567069 -1743402 -1892077 -2007874 -2085284 -2119432 -2106989 -2047573 -1946075 -1814874 -1673565
40353 -1673565 -1545008 -1449453 -1400368 -1403970 -1461540 -1572238 -1734818 -1947601 -2206652 -2502789
40343 -2502789 -2819093 -3130802 -3408237 -3621831 -3747582 -3771517 -3692184 -3520674 -3278059 -2990947
40333 -2990947 -2686450 -2388189 -2114463 -1878430 -1689102 -1551818 -1467639 -1432094 -1434304 -1457713
40323 -1457713 -1483095 -1493059 -1476020 -1427785 -1350720 -1251766 -1140461 -1027002 -920241 -826065 -746863
40312 -746863 -682126 -629360 -584651 -542947 -498624 -446705 -384303 -311285 -229393 -139923 -41209
40301 -41209 72485 209741 378833 584311 825059 1094303 1380668 1669141 1942027 2180916
40291 2180916 2370055 2499982 2569404 2584239 2554549 2491048 2402606 2295160 2171693 2033054
40281 2033054 1879557 1713178 1539526 1368463 1212839 1085733 997344 952663 950364 982725
40271 982725 1036150 1092583 1132618 1140381 1108295 1038781 941667 828978 710297 590700 471271
40260 471271 351103 229737 109047 -6215 -109604 -195255 -260144 -305121 -334240 -352723
40250 -352723 -364770 -372288 -374974 -371425 -360910 -345255 -329868 -322858 -332369 -363621 -417282 -489578
40238 -489578 -573391 -659708 -739087 -802940 -844143 -856923 -836611 -780071 -686941 -560930 -410176
40227 -410176 -246027 -80593 75804 216056 336104 433913 508607 560180 589218 595983 579168
40216 579168 535550 461425 355465 221557 70081 -83017 -219104 -320469 -373209 -368640
40206 -368640 -303576 -180199 -5501 210342 456315 722067 997171 1268857 1520522 1732993
40196 1732993 1888717 1977144 1998593 1964204 1891363 1796724 1690512 1574739 1445486 1297396
40186 1297396 1128326 942342 749860 564689 399376 261238 150894 63367 -9640 -77933
40176 -77933 -152027 -242606 -358844 -505374 -679461 -870697 -1063963 -1244094 -1399580 -1523845
40166 -1523845 -1614491 -1671782 -1697232 -1692532 -1659038 -1598233 -1513274 -1410973 -1302879 -1204411 -1131942
40155 -1131942 -1098903 -1112519 -1172525 -1272136 -1400474 -1545074 -1693508 -1834061 -1956114 -2050948
40145 -2050948 -2113081 -2141410 -2139242 -2112742 -2068449 -2010988 -1941948 -1860180 -1763345 -1650290 -1523460
40134 -1523460 -1390118 -1261282 -1148457 -1059678 -996922 -956255 -930445 -912497 -898356 -887757 -883155
40123 -883155 -887503 -901930 -924445 -950330 -974060 -991696 -1002377 -1007834 -1009906 -1007377 -994222 -960846
40111 -960846 -897995 -801032 -672177 -519737 -355391 -191501 -39984 87083 176594 215394
40101 215394 193892 110469 -26695 -202272 -399460 -604995 -810594 -1010928 -1200528 -1372103
40091 -1372103 -1517248 -1628713 -1702924 -1741523 -1751375 -1743080 -1728672 -1719482 -1724748 -1750923 -1801543 -1877701
40079 -1877701 -1979160 -2105411 -2255719 -2427880 -2616669 -2813476 -3008084 -3192147 -3362684
40070 -3362684 -3523379 -3682529 -3848487 -4024916 -4207911 -4385756 -4541245 -4656189 -4717013 -4719274
40060 -4719274 -4669090 -4581282 -4475724 -4373437 -4292887 -4246526 -4238234 -4262737 -4307512 -4356533 -4394348
40049 -4394348 -4408828 -4391632 -4336946 -4240172 -4097877 -3908867 -3675365 -3403672 -3104542 -2793232
40039 -2793232 -2488325 -2208601 -1968719 -1775877 -1629392 -1523247 -1449835 -1402661 -1376798 -1367409
40029 -1367409 -1367771 -1368380 -1358005 -1326423 -1267333 -1179602 -1065903 -929667 -772546 -594157 -393964
40018 -393964 -173688 61455 303301 542692 771895 986237 1184029 1365044 1529083 1676046
40008 1676046 1807136 1925276 2033561 2132663 2219412 2287850 2332216 2350075 2343887 2320223 2287081
39997 2287081 2250891 2214818 2178844 2140890 2098330 2049888 1997914 1949928 1917900 1914935 1950632
39986 1950632 2027135 2137195 2264902 2389323 2490354 2554737 2579297 2569735 2535768 2485442 2421516
39975 2421516 2341261 2239158 2110798 1956101 1780449 1593397 1405643 1225570 1056939 898764
39965 898764 747567 600748 458918 325669 205415 101733 17971 -40697 -66426 -50802
39955 -50802 11019 116672 255549 410930 564405 700833 811647 894805 951556 982094
39945 982094 982915 947510 869947 749219 591785 410858 222876 43280 -116337 -249108
39935 -249108 -352523 -427848 -479498 -514121 -539163 -561299 -585166 -612842 -644168 -677657 -711347
39924 -711347 -743024 -769989 -789051 -797110 -792026 -773011 -739986 -691907 -624624 -529748 -396239 -215254
39912 -215254 13689 278949 558187 824773 1056104 1240033 1377005 1477871 1559078 1637229
39902 1637229 1724364 1824592 1932787 2036151 2118568 2166015 2170569 2131419 2053305 1943940 1811780
39891 1811780 1664390 1507082 1341931 1167905 982555 784490 575204 359518 145323
39882 145323 -56622 -233178 -370598 -457690 -488925 -465662 -394811 -285808 -147742 11987
39872 11987 187435 373585 566582 764367 966527 1172911 1382000 1590224 1792388 1982249
39862 1982249 2152459 2294066 2396600 2449714 2446234 2385209 2273307 2123955 1954771 1784155
39852 1784155 1627688 1495178 1389549 1308075 1244932 1193190 1145351 1093185 1028185 943100 833857
39841 833857 700979 550027 391140 237628 103540 575 -64619 -91659 -85985 -57271
39831 -57271 -17201 23085 55228 74583 79686 71338 52768 30938 17452 27357 75433 171379
39819 171379 316205 501466 711243 925346 1122378 1282554 1390842 1440350 1434681 1387574
39809 1387574 1319126 1249666 1193991 1158674 1143235 1143345 1153502 1168092 1181354 1187202 1179116 1150372
39797 1150372 1095092 1010221 897375 763220 618057 473982 344069 242599 184713 184025
39787 184025 248653 377813 560830 778673 1007131 1220883 1398005 1523884 1593215 1609186
39777 1609186 1580202 1515330 1420377 1296541 1142362 957706 747497 523689 305126 115003
39767 115003 -24208 -97061 -99730 -40581 63178 190976 324790 454055 577722 701936
39757 701936 834117 976743 1124457 1265919 1388884 1485394 1554327 1600417 1630880 1651670
39747 1651670 1664853 1667769 1654078 1616209 1547930 1445654 1308192 1136061 931551 699590
39737 699590 448297 188366 -68583 -311555 -530799 -717585 -864080 -964060 -1014247 -1015346
39727 -1015346 -972176 -893007 -788592 -671092 -552718 -443895 -351264 -276335 -215580 -161970
39717 -161970 -107158 -43385 35257 132075 247467 379203 523303 675276 831257 988453
39707 988453 1144401 1295299 1434502 1552604 1639658 1688611 1697872 1671174 1614705 1533729 1431721
39696 1431721 1312807 1185110 1061514 956788 883121 846910 847941 880314 934116 997231 1057042
39685 1057042 1101819 1121686 1109295 1060291 973715 852368 703020 536318 366315 209627
39675 209627 83963 5603 -14141 27510 122890 254834 400635 537613 647974 721168
39665 721168 753472 746246 704229 634273 543981 440259 328405 212236 94699 -22001 -136841
39654 -136841 -250039 -361882 -470976 -573698 -665705 -744167 -808369 -857798 -889331 -895914 -867915
39643 -867915 -796758 -679486 -522460 -342108 -161729 -5537 106979 164079 161982 103567
39633 103567 -3645 -150208 -327813 -531515 -759870 -1012951 -1289407 -1584048 -1886818 -2183231
39623 -2183231 -2455854 -2686347 -2857951 -2958248 -2981528 -2929580 -2810165 -2633827 -2410896 -2150307
39613 -2150307 -1860720 -1552835 -1241104 -943004 -675335 -448966 -264733 -112741 24688
39604 24688 167776 333542 530963 758289 1003433 1247520 1470503 1656958 1799939 1901232
39594 1901232 1967770 2006131 2018464 2002370 1954408 1874499 1768132 1645129 1516199 1389722
39584 1389722 1270757 1162245 1066835 987603 927331 887334 866994 864406 877797 906978 954000
39573 954000 1022301 1114328 1228605 1357846 1489292 1607207 1696342 1744935 1746357 1699195 1605988
39562 1605988 1471326 1300305 1098045 870068 622818 364011 103086 -148242 -376172
39553 -376172 -566623 -708419 -796553 -834142 -832348 -808244 -781083 -768029 -780771 -824179 -897336
39542 -897336 -996052 -1115239 -1249764 -1393737 -1539643 -1678947 -1804438 -1912915 -2006348 -2090711
39532 -2090711 -2173298 -2260210 -2355285 -2460273 -2574934 -2696055 -2816059 -2923017 -3003191 -3045299
39522 -3045299 -3044251 -3002442 -2928029 -2831272 -2720864 -2602118 -2477485 -2348381 -2216523 -2083765
39512 -2083765 -1951023 -1817845 -1683686 -1550238 -1422827 -1309196 -1216109 -1146097 -1096554 -1061665
39502 -1061665 -1035858 -1016999 -1007896 -1015315 -1046521 -1104619 -1184877 -1273892 -1352087 -1398584 -1396796 -1338967
39490 -1338967 -1228225 -1077573 -906358 -735504 -582708 -458413 -363401 -289135 -221473 -146603
39480 -146603 -56442 49224 164385 280348 388750 482750 556773 605757 624725 609077 555667
39469 555667 464177 338120 184966 15293 -159125 -328176 -486580 -636034 -785205 -947516
39459 -947516 -1137641 -1367621 -1643133 -1960573 -2306082 -2657488 -2988984 -3277143 -3506238 -3671108
39449 -3671108 -3776572 -3833596 -3853871 -3845386 -3811134 -3751074 -3665393 -3556620 -3429434 -3288859 -3138387
39438 -3138387 -2979141 -2810295 -2630217 -2437473 -2231168 -2011072 -1778409 -1537592 -1297655
39429 -1297655 -1071677 -873734 -714840 -600124 -528680 -495930 -496910 -528292 -587860 -672117 -774237
39418 -774237 -884118 -990387 -1082824 -1153779 -1198229 -1212986 -1196015 -1146926 -1068742 -969594 -862306
39407 -862306 -761262 -678265 -620053 -588456 -581723 -594920 -619098 -641189 -646535 -623645 -568594 -486554
39395 -486554 -390102 -295672 -219529 -173927 -164021 -186585 -231400 -284913 -334418 -370824 -389198 -387846
39383 -387846 -367174 -328929 -275489 -208917 -130251 -39898 60847 168178 275392 374318 457814
39372 457814 521917 566491 594485 610929 622392 636439 660151 698061 751092 817500 895182
39361 895182 983813 1085804 1205833 1348894 1517197 1707083 1907482 2100671 2265062 2379124
39351 2379124 2425552 2394551 2285121 2104032 1863118 1575895 1254083 904751 529353 125894
39341 125894 -306260 -761436 -1225635 -1678564 -2098445 -2467168 -2773725 -3015096 -3194932 -3321308
39331 -3321308 -3404976 -3458387 -3494558 -3524646 -3554618 -3582725 -3599478 -3590545 -3541796 -3444767 -3300438
39320 -3300438 -3119418 -2918183 -2713042 -2514693 -2325830 -2142508 -1958042 -1766751 -1565358
39311 -1565358 -1351925 -1124428 -881136 -622926 -355639 -90486 157948 374925 548519
39302 548519 671450 741782 762557 740148 681409 590745 469020 315144 129201 -84946
39292 -84946 -318661 -558732 -788056 -986871 -1135220 -1216703 -1222387 -1152804 -1016721 -827327
39282 -827327 -597961 -339263 -58225 241341 557364 887689 1228843 1575784 1921982 2258956
39272 2258956 2575844 2860302 3100855 3289071 3420144 3492229 3505947 3464718 3375527 3249356
39262 3249356 3100555 2944738 2795557 2661765 2546118 2446396 2357383 2272427 2184102 2084729
39252 2084729 1967922 1831515 1680527 1527614 1389383 1279848 1204760 1160274 1136512 1123353
39242 1123353 1114736 1109539 1109800 1118474 1138078 1169943 1213395 1265146 1319819 1371672 1416327 1451322
39230 1451322 1475501 1488319 1489909 1481609 1466045 1446277 1424540 1401599 1377191 1350876 1322174 1289653
39218 1289653 1249869 1197408 1126421 1032949 917088 784383 646007 517082 412917 344466
39208 344466 315448 322738 359175 416336 485555 557653 622941 672349 699073 699499 672754 619317
39196 619317 539705 433997 302227 145056 -35728 -236943 -453635 -678502 -901423 -1109972
39186 -1109972 -1291536 -1436744 -1542622 -1613681 -1660034 -1693302 -1721977 -1748115 -1766491 -1766329 -1734701
39175 -1734701 -1660399 -1537331 -1366759 -1157726 -925367 -687803 -463033 -266803 -111386 -4689
39165 -4689 50625 57912 26809 -27537 -86629 -131612 -145923 -116845 -36524 96785 277555 493163
39153 493163 726342 959243 1177436 1371811 1537360 1669745 1762465 1807344 1798531 1737191
39143 1737191 1633381 1503601 1365561 1233342 1115550 1016686 939712 887308 861051 859729
39133 859729 878335 907978 936220 947898 927357 862244 747379 586551 391345 178095 -35241
39122 -35241 -231159 -393605 -508231 -562379 -545548 -451003 -278212 -34746 263881 596676
39112 596676 940913 1275810 1585298 1859640 2095866 2297007 2470270 2624471 2767249 2902551
39102 2902551 3029037 3140053 3225507 3275028 3280867 3239269 3150585 3019353 2854716 2670039
39092 2670039 2480618 2300255 2138750 2001546 1890915 1807261 1749712 1716250 1704060 1710563
39082 1710563 1734705 1777451 1840840 1926204 2032939 2158481 2299044 2450306 2607774 2767100
39072 2767100 2924595 3078115 3228292 3379741 3541344 3724778 3941359 4198273 4495703
39063 4495703 4826022 5175249 5525909 5860069 6161698 6418063 6620390 6764110 6849164 6880399
39053 6880399 6867411 6823029 6760625 6691513 6623540 6560804 6503729 6449492 6393513 6332365 6266856
39042 6266856 6203065 6150170 6116197 6104582 6113713 6139058 6175619 6218741 6263130 6301350 6323283
39031 6323283 6317496 6274287 6188885 6062672 5901601 5713056 5503398 5277331 5038642 4791211
39021 4791211 4539429 4287695 4039310 3795790 3557294 3323771 3095503 2872353 2652430
39012 2652430 2431447 2203525 1963259 1708081 1439652 1163341 886241 615209 356214
39003 356214 114932 -102329 -288079 -433710 -530611 -572474 -558133 -493389 -390660 -266463
38993 -266463 -137580 -17165 87817 176561 251766 316024 369445 409510 432363 434243 412235
38982 412235 364359 289262 185972 54276 -104172 -284565 -478478 -674805 -861763 -1029171
38972 -1029171 -1170165 -1281914 -1365221 -1423116 -1458672 -1472651 -1462150 -1421501 -1345617 -1234325 -1095294
38961 -1095294 -943806 -799398 -680697 -600523 -563245 -565627 -600728 -662694 -749713 -863481 -1005695
38950 -1005695 -1173755 -1358255 -1543714 -1712092 -1847159 -1937729 -1978872 -1971328 -1919895 -1831546
38940 -1831546 -1713952 -1574826 -1421980 -1263460 -1107078 -959241 -823799 -701962 -593618
38931 -593618 -499231 -420698 -360302 -318269 -290548 -267998 -237424 -184086 -95121 37069 212591
38920 212591 423822 657149 895871 1123266 1325083 1491159 1616094 1699165 1743629 1755594
38910 1755594 1742758 1713549 1677098 1643726 1624847 1631299 1670427 1743595 1845656 1966561 2093908
38899 2093908 2215259 2319861 2400029 2452292 2477993 2482964 2476164 2467687 2466749 2480127 2511167 2559511
38887 2559511 2621732 2692818 2767663 2841614 2909962 2967500 3009226 3032016 3035999 3024462 3002257
38876 3002257 2973771 2941719 2907355 2871310 2833652 2792615 2743052 2676402 2582865 2454783 2289460
38865 2289460 2090141 1865163 1626322 1387583 1164300 972014 824024 728277 685052 686529
38855 686529 718294 762431 801814 824653 827559 815568 798960 788185 789026 800029 813250 817400
38843 817400 801023 753931 667438 535217 355475 133073 -120124 -386838 -646800 -879380
38833 -879380 -1066781 -1198104 -1273157 -1303645 -1309942 -1314170 -1332883 -1373009 -1432452 -1504012 -1580263
38822 -1580263 -1657664 -1738749 -1831243 -1943698 -2079436 -2232386 -2387606 -2526076 -2630604 -2689543
38812 -2689543 -2697056 -2651014 -2550780 -2396839 -2192610 -1946848 -1674126 -1391950 -1115658 -854237
38802 -854237 -609825 -381088 -167922 25807 193189 328093 429479 503672 563183 622285
38792 622285 691259 772135 857936 935433 989703 1008516 985369 920733 821214 696679 556153
38781 556153 404114 239122 55872 -149912 -376106 -611393 -836825 -1030988 -1176056 -1261862
38771 -1261862 -1286598 -1254645 -1173372 -1050864 -895454 -716300 -523547 -327498 -137620 37274
38761 37274 187532 301211 364368 363759 290958 146098 -60482 -309567 -577282 -841012 -1084839
38750 -1084839 -1302165 -1494501 -1667625 -1827528 -1977903 -2119304 -2249351 -2363686 -2457826 -2529460
38740 -2529460 -2579927 -2613809 -2636985 -2654493 -2669402 -2682729 -2693647 -2699300 -2694452 -2671907 -2624498 -2548189
38728 -2548189 -2444603 -2321178 -2188656 -2057552 -1935588 -1827016 -1733232 -1653720 -1586783 -1529910
38718 -1529910 -1479954 -1433552 -1388247 -1344081 -1304644 -1276600 -1267753 -1284554 -1330067 -1403089 -1498601
38707 -1498601 -1609140 -1726261 -1841432 -1946546 -2034395 -2098983 -2135367 -2139411 -2108344 -2042061 -1944026
38696 -1944026 -1820819 -1680771 -1532776 -1385474 -1246235 -1119656 -1006299 -902545 -801984
38687 -801984 -697934 -586079 -465934 -340306 -213222 -87722 35125 155620 273464 385179
38677 385179 482218 551380 578260 552409 471426 341828 176650 -8319 -197581 -377216
38667 -377216 -534987 -660347 -745139 -784679 -778410 -729553 -643993 -529033 -392162 -239422 -73359
38656 -73359 108258 311313 541508 799984 1081315 1374921 1667895 1946480 2195522 2397857
38646 2397857 2535984 2596208 2573316 2473380 2313401 2117712 1911966 1716546 1542023 1388806
38636 1388806 1250890 1121336 996520 877736 770517 682753 622147 593406 595976 623539
38626 623539 665983 713114 758314 800372 842681 890391 947138 1013160 1085719 1161151 1236861
38615 1236861 1312023 1386978 1461942 1535447 1602814 1655689 1683979 1680048 1642730 1578111 1496304
38604 1496304 1406718 1315308 1225119 1138255 1056505 979858 904593 823172 726498 607352 463374
38593 463374 298446 121902 -54426 -220152 -369175 -499654 -611185 -701162 -763006 -788002
38583 -788002 -770362 -712718 -628446 -538799 -465982 -425767 -423244 -453452 -506022 -571081 -643266 -722152
38571 -722152 -809713 -906998 -1011961 -1119054 -1220145 -1305960 -1367525 -1397379 -1390492 -1344656 -1260038
38560 -1260038 -1138052 -980496 -789802 -570146 -328449 -74647 178454 415595 620500
38551 620500 778932 882656 932158 936325 908915 863470 809023 748375 679271 597646 501576
38540 501576 394450 286044 190766 123837 97244 117185 183320 289322 424324 575265
38530 575265 729613 877523 1012736 1132460 1236884 1328500 1410809 1486127 1553199 1606095
38520 1606095 1635548 1632258 1590156 1507827 1387998 1236278 1060149 868263 669923 474958
38510 474958 294073 139089 22176 -46191 -59887 -19285 68173 189555 329791 475617
38500 475617 618661 756712 892830 1032551 1180160 1335662 1493840 1645731 1781753 1895205
38490 1895205 1984836 2055321 2115198 2173245 2235175 2301876 2369078 2427698 2464832 2465849 2417595
38479 2417595 2311683 2146596 1928107 1668269 1383653 1093355 817088 573575 379295
38470 379295 247419 186746 200922 288618 444986 663651 937840 1260194 1622153 2013995
38460 2013995 2425494 2846338 3265898 3672785 4054607 4397993 4689014 4914545 5064868
38451 5064868 5136816 5136190 5078324 4986201 4885995 4800783 4744311 4717306 4708079 4697325 4665263 4598141
38439 4598141 4491692 4350891 4187408 4016684 3855553 3719974 3622545 3570178 3562784 3593369
38429 3593369 3649349 3714737 3772753 3808250 3809495 3769106 3684274 3556551 3391555 3198812 2991304
38418 2991304 2783953 2590763 2421821 2281849 2170857 2085763 2021796 1973708 1937581 1912728
38408 1912728 1902132 1910513 1941421 1995755 2072550 2170470 2287853 2420778 2560768 2694541 2807108
38397 2807108 2887499 2934526 2959691 2985564 3039974 3148137 3325737 3575799 3890428 4255909
38387 4255909 4657942 5084542 5526540 5977093 6430969 6883452 7328953 7760153 8168433
38378 8168433 8545349 8884389 9182324 9439531 9658573 9841220 9985533 10084921 10129560 10108739
38368 10108739 10012586 9833343 9567520 9219227 8802927 8342862 7868313 7406865 6979217
38359 6979217 6597507 6266211 5983586 5742705 5532716 5341182 5157129 4973474 4787690
38350 4787690 4600625 4414486 4231118 4051152 3873947 3697972 3521418 3342530 3159333
38341 3159333 2968939 2767446 2551188 2319000 2074282 1825829 1586894 1372228 1193492
38332 1193492 1054619 949593 864100 780466 683520 565026 425159 270779 111298 -46070
38322 -46070 -200000 -356597 -528551 -731816 -980068 -1278145 -1617006 -1972826 -2311271 -2595516
38312 -2595516 -2794928 -2891407 -2881814 -2776661 -2596402 -2366797 -2114278 -1861593 -1624160 -1408000
38302 -1408000 -1210402 -1023450 -838954 -652469 -464663 -280030 -104340 57539 202628
38293 202628 329893 439897 534246 614774 682697 738231 780922 810435 827360 833944 834772 837263
38281 837263 851662 890231 965469 1087366 1260288 1480680 1736602 2009250 2275931 2513860
38271 2513860 2704380 2836999 2912324 2942738 2949707 2957443 2984668 3038235 3112018 3191256 3259056
38260 3259056 3301097 3306945 3268968 3180837 3037089 2834084 2571762 2255166 1894999 1507026
38250 1507026 1110365 724812 367880 52634 -213121 -426705 -590127 -709259 -792275 -847481
38240 -847481 -881184 -896066 -890245 -857435 -788791 -676448 -517589 -317283 -88622 150002 379311
38229 379311 583341 751818 880123 967209 1012587 1014021 967494 869696 721443 529730 307233
38218 307233 69846 -166258 -386848 -580542 -738560 -853942 -921007 -935456 -895018 -800142
38208 -800142 -654084 -461974 -229454 37820 333107 646919 966498 1277022 1563599 1813062
38198 1813062 2015425 2165328 2263407 2317213 2341198 2355068 2379869 2432409 2520351 2640507 2780873
38187 2780873 2924834 3055474 3159081 3227758 3260922 3264847 3249854 3226105 3200162 3173944 3145873
38176 3145873 3112583 3069940 3013599 2939847 2846709 2734387 2604385 2457726 2293787 2111150
38166 2111150 1910680 1699272 1491769 1309441 1175215 1107536 1114994 1193450 1326598 1489909
38156 1489909 1656805 1805012 1920849 1999829 2043566 2055047 2035364 1983970 1901946 1795779
38146 1795779 1679027 1570603 1490270 1453341 1467076 1530188 1635087 1771296 1928632 2099351
38136 2099351 2278691 2463632 2650730 2834650 3008470 3165268 3299726 3408789 3491257 3546727
38126 3546727 3574703 3574773 3548093 3499221 3436840 3372642 3319103 3287385 3286147 3321255 3395881 3510432
38114 3510432 3661967 3843275 4042337 4243009 4427257 4578378 4684113 4738416 4741233 4696475
38104 4696475 4609292 4483891 4322566 4125684 3892183 3620474 3309742 2961285 2579426 2172023
38094 2172023 1750942 1332235 934972 577943 274927 30458 -161940 -318181 -459013
38085 -459013 -603990 -766313 -950487 -1152937 -1364004 -1569701 -1753142 -1896941 -1987212 -2017798
38075 -2017798 -1992031 -1920459 -1815637 -1687188 -1539980 -1375894 -1197111 -1008112 -815100 -623991
38065 -623991 -439304 -265141 -106982 28080 133650 207558 254320 285134 315285 359775
38055 359775 428682 524298 641306 769292 895424 1005933 1087061 1126916 1118447 1062053 966122
38044 966122 844905 714645 589569 479210 387607 313854 252954 196466 133416 52223 -56330
38033 -56330 -196257 -364990 -553865 -749809 -937483 -1101746 -1230343 -1316274 -1358803 -1362538
38023 -1362538 -1334839 -1282668 -1210515 -1120780 -1016439 -903848 -793064 -695033 -617709 -563817 -531118
38012 -531118 -514033 -505377 -498060 -487093 -471367 -453897 -439953 -433990 -437132 -446434 -456002 -459261 -451422
37999 -451422 -431016 -399751 -360910 -317367 -270244 -218292 -157684 -82257 15329 141428 298779
37988 298779 484381 688750 897357 1094205 1266297 1406886 1516246 1600205 1667596 1727585
37978 1727585 1787461 1851372 1920352 1993477 2069546 2148490 2231770 2321235 2416762 2514109 2604908
37967 2604908 2679402 2730441 2755986 2758386 2741332 2707172 2656728 2591180 2513813 2429749 2343878
37956 2343878 2258660 2173494 2086225 1996060 1906243 1824818 1762674 1729620 1730226 1761321 1812312 1868514
37944 1868514 1916390 1948672 1967011 1980901 2003296 2045081 2110932 2198175 2298461 2400963 2495684
37933 2495684 2575787 2638084 2681208 2702430 2695460 2651363 2562540 2427323 2252006 2048836 1831309
37922 1831309 1610013 1391708 1181393 984532 806944 652707 522749 415979 332075 273099
37912 273099 242123 239639 260745 295596 333078 364833 386659 396712 392868 372144 332991 278579
37900 278579 218089 164397 129151 118061 129110 154461 184849 214032 241144 269968 306153
37889 306153 354584 418490 499839 599512 716710 848441 989840 1134652 1274917 1400232
37879 1400232 1497992 1555322 1561692 1510627 1399844 1230491 1006531 734902 426324 96031
37869 96031 -236632 -550427 -825847 -1048638 -1211567 -1314017 -1360298 -1357744 -1315027 -1240765 -1142683
37858 -1142683 -1027806 -903318 -777017 -656350 -546157 -446388 -351455 -252176 -139888 -11028
37848 -11028 129749 269041 386805 460570 470746 405499 263532 53949 -206282 -496170
37838 -496170 -794696 -1084058 -1351307 -1587993 -1788365 -1947275 -2058980 -2117436 -2117889 -2058802
37828 -2058802 -1942960 -1777295 -1571810 -1338348 -1089407 -836922 -591103 -359730 -148339
37819 -148339 38728 196955 321019 405793 448801 452583 425342 379603 330009 291390 277206
37808 277206 297892 358981 459518 591436 740334 887862 1015485 1108776 1160668 1172219
37798 1172219 1150447 1104480 1042267 969552 891053 812100 738871 676800 628573 593601 569692
37787 569692 555730 553488 567420 602769 663190 748957 856293 977745 1103205 1221120 1319828
37776 1319828 1389130 1421991 1415749 1372278 1297217 1198886 1087503 974742 873315 796031 753944
37765 753944 753675 794918 869570 963466 1060389 1146806 1215421 1266218 1304772 1338659 1373313 1408825
37753 1408825 1438903 1452553 1438040 1387618 1301064 1186513 1058110 931454 818826 726251
37743 726251 653348 595447 546604 502227 460321 420935 384441 350143 316529 282747 249706
37732 249706 219762 195552 179118 171768 174221 186697 208805 239156 274501 308807 333248 338207
37720 338207 317255 271542 212198 158969 135464 163200 256889 421998 654243 940372 1260037
37709 1260037 1588807 1901933 2178102 2402135 2565894 2667352 2708760 2695302 2635015 2539521
37699 2539521 2424191 2306513 2202638 2123502 2072625 2047092 2041284 2051109 2076145 2118618 2180286
37688 2180286 2259658 2351246 2446879 2537783 2616280 2677097 2718559 2743252 2757119 2766922 2777501
37677 2777501 2790608 2805566 2820619 2833891 2843958 2850400 2854142 2857042 2860614 2864648 2866581 2861981 2845585
37664 2845585 2811997 2755422 2668818 2543638 2371046 2144369 1861645 1527393 1153361 758177
37654 758177 365602 1207 -311855 -556987 -727363 -827770 -874334 -891362 -905629 -940042
37644 -940042 -1009081 -1116999 -1258149 -1418495 -1578302 -1716480 -1815948 -1867842 -1872287 -1835259 -1763659
37633 -1763659 -1661787 -1531096 -1372400 -1188140 -982946 -762750 -533880 -303142 -78625
37624 -78625 129866 311699 457707 562670 626123 650859 640577 599099 531867 447781 358909
37613 358909 277662 213348 170479 149607 149593 169334 207602 261572 325983 394254 460855 523013
37601 523013 580855 636684 694042 756371 825145 898517 971888 1040284 1100886 1153959 1201817
37590 1201817 1246589 1287885 1321542 1340382 1337240 1308991 1259266 1197921 1137337 1087962 1055921
37579 1055921 1043701 1052179 1081527 1130340 1194768 1269569 1350869 1438288 1534550 1642917 1764652
37568 1764652 1898284 2040748 2188984 2340610 2493088 2641968 2779493 2894843 2976408 3015052
37558 3015052 3006788 2953829 2864064 2749567 2624498 2502602 2394592 2306078 2236895 2182435 2136611
37547 2136611 2094907 2055678 2019204 1985798 1954633 1923702 1890135 1850448 1801108 1739749 1666374
37536 1666374 1583645 1496330 1410859 1335456 1280023 1254542 1266004 1315713 1399009 1507741 1633584
37525 1633584 1769879 1911368 2053091 2190005 2317757 2433820 2538227 2633499 2723772 2813192
37515 2813192 2903860 2994118 3078061 3146871 3191571 3205809 3187038 3135554 3052599 2939628 2799542
37504 2799542 2638457 2465761 2291626 2123380 1962899 1806200 1645348 1472215 1282991
37495 1282991 1081534 879638 694041 542089 438202 391840 406379 478493 598410 751618
37485 751618 921792 1094071 1257462 1405516 1535341 1646054 1738085 1813746 1878198 1939540
37475 1939540 2007316 2089787 2191073 2309390 2436991 2561502 2667965 2741131 2767962 2740123
37465 2740123 2655927 2521149 2348379 2154608 1956995 1767824 1590883 1421287 1248841 1062953
37455 1062953 856843 629915 388321 143946 -88103 -293200 -461152 -589047 -681628 -748593
37445 -748593 -799861 -841365 -874084 -896859 -910533 -919972 -932499 -954468 -988887 -1035438 -1092041 -1156373
37433 -1156373 -1226660 -1301658 -1379813 -1457571 -1527475 -1577348 -1591561 -1554087 -1452046 -1278464 -1033789
37422 -1033789 -726499 -372995 3610 376426 719352 1011934 1242613 1409199 1516994
37413 1516994 1576158 1599530 1600906 1592988 1584905 1580385 1577883 1572743 1559999 1536014 1498228 1443793
37401 1443793 1368687 1268211 1138346 976653 782064 554394 294806 7398 -299168 -611142
37391 -611142 -910530 -1176935 -1390060 -1532679 -1593878 -1572038 -1476582 -1327298 -1150700 -974388
37381 -974388 -821515 -707158 -637160 -609011 -614054 -640238 -674598 -705044 -721645 -717624 -689839
37370 -689839 -638460 -566203 -477744 -379344 -278071 -180270 -89988 -8494 64540 128930 182395
37359 182395 220672 239203 235325 209999 168777 121913 83053 66272 82254 135348 222564 334467
37347 334467 457317 576079 677921 755322 807517 839396 858239 869964 876905 877936 870056
37336 870056 850032 815740 767769 711264 656806 619208 614515 656372 752696 903168 1098375
37325 1098375 1321557 1552835 1774270 1973391 2143794 2283034 2389440 2459800 2489211 2473278
37315 2473278 2411652 2311100 2186034 2055508 1937886 1846183 1786498 1759384 1762058 1789529 1834455
37304 1834455 1886769 1934367 1965534 1972603 1954903 1919140 1876815 1840077 1817602 1811385 1815421 1817459
37292 1817459 1803861 1765234 1699635 1612121 1512064 1410409 1317890 1244049 1196486 1179781 1193933
37281 1193933 1233115 1286183 1339415 1380213 1399839 1394415 1364794 1315835 1254901 1189264 1123166
37270 1123166 1056142 983885 901586 807999 707997 612378 535415 491622 492811 545711 650254
37259 650254 799043 978582 1172370 1365084 1546509 1713608 1869827 2021991 2176374 2335524
37249 2335524 2496719 2652322 2792150 2907396 2994554 3057140 3104034 3145288 3187794 3232909
37239 3232909 3276725 3312351 3333177 3336193 3324492 3307900 3300980 3318609 3370760 3458711 3574387
37228 3574387 3703102 3828448 3937228 4022341 4082819 4121735 4143577 4152362 4150793 4140186 4120921
37217 4120921 4093290 4058511 4019494 3981089 3949710 3932441 3935907 3965211 4023233 4110316 4224231
37206 4224231 4360447 4512873 4674949 4840589 5004494 5161855 5307805 5436732 5541731
37197 5541731 5614925 5649552 5643554 5602577 5540062 5473911 5421252 5393340 5391929 5407860 5422680 5413401
37185 5413401 5358924 5245665 5070493 4840927 4573537 4291178 4018918 3778618 3583392 3434227
37175 3434227 3320792 3226350 3134434 3033974 2920951 2797093 2667696 2540377 2424625 2330749
37165 2330749 2267222 2237379 2237466 2257302 2282958 2300116 2297111 2267044 2208228 2122501 2012326 1878637
37153 1878637 1720957 1539504 1337873 1124801 914409 724749 574853 480660 450786 483501
37143 483501 566291 678362 795092 892582 951058 956837 903145 789964 623367 414955 181437
37132 181437 -56721 -278574 -467180 -612961 -714107 -774183 -798468 -790619 -751095 -678502 -573715
37121 -573715 -444301 -305769 -178226 -80327 -23784 -10457 -32239 -73392 -114563 -137057 -125757
37110 -125757 -70397 33756 185327 377279 599492 842568 1100443 1370040 1648215 1928112
37100 1928112 2197306 2439364 2638493 2784885 2877752 2924625 2937973 2931377 2916828 2903454 2897203
37089 2897203 2900862 2914164 2934107 2955836 2973979 2983885 2982281 2967534 2939765 2900742 2853199 2799797
37077 2799797 2742517 2682950 2623040 2565484 2513490 2470422 2439993 2426950 2437371 2477820 2553521
37066 2553521 2666653 2816019 2998361 3210382 3449845 3714599 3999828 4295399 4585546
37057 4585546 4851634 5076655 5249292 5366172 5432243 5459408 5463454 5459640 5458436 5463403 5472128
37046 5472128 5479345 5480192 5471868 5453518 5425394 5388478 5344727 5297185 5249453 5204964 5166895 5138774
37034 5138774 5124990 5130317 5158559 5210849 5284248 5371164 5460442 5540486 5603370 5647491 5676894
37023 5676894 5697641 5713677 5724637 5726342 5712983 5679353 5622161 5540530 5436521 5316030 5189207
37012 5189207 5069102 4968278 4894959 4851051 4833154 4835535 4852711 4879828 4911033 4937809 4949343
37001 4949343 4935250 4889008 4809864 4702209 4573074 4429461 4276939 4119904 3962614 3809747
36991 3809747 3665830 3533816 3413461 3300231 3185616 3059754 2916257 2757383 2596785
36982 2596785 2458052 2369202 2355013 2429876 2593854 2833481 3126450 3447351 3771673 4077481
36972 4077481 4346399 4565503 4729823 4843483 4917847 4967168 5003984 5036535 5068923 5103106
36962 5103106 5141260 5187156 5245650 5320105 5408692 5501538 5580868 5625006 5614986 5540686 5403513
36951 5403513 5214709 4991076 4750835 4511065 4286546 4089554 3930527 3819200 3764831 3774487
36941 3774487 3850157 3986828 4172898 4392300 4626920 4858715 5071997 5256203 5408309 5533356
36931 5533356 5642268 5747729 5860237 5986200 6128376 6287300 6462146 6650436 6847182
36922 6847182 7044273 7230621 7393357 7520161 7602242 7636808 7627892 7585272 7522270 7453279 7391482
36911 7391482 7346787 7324239 7323463 7339770 7367061 7401717 7445462 7505008 7588049 7697930 7830478
36900 7830478 7974712 8116215 8240939 8338532 8405480 8447642 8480431 8525269 8603146 8728042
36890 8728042 8902825 9118649 9357438 9596523 9814453 9996717 10139740 10251701 10349743 10454679
36880 10454679 10585275 10754236 10967054 11223599 11521292 11858239 12234948 12654046 13118459
36871 13118459 13629163 14183879 14777672 15405568 16066037 16763449 17507897 18312179 19187170
36862 19187170 20137646 21160341 22244777 23375744 24535192 25702027 26850264 27947759
36854 27947759 28957498 29841360 30564608 31099273 31426132 31536212 31432780 31133272 30669414
36845 30669414 30084078 29425454 28740723 28071498 27451721 26907267 26456168 26108631 25866558
36836 25866558 25723010 25662734 25664868 25707478 25772104 25846305 25923606 26001916 26082078 26167525 26264995
36825 26264995 26385372 26543711 26757903 27046092 27423412 27898914 28473670 29140871 29887780
36816 29887780 30698505 31556486 32446571 33357321 34283777 35229694 36207768 37237258 38339977
36807 38339977 39536366 40842853 42270532 43824637 45504427 47303710 49212400 51219401
36799 51219401 53316727 55504178 57793111 60207547 62781928 65556701 68574146 71876027
36791 71876027 75502790 79492968 83882251 88703376 93988271 99772365 106099097 113022661
36783 113022661 120608655 128933598 138083908 148154060 159243799 171455502 184892892
36776 184892892 199660658 215862541 233594814 252932991 273911381 296496349 320554211
36769 320554211 345814019 371825737 397918125 423168413 446404463 466264055 481329121
36762 481329121 490330501 492383929 487186828 475101975 457090826 434519891 408911614
36755 408911614 381719124 354175151 327225170 301527012 277490119 255330555 235125526
36748 235125526 216858764 200454161 185798884 172759267 161193208 150961071 141934258
36741 141934258 133999297 127056936 121018675 115803982 111339850 107562288 104418409 101867921
36733 101867921 99883047 98446757 97550298 97191353 97373623 98107508 99410881 101308641
36725 101308641 103829851 107002434 110847033 115372304 120572316 126424409 132885047 139882401
36717 139882401 147306258 154996944 162735321 170235955 177146173 183055318 187520800 190116521
36709 190116521 190501470 188492691 184116728 177616545 169408166 160002339 149918862 139618515
36701 139618515 129465186 119717190 110538888 102021653 94205127 87093340 80664649 74878110
36693 74878110 69680045 65012121 60818854 57051095 53664589 50616347 47862896 45362073
36685 45362073 43076802 40978056 39045597 37266753 35634042 34142099 32784586 31552202
36677 31552202 30432931 29414294 28486127 27641989 26878427 26192895 25581846 25040095 24561089
36668 24561089 24136946 23757357 23407896 23069281 22719014 22335329 21901750 21410013 20860083
36659 20860083 20257901 19612614 18934796 18236046 17529295 16829057 16150817 15509139 14914654
36650 14914654 14371304 13875843 13420631 12998449 12606302 12245824 11920668 11633465 11384582
36641 11384582 11172650 10995104 10847678 10723511 10613343 10507392 10397877 10280558 10154229
36632 10154229 10018522 9871511 9708729 9524321 9313904 9077980 8824274 8567602 8326669
36623 8326669 8119198 7957955 7849536 7795599 7794764 7843647 7936694 8065243 8216800 8375736
36613 8375736 8525865 8653800 8751053 8813889 8841848 8836551 8801422 8741778 8664711 8578836 8494095
36602 8494095 8421434 8372052 8356389 8383609 8462291 8602008 8814531 9113552 9513066 10025433
36592 10025433 10659751 11420210 12303864 13298128 14379094 15511706 16651873 17749844 18753985
36583 18753985 19614600 20287823 20739343 20947077 20901869 20606561 20074890 19331396 18411796
36574 18411796 17362153 16235528 15086255 13963159 12903738 11931078 11054247 10271296
36566 10271296 9572981 8945661 8373008 7837398 7322064 6814368 6309203 5810560 5329743
36557 5329743 4880677 4474490 4116034 3803674 3531915 3295103 3090180 2917291 2778558
36548 2778558 2676331 2612070 2585814 2595455 2635590 2697070 2768752 2841474 2912165 2985475 3072160
36537 3072160 3185675 3338830 3541152 3796751 4102810 4449246 4819405 5191190 5538471
36528 5538471 5833541 6051114 6172903 6190829 6107407 5933352 5683884 5375683 5025630 4650807
36518 4650807 4268067 3892163 3533403 3196951 2884719 2598339 2340642 2114481 1920373
36509 1920373 1755519 1615175 1494815 1390905 1299975 1217756 1140112 1065520 997502 945565
36499 945565 923954 948133 1029894 1173308 1373918 1621417 1903419 2207739 2522704 2837066
36489 2837066 3140667 3425622 3687272 3924604 4139991 4337766 4521413 4690578 4840027
36480 4840027 4961694 5048794 5099383 5117214 5109584 5083871 5045080 4995787 4937757 4873032 4802927
36469 4802927 4725671 4635284 4523691 4385454 4222373 4045229 3871653 3721113 3609218 3543639
36459 3543639 3523224 3540226 3584037 3644494 3713859 3787704 3864995 3946908 4034003 4122673 4203062
36448 4203062 4260244 4278283 4244767 4153302 4003342 3798839 3547563 3261477 2956818 2652448
36438 2652448 2366670 2114174 1904729 1743735 1633506 1574156 1563649 1597201 1666450 1758932
36428 1758932 1858656 1948242 2012251 2040409 2029266 1981685 1904678 1806745 1695559 1576336 1451114
36417 1451114 1319372 1180260 1035919 894395 770517 683894 654359 696305 813965 999627
36407 999627 1235521 1498292 1763669 2009456 2216740 2370566 2461148 2485632 2449594 2367275
36397 2367275 2259715 2150551 2060356 2001619 1976398 1977525 1992674 2009631 2020755 2024885 2026226
36386 2026226 2031390 2046432 2074747 2115622 2163575 2209552 2244525 2263963 2270230 2271123 2275351 2287787
36374 2287787 2307227 2327840 2343191 2350159 2350349 2348612 2350197 2358427 2373588 2392592 2408833 2412432 2391668
36361 2391668 2336153 2240840 2108614 1949551 1777187 1604322 1440738 1293221 1166491 1063676
36351 1063676 986084 932808 900818 885956 884599 894978 916889 949487 988652 1026132 1051693
36340 1051693 1057125 1039481 1001461 949239 890052 831696 783760 758315 768153 823222 927756
36329 927756 1079904 1273373 1499386 1748157 2010417 2279457 2552846 2832276 3120759 3418255
36319 3418255 3718057 4006141 4264077 4473906 4622240 4701764 4710576 4651258 4530855 4361407
36309 4361407 4159705 3945506 3738564 3555717 3409030 3305135 3245254 3225661 3238955 3276345
36299 3276345 3330072 3394392 3464326 3533099 3590424 3623407 3620290 3575261 3491518 3380748 3259601
36288 3259601 3145322 3052250 2989371 2958773 2955564 2969817 2989827 3005083 3008285 2996934 2974900
36277 2974900 2952988 2946991 2973203 3043276 3161039 3322753 3520589 3747599 4001918 4288118
36267 4288118 4614932 4990500 5417817 5892965 6406934 6949685 7514174 8098369 8704486
36258 8704486 9336147 9995270 10680515 11387725 12111220 12844766 13582207 14318624 15052316
36249 15052316 15786816 16531865 17302601 18116731 18989843 19929516 20929461 21964962 22990814
36240 22990814 23942885 24744427 25317436 25597464 25547949 25169063 24497671 23598682 22551658
36231 22551658 21437268 20326438 19273040 18310502 17452925 16700225 16045068 15478596 14993276
36222 14993276 14583334 14244255 13972293 13763719 13613342 13512844 13450602 13414093 13393784 13385659
36212 13385659 13390622 13411508 13449836 13503428 13564590 13618692 13644218 13615488 13507985 13304684 13001159
36201 13001159 12607575 12146558 11647383 11138521 10641476 10167941 9720221 9293369 8877583
36192 8877583 8460700 8031263 7582071 7112977 6631707 6152503 5693500 5273749 4910504
36183 4910504 4617271 4403296 4274466 4234752 4286860 4431836 4668397 4992847 5399653 5882371
36173 5882371 6435056 7054424 7742262 8506278 9357751 10305909 11351173 12480043 13663414
36164 13663414 14858255 16011242 17062803 17950793 18614634 19001635 19076331 18830578 18289243
36155 18289243 17507000 16556336 15512061 14438955 13385972 12386151 11459212 10614484 9853282
36146 9853282 9170970 8559222 8008539 7510600 7059856 6654311 6295984 5991091 5749105
36137 5749105 5579778 5488229 5469873 5507767 5574270 5636852 5665391 5637475 5539966 5367812 5122531
36126 5122531 4811580 4448122 4050199 3639030 3236668 2863361 2534980 2261200 2045207
36117 2045207 1885076 1776311 1714707 1698601 1729652 1811760 1948266 2138331 2373838 2638233
36107 2638233 2908074 3156979 3360563 3500814 3568985 3566449 3503109 3393466 3251706 3088202
36097 3088202 2909265 2719835 2526868 2340858 2174368 2038377 1938454 1872661 1831982 1802721
36087 1802721 1769721 1719355 1641774 1532280 1391912 1227425 1050889 878842 730524 624990
36077 624990 577655 597619 686675 839987 1047637 1296359 1571113 1856307 2136841 2399599
36067 2399599 2635859 2843862 3029302 3201831 3368317 3526294 3661305 3749267 3761976 3673142
36057 3673142 3463651 3126151 2668485 2114299 1499295 863982 246004 -324765 -827420
36048 -827420 -1248887 -1582390 -1826564 -1985087 -2066364 -2082956 -2050728 -1987515 -1910972 -1835534 -1769250
36037 -1769250 -1711901 -1655665 -1588520 -1499212 -1381849 -1238401 -1078451 -916648 -768877 -648149
36027 -648149 -561319 -507977 -482234 -476526 -484941 -504059 -531548 -564571 -599838 -635322 -672272 -715931
36015 -715931 -774024 -853318 -955993 -1077977 -1210187 -1341419 -1460580 -1557054 -1620014 -1638353
36005 -1638353 -1602234 -1505897 -1350547 -1146008 -910097 -665485 -434829 -235847 -78236 36453
35995 36453 112185 154576 167771 153144 109792 36199 -67393 -196264 -339175 -478623 -594298
35984 -594298 -668698 -692207 -665120 -595958 -497599 -383489 -265445 -152829 -52173 33449 104947
35973 104947 166934 226459 291194 367810 460959 572991 704245 853478 1017761 1191482
35963 1191482 1364883 1523334 1648572 1722229 1730651 1669215 1544501 1373614 1180923 993076
35953 993076 833655 719061 656910 646991 683619 758089 860753 982860 1117912 1261571
35943 1261571 1409588 1554748 1684990 1784386 1836649 1829187 1755707 1616800 1419285 1175260
35933 1175260 901031 615410 336970 80584 -145484 -340352 -508264 -654195 -779759
35924 -779759 -881952 -955386 -996312 -1005697 -989569 -956826 -916140 -873486 -830886 -786258 -734301
35913 -734301 -668537 -584035 -479493 -357207 -220902 -73110 85809 256348 437582 626082
35903 626082 817117 1007243 1196227 1386735 1581947 1782638 1985409 2182710 2364271 2519167
35893 2519167 2637874 2713882 2744479 2730495 2675234 2583230 2459673 2310764 2144335 1969461
35883 1969461 1794440 1624133 1458733 1295077 1129538 960283 787865 614935 446182
35874 446182 288225 148458 32790 -56214 -119570 -160653 -183742 -193191 -193428 -189733 -189334 -201835
35862 -201835 -238084 -307643 -415948 -562049 -737240 -925028 -1103431 -1249781 -1346335 -1383852
35852 -1383852 -1361648 -1285154 -1163158 -1005880 -823471 -624312 -413438 -192168 40549 285575
35842 285575 541030 800991 1056125 1296277 1513726 1704982 1869675 2007258 2114150 2183769
35832 2183769 2209806 2190864 2133740 2053458 1969693 1901129 1860285 1851167 1870508 1911486 1967749
35821 1967749 2035798 2114884 2205017 2304643 2409433 2512596 2605913 2680547 2727400 2737569 2703500
35810 2703500 2620848 2490379 2318905 2118352 1902792 1684479 1471019 1265538 1069858 888586
35800 888586 731316 611654 543915 539572 605029 740916 942089 1197681 1491399 1802821
35790 1802821 2110153 2393814 2639620 2840527 2996630 3113766 3201274 3269686 3329090 3388419
35780 3388419 3455308 3536025 3635361 3756572 3901074 4067373 4249363 4435291 4608849 4752784
35770 4752784 4853834 4906902 4916543 4894931 4856968 4814615 4772981 4729911 4679015 4614326 4534041
35759 4534041 4441415 4342614 4243027 4144329 4043835 3936230 3816566 3683206 3539538 3393537
35749 3393537 3254930 3131109 3024153 2930962 2846551 2768256 2698122 2642101 2606616 2594418 2601828
35738 2601828 2618888 2632636 2632136 2612772 2577697 2536178 2500208 2481143 2487094 2520912 2578947 2651558
35726 2651558 2726096 2791566 2842768 2881917 2917485 2961554 3027100 3125753 3265685 3449606 3673709
35715 3673709 3928612 4202273 4483047 4760625 5024408 5261412 5456714 5597267 5676986 5699606
35705 5699606 5677367 5626247 5560336 5487721 5408898 5317464 5202452 5051865 4856745 4614566
35695 4614566 4330697 4017446 3691539 3371310 3074390 2815819 2606104 2449099 2340223
35686 2340223 2266325 2208415 2147175 2069174 1970602 1856673 1737456 1622732 1518223 1424116
35676 1424116 1335673 1245404 1146081 1033563 908498 776486 646872 530293 435270 364930
35666 364930 315682 278952 245079 206959 161549 109306 52893 -3676 -55484 -97295 -124706
35655 -124706 -135540 -130710 -113795 -89256 -60190 -26901 12931 62812 125655 202560 292359 391797
35643 391797 495858 597939 689851 762267 806267 815963 791000 737255 664879 584616 504401
35632 504401 427967 355553 285722 217169 150118 87238 33837 -3102 -16800 -2634 40534
35621 40534 109510 196104 287279 367295 421890 442440 427674 382273 314045 231616 143223 56039
35609 56039 -24177 -92815 -145523 -177606 -184614 -164061 -117220 -49754 29562 111863 191722 269130
35597 269130 348416 434656 530136 633301 740382 847767 953236 1055591 1153479 1244192
35587 1244192 1322937 1383166 1418355 1424776 1403929 1363345 1315425 1274765 1254785 1264438 1305820 1373230
35575 1373230 1453835 1529897 1582470 1596070 1562951 1485136 1373129 1241953 1106408 977664
35565 977664 862191 762596 678977 609522 550199 494382 433362 357900 260262 135864 -15977
35554 -15977 -192383 -388180 -597630 -815992 -1040018 -1266823 -1491492 -1705056 -1894792 -2047411
35544 -2047411 -2153495 -2210592 -2223319 -2200820 -2153382 -2090050 -2017855 -1941939 -1865466 -1789187 -1711711
35533 -1711711 -1631306 -1548394 -1466887 -1393179 -1333406 -1290682 -1263810 -1248017 -1237131 -1225873 -1210905
35522 -1210905 -1190435 -1163452 -1129850 -1091730 -1054880 -1029112 -1026659 -1058887 -1132651 -1247913 -1397491
35511 -1397491 -1568600 -1745080 -1909655 -2046109 -2141302 -2186594 -2178245 -2116873 -2006533 -1853892
35501 -1853892 -1667353 -1455648 -1225957 -982650 -727900 -464011 -195529 70662 327086
35492 327086 567485 787287 982844 1150704 1287952 1393806 1471777 1530838 1584163 1645287
35482 1645287 1723557 1821372 1934718 2056284 2178901 2297082 2405976 2499341 2569011 2606870
35472 2606870 2607890 2571945 2503712 2411572 2306244 2198768 2097598 2006081 1922308 1841874 1761952
35461 1761952 1684331 1615849 1566080 1543212 1549728 1579835 1619971 1652313 1659816 1630706 1560842 1453476
35449 1453476 1317062 1162685 1002468 849209 716056 614744 552386 528717 536101 562794
35439 562794 597465 632318 663713 691282 717221 746492 787363 851243 950989 1097750 1297304
35428 1297304 1547526 1838162 2152834 2472004 2775669 3045435 3266330 3428563 3528857
35419 3528857 3570520 3561678 3512033 3429521 3318465 3179970 3014059 2822393 2610297 2387000
35409 2387000 2163434 1948149 1743362 1543535 1337492 1113078 862366 585629 293022
35400 293022 3645 -257754 -465714 -599690 -649353 -617959 -522003 -386415 -236636 -90832
35390 -90832 44378 172932 303869 444379 594804 747702 890516 1009719 1094300 1137844
35380 1137844 1139557 1104653 1044030 972831 907730 863394 848998 865824 906939 959286 1007497
35369 1007497 1037814 1040550 1010617 946781 850434 724462 572638 399959 213509 22503
35359 22503 -163380 -336310 -491124 -623938 -730242 -804829 -844052 -848844 -826491 -790176 -756272
35348 -756272 -740056 -751334 -791888 -855982 -933411 -1013180 -1086161 -1146207 -1190069 -1216284 -1223050 -1205743
35336 -1205743 -1155799 -1062618 -918512 -724269 -491795 -241644 3549 226048 416759 574751
35326 574751 704359 812135 904359 984519 1050936 1096160 1109455 1081338 1007301 888574 730302
35315 730302 539279 322881 89184 -152574 -391867 -617107 -816356 -978720 -1096348 -1166143
35305 -1166143 -1189847 -1172057 -1117314 -1028505 -907967 -760364 -594664 -423168 -258081 -108067
35295 -108067 23206 136364 234535 321515 400486 473750 543451 612399 683711 759108 837206
35284 837206 913461 982255 1040057 1087990 1132509 1183701 1251759 1342920 1456427 1583746 1710660
35273 1710660 1821864 1906455 1961887 1994399 2015696 2037634 2067390 2104985 2143626 2172148 2178506
35262 2178506 2153371 2093202 2002131 1891904 1779429 1682424 1614629 1582412 1584043 1611591 1654292
35251 1654292 1701804 1746142 1781702 1803393 1803918 1772467 1697012 1569999 1394037 1183378 959984
35240 959984 746829 562324 417731 316899 256899 228926 219678 213358 193984 147432 62891
35229 62891 -65963 -239652 -451685 -688929 -934988 -1176021 -1405802 -1626224 -1842413 -2055816
35219 -2055816 -2260301 -2443802 -2593879 -2703477 -2774216 -2816309 -2845236 -2875907 -2916604 -2965801
35209 -2965801 -3013543 -3045981 -3050206 -3017757 -2946905 -2843879 -2722255 -2599954 -2494769 -2420170 -2382623
35198 -2382623 -2380847 -2407134 -2450451 -2500070 -2547856 -2588205 -2616363 -2626618 -2611523 -2562547 -2472262
35187 -2472262 -2337719 -2163459 -1961974 -1750575 -1546123 -1360635 -1199678 -1063102 -946512
35178 -946512 -842728 -743749 -643335 -539184 -433345 -330920 -238544 -164036 -117170 -110134 -156024
35167 -156024 -264962 -439203 -669780 -936924 -1214478 -1476518 -1703479 -1885742 -2023797 -2125124
35157 -2125124 -2199196 -2252956 -2288918 -2306169 -2302579 -2276320 -2226327 -2152543 -2056573 -1942573 -1817791
35146 -1817791 -1692340 -1577810 -1484560 -1418761 -1381020 -1367714 -1373854 -1395143 -1428116 -1469074 -1513145
35135 -1513145 -1553817 -1582845 -1590772 -1568569 -1510052 -1413712 -1282834 -1123961 -945015 -754247 -560221
35124 -560221 -371823 -197279 -42211 91911 207544 309105 400576 483950 558852 623046
35114 623046 673529 707724 724039 721289 697521 649629 574711 472743 349066 215298 88035
35103 88035 -14485 -77237 -93346 -66908 -11490 55498 119429 172314 212721 243549 269811
35092 269811 296718 327394 360793 391383 411069 411956 388395 338075 262738 168514 65337 -34476
35080 -34476 -117730 -171606 -185207 -151765 -70684 52069 205823 378103 556860 731251 891653
35069 891653 1029907 1139903 1217909 1262356 1273499 1253388 1205930 1136389 1050277 952208 845503
35058 845503 732630 615849 497503 379973 265684 157140 56220 -37625 -129093 -226651
35048 -226651 -339320 -472531 -625935 -794457 -971359 -1150950 -1329387 -1503464 -1668441 -1816508
35038 -1816508 -1937161 -2019504 -2055071 -2039346 -1971354 -1852391 -1685747 -1478087 -1241103 -991162
35028 -991162 -746112 -521102 -326023 -165434 -39691 54087 120983 166323 192959 199137 178232
35017 178232 120664 17600 -134696 -331662 -560314 -802674 -1041185 -1263289 -1462970 -1638914
35007 -1638914 -1790979 -1917650 -2016256 -2085462 -2127695 -2149618 -2160579 -2170459 -2188001 -2219737 -2269144
34996 -2269144 -2335949 -2416004 -2501944 -2584440 -2653553 -2700005 -2716646 -2700414 -2654309 -2588210 -2517383
34985 -2517383 -2458674 -2425501 -2423505 -2448811 -2489916 -2532522 -2564724 -2579791 -2575397 -2550678 -2503590 -2430310
34973 -2430310 -2326518 -2188981 -2015994 -1806944 -1562480 -1286229 -987009 -679475 -382222
34964 -382222 -114344 107798 272610 374268 413300 397177 340530 263915 190064 138207 118821
34953 118821 131485 166664 210105 247621 268582 267392 242949 196974 132515 53541 -34740 -126143
34941 -126143 -215220 -299703 -381894 -467787 -564574 -678111 -811484 -964457 -1133179 -1310014
34931 -1310014 -1483933 -1641783 -1770222 -1857725 -1895992 -1880609 -1811253 -1691823 -1530183 -1336933
34921 -1336933 -1123570 -901304 -681352 -475681 -296473 -153898 -53600 4383 24698 14222
34911 14222 -20836 -77049 -154010 -252643 -372760 -511156 -660836 -811146 -948733 -1059404
34901 -1059404 -1130703 -1154483 -1128583 -1057032 -948914 -816492 -673230 -531794 -401945 -288690
34891 -288690 -191798 -107690 -33430 28894 69859 74306 26647 -82568 -252289 -470717 -718420
34880 -718420 -972656 -1211166 -1415095 -1571276 -1673923 -1725342 -1734841 -1715245 -1677751 -1627315 -1560880
34869 -1560880 -1468867 -1338545 -1157827 -919243 -623943 -284495 75697 427209 741898 999402
34859 999402 1190227 1315217 1382995 1406950 1402220 1382442 1356500 1326377 1287292 1230460 1147527
34848 1147527 1034920 896257 741899 586246 444371 329630 252923 223117 247493 331162
34838 331162 475158 673973 913743 1172260 1421663 1633742 1786462 1868852 1881785 1834390
34828 1834390 1738486 1604042 1437315 1241381 1018032 770061 503316 227885 -42299 -291784
34818 -291784 -507032 -679289 -805495 -887451 -930410 -941724 -929162 -898723 -852958 -791127 -711152
34807 -711152 -612131 -496081 -368641 -238811 -117735 -16432 57172 100810 118688 119792 114287
34796 114287 109786 109220 110902 110044 100834 78584 41683 -7303 -62164 -115178 -159828 -192786 -214620
34783 -214620 -229492 -244119 -266035 -301497 -354197 -425617 -516288 -626073 -752801 -890765 -1031216
34772 -1031216 -1165177 -1286727 -1394588 -1491061 -1578950 -1658142 -1723924 -1768128 -1782371 -1761274 -1703997
34761 -1703997 -1613969 -1497654 -1363073 -1218367 -1070714 -925888 -788510 -662645 -552389 -462056
34751 -462056 -395649 -355762 -342503 -353223 -383061 -425598 -472829 -514544 -538120 -529736 -477099 -372678
34739 -372678 -216158 -15272 215139 455618 685634 887162 1047033 1157519 1215744 1223072
34729 1223072 1184984 1111078 1014670 911901 820613 759024 743857 787708 896124 1065688 1284299
34718 1284299 1533870 1794109 2045534 2270881 2455599 2588733 2664523 2683719 2653413 2585265
34708 2585265 2493100 2390655 2289504 2196780 2113228 2032979 1946090 1843193 1720070 1579839
34698 1579839 1431899 1288520 1160945 1056564 977891 923237 888442 868716 859669 857242 857205
34687 857205 855223 847682 832299 807626 771832 722190 656157 573259 476093 369610 259358
34676 259358 150178 45980 -50007 -135573 -210518 -277183 -339531 -401190 -464129 -529132 -597571
34665 -597571 -672677 -759122 -861212 -980933 -1116827 -1263763 -1413431 -1555554 -1679927 -1778959
34655 -1778959 -1849630 -1893612 -1915249 -1918477 -1904499 -1871270 -1814381 -1728157 -1606526 -1444273 -1239304
34644 -1239304 -995419 -724090 -444099 -179032 46650 212184 304714 321648 269765 161428
34634 161428 10353 -170261 -366674 -562781 -740364 -882294 -976931 -1020912 -1018535 -978188
34624 -978188 -908134 -814208 -700406 -571007 -431880 -289816 -150706 -18236 106046 221787
34614 221787 329015 428253 521613 614107 713772 829631 967890 1128106 1301297 1470915
34604 1470915 1616432 1718381 1763328 1747170 1675581 1561541 1421034 1268822 1116113 970874
34594 970874 839856 730339 650032 605427 600427 636781 715930 840375 1012915 1233825 1497478
34583 1497478 1790335 2091427 2375390 2617071 2796325 2901682 2931887 2894746 2803429 2671688
34573 2671688 2510513 2328019 2131928 1931870 1739111 1563948 1413169 1289602 1193559 1124147
34563 1124147 1078719 1050750 1028327 995267 934854 834016 685761 489431 250016 -22411
34553 -22411 -313346 -605446 -881393 -1127145 -1334276 -1500594 -1629279 -1727392 -1804289 -1869986
34543 -1869986 -1933407 -2000760 -2074247 -2151186 -2223916 -2281345 -2312424 -2310240 -2274329 -2209774 -2123732
34532 -2123732 -2021358 -1903029 -1764084 -1597156 -1395813 -1157455 -884251 -582590 -262388
34523 -262388 63168 377965 664076 903847 1082552 1191265 1229371 1205756 1137601 1046376
34513 1046376 952333 870056 807188 766128 746616 747409 766965 804001 858320 931797 1029209 1158338
34501 1158338 1328382 1546701 1815844 2133209 2493217 2889240 3313045 3752532 4190453
34492 4190453 4605745 4976717 5284265 5513841 5655949 5705797 5662904 5530961 5317456 5032597
34482 5032597 4687953 4295971 3870963 3430581 2995990 2589643 2231344 1934728 1706326
34473 1706326 1547594 1458204 1437870 1485197 1594428 1752710 1940292 2134134 2313240 2463056
34463 2463056 2577086 2655648 2703295 2726491 2732200 2727107 2717118 2707262 2702229 2707308 2728973 2774556
34451 2774556 2850839 2961873 3106681 3278096 3463958 3650736 3827835 3990287 4138615 4276237
34441 4276237 4405737 4525504 4628206 4701814 4732374 4706713 4614008 4446743 4202261 3884908
34431 3884908 3507423 3090188 2658090 2236214 1846149 1504370 1222689 1009267 868328
34422 868328 798202 789371 824992 884867 951285 1013426 1067803 1114966 1155124 1185718 1202329 1202164
34410 1202164 1187934 1169527 1161822 1179353 1230901 1317255 1432935 1569710 1719160 1873147 2023097
34399 2023097 2159550 2272785 2354255 2397958 2401014 2363364 2287146 2176270 2036258 1874039
34389 1874039 1697380 1513790 1329062 1145996 964076 780505 592071 396798 194677
34380 194677 -12318 -220252 -423220 -613959 -785532 -933285 -1055409 -1151447 -1220015 -1257706
34370 -1257706 -1259772 -1221441 -1138733 -1008959 -831965 -612317 -361117 -95777 162934 395471
34360 395471 587690 733070 832993 896229 938024 977874 1034790 1120932 1236456 1368478 1494796
34349 1494796 1590844 1637191 1625025 1557595 1447140 1308999 1156194 997114 836592 678748
34339 678748 529642 398666 298022 240171 233909 281066 375765 506527 659634 821780
34329 821780 981419 1129642 1261335 1376156 1478004 1572361 1662569 1747305 1820799 1875449
34319 1875449 1905139 1907734 1886182 1848200 1804279 1763943 1731258 1701847 1663551 1601061 1502634
34308 1502634 1365874 1200022 1023738 859137 724313 627418 564878 524480 491530 454858
34298 454858 409919 358217 304363 252980 207170 168783 139450 121189 116301 127108 155936 204931
34286 204931 275093 364825 469535 583510 703465 831017 971565 1129414 1301845 1475648
34276 1475648 1628146 1732526 1765666 1715716 1586559 1397355 1177439 958681 767820 620868
34266 620868 520955 460002 423272 394676 360881 313437 249045 168340 74050 -30185 -139598
34255 -139598 -247454 -345344 -425485 -483973 -523129 -551618 -582355 -629154 -703500 -812372 -957335
34244 -957335 -1134566 -1335601 -1548798 -1761241 -1960238 -2133811 -2270528 -2359746 -2392792 -2364546
34234 -2364546 -2274338 -2125559 -1924421 -1678831 -1398199 -1094281 -782310 -481205 -212108 4517
34224 4517 152126 220738 208941 125456 -10349 -170328 -322225 -435673 -486946 -461137 -352336
34213 -352336 -163212 95292 404536 739788 1073212 1377871 1631635 1819736 1935362 1978653
34203 1978653 1955222 1874918 1750770 1597590 1430181 1261834 1103765 965141 852577 768805
34193 768805 711654 674811 650003 628971 604252 569458 520174 455204 376987 290649 202188
34182 202188 116653 36782 -37415 -107769 -176118 -242899 -307464 -370160 -434552 -507744 -597934
34171 -597934 -710345 -844120 -992050 -1142982 -1284891 -1406856 -1499708 -1556344 -1572668 -1549090
34161 -1549090 -1491687 -1412069 -1325612 -1248721 -1196286 -1180180 -1208682 -1286132 -1412260 -1581327 -1781855
34150 -1781855 -1997713 -2210812 -2404677 -2567705 -2695107 -2789017 -2856913 -2908933 -2955280 -3004706
34140 -3004706 -3064135 -3138455 -3229611 -3335395 -3448978 -3559779 -3655244 -3722870 -3752255 -3736959 -3675493
34129 -3675493 -3570623 -3427166 -3249771 -3042588 -2811280 -2565870 -2321822 -2097588 -1909122
34120 -1909122 -1764011 -1658789 -1581791 -1520823 -1471366 -1440016 -1440718 -1486507 -1582410 -1723486 -1897833
34109 -1897833 -2091537 -2292797 -2493901 -2690872 -2881125 -3060452 -3221275 -3353710 -3449069 -3503740
34099 -3503740 -3521205 -3511363 -3488033 -3465993 -3458146 -3472791 -3511545 -3569197 -3636343 -3703761 -3766211 -3823821
34087 -3823821 -3880884 -3943051 -4014174 -4093932 -4177029 -4253855 -4311895 -4337295 -4317038 -4242239 -4111955
34076 -4111955 -3935492 -3731283 -3521951 -3327215 -3157404 -3010350 -2873273 -2729108 -2564453
34067 -2564453 -2375279 -2167749 -1954490 -1749180 -1562544 -1400882 -1266262 -1157097 -1068747 -994478
34057 -994478 -926981 -860225 -791088 -720115 -650857 -587877 -534540 -491860 -458923 -434100 -416031
34046 -416031 -403636 -395263 -387457 -374326 -348341 -302670 -233974 -144134 -39912 69110 172887
34035 172887 262061 327490 359306 347121 281981 158989 -20829 -249860 -514038 -793634
34025 -793634 -1065271 -1305615 -1495906 -1625425 -1692108 -1700126 -1656030 -1565854 -1434624 -1267856
34015 -1267856 -1073434 -862245 -647158 -440945 -254395 -95539 29809 117033 162438 164267
34005 164267 124318 48654 -53443 -171748 -296947 -421033 -536626 -636602 -714813 -767274
33995 -767274 -792654 -791571 -765445 -715943 -645672 -559825 -467735 -383176 -322729 -302621 -335096 -425545
33983 -425545 -571166 -761410 -979941 -1207349 -1423851 -1611677 -1757218 -1852819 -1897490 -1896012
33973 -1896012 -1856708 -1789073 -1702303 -1605117 -1506416 -1415916 -1343923 -1299825 -1289797 -1314878 -1370481
33962 -1370481 -1447675 -1535684 -1624750 -1708560 -1785431 -1857655 -1929023 -2001800 -2074815 -2143630 -2202135
33951 -2202135 -2244151 -2264226 -2257856 -2221738 -2154364 -2056754 -1933110 -1790952 -1640073 -1489844 -1345364
33940 -1345364 -1204331 -1056793 -888553 -686875 -445671 -167948 135152 447811 753855
33931 753855 1040245 1298388 1523087 1710344 1855920 1955745 2007518 2011872 1972218 1893803 1783133
33920 1783133 1648005 1497220 1339239 1180338 1023700 870301 720963 578377 448290
33911 448290 339462 262139 225230 233314 285075 373826 489414 620340 755591 886266 1006964
33900 1006964 1116233 1215311 1305205 1383542 1443491 1476082 1474974 1440786 1382255 1313551 1249417
33889 1249417 1200731 1172494 1164608 1174135 1197321 1230552 1270440 1313538 1355943 1393284 1421713 1439515
33877 1439515 1447709 1448467 1442321 1426736 1397649 1353010 1295809 1234468 1180124 1142108 1123994 1122351
33865 1122351 1128724 1133648 1130580 1117999 1099047 1079360 1064758 1060222 1070154 1098651 1148966 1222439
33853 1222439 1317505 1428806 1546206 1654567 1735781 1773534 1759111 1695275 1595908 1481330
33843 1481330 1371376 1279299 1208888 1155352 1108937 1059400 999674 927705 846261 761028 677972
33832 677972 601110 531692 468717 409600 349773 281758 195706 82749 -60048 -226096 -399450
33821 -399450 -558811 -683465 -758718 -779010 -748251 -678186 -586077 -492232 -417049 -377203 -381643
33810 -381643 -428826 -506714 -596204 -677191 -735145 -765516 -774311 -774822 -782052 -806866 -851727 -909253
33798 -909253 -964018 -997078 -991627 -937654 -833685 -685224 -501392 -292267 -68247 159247
33788 159247 377492 573578 736568 859795 942617 991153 1017554 1037552 1066631 1115938 1189462
33777 1189462 1283775 1390361 1499143 1601253 1690273 1762589 1817732 1858457 1889535 1915261 1937214
33766 1937214 1954075 1963650 1965554 1962615 1960376 1965597 1985283 2027034 2099928 2214112 2378174 2595483
33754 2595483 2862193 3168437 3501715 3849905 4202160 4547961 4875852 5173263 5427998
33745 5427998 5631087 5780195 5882297 5954221 6019788 6103530 6222925 6382591 6573288 6775853
33735 6775853 6967475 7126977 7237439 7286412 7265199 7168480 6994784 6747265 6433771 6065700
33725 6065700 5656181 5218535 4765348 4307829 3855267 3415015 2993388 2596852 2232169
33716 2232169 1904871 1617008 1365928 1144920 944899 755908 568274 374264 170509
33707 170509 -39838 -246917 -436661 -595365 -714845 -796247 -850816 -896796 -953503 -1035111
33697 -1035111 -1146705 -1283834 -1435169 -1586817 -1726572 -1846893 -1946154 -2028359 -2101561 -2175224
33687 -2175224 -2256985 -2349773 -2450321 -2549860 -2637003 -2701618 -2737255 -2740157 -2705516 -2624579 -2486110
33676 -2486110 -2282000 -2013020 -1690698 -1334537 -966948 -608590 -275342 23103 283310
33667 283310 507319 701518 875170 1038143 1197744 1355843 1508006 1645179 1756748 1833213
33657 1833213 1867946 1858425 1807236 1722272 1615502 1500615 1390642 1296474 1226382 1185985 1177998
33646 1177998 1201372 1250123 1312853 1374272 1419004 1436331 1423454 1385644 1333515 1278838 1230358
33635 1230358 1190686 1155376 1115023 1059715 983350 884988 766638 629560 472061 290258
33625 290258 81109 -154256 -408813 -670318 -923824 -1154472 -1349153 -1496991 -1589767 -1623271
33615 -1623271 -1599055 -1524956 -1413366 -1278127 -1131924 -985205 -845974 -719512 -608268 -513030
33605 -513030 -435443 -380145 -354378 -364686 -412824 -493736 -597061 -711250 -827851 -943859 -1061511
33594 -1061511 -1186083 -1322507 -1471685 -1627942 -1779370 -1911459 -2012057 -2074799 -2099414 -2089679
33584 -2089679 -2050779 -1987361 -1902798 -1799685 -1681109 -1551868 -1418943 -1291050 -1177267 -1084688
33574 -1084688 -1015385 -963894 -916798 -855253 -759816 -615774 -416973 -166892 122790 434720
33564 434720 748296 1041917 1295512 1493093 1624410 1685511 1679069 1614840 1509334 1383530
33554 1383530 1259106 1154893 1084598 1055500 1067747 1114939 1186733 1272800 1366068 1463664 1565631
33543 1565631 1672755 1784676 1898760 2009851 2110973 2195024 2257051 2296407 2318197 2333598
33533 2333598 2358507 2409964 2500693 2633554 2798499 2973532 3129194 3234730 3264225 3201545
33523 3201545 3043271 2798846 2487810 2135155 1766683 1406087 1074087 788602 564429
33514 564429 411662 333409 324139 369809 450223 543209 629317 695261 734678 746147 730054
33503 730054 686586 616345 523028 415787 308846 218011 156377 132165 149616 210981 316915
33492 316915 464477 644781 843117 1042571 1229204 1395446 1539612 1662343 1762660 1836045
33482 1836045 1875302 1873451 1827206 1739467 1619670 1481846 1341347 1211564 1101479 1014454
33472 1014454 948570 898474 858034 822391 788390 753335 713078 660963 588923 490755 365793
33461 365793 220390 65777 -86643 -229928 -363888 -494443 -630721 -781037 -949052 -1131384
33451 -1131384 -1317674 -1493169 -1642947 -1756347 -1830193 -1869713 -1886598 -1894876 -1906389 -1927944 -1960947
33440 -1960947 -2002893 -2049414 -2095973 -2138882 -2175620 -2204773 -2226154 -2241409 -2254705 -2272746 -2303840
33429 -2303840 -2356451 -2437789 -2552837 -2703977 -2891170 -3112197 -3362273 -3632922 -3911053 -4179360
33419 -4179360 -4418422 -4609734 -4738598 -4796231 -4780990 -4698616 -4561246 -4384978 -4186476 -3979860
33409 -3979860 -3775125 -3578416 -3393414 -3222630 -3067667 -2928308 -2801100 -2678852 -2552108
33400 -2552108 -2412378 -2255469 -2083148 -1902548 -1724087 -1559075 -1417794 -1308266 -1235779 -1203244
33390 -1203244 -1212306 -1264512 -1361264 -1501968 -1681448 -1888966 -2110252 -2331644 -2543886 -2743655
33380 -2743655 -2932393 -3113107 -3286557 -3448662 -3590662 -3702055 -3774489 -3804225 -3791925 -3740341
33370 -3740341 -3651561 -3525579 -3361079 -3158033 -2920633 -2658957 -2388603 -2128633 -1898679 -1715948
33360 -1715948 -1592600 -1534147 -1539565 -1603302 -1718101 -1876740 -2071556 -2292413 -2525026 -2751246
33350 -2751246 -2951410 -3107799 -3207875 -3246265 -3225216 -3153966 -3047748 -2926451 -2812263 -2725852
33340 -2725852 -2681982 -2686387 -2735474 -2818886 -2923564 -3037448 -3151559 -3260361 -3361116 -3453059
33330 -3453059 -3536666 -3612897 -3682428 -3745354 -3801798 -3853043 -3901863 -3950940 -3999854 -4042853 -4069577
33319 -4069577 -4068934 -4033932 -3964591 -3867374 -3751824 -3626605 -3497058 -3364980 -3229674 -3088864
33309 -3088864 -2939033 -2775958 -2596319 -2400146 -2192730 -1984484 -1788248 -1614997 -1469880
33300 -1469880 -1350456 -1247975 -1151104 -1050487 -942036 -827395 -711503 -598889 -490954 -385476
33290 -385476 -278113 -164940 -45151 77057 192349 288180 351913 373830 349204 279323
33280 279323 171537 38257 -105063 -242706 -361701 -454104 -517520 -553512 -564829 -553028
33270 -553028 -517565 -456513 -368547 -255581 -124983 9909 131748 223212 271733 273297 234122
33259 234122 170044 104079 62590 70034 142937 285160 487027 728709 985665 1233129 1448622
33248 1448622 1613377 1713760 1742834 1701373 1597894 1447517 1269789 1085710 914451 770485
33238 770485 661943 590710 554006 546523 562202 595282 640640 693327 747463 795252 827290
33227 827290 834467 810548 753964 668023 559793 438487 313944 195366 90142 2842 -65351
33216 -65351 -116617 -156029 -190810 -228968 -277146 -338580 -412793 -497714 -592566 -698996 -819513
33205 -819513 -954706 -1101529 -1253640 -1403304 -1543928 -1672368 -1790085 -1902440 -2016400 -2138015
33195 -2138015 -2270858 -2415616 -2570283 -2730690 -2891300 -3045896 -3187500 -3307584 -3395855 -3441953
33185 -3441953 -3438922 -3386601 -3292830 -3171585 -3039023 -2909415 -2792720 -2694303 -2616018 -2557305 -2515453
33174 -2515453 -2485168 -2458371 -2425123 -2375969 -2304880 -2211261 -2099622 -1976697 -1847474 -1712390
33164 -1712390 -1567148 -1404988 -1220108 -1011063 -783467 -551203 -334757 -155977 -30676
33155 -30676 37343 57637 49292 34225 30710 49217 91268 150968 218241 282291 334188 368385
33143 368385 383748 384351 379254 380167 396956 432750 481563 530535 566081 580428 574539 556199 535588
33130 535588 521814 521781 540281 579802 639961 717074 803965 889883 961394 1005311 1013131 984514
33118 984514 927579 856213 786309 732626 706605 714839 758045 830823 922679 1020763 1113972 1196786
33106 1196786 1270464 1340585 1412268 1485811 1554680 1606138 1623847 1591686 1497975 1338819 1119183
33095 1119183 851364 551729 237251 -77101 -379709 -662378 -919215 -1144759 -1332304
33086 -1332304 -1473708 -1561350 -1591714 -1568724 -1504813 -1418786 -1331204 -1259064 -1211599 -1188408 -1180391
33075 -1180391 -1172951 -1149989 -1097074 -1003186 -861737 -671785 -439285 -177280 95872 359954
33065 359954 596659 792310 938895 1033810 1078990 1079773 1043319 976586 884383 768449 627995
33054 627995 461295 267339 46823 -197664 -461814 -739824 -1024800 -1309473 -1586911 -1850464
33044 -1850464 -2093065 -2307254 -2487320 -2632708 -2749747 -2849357 -2941793 -3032236 -3120239 -3202571
33034 -3202571 -3276413 -3340316 -3392813 -3430270 -3445734 -3429588 -3372066 -3266828 -3114081 -2921718 -2704007
33023 -2704007 -2478656 -2263513 -2073605 -1918860 -1802758 -1722408 -1670206 -1636753 -1614124 -1598246
33013 -1598246 -1589321 -1590279 -1604557 -1634771 -1682578 -1748636 -1831628 -1926841 -2025779 -2117684 -2192284 -2242197
33001 -2242197 -2263915 -2257430 -2225206 -2171063 -2099228 -2013780 -1918778 -1819089 -1721307 -1633944 -1566349
32990 -1566349 -1526573 -1519024 -1542857 -1591704 -1654774 -1718788 -1770286 -1798032 -1795247 -1760937 -1699709 -1620275
32978 -1620275 -1533627 -1451665 -1386141 -1347343 -1342496 -1374669 -1442852 -1543027 -1669162 -1813301 -1964840
32967 -1964840 -2110178 -2233917 -2321682 -2363208 -2353929 -2294165 -2186613 -2034044 -1838981 -1605582
32957 -1605582 -1342063 -1061200 -777896 -505219 -251708 -21846 180766 349901 475415
32948 475415 545319 550350 488813 369394 210663 37425 -124743 -254822 -339607 -373927 -358305
32937 -358305 -295641 -188608 -38700 153000 383785 646748 928833 1210624 1468342 1677315
32927 1677315 1815694 1867604 1825591 1692111 1479274 1206113 893889 561253 221353 -118105
32917 -118105 -452467 -777045 -1085078 -1367463 -1613756 -1813424 -1956956 -2037358 -2052380 -2006682
32907 -2006682 -1912360 -1786983 -1649771 -1517655 -1402682 -1311124 -1244007 -1198750 -1171722 -1161045
32897 -1161045 -1168245 -1197635 -1253821 -1338914 -1450736 -1581999 -1720130 -1848226 -1948110 -2005122 -2012462
32886 -2012462 -1972657 -1895441 -1793680 -1679752 -1563740 -1453092 -1352561 -1264074 -1187327 -1121635
32876 -1121635 -1067827 -1028108 -1003437 -990703 -982461 -969599 -944693 -903650 -845212 -769529 -677105
32865 -677105 -568706 -446248 -314051 -179362 -51173 62648 158506 238700 310389 382269
32855 382269 460697 547487 640599 736824 834194 932418 1031559 1130539 1226780 1317019 1398554
32844 1398554 1470165 1532444 1587588 1638739 1689075 1740998 1795927 1854891 1919347 1991225 2071738
32833 2071738 2159473 2248784 2329211 2386640 2406620 2378998 2301242 2177808 2016001 1821931 1599782
32822 1599782 1354119 1092194 823947 559954 308854 75425 -140246 -342222 -536712
32813 -536712 -729132 -921308 -1110051 -1287964 -1446372 -1579149 -1685582 -1770873 -1844176 -1915348
32803 -1915348 -1992194 -2079494 -2179697 -2293798 -2420842 -2556133 -2689718 -2806754 -2890023 -2923757
32793 -2923757 -2897815 -2811171 -2673564 -2504217 -2327667 -2168088 -2044125 -1965987 -1935472 -1948340
32783 -1948340 -1997549 -2075769 -2176406 -2293297 -2419829 -2548275 -2669764 -2774799 -2853925 -2898179
32773 -2898179 -2899311 -2850072 -2744789 -2580202 -2356406 -2077642 -1752512 -1393231 -1013937 -628650
32763 -628650 -249684 112987 451593 760214 1034742 1273157 1475747 1644867 1784266 1898392
32753 1898392 1992070 2070422 2138514 2200540 2258978 2314481 2366503 2413799 2453992 2482515 2492286
32742 2492286 2475150 2424806 2339596 2223283 2082843 1924246 1748899 1553474 1333685 1089641
32732 1089641 829264 567695 323323 112928 -51543 -163642 -221601 -227827 -189460 -118999
32722 -118999 -33476 48243 109025 136596 125531 78008 3525 -82113 -158305 -201738 -189388
32711 -189388 -102422 69657 325980 653622 1029986 1427468 1818644 2180061 2493867 2747828
32701 2747828 2934588 3050724 3095796 3071676 2982312 2833928 2635525 2399629 2142831 1885187
32691 1885187 1647734 1448518 1298657 1200252 1147064 1127567 1128926 1140341 1154814 1169285 1183414
32680 1183414 1197385 1209514 1215135 1207877 1182744 1138773 1079189 1008942 931406 846266 749547 635614
32668 635614 500354 344264 173795 -171 -166157 -315821 -445040 -551912 -633719 -685658
32658 -685658 -702367 -680861 -622517 -532896 -420073 -293093 -161509 -35589 73862 156614
32648 156614 204772 214690 188756 136602 74572 22361 -2725 8643 55355 127597 211228 292081
32636 292081 358505 402138 417827 403472 360329 293926 214999 138997 82913 60016 74862
32625 74862 121145 183293 240919 274586 271237 227781 151471 56900 -38945 -121226 -179622 -208449
32613 -208449 -205687 -172126 -110932 -27085 73569 185250 302473 419808 532145 636214
32603 636214 732517 825783 922638 1027192 1137031 1242061 1326939 1375964 1378456 1332848 1248256
32592 1248256 1142819 1039141 958455 915819 917800 962552 1041107 1139007 1238395 1321179 1373160
32581 1373160 1387702 1366957 1319908 1258411 1193501 1133374 1082878 1043622 1014244 991176 970294
32570 970294 949152 928735 913547 909618 921387 949226 988993 1033659 1075934 1110549 1135532 1152525
32558 1152525 1166354 1183883 1212116 1256333 1319684 1404899 1516751 1662490 1848764 2076472
32548 2076472 2336964 2612217 2879112 3115775 3306976 3446224 3533920 3573236 3566729 3515865
32538 3515865 3423253 3295378 3143283 2980276 2817733 2661423 2510222 2357512 2194175 2011849
32528 2011849 1805587 1575341 1325904 1065524 804291 553433 325527 134338 -6879
32519 -6879 -88407 -106781 -65749 24717 150343 294577 440765 574868 688262 779267 852434
32508 852434 916096 979634 1051607 1138889 1246239 1375724 1525678 1689533 1855607 2008830
32498 2008830 2134249 2220685 2262922 2262079 2224867 2162236 2087195 2011794 1944257 1887671 1841017
32487 1841017 1801839 1769012 1744062 1730418 1731198 1746916 1774336 1806817 1835845 1853157 1853029 1834180
32475 1834180 1800710 1761471 1727627 1708703 1708546 1723257 1742633 1754510 1749768 1725631 1686377 1641770
32463 1641770 1603886 1583106 1584682 1607510 1645815 1692709 1743305 1795416 1847609 1896382 1935075
32452 1935075 1955808 1953187 1926951 1881641 1824008 1760485 1696354 1636376 1585496 1548638 1529656
32441 1529656 1530185 1549088 1582906 1627093 1677285 1729740 1780866 1826777 1864067 1891823 1913485 1936672
32429 1936672 1970322 2020231 2085247 2156026 2217059 2251129 2244506 2191178 2094932 1968651 1831055
32418 1831055 1702122 1599228 1535433 1519614 1556929 1648379 1789476 1968702 2166612 2356630
32408 2356630 2508746 2596148 2602782 2528316 2387837 2206270 2010178 1820388 1648047 1494653
32398 1494653 1355006 1221214 1086299 946533 802428 658627 523118 405829 316523 262184
32388 262184 244861 261093 303394 363156 433796 512839 601894 704266 821448 950978 1087444
32377 1087444 1225721 1363387 1499808 1632549 1754221 1852643 1914439 1929826 1895765 1816037
32367 1816037 1698882 1554185 1392006 1222852 1058527 912173 797027 724462 701958 731438
32357 731438 808435 922812 1061343 1211470 1364648 1517802 1672361 1831595 1997724 2170137
32347 2170137 2344992 2515590 2672838 2805924 2903770 2957408 2962519 2920850 2839501 2728162
32337 2728162 2595467 2446333 2281530 2099540 1899604 1684551 1462358 1245902 1050839
32328 1050839 892067 779598 715025 689876 686935 684746 664067 613892 534531 436334 334685
32317 334685 243592 170830 116463 74635 37068 -3586 -51821 -109220 -175719 -250867 -333907
32306 -333907 -422539 -511336 -591029 -649385 -673503 -652725 -581081 -458427 -290147 -85681 143634
32295 143634 386898 635251 882058 1121622 1347459 1551394 1724300 1858242 1948821 1995962
32285 1995962 2002308 1970458 1901764 1798437 1667787 1525113 1392412 1292996 1244901 1256331 1324702
32274 1324702 1438653 1581410 1734206 1879093 2000826 2087784 2132166 2129709 2078906 1979828
32264 1979828 1833332 1641550 1409445 1145961 863537 576110 296769 35946 -199622
32255 -199622 -407191 -587560 -743869 -879837 -998005 -1098958 -1182129 -1247427 -1295954 -1328786
32245 -1328786 -1344907 -1340354 -1309714 -1249194 -1159505 -1046830 -921009 -791564 -663794 -537180
32235 -537180 -406786 -266573 -113257 50206 212481 354264 451890 483085 432887 297807
32225 297807 86934 -180344 -479100 -784051 -1073324 -1330423 -1545199 -1714351 -1840838 -1931347
32215 -1931347 -1992190 -2025617 -2028857 -1996662 -1925947 -1819887 -1689445 -1551702 -1425770 -1327834 -1267282
32204 -1267282 -1245434 -1257196 -1294602 -1350619 -1421589 -1507331 -1608951 -1726014 -1855416 -1992956
32194 -1992956 -2136309 -2286920 -2449440 -2628910 -2826875 -3037963 -3248679 -3439511 -3589698
32185 -3589698 -3682253 -3707016 -3661227 -3548741 -3378956 -3165591 -2924809 -2672601 -2422263 -2183172
32175 -2183172 -1961250 -1760307 -1583023 -1431300 -1306510 -1209881 -1142463 -1104148 -1092304 -1101152
32165 -1101152 -1122330 -1145997 -1161736 -1159154 -1128719 -1063120 -958858 -817174 -643421 -444997 -229155
32154 -229155 -2335 228725 455673 668904 859800 1023302 1159194 1271742 1368297 1457435
32144 1457435 1546844 1641317 1741483 1843646 1940541 2022657 2080037 2104507 2091897 2043515 1966458
32133 1966458 1872730 1777300 1695178 1638057 1611713 1615238 1642151 1682331 1723852 1754639 1764404 1746927
32121 1746927 1702138 1637259 1566465 1508706 1483586 1506090 1581835 1704848 1859082 2023360 2177823
32110 2177823 2309063 2411804 2487100 2539026 2572055 2589869 2594855 2587570 2566314 2527492 2467220
32099 2467220 2383816 2279975 2162966 2041965 1923536 1808007 1689192 1557758 1406094 1231791
32089 1231791 1037881 830134 613359 388853 153923 -96993 -370284 -670338 -996155
32080 -996155 -1338650 -1680454 -1998749 -2269885 -2473625 -2595826 -2629529 -2574994 -2438851 -2232357
32070 -2232357 -1968849 -1660962 -1318712 -949375 -559113 -155088 253316 654662 1036528
32061 1036528 1387164 1697732 1964428 2188764 2374867 2525151 2637516 2705888 2722924 2682607
32051 2682607 2582034 2423261 2215296 1974672 1723156 1483311 1273948 1106964 985836
32042 985836 905862 856413 824831 800285 775721 747414 713275 671497 620331 558877 488560
32031 488560 414685 346938 297362 275557 283216 311625 344419 364339 359946 328449 273730 201820
32019 201820 117113 21329 -85308 -202544 -329430 -464082 -602654 -737652 -857221 -947149
32009 -947149 -995382 -996781 -955524 -883850 -797859 -712391 -637245 -575990 -527113 -486159 -447599 -406194
31997 -406194 -358251 -302781 -241968 -180491 -124167 -78795 -49478 -39977 -51705 -82766 -127914 -179955
31985 -179955 -232368 -282163 -331576 -387336 -457341 -546187 -652039 -766912 -880308 -984021 -1075110
31974 -1075110 -1155543 -1229401 -1299826 -1367272 -1429274 -1481190 -1517539 -1533561 -1526650 -1497383 -1450046
31963 -1450046 -1392493 -1334994 -1288119 -1260387 -1256524 -1276760 -1317204 -1371258 -1431754 -1492940 -1551474
31952 -1551474 -1606295 -1657675 -1705794 -1749081 -1783166 -1801296 -1796147 -1761927 -1695645 -1597429 -1470282
31941 -1470282 -1319512 -1151888 -974706 -795284 -621058 -460015 -320645 -210713 -134868 -92188
31931 -92188 -75113 -70754 -64486 -44772 -7615 41270 87864 114625 106944 58696 -25250 -130512
31919 -130512 -237666 -327185 -382494 -390660 -342079 -230836 -56137 175913 451598 751268
31909 751268 1053672 1341024 1601793 1829554 2019277 2163979 2253703 2276952 2223843 2090090
31899 2090090 1880662 1611637 1309078 1004528 727832 499323 324546 194313 90235
31890 90235 -7058 -111073 -226359 -349034 -469180 -573545 -648102 -680485 -662005 -588551 -460041
31879 -460041 -279047 -49775 221918 527653 855469 1189371 1509908 1796055 2028409 2193151
31869 2193151 2285328 2309338 2275650 2195414 2076355 1922106 1734321 1515543 1271547 1012684
31859 1012684 753378 509165 292364 108926 -42071 -166789 -273959 -371651 -464137 -550404
31849 -550404 -625560 -684361 -724693 -749355 -765811 -784110 -813538 -859305 -920920 -992975 -1067541
31838 -1067541 -1136873 -1195711 -1242899 -1281952 -1320242 -1367035 -1431200 -1519403 -1634979 -1777310 -1941572
31827 -1941572 -2119100 -2298654 -2468521 -2618695 -2742320 -2836268 -2901188 -2941284 -2963517 -2975989
31817 -2975989 -2986029 -2998978 -3018195 -3045785 -3082955 -3129600 -3183546 -3240196 -3292805 -3333125 -3352282
31806 -3352282 -3342015 -3296173 -3211822 -3089355 -2931750 -2743915 -2532952 -2309277 -2087514 -1885707
31796 -1885707 -1722105 -1610228 -1554344 -1547807 -1575267 -1617628 -1657190 -1680851 -1680791 -1653720 -1600114 -1524032
31784 -1524032 -1432985 -1337026 -1246776 -1170838 -1113320 -1072402 -1040719 -1007855 -964082 -903493 -825010
31773 -825010 -731259 -626786 -517111 -408861 -310124 -230086 -177834 -160901 -184012 -247827 -347322
31762 -347322 -470221 -597033 -704240 -770438 -782755 -740038 -651127 -529764 -389505 -241098
31752 -241098 -92374 51001 185368 309644 425663 537226 647704 757214 860945 949795
$$ [...]
##END NTUPLES=NMR SPECTRUM
##END=
