##TITLE=31Pdec_DE-35-oil_TFAA
 CDCl3
 64 sc
 4.3.2024
##JCAMPDX= 6.0         $$ Bruker NMR JCAMP-DX V2.0
##DATA TYPE= NMR SPECTRUM
##DATA CLASS= NTUPLES
##ORIGIN= UXNMR, Bruker Analytische Messtechnik GmbH
##OWNER= root
$$ XWIN-NMR		Version 3.5
$$ Mon Mar  4 16:09:09 2024 Russian Standard Time (UT+4h)  she@DPX200
##.OBSERVE FREQUENCY= 81.013821
##.OBSERVE NUCLEUS= ^31P
##.ACQUISITION MODE= SIMULTANEOUS
##.ACQUISITION SCHEME= undefined
##.AVERAGES= 64
##.DIGITISER RES= 16
##SPECTROMETER/DATA SYSTEM= spect
##.PULSE SEQUENCE= zgpg30
##.SOLVENT NAME= CDCl3
##.SHIFT REFERENCE= (INTERNAL, CDCl3, 0, 248.564)
##AUDIT TRAIL= $$ (NUMBER, WHEN, WHO, WHERE, WHAT)
$$ ##TITLE= Audit trail, XWIN-NMR		Version 3.5
$$ ##JCAMPDX= 5.01
$$ ##ORIGIN= Bruker BioSpin GmbH
$$ ##OWNER= she
$$ F:/spectra/data/she/nmr/P31/1/pdata/1/auditp.txt
$$ ##AUDIT TRAIL=  $$ (NUMBER, WHEN, WHO, WHERE, WHAT)
(   1,<2024-03-04 16:07:53.93 +0400>,<she>,<DPX200>,
      <continue with go, POWCHK disabled, PULCHK disabled
       configuration hash MD5:
       00 E9 B6 7A A2 85 ED C7 34 08 36 98 17 FE 4E 26
       data hash MD5: 32K
       8F 2E 84 92 CD 1E 03 AA 82 D2 40 B6 FE B9 F3 27>)
(   2,<2024-03-04 16:07:55.60 +0400>,<she>,<DPX200>,
      <Start of raw data processing
       efp BC_mod = 2 LB = 10 FT_mod = 6 PKNL = 1 PHC0 = -12857.41 PHC1 = 49.28345 SI = 64K 
       data hash MD5: 64K
       A2 1B 1F 02 AA E4 BA 18 38 D7 05 32 16 F8 77 7C>)
(   3,<2024-03-04 16:08:35.51 +0400>,<she>,<DPX200>,
      <pk PHC0 = 90.58875 PHC1 = -205.4 
       data hash MD5: 64K
       D3 88 FA EA CE 80 13 62 9D 97 19 0B 5F 6E F2 B6>)
(   4,<2024-03-04 16:08:38.42 +0400>,<she>,<DPX200>,
      <abs ABSG = 5 
       data hash MD5: 64K
       43 C2 D3 BD D6 BD 6D E2 0D 8E FC 84 AC 61 F0 12>)
$$ ##END=
$$ 
$$ hash MD5
$$ 49 90 1C A5 64 10 9A 45 08 87 F2 BE 27 4D 97 29
##$RELAX= 
##$RELAX= 
##$RELAX= 
##$RELAX= 
##$RELAX= 
##$RELAX= 
##$RELAX= 
##$RELAX= 
##$RELAX= 
$$ Bruker specific parameters
$$ --------------------------
##$DU= <F:/spectra>
##$EXPNO= 1
##$NAME= <P31>
##$PROCNO= 1
##$TYPE= <nmr>
##$USER= <she>
##$AMP= (0..31)
100 100 100 100 100 100 100 100 100 100 100 100 100 100 100 100 100 100 
100 100 100 100 100 100 100 100 100 100 100 100 100 100 
##$AQSEQ= 0
##$AQ_mod= 1
##$AUNM= <au_zg>
##$AUTOPOS= <>
##$BF1= 81.014009
##$BF2= 200.13
##$BF3= 200.13
##$BF4= 200.13
##$BF5= 200.13
##$BF6= 200.13
##$BF7= 200.13
##$BF8= 200.13
##$BYTORDA= 1
##$CFDGTYP= 0
##$CFRGTYP= 5
##$CHEMSTR= <none>
##$CNST= (0..31)
1 1 145 1 1 1 1 1 1 1 1 1 1 1 1 1 1 1 1 1 1 1 1 1 1 1 1 1 1 1 1 1 
##$CPDPRG= <waltz16>
##$CPDPRG1= <>
##$CPDPRG2= <waltz16>
##$CPDPRG3= <>
##$CPDPRG4= <mlev>
##$CPDPRG5= <mlev>
##$CPDPRG6= <mlev>
##$CPDPRG7= <mlev>
##$CPDPRG8= <mlev>
##$CPDPRGB= <>
##$CPDPRGT= <>
##$D= (0..31)
0 1 0 0 0 0 0 0 0 0 0 0.03 2e-05 3e-06 0 0 0 0 0 0 0 0 0 0 0 0 0 0 0 0 
0 0 
##$DATE= 1709553997
##$DBL= (0..7)
120 120 120 11 120 120 24 19 
##$DBP= (0..7)
150 150 150 150 150 150 150 150 
##$DBP07= 0
##$DBPNAM0= <>
$$ [...]
##$SUBNAM3= <"">
##$SUBNAM4= <"">
##$SUBNAM5= <"">
##$SUBNAM6= <"">
##$SUBNAM7= <"">
##$SUBNAM8= <"">
##$SUBNAM9= <"">
##$SW= 501.771253377433
##$SWIBOX= (0..15)
0 1 3 0 0 0 0 0 0 0 0 0 0 0 0 0 
##$SW_h= 40650.406504065
##$TD= 32768
##$TD0= 1
##$TE= 0
##$TE2= 300
##$TE3= 300
##$TEG= 300
##$TL= (0..7)
0 120 53 12 22 120 120 120 
##$TP= (0..7)
150 150 150 150 150 150 150 150 
##$TP07= 0
##$TPNAME0= <>
##$TPNAME1= <>
##$TPNAME2= <>
##$TPNAME3= <>
##$TPNAME4= <>
##$TPNAME5= <>
##$TPNAME6= <>
##$TPNAME7= <>
##$TPOAL= (0..7)
0.5 0.5 0.5 0.5 0.5 0.5 0.5 0.5 
##$TPOFFS= (0..7)
0 0 0 0 0 0 0 0 
##$TUNHIN= 0
##$TUNHOUT= 0
##$TUNXOUT= 0
##$USERA1= <user>
##$USERA2= <user>
##$USERA3= <user>
##$USERA4= <user>
##$USERA5= <user>
##$V9= 5
##$VALIST= <valist>
##$VCLIST= <CCCCCCCCCCCCCCC>
##$VD= 0
##$VDLIST= <DDDDDDDDDDDDDDD>
##$VPLIST= <PPPPPPPPPPPPPPP>
##$VTLIST= <TTTTTTTTTTTTTTT>
##$WBST= 1024
##$WBSW= 4
##$XGAIN= (0..3)
0 0 0 0 
##$XL= 0
##$YL= 0
##$YMAX_a= 1787
##$YMIN_a= -3110
##$ZGOPTNS= <>
##$ZL1= 120
##$ZL2= 120
##$ZL3= 120
##$ZL4= 120
##$ABSF1= 248.5645
##$ABSF2= -253.2056
##$ABSG= 5
##$ABSL= 3
##$ALPHA= 0
##$AQORDER= 0
##$ASSFAC= 0
##$ASSFACI= 0
##$ASSFACX= 0
##$ASSWID= 0
##$AUNMP= <proc_1d>
##$AZFE= 0.1
##$AZFW= 0.5
##$BCFW= 0
##$BC_mod= 2
##$BYTORDP= 0
##$COROFFS= 0
##$CY= -3
##$DATMOD= 1
##$DC= 0
##$DFILT= <>
##$DTYPP= 0
##$F1P= 0
##$F2P= 0
##$FCOR= 1
##$FTSIZE= 65536
##$FT_mod= 6
##$GAMMA= 0
##$GB= 0
##$INTBC= 1
##$INTSCL= 6.047779e-11
##$ISEN= 30
##$LB= 10
##$LEV0= 0
##$LPBIN= 0
##$MAXI= 10000
##$MC2= 0
##$MEAN= 0
##$ME_mod= 0
##$MI= 50
##$NCOEF= 0
##$NC_proc= -9
##$NLEV= 6
##$NOISF1= 182.463
##$NOISF2= 159.3651
##$NSP= 0
##$NTH_PI= 0
##$NZP= 0
##$OFFSET= 248.5645
##$PC= 4
##$PHC0= -12766.82
##$PHC1= -156.1165
##$PH_mod= 1
##$PKNL= yes
##$PPARMOD= 0
##$PSCAL= 0
##$PSIGN= 0
##$REVERSE= no
##$SF= 81.0140089999694
##$SI= 65536
##$SIGF1= 159.3651
##$SIGF2= -187.1042
##$SINO= 113.3802
##$SIOLD= 16384
##$SREGLST= <1H.CDCl3>
##$SSB= 0
##$STSI= 65536
##$STSR= 0
##$SW_p= 40650.406504065
##$SYMM= 0
##$S_DEV= 0
##$TDeff= 32768
##$TDoff= 0
##$TI= <>
##$TILT= no
##$TM1= 0
##$TM2= 0
##$TOPLEV= 0
##$USERP1= <user>
##$USERP2= <user>
##$USERP3= <user>
##$USERP4= <user>
##$USERP5= <user>
##$WDW= 1
##$XDIM= 65536
##$YMAX_p= 279637849
##$YMIN_p= -20111152
$$ End of Bruker specific parameters
$$ ---------------------------------
##NTUPLES= NMR SPECTRUM
##VAR_NAME=  FREQUENCY,     SPECTRUM/REAL,   SPECTRUM/IMAG
##SYMBOL=    X,             R,               I
##VAR_TYPE=  INDEPENDENT,   DEPENDENT,       DEPENDENT
##VAR_FORM=  AFFN,          ASDF,            ASDF
##VAR_DIM=   65536,         65536,           65536
##UNITS=     HZ,            ARBITRARY UNITS, ARBITRARY UNITS
##FACTOR=    0.620285442955139, 1,           1
##FIRST=     20137.2065510682, 0,            0
##LAST=      -20513.1999529968, 0,           0
##MIN=       -20513.1999529968, -20111152,   0
##MAX=       20137.2065510682, 279637849,    0
$$ Real data points
##PAGE= N=1
##DATA TABLE= (X++(R..R)), XYDATA
$$ [...]
13237d497860K34811M41686O52311Q51899J022896J148772J218868J231239J192733
13228C497355J117280J023267R30020Q53351Q01145P70631P48665P15232O48989
13219A1105935N33270L61368J40318j08470l53851n64622p19435q10542q39771
13210H744200q12036p32755o09678m54693k82750j10191M4837J61369K17858J98409
13200F364570R9116o9932k87646n26938p58260r50896j074653j105093j031988
13191F58280q65663o35696l81579j40735O0035K06998K96689L30739L12443K48011
13181H9522J50987M4349m3647q7718p2746K663J25444K70070M04957N02783N49746
13170A936410N48270N12388M59877M05842L59839L26011L04453K92291K83869
$$ y = [-4497860, -4263049, -3821363, -3169052, -2317153, -1294257, -145485, 1073383, 2304622, 3497355, 4614635, 5637902, 6567922, 7421273, 8222418, 8993049, 9741714, 10456946, 11105935, 11639205, 12000573, 12140891, 12032421, 11678570, 11113948, 10394513, 9583971, 8744200, 7932164, 7199409, 6589731, 6135038, 5852288, 5742097, 5786934, 5948303, 6166161, 6364570, 6463686, 6393754, 6106108, 5579170, 4820910, 3870014, 2795361, 1690268, 658280, -207383, -843079, -1224658, -1365393, -1305358, -1098360, -801671, -470932, -158489, 89522, 240509, 284858, 241211, 153493, 80747, 83410, 208854, 478924, 883881, 1386664, 1936410, 2484680, 2997068, 3456945, 3862787, 4222626, 4548637, 4853090, 5145381, 5429250]
13161E429250K70832K43294J92724J15595J5789r6530k10008l18386m23376n31482
13151D687702o46864p65688q76140r63973j019445j040649j031455r96458r37591
13142c590561q54524p47277o17812m69761l07911j39278K4635J66731K67092L10417
13132e958249K95012K37485J68507J21066J17933J64706K50070L51035M40493
13123c811942M95249N02682M63953L93058L12356K45759K10963K13640K47134
13114g27148K98298L55574M13632M71976N29541N79416O07386N95636N30115M07528
13104D061954K38490M6445j36454k76627l49847l51596k99077k21027j41816p1425
13094B499020o803O0078J34888K16982K97083L56590L71304L20761J99077K0368
$$ y = [5429250, 5700082, 5943376, 6136100, 6251695, 6267484, 6170954, 5960946, 5642560, 5219184, 4687702, 4040838, 3275150, 2399010, 1435037, 415592, -625057, -1656512, -2652970, -3590561, -4445085, -5192362, -5810174, -6279935, -6587846, -6727124, -6702489, -6535758, -6268666, -5958249, -5663237, -5425752, -5257245, -5136179, -5018246, -4853540, -4603470, -4252435, -3811942, -3316693, -2814011, -2350058, -1957000, -1644644, -1398885, -1187922, -974282, -727148, -428850, -73276, 340356, 812332, 1341873, 1921289, 2528675, 3124311, 3654426, 4061954, 4300444, 4346889, 4210435, 3933808, 3583961, 3232365, 2933288, 2712261, 2570445, 2499020, 2492217, 2552295, 2687183, 2904165, 3201248, 3557838, 3929142, 4249903, 4448980, 4469348]
13084D469348j84982l80468n33951o24105o42612n93519m90693l53918k04990
13075D60110o4481N1794J37068J95978K41104K84285L28518L66263L84715L74205
13065B759559L34995K79224K26862J97468K01812K37176K88124L32949L54106
13056E212275L47469L23503K98528K82705K74302K63199K39050J98116J46440
13047G585587R8918P3473Q1223J17283J58476J71115J25848J1810j57872l51810
13037G914051n32943o70741p48715p67177p41815o97924o61208o48814o64207
13028A780507o97345p29660p42477p25725o82442o26968n79149n58535n79514
13019d141308o45919p45650q49674r19273r19947q34601o68401m43289j87092
$$ y = [4469348, 4284366, 3903898, 3369947, 2745842, 2103230, 1509711, 1019018, 665100, 460110, 395629, 447423, 584491, 780469, 1021573, 1305858, 1634376, 2000639, 2385354, 2759559, 3094554, 3373778, 3600640, 3798108, 3999920, 4237096, 4525220, 4858169, 5212275, 5559744, 5883247, 6181775, 6464480, 6738782, 7001981, 7241031, 7439147, 7585587, 7684505, 7757978, 7839201, 7956484, 8114960, 8286075, 8411923, 8423733, 8265861, 7914051, 7381108, 6710367, 5961652, 5194475, 4452660, 3754736, 3093528, 2444714, 1780507, 1083162, 353502, -388975, -1114700, -1797142, -2424110, -3003259, -3561794, -4141308, -4787227, -5532877, -6382551, -7301824, -8221771, -9056372, -9724773, -10168062, -10355154]
13010a0355154P5821L28690N61912P69727R45603J079075J157741J174522J134880
13001c127183J057339R66044Q80340Q07759P44133O80423O11548N40203M72395
12992C633001M09414L45354K73109J92120J08751K8662n0869j40788k52349l88193
12982D158212n38896o85958q07718q84818r04842q66837p84580o85337o02657
12973b603431n65439n87665o62518p62932q49337q83167q41417p25332n58220
12964i039458l73097j96661l8391J09744K64053M36587O26024Q15434R77032J082067
12954e336666J112606J070228R76551Q63931P60586O78558O11727N44767M66545
12945A748833L78848K95309K32634K00756J97540K09690K18023K04536J58735
$$ y = [-10355154, -10279333, -9950643, -9388731, -8619004, -7673401, -6594326, -5436585, -4262063, -3127183, -2069844, -1103800, -223460, 584299, 1328432, 2008855, 2620403, 3160606, 3633001, 4042415, 4387769, 4660878, 4852998, 4961749, 4990411, 4939542, 4798754, 4546405, 4158212, 3619316, 2933358, 2125640, 1240822, 335980, -530857, -1315437, -2000774, -2603431, -3168870, -3756535, -4419053, -5181985, -6031322, -6914489, -7755906, -8481238, -9039458, -9412555, -9609216, -9647607, -9537863, -9273810, -8837223, -8211199, -7395765, -6418733, -5336666, -4224060, -3153832, -2177281, -1313350, -552764, 125794, 737521, 1282288, 1748833, 2127681, 2422990, 2655624, 2856380, 3053920, 3263610, 3481633, 3686169, 3844904]
12936C844904Q0842j9962j31831k47145l64507m83389n95452o80586p13028o74796
12926A5050n67047m11032k38045p5535O1971J73353K65191L44582M13947M69509
12916D51944N04113N13011M98314M67550M27174L77406L14213K36673J52269P5124
12906D017791J9543n340K705L8980R2212J46960J89823K16886K36689K65654L18654
12895E540557M00615N03275O07761O91003P32966P21669O54665N38042L84749
12886A0775302K12292L8881j21301k61384l82356m91951o02594p27241q72868
12877G566780j034919j196997j335904j428070j454514j404743j279915j092927
12869b661209q64010o15069l67523j43361L5735J53673K05512J97913J45308O6629
$$ y = [3844904, 3925746, 3905784, 3773953, 3526808, 3162301, 2678912, 2083460, 1402874, 689846, 15050, -551997, -963029, -1201074, -1276609, -1214638, -1041285, -776094, -431512, -17565, 451944, 956057, 1469068, 1967382, 2434932, 2862106, 3239512, 3553725, 3790398, 3942667, 4017791, 4037334, 4031994, 4034699, 4073679, 4165891, 4312851, 4502674, 4719560, 4956249, 5221903, 5540557, 5941172, 6444447, 7052208, 7743211, 8476177, 9197846, 9852511, 10390553, 10775302, 10987594, 11026475, 10905174, 10643790, 10261434, 9769483, 9166889, 8439648, 7566780, 6531861, 5334864, 3998960, 2570890, 1116376, -288367, -1568282, -2661209, -3525219, -4140288, -4507811, -4651172, -4615437, -4461764, -4256252, -4058339, -3913031, -3846402]
12859c846402j5844p9095j05256q6897k6981O5466J79089L01228M18542N18782
12849b677368N92261O31636O31653N90679N13035M09632K96313J90717J07729
12840A286287N3992K4316L939k3220o5400j19205j73382k16574k42554k48853
12830B79346k31265j81881r5548J9777J39377K30221K66043K38691J60623O0289
12820H85673k6143o5315l7664N5439J92809L42347M72365N59567N91830N67634
12810C538542M94466L86702K62824J42342M3050k2024m8559m4168k7193j9596
12800D706386l7532q5457j56288k35026l02017l35318l14502k26991p4442J24993
12790C063806L40530N36725O81794P53653P43372O56436N11381L34957J54663
$$ y = [-3846402, -3862246, -3941341, -4046597, -4133494, -4160475, -4095009, -3915920, -3614692, -3196150, -2677368, -2085107, -1453471, -821818, -231139, 281896, 691528, 987841, 1178558, 1286287, 1340279, 1364595, 1368534, 1345314, 1279914, 1160709, 987327, 770753, 528199, 279346, 48081, -133800, -229348, -209571, -70194, 160027, 426070, 664761, 825384, 885673, 859530, 794215, 756551, 811990, 1004799, 1347146, 1819511, 2379078, 2970908, 3538542, 4033008, 4419710, 4682534, 4824876, 4867926, 4845902, 4797343, 4753175, 4725982, 4706386, 4668854, 4583397, 4427109, 4192083, 3890066, 3554748, 3240246, 3013255, 2938813, 3063806, 3404336, 3941061, 4622855, 5376508, 6119880, 6776316, 7287697, 7622654, 7777317]
12781G777317q643j44912k54805l46686m32626n24267o28488p43790q59146r56393
12771B877561j015239j019265r61883q51151p11017n76406m82670m53696m93661
12762c687427n85066o93182p75865p96245p33877n89822l83865j45975R3520L10644
12752g987160M89450O20280O98490P26236P15492O87965O69382O80141P27051
12743a972673Q00054Q75425R24020R21140Q53920P23692N43787L35334J23180
12734D127879o7872k17315l13406l55665l53633l22706k80000k41670k20329k21551
12724A533732k41708k70675k98788l22793l45845l72035m00073m20552m18328
12715a557065l78725k94453j69610j8484J39709K86798M09731N02169N64242O00459
$$ y = [7777317, 7768674, 7623762, 7368957, 7022271, 6589645, 6065378, 5436890, 4693100, 3833954, 2877561, 1862322, 843057, -118826, -969977, -1680994, -2257400, -2740070, -3193766, -3687427, -4272493, -4965675, -5741540, -6537785, -7271662, -7861484, -8245349, -8391324, -8297804, -7987160, -7497710, -6877430, -6178940, -5452704, -4737212, -4049247, -3379865, -2699724, -1972673, -1172619, -297194, 626826, 1547966, 2401886, 3125578, 3669365, 4004699, 4127879, 4060007, 3842692, 3529286, 3173621, 2819988, 2497282, 2217282, 1975612, 1755283, 1533732, 1292024, 1021349, 722561, 399768, 53923, -318112, -718185, -1138737, -1557065, -1935790, -2230243, -2399853, -2418337, -2278628, -1991830, -1582099, -1079930, -515688, 84771]
12705H4771O15937O11862N82897N18702M09732K54279O2372j45869l46135n16533
12695B132015o42091p16394p40417p18972o56363n54251m13993k42178n4990J22641
12685b484993K63918L49790L75941L52636K96864K21854J31843K6208r0916k04590
12675g61445k92539l36065l30801k90685k43209k18055k33864k89313l63560m26378
12665c785914m52344m30965l67909k78644j79988q4651PP1402J31716J87939K49639
12654d939712L24104M12027N07110N99388O78979P37919P70299P71861P39282
12645F01257O69308N59267M10091K30007L5157j54599l21626m53983n45395n94572
12635D34912o05655n88083n53422n10752m64908m19141l78996l53259l51683l81674
$$ y = [84771, 700708, 1312570, 1895467, 2414169, 2823901, 3078180, 3140552, 2994683, 2648548, 2132015, 1489924, 773530, 33113, -685859, -1342222, -1896473, -2310466, -2552644, -2607634, -2484993, -2221075, -1871285, -1495344, -1142708, -845844, -623990, -492147, -465939, -556855, -761445, -1053984, -1390049, -1720850, -2011535, -2254744, -2472799, -2706663, -2995976, -3359536, -3785914, -4238258, -4669223, -5037132, -5315776, -5495764, -5580415, -5580408, -5509006, -5377290, -5189351, -4939712, -4615608, -4203581, -3696471, -3097083, -2418104, -1680185, -909886, -138025, 601257, 1270565, 1829832, 2239923, 2469930, 2505087, 2350488, 2028862, 1574879, 1029484, 434912, -170743, -758826, -1312248, -1823000, -2287908, -2707049, -3086045, -3439304, -3790987, -4172661]
12625d172661m45159n35516o35737p20182p60525p33772o29829m57093k43767
12616i334241l1481J38854K42552K78799K66498K32461J99304J77824J65097J47911
12606g516422J10454M3300n0547j55768k50968l17922l49055l49270l31425l08603
12596i476226k88326k71693k56250k38924k17025j88530j53066j12472o8710k0274
12586a1291496L8100J09634J87506K52319K78730K47816J57958K8592j05360k06227
12576a0302428k46895k17058j20038L4018K30993M50660O65610Q45957R67849
12567g691332J019692J002836R28398Q13613O79647N50155M48505L92596L88770
12558a467120M28445M90239N46914N73967N56608M93325L95348K82562J77784
$$ y = [-4172661, -4617820, -5153336, -5789073, -6509255, -7269780, -8003552, -8633381, -9090474, -9334241, -9365722, -9226868, -8984316, -8705517, -8439019, -8206558, -8007254, -7829430, -7664333, -7516422, -7405968, -7362668, -7413215, -7568983, -7819951, -8137873, -8486928, -8836198, -9167623, -9476226, -9764552, -10036245, -10292495, -10531419, -10748444, -10936974, -11090040, -11202512, -11271222, -11291496, -11253396, -11143762, -10956256, -10703937, -10425207, -10177391, -10019433, -9990841, -10096201, -10302428, -10549323, -10766381, -10886419, -10852401, -10621408, -10170748, -9505138, -8659181, -7691332, -6671640, -5668804, -4740406, -3926793, -3247146, -2696991, -2248486, -1855890, -1467120, -1038675, -548436, -1522, 572445, 1129053, 1622378, 2017726, 2300288, 2478072]
12549B478072J01941P1524R7681J85426L32088N25427P42859R52984J119686J207892
12539G815580J190176J053695Q06372M79331J22046k10059m70709o33325o93218
12530I459889o63348n68175m37507k99380j72375o1525L8085J31829K17398K83974
12520G928865L18148L11143K62390J78187O7419o2195k04420l51315m89925o02602
12510G355695o71504o83931o35203n28609l74605j90959k739J60459K71205L11903
12500E011712K78753J80207L2572j43766l26864m96429o37966p45376q19394q62154
12490A471295q71356q38758p54986o17407m34366k22050K897K28246M45574O46654
12480i44257Q20692R54222J033719J050217J003789R04835P71344O24213M83033
$$ y = [2478072, 2580013, 2651537, 2749218, 2934644, 3266732, 3792159, 4535018, 5488002, 6607688, 7815580, 9005756, 10059451, 10865823, 11345154, 11467200, 11257141, 10786432, 10153107, 9459889, 8796541, 8228366, 7790859, 7491479, 7319104, 7257579, 7295664, 7427493, 7644891, 7928865, 8247013, 8558156, 8820546, 8998733, 9066152, 9003957, 8799537, 8448222, 7958297, 7355695, 6684191, 6000260, 5365057, 4836448, 4461843, 4270884, 4268145, 4428604, 4699809, 5011712, 5290465, 5470672, 5503244, 5359478, 5032614, 4536185, 3898219, 3152843, 2333449, 1471295, 599939, -238819, -993805, -1611212, -2045578, -2267628, -2264731, -2036485, -1590911, -944257, -123565, 830657, 1864376, 2914593, 3918382, 4823217, 5594561, 6218774, 6701807]
12471F701807L62690K70590K05013J55322J04295L3062p1405k09237l66452n21479
12461F664206o54843p55155q19166q48652q47304q18843p66449o93117o01836
12452a41159m95244l76153k49254j20987N448J36429K87289M70968O83517Q98795
12442A099649J077942J187212J212269J161424J058829R33582Q09624O98284N94906
12433I833721M81562L35850J41625j03487l85585o76406r39831j142907j266952
12424F277590j311204j286279j203561j069499q88083o67422m24374j83687K7908
12415g28611J89431K91351L37024L40164L19461K91792K66823K45752K23903J93340
12405A970430J43443O2563n6088k07169l72087n27060o54779p50830q20444q68277
$$ y = [6701807, 7064497, 7335087, 7540100, 7695422, 7799717, 7832779, 7761374, 7552137, 7185685, 6664206, 6009363, 5254208, 4435042, 3586390, 2739086, 1920243, 1153794, 460677, -141159, -636403, -1012556, -1261810, -1382797, -1377349, -1240920, -953631, -482663, 200854, 1099649, 2177591, 3364803, 4577072, 5738496, 6797325, 7730907, 8540531, 9238815, 9833721, 10315283, 10651133, 10792758, 10689271, 10303686, 9627280, 8687449, 7544542, 6277590, 4966386, 3680107, 2476546, 1407047, 518964, -148458, -572832, -756519, -728611, -539180, -247829, 89195, 429359, 748820, 1040612, 1307435, 1553187, 1777090, 1970430, 2113873, 2176436, 2120348, 1913179, 1541092, 1014032, 359253, -391577, -1212021, -2080298]
12395b080298q88479q62208p65331n82251l17026N130L46038O66692R36621J137345
12385b403767J261127J308464J286532J207770J086640R34956P59199N62813L51860
12376F355594J39014n7932k21850l41734m14478m43585m37139m05990l61543l13709
12366C496648k70651k40167k30015k45512k86337l45450m10077m63369m87504
12357E17566m69818m09309l17476k11291j03524K567J12115K33219L69602N13977
12347B37628O46562P41877P80193P55480O75716N58938M29803L16035K41512K17415
12337E601159K37731K83138L30103L59031L58675L28333K78508K28108J96644
12328H201430J94281K15590K40945K44891K07227J21640k338j44751k84304m05177
$$ y = [-2080298, -2968777, -3830985, -4596316, -5178567, -5495593, -5490463, -5144425, -4477733, -3541112, -2403767, -1142640, 165824, 1452356, 2660126, 3746766, 4681722, 5440921, 6003734, 6355594, 6494608, 6436676, 6214826, 5873092, 5458614, 5015029, 4577890, 4171900, 3810357, 3496648, 3225997, 2985830, 2755815, 2510303, 2223966, 1878516, 1468439, 1005070, 517566, 47748, -361561, -679037, -890328, -993852, -991285, -879170, -645951, -276349, 237628, 884190, 1626067, 2406260, 3161740, 3837456, 4396394, 4826197, 5142232, 5383744, 5601159, 5838890, 6122028, 6452131, 6811162, 7169837, 7498170, 7776678, 8004786, 8201430, 8395711, 8611301, 8852246, 9097137, 9304364, 9426004, 9423666, 9278915, 8994611, 8589434]
12318H589434m98309n58883n83784n71072n21392m40403l40821k41701j63732
12309D669337j22885j26468j73036k53966l54449m54727n33607n74515n71599
12300A504085n32168m73311m13917l67318l39547l32483l46013l75205m05887
12291b081764m15306l79425k81927j19426R8180L50493O11134Q53264J054800
12282c09977J202134J291902J330625J331657J309545J274027J226212J158094
12274I814219J054997R00529O83337M03566P5725k73808o13420r13605j152181
12265I979359j316532j403551j417972j369195j267008j118221r26725o97492
12257D62663m41332j76295P6117K97713M79157O20734P27652Q02520Q39893Q27124
$$ y = [8589434, 8091125, 7532242, 6948458, 6377386, 5855994, 5415591, 5074770, 4833069, 4669337, 4546452, 4419984, 4246948, 3992982, 3638533, 3183806, 2650199, 2075684, 1504085, 971917, 498606, 84689, -282629, -622176, -954659, -1300672, -1675877, -2081764, -2497070, -2876495, -3158422, -3277848, -3179668, -2829175, -2218041, -1364777, -309977, 892157, 2184059, 3514684, 4846341, 6155886, 7429913, 8656125, 9814219, 10869216, 11769745, 12453082, 12856648, 12932373, 12658565, 12045145, 11131540, 9979359, 8662827, 7259276, 5841304, 4472109, 3205101, 2086880, 1160155, 462663, 21331, -154964, -78847, 218866, 698023, 1318757, 2046409, 2848929, 3688822, 4515946]
12247D515946P52016O13331M27803K28622N4801o3521j16056j14230q4174n5262
12237F159276m8997p1460j11762j47926j58425j33178p6916l137P5698J53075
12227E636248K25166K84272L17002L10080K58904J71724O6462l7264j26005j96261
12217F910328k52740l02638l49927l93147m26808m43892m37883m05033l47797
12208C550463k77680k13818j75227j69687j86762k01734j89969j42706p3303r956
12198A909621J9777L225n1554j20407j74819j93659j68610j02933q866R2896J74307
12187A378978K06379J69506O0670j06908l08700n13109o84838p91612q15204p60069
12177b164907o51555n23221m02275l02697k27675j75502j43487j29323j31543
$$ y = [4515946, 5267962, 5881293, 6309096, 6537718, 6592519, 6528998, 6412942, 6298712, 6214538, 6159276, 6110279, 6038819, 5927057, 5779131, 5620706, 5487528, 5410612, 5407475, 5483173, 5636248, 5861414, 6145686, 6462688, 6772768, 7031672, 7203396, 7269858, 7232594, 7106589, 6910328, 6657588, 6354950, 6005023, 5611876, 5185068, 4741176, 4303293, 3898260, 3550463, 3272783, 3058965, 2883738, 2714051, 2527289, 2325555, 2135586, 1992880, 1919577, 1909621, 1929398, 1932623, 1881069, 1760662, 1585843, 1392184, 1223574, 1120641, 1111775, 1204671, 1378978, 1585357, 1754863, 1815533, 1708625, 1399925, 886816, 201978, -589634, -1404838, -2164907, -2816462, -3339683, -3741958, -4044655, -4272330, -4447832, -4591319, -4720642, -4852185]
12168d852185j49004j78717k13877k45179k65161k71278k64285k43945k07278
12159f890909j51661p9514P09P8901J49595K15482K86143L73284M84907O20274
12149d912789P67488R05162J008007J053765J028392R28041P58689N34776K77509
12140B349040J2239k35979m47895o13616p31456q03372q31918q21495p80872p21813
12130c627137o53360n76932m86734l74640k35242o8223J21401L23234N21240O94977
12120d361416Q24251Q95987R08682Q70451P92091O81563N44514L89288K30644
12111A776055Q8206j9547q1946r9667q3217m7275m255L9059Q0583J19898J56407
12100A924301J89615K19778K46835K67685K74343K55516K01966J12994j33j17036
$$ y = [-4852185, -5001189, -5179906, -5393783, -5638962, -5904123, -6175401, -6439686, -6683631, -6890909, -7042570, -7122084, -7121375, -7042474, -6892879, -6677397, -6391254, -6017970, -5533063, -4912789, -4145301, -3240139, -2232132, -1178367, -149975, 778066, 1536755, 2071531, 2349040, 2361279, 2125300, 1677405, 1063789, 332333, -471039, -1302957, -2124452, -2905324, -3627137, -4280497, -4857429, -5344163, -5718803, -5954045, -6022268, -5900867, -5577633, -5056393, -4361416, -3537165, -2641178, -1732496, -862045, -69954, 611609, 1156123, 1545411, 1776055, 1864261, 1844714, 1762768, 1663101, 1579884, 1532609, 1528354, 1567413, 1647996, 1767894, 1924301, 2113916, 2333694, 2580529, 2848214, 3122557, 3378073, 3580039, 3693033, 3692900, 3575864]
12090C575864k16542k85445l21877l32007l23881l03398k73619k35620j89585
12081A093890j35960p5846r242O7533J61080K75020M03146N27940O25962O75996
12071C609519O65507N94476M76715L37386K05706J05536M8865L5149N4713R2669
12061F226241J31387J52442J39613Q3245j5835j45491k85863m15908n19639n89551
12051D760641o26697o38182o32779o15901n86606n39514m71748l90253l13024
12042e4063k61567k49222k74127l22062l75713m22298m55112m71908m74896m72437
12032c833405m77760n02184n46439n97111o31746o29396n79265m82182l46146
12023h625634j81736j148J80832L47721M84631N81538O35477O52588O49139O47919
$$ y = [3575864, 3359322, 3073877, 2752000, 2419993, 2096112, 1792714, 1519095, 1283475, 1093890, 957930, 882084, 872842, 940375, 1101455, 1376475, 1779621, 2307561, 2933523, 3609519, 4275026, 4869502, 5346217, 5683603, 5889309, 5994845, 6043710, 6078859, 6133572, 6226241, 6357628, 6510070, 6649683, 6732928, 6717093, 6571602, 6285739, 5869831, 5350192, 4760641, 4133944, 3495762, 2862983, 2247082, 1660476, 1120962, 649214, 258961, -54063, -315630, -564852, -838979, -1161041, -1536754, -1959052, -2414164, -2886072, -3360968, -3833405, -4311165, -4813349, -5359788, -5956899, -6588645, -7218041, -7797306, -8279488, -8625634, -8807370, -8808518, -8627686, -8279965, -7795334, -7213796, -6578319, -5925731, -5276592, -4628673]
12013d628673O68956P19617P91243Q64362R18420R40260R27594Q86431Q24380
12004B912590P44397O43825N19738L76089K26487Q9727j8895r4080j40299j66134
11994E093445j78925j83885j86291j92421k06880k28566k49407k58309k48062
11985C160699k19635j79491j32417p7533j1905O2509J36435J97275K34498K42114
11975C412549K19009J69681J04641L8051j7329n4364p1853p1090n2601j7004L0216
11964C689906P5236R9153Q7341L8116l6038j15445j83279k31908k61937k75972
11954B885173k73322k50765k07918j51189r2660m6102k4093l6823r0465j84264
11944A527572l07813m40695n55713o25723o32089n71045m54713l06198j51188
$$ y = [-4628673, -3959717, -3240100, -2448857, -1584495, -666075, 274185, 1201779, 2088210, 2912590, 3656987, 4300812, 4820550, 5196639, 5423126, 5512853, 5493958, 5399878, 5259579, 5093445, 4914520, 4730635, 4544344, 4351923, 4145043, 3916477, 3667070, 3408761, 3160699, 2941064, 2761573, 2629156, 2551623, 2539718, 2602227, 2738662, 2935937, 3170435, 3412549, 3631558, 3801239, 3905880, 3943931, 3926602, 3872238, 3800385, 3729295, 3676694, 3659690, 3689906, 3765142, 3864295, 3951636, 3989752, 3953714, 3838269, 3654990, 3423082, 3161145, 2885173, 2611851, 2361086, 2153168, 2001979, 1909319, 1863217, 1839124, 1802301, 1711836, 1527572, 1219759, 779064, 223351, -402372, -1034461, -1605506, -2060219, -2366417, -2517605]
11935b517605r986J06426J95182K57451K95186L09837L01266K66366J99926R9503
11925d96448k9027j70635l06376m20182n02075n46805n50971n11970m29441l07282
11915d271212j54560J4407J80033L19074M10711M46064M34477M00163L70343L62790
11905a487710L80118M12035M41847M52805M32084L73058K77131J54790K3631r7441
11895A362348j94957k64082l06569l25445l20214k85674k15211j06046L8191K09496
11885d08163L98791N95903P86474R50292J064009J106599J064963R38600P42143
11876G239611N03015K53240J9007j85967l60220n09022o37750p47675q35503q95597
11866C843139r22561r12897q66167p86670o85212n78817m86505m22128l88583
$$ y = [-2517605, -2527591, -2421165, -2225983, -1968532, -1673346, -1363509, -1062243, -795877, -595951, -496448, -525475, -696110, -1002486, -1422668, -1924743, -2471548, -3022519, -3534489, -3963930, -4271212, -4425772, -4411365, -4231332, -3912258, -3501547, -3055483, -2621006, -2220843, -1850500, -1487710, -1107592, -695557, -253710, 199095, 631179, 1004237, 1281368, 1436158, 1459789, 1362348, 1167391, 903309, 596740, 271295, -48919, -334593, -549804, -655850, -617659, -408163, -9372, 586531, 1373005, 2323297, 3387306, 4493905, 5558868, 6497468, 7239611, 7742626, 7995866, 8014873, 7828906, 7468686, 6959664, 6321914, 5574239, 4738736, 3843139, 2920578, 2007681, 1141514, 354844, -330368, -909185, -1395690, -1817818, -2206401]
11857b206401l78014l77836l77216l68829l46431l03006k32035j30021J908J57057
11847d560824L22350M79643O10814P04307P58044P76405P64444P24897O60393
11838A240473N77673M88054M01845L21497K40979J53263N9194l0829j03705j52448
11828C195996j79664j94337k05956k20507k39752k62478k85847l06140l19123
11819I82192l20523l06782k76639k33653j88566j58868j63548k14022l05553m14786
11809a600748n06816n49822n29679m55575l52812k47734j54723p2997O681R1937
11799d372288J82993K73834L56848M25513M73629M94232M81377M34100L58620
11790h91142K65969J66022O2022m9963j75379l12889m50096n67342o46801o79317
$$ y = [-2206401, -2584415, -2962251, -3339467, -3708296, -4054727, -4357733, -4589768, -4719789, -4717881, -4560824, -4238474, -3758831, -3148017, -2443710, -1685666, -909261, -144817, 580080, 1240473, 1818146, 2306200, 2708045, 3029542, 3270521, 3423784, 3482978, 3452149, 3348444, 3195996, 3016332, 2821995, 2616039, 2395532, 2155780, 1893302, 1607455, 1301315, 982192, 661669, 354887, 78248, -155405, -343971, -502839, -666387, -880409, -1185962, -1600748, -2107564, -2657386, -3187065, -3642640, -3995452, -4243186, -4397909, -4470906, -4464225, -4372288, -4189295, -3915461, -3558613, -3133100, -2659471, -2165239, -1683862, -1249762, -891142, -625173, -459151, -397129, -447092, -622471, -935360, -1385456, -1952798, -2599599, -3278916]
11780c278916o63644o00383m88060l26413j23900R8403L11094M85673O01948O50923
11770c333275O35271N69254M76505L84116L15049K82676K88231L19850L53368
11761B91045L57998L07939J95332L6140j36287k87243l96537m64319n04168n29867
11751a129967n45919n47168n25541m77626m08459l30580k59884k10070j87498
11742d622712j88194j98395j98373j67650r0044M1820K22678M33329O44397Q24928
11732c298216R51818J014919J015599R60988Q58879P17356N48819L72986K13534
11723C356682Q9331P474l5824m8160l4972N0M9479R7823J24171J12002N8936k2678
11711C754314j16018k11868l11321m17502n25211o17708o72167o69176o00981
$$ y = [-3278916, -3942560, -4542943, -5031003, -5357416, -5481316, -5382913, -5071819, -4586146, -3984198, -3333275, -2698004, -2128750, -1652245, -1268129, -953080, -670404, -382173, -62323, 291045, 649043, 956982, 1152314, 1188454, 1052167, 764924, 368387, -95932, -600100, -1129967, -1675886, -2223054, -2748595, -3226221, -3634680, -3965260, -4225144, -4435214, -4622712, -4810906, -5009301, -5207674, -5375324, -5465368, -5423548, -5200870, -4767541, -4123144, -3298216, -2346398, -1331479, -315880, 645108, 1503987, 2221343, 2770162, 3143148, 3356682, 3446013, 3453487, 3417663, 3369503, 3334531, 3334581, 3384060, 3481883, 3606054, 3718056, 3776992, 3754314, 3638296, 3426428, 3115107, 2697605, 2172394, 1554686, 882519, 213343, -387638]
11702c87638m74885l10007j29256M8348K10485L49826M61947N45770O05499O51008
11692A571097O94575P44470P98757Q43588Q58053Q23444P32190N92622M27993
11683H086789K70011J48561Q1480O8936R4715J32909J56499J45151R0666r98j11768
11672I162951k17093k93659l27530l20830k93639k77848l03068l81268m99823
11663F248193o28322p34626p99360q20330q07049p72206p26611o78853o36405
11654c55569o04904n85829n75094n64222n43040n02295m36222l45879k41644j41300
11644d895998o2758j5797J196j673j0410r441J7410Q3647J94118L40296N00870
11633c858540O47890P55335Q06729P99404P43881O58516N62225M69606L90267
$$ y = [-387638, -862523, -1172530, -1301786, -1253438, -1042953, -693127, -231180, 314590, 920089, 1571097, 2265672, 3010142, 3808899, 4652487, 5510540, 6333984, 7066174, 7658796, 8086789, 8356800, 8505361, 8586841, 8655777, 8750492, 8883401, 9039900, 9185051, 9275717, 9274719, 9162951, 8945858, 8652199, 8324669, 8003839, 7710200, 7432352, 7129284, 6748016, 6248193, 5619871, 4885245, 4085885, 3265555, 2458506, 1686300, 959689, 280836, -355569, -960473, -1546302, -2121396, -2685618, -3228658, -3730953, -4167175, -4513054, -4754698, -4895998, -4958756, -4974553, -4973357, -4975030, -4985440, -4994881, -4977471, -4893824, -4699706, -4359410, -3858540, -3210650, -2455315, -1648586, -849182, -105301, 553215, 1115440, 1585046, 1975313]
11624A975313L30033K90651K67864K51235K28370J91648J42507R0001M5259J6147
11614C829028N203J0129K4779M0112M6440L7246J2124k3901o4268j04385j42043
11603C670464j75449k01914k18505k23289k15109j91926j49910q5489o4R5779
11593B304588J82722K39684K54748K33768K00372J85441K10971K77611L63657
11584D453562M36236M67680M47176L81235K84106J65838K7283j34190l13689m92977
11574E722260o45829p50186p97214p91657p46333o76707n97615n20498m50115
11565b53894l82891l09042k18297j06587J9390J42089K38448K88671K84177K30199
11555f7737J41758L5352p8889k00012l32246m76816o25445p59872q57195q97329
$$ y = [1975313, 2305346, 2595997, 2863861, 3115096, 3343466, 3535114, 3677621, 3767622, 3812881, 3829028, 3834231, 3844360, 3869139, 3909251, 3955691, 3992937, 4005061, 3981160, 3916892, 3812507, 3670464, 3495015, 3293101, 3074596, 2851307, 2636198, 2444272, 2294362, 2208873, 2208809, 2304588, 2487310, 2726994, 2981742, 3215510, 3415882, 3601323, 3812294, 4089905, 4453562, 4889798, 5357478, 5804654, 6185889, 6469995, 6635833, 6663116, 6528926, 6215237, 5722260, 5076431, 4326245, 3529031, 2737374, 1991041, 1314334, 716719, 196221, -253894, -636785, -945827, -1164124, -1270711, -1251321, -1109232, -870784, -582113, -297936, -67737, 74021, 109373, 30484, -169528, -501774, -978590, -1604035, -2363907, -3221102, -4118431]
11545d118431q69547p77071o38563m84384l47258k51325k05579k04613k34152
11536h130923k76649l14519l31603l14479k54274j48954n648J58580L20021M56015
11526h842433N52868O07849O23792O02086N41707M45633L28476K17583J45240
11517d777199J35650J93459L00129M20973N19926N73928N78946N45762M90481
11508a017945M26423L60443K92702K17941J27605J2796j32140l05728m95862o78618
11498a192383q22219q96573q84068p84947o14735l97319j58897P5764K86269M58998
11488d930110N87303O69262P05499O99022O56124N86404N01852M15788L41274
11479B32418K87943K58269K46160K39430K24428J89516J25995K8094j05581k68919
$$ y = [-4118431, -4987978, -5765049, -6403612, -6887996, -7235254, -7486579, -7692158, -7896771, -8130923, -8407572, -8722091, -9053694, -9368173, -9622447, -9771401, -9777049, -9618469, -9298448, -8842433, -8289565, -7681716, -7057924, -6455838, -5914131, -5468498, -5140022, -4922439, -4777199, -4641549, -4448090, -4147961, -3726988, -3207062, -2633134, -2054188, -1508426, -1017945, -591522, -231079, 61623, 279564, 407169, 419965, 287825, -17903, -513765, -1192383, -2014602, -2911175, -3795243, -4580190, -5194925, -5592244, -5751141, -5675377, -5389108, -4930110, -4342807, -3673545, -2968046, -2269024, -1612900, -1026496, -524644, -108856, 232418, 520361, 778630, 1024790, 1264220, 1488648, 1678164, 1804159, 1832253, 1726672, 1457753]
11469A457753m46471o15609p52197q36215q55132q06055o97891n51719l96095
11460d499631k57484j50546p4070j4596M4733J15255J98451K87638L73060M46047
11450c531143N00244N31309N37105N18245M77673M19625L50061K78858K20899
11441C02876J92633K05005K57728L39101M30610N12361N66857N81634N51651M80469
11431D420925L78636K59249J32776L876j27312k59533l84229m84500n41191n42050
11421B856647m87813l93215k84616j95235j56778j88091k86080m24915n64881
11412a24977o66037o99858o54658n34823l56443j42182Q3000K94825M71520N95268
11402a734365O54548O47328N82805M78794L54859K24952R4316l7651j71060l00601
$$ y = [1457753, 1011282, 395673, -356524, -1192739, -2047871, -2853926, -3551817, -4103536, -4499631, -4757115, -4907661, -4981731, -4996327, -4951594, -4836339, -4637888, -4350250, -3977190, -3531143, -3030899, -2499590, -1962485, -1444240, -966567, -546942, -196881, 81977, 302876, 495509, 700514, 958242, 1297343, 1727953, 2240314, 2807171, 3388805, 3940456, 4420925, 4799561, 5058810, 5191586, 5195462, 5068150, 4808617, 4424388, 3939888, 3398697, 2856647, 2368834, 1975619, 1691003, 1495768, 1338990, 1150899, 864819, 439904, -124977, -791014, -1490872, -2145530, -2680353, -3036796, -3178978, -3095978, -2801153, -2329633, -1734365, -1079817, -432489, 150316, 629110, 983969, 1208921, 1303237, 1265586, 1094526, 793925]
11392G93925m15527n04139n58907n78756n68314n35780m90771m42810m01390l77630
11382d080099l84451m31843n18884o29233p34975q06474q21769p71573o60124
11373i839425n03236l24132j47662N810J25517K12905K79679L40798M05673M73097
11363h970976N33055N73514N87612N77362N52805N27744N14629N20923N47773
11354d035559N90701O41838O93010P37953P71891P89043P80756P36504O47567
11345B353704N11261L34060J32090p1791k53732l95067m86328n28144n29187n01524
11335E65342m54747l91947l10489k07330q5269M3946J61438K47156K87427K80257
11325A35784K35301J68542R5627K8206k6009o2037p7733p4761n8294l4780r832
$$ y = [793925, 378398, -125741, -684648, -1263404, -1831718, -2367498, -2858269, -3301079, -3702469, -4080099, -4464550, -4896393, -5415277, -6044510, -6779485, -7585959, -8407728, -9179301, -9839425, -10342661, -10666793, -10814455, -10808645, -10683128, -10470223, -10190544, -9849746, -9444073, -8970976, -8437921, -7864407, -7276795, -6699433, -6146628, -5618884, -5104255, -4583332, -4035559, -3444858, -2803020, -2110010, -1372057, -600166, 188877, 969633, 1706137, 2353704, 2864965, 3199025, 3331115, 3259324, 3005592, 2610525, 2124197, 1596053, 1066866, 565342, 110595, -281352, -591841, -799171, -884440, -840494, -679056, -431900, -144473, 135784, 371085, 539627, 635254, 663460, 637451, 575414, 497681, 422920, 364626, 329846, 320014]
11314C20014J1527K3093J7975o249m1225o7181o1171r070Q7233K11051L37000
11303H22997M37028M85591M65825L76392K35150P5875o2031j47000j66114j28139
11293B395574n7318J8350P7287J08167J07725P6959J9433n8089j44733k26443
11283B316912k88782l20336l15379k75709k11871j42417q8896o6686p6718j05054
11273D25064j32064j44773j43044j35784j31546j31239j27730j11563p8373l2611
11263g43663J5122N4962Q3022J00864J10675J11298R8652O9681K6520k2200o4426
11252a59493r0804r9622r6651r0367q7377r1438j04546j26774j54850j82061k00619
11241a484602k04501j90896j60401j16725o5571j2061M2192R9794J64788K38116
$$ y = [320014, 331541, 354634, 372609, 366360, 325135, 257954, 196783, 187713, 274946, 485997, 822997, 1260025, 1745616, 2211441, 2587833, 2822983, 2898858, 2836827, 2689827, 2523713, 2395574, 2338256, 2356606, 2433893, 2542060, 2649785, 2726744, 2746177, 2688088, 2543355, 2316912, 2028130, 1707794, 1392415, 1116706, 904835, 762418, 673522, 606836, 530118, 425064, 293000, 148227, 5183, -130601, -262147, -393386, -521116, -632679, -711052, -743663, -728541, -673579, -590557, -489693, -379018, -267720, -169068, -99387, -72867, -95067, -159493, -250297, -349919, -446570, -536937, -624314, -715752, -820298, -947072, -1101922, -1283983, -1484602, -1689103, -1879999, -2040400, -2157125, -2222696, -2234757, -2192565, -2092771, -1927983, -1689867]
11231a689867L15393L89110M52945N03609N38728N53896N42083M94892M03841
11222B504630K62874P4229j44831l61300n35213o33521o41178n65252m32767k83979
11212g56308j61988j00226j11669j84255k85302l73949m16259l95966l16596j96507
11202c299025o1738N9712J42029J65503J20597J1443j42432l07424m41647n05431
11192d258413m73883l45943j45082Q8584L10089M80197N73144N81852N19177M12786
11182b257492K94715J91454J19723Q7216R3856J31552J85092K36815K73312K89213
11172c54544K85035K61727K17897J53238P5155J181m7282n6857l1319R062L8246
11161E51539L8733J0557l0333o2332o9689m8600o313M4043Q9571J22350J41119
$$ y = [-1689867, -1374474, -985364, -532419, -28810, 509918, 1063814, 1605897, 2100789, 2504630, 2767504, 2841733, 2696902, 2335602, 1800389, 1166868, 525690, -39562, -472329, -756308, -918296, -1018522, -1130191, -1314446, -1599748, -1973697, -2389956, -2785922, -3102518, -3299025, -3360763, -3301051, -3159022, -2993519, -2872922, -2861479, -3003911, -3311335, -3752982, -4258413, -4732296, -5078239, -5223321, -5134737, -4824648, -4344451, -3771307, -3189455, -2670278, -2257492, -1962777, -1771323, -1651600, -1564384, -1470528, -1338976, -1153884, -917069, -643757, -354544, -69509, 192218, 410115, 563353, 638508, 639689, 592407, 535550, 504231, 513293, 551539, 590272, 600829, 570496, 508164, 438475, 389875, 383562, 427605, 517176, 639526, 780645]
11150G80645J49403J51923J52355J53104J55173J56428J50238J27777Q4037K2926
11140B084009m3398j01017j41809j66788j83613k00261k18743k33165k34772k21321
11130C39122k02783j96624k15504k58229l11867l61774l99767m24737m37902m38098
11120b908163m20201l77193l04784k06355r4980R681Q8904J33311J47229J45328
11110c787223J42860J45990J49156J40292J08146M6248m6391j64268k93734m14458
11100c973382n06676n60375n78630n71512n45753m99471m26215l23614j98901
11091h184529o8051M8874J32696J69317J53067Q8257j1937j28370k38802l20219
11081h359697l51868l20316k25536q4514P1786K08701L00909L40949L38553L11867
$$ y = [780645, 930048, 1081971, 1234326, 1387430, 1542603, 1699031, 1849269, 1977046, 2061083, 2084009, 2040611, 1939594, 1797785, 1630997, 1447384, 1247123, 1028380, 795215, 560443, 339122, 136339, -60285, -275789, -534018, -845885, -1207659, -1607426, -2032163, -2470065, -2908163, -3328364, -3705557, -4010341, -4216696, -4311676, -4301995, -4213091, -4079780, -3932551, -3787223, -3644363, -3498373, -3349217, -3208925, -3100779, -3054531, -3100922, -3265190, -3558924, -3973382, -4480058, -5040433, -5619063, -6190575, -6736328, -7235799, -7662014, -7985628, -8184529, -8252580, -8203706, -8071010, -7901693, -7748626, -7660369, -7672306, -7800676, -8039478, -8359697, -8711565, -9031881, -9257417, -9341931, -9270145, -9061444, -8760535, -8419586, -8081033, -7769166]
11071g769166K75996K35035J81570J03559n670j40415k82465m07343m93151n27207
11061h829257n07325m38003l25656j77490l846J80675L60723N25773O72548Q02527
11051g739331R17475J016246J093860J143075J158413J140678J097790J039649
11043H67855R70258Q83538P66559O08132M07412J77755n5931k64734m24502n22136
11033C414206n57969n45011n05807m66781m50173m66387n10961n68227o19138
11024a276248o48192o46047o08204n32321m16474k59708o5321J54529L76666N71196
11014c350124P12050P87876Q06226P88570P60033P39669P34739P39727P39749
11005C458515P17218O58688N58144M15780K35627K6026j97209m09682n83524o97105
$$ y = [-7769166, -7493170, -7258135, -7076565, -6973006, -6978676, -7119091, -7401556, -7808899, -8302050, -8829257, -9336582, -9774585, -10100241, -10277731, -10281577, -10100902, -9740179, -9214406, -8541858, -7739331, -6821856, -5805610, -4711750, -3568675, -2410262, -1269584, -171794, 867855, 1838113, 2721651, 3488210, 4096342, 4503754, 4681509, 4625578, 4360844, 3936342, 3414206, 2856237, 2311226, 1805419, 1338638, 888465, 422078, -88883, -657110, -1276248, -1924440, -2570487, -3178691, -3711012, -4127486, -4387194, -4452515, -4297986, -3921320, -3350124, -2638074, -1850198, -1043972, -255402, 504631, 1244300, 1979039, 2718766, 3458515, 4175733, 4834421, 5392565, 5808345, 6043972, 6069998, 5872789, 5463107, 4879583, 4182478]
10995D182478p43205p30339o77363o05185n29246m55228l79779k96920k06481
10986d41268j17765m4745L043K5728L0699K6211J6729K021k1192n6649j05829
10975f83017j66358k32180k94736l43597l66706l51568k88044j71840p471J90095
10965b715422L96262N81232P17988P91417Q04655P78848P44544P27522P36311
10956C563357P59125P71867P51138O83814N69001M14468K32137L5734j59467l37030
10946G284144m82141n86633o52874o92706p21167p48902p77705q00168q02110
10937A019738p67056o83089n50128l82501k03259l3294J16552K44571L50469M28348
10927d59649M66826M56399L98290L07517K07409J19465N5799J7896l20r040j9526
$$ y = [4182478, 3439273, 2708934, 2031571, 1426386, 897140, 441912, 62133, -234787, -441268, -559033, -603778, -600735, -575007, -544308, -518097, -501368, -499347, -520539, -577188, -683017, -849375, -1081555, -1376291, -1719888, -2086594, -2438162, -2726206, -2898046, -2905517, -2715422, -2319160, -1737928, -1019940, -228523, 576132, 1354980, 2099524, 2827046, 3563357, 4322482, 5094349, 5845487, 6529301, 7098302, 7512770, 7744907, 7780641, 7621174, 7284144, 6802003, 6215370, 5562496, 4869790, 4148623, 3399721, 2622016, 1821848, 1019738, 252682, -430407, -980535, -1363036, -1566295, -1599589, -1483037, -1238466, -887997, -459649, 7177, 463576, 861866, 1169383, 1376792, 1496257, 1552056, 1569952, 1569632, 1560592, 1541066]
10916A541066m0107p1890j07593j35562j46470j37763j13494q1238m9355k6223
10906F31371k0617m1291r4790j82082k95844m20518n35880o23104o70644o77658
10896b931057o53963o16587n83470n66123n65094n71488n73745n64179n40430
10887h166136n01905m45786l66455k58358j19807M4053K19564L84731N13587N85800
10877h110712N97284N63023N07057M46423L82827L09069K22646J33160N8354J4725
10867d876144J0502M2759R6838J47996J67250J31197L1442j21873l04781m89550
10857e164364o54103p86064q81221r39829r64038r57000r22464q63929p83858
10848a2916870o83856n65972m33880k92418j45470N934J63470L29359N03231O78826
$$ y = [1541066, 1500959, 1429069, 1321476, 1185914, 1039444, 901681, 788187, 706949, 657594, 631371, 610754, 569463, 474673, 292591, -3253, -423771, -959651, -1582755, -2253399, -2931057, -3585020, -4201607, -4785077, -5351200, -5916294, -6487782, -7061527, -7625706, -8166136, -8668041, -9113827, -9480282, -9738640, -9858447, -9814394, -9594830, -9210099, -8696512, -8110712, -7513428, -6950405, -6443348, -5996925, -5614098, -5305029, -5082383, -4949223, -4890869, -4876144, -4865642, -4822883, -4726045, -4578049, -4410799, -4279602, -4248160, -4370033, -4674814, -5164364, -5818467, -6604531, -7485752, -8425581, -9389619, -10346619, -11269083, -12133012, -12916870, -13600726, -14166698, -14600578, -14892996, -15038466, -15032532, -14869062, -14539703, -14036472, -13357646]
10838a3357646Q41643R70296J043581J050860R98811R08875Q06658P10502O26196
10829e400224N49464M72855L92077L08321K25643J45428O2307l4115j51798k88926
10819c718968m32952n66128o71744p36827p52791p16566o31023n02309l36213
10810i065521j38581P9767K99305M94824O44116P36450P75770P77824P64161P56683
10800c875202P74172Q29294R24741J050500J185778J305577J387721J416706J384704
10791F383991J291845J146062R61343P53856N37370L20789J10383q3966k44303
10782A1177370l48129l79359l38303k43036j22193n013Q6563J41770J60151J46737
10772A0276558J07035M5966k9684j09861j84022k45933k96030l39220l79837m17638
$$ y = [-13357646, -12516003, -11545707, -10502126, -9451266, -8452455, -7543580, -6736922, -6026420, -5400224, -4850760, -4377905, -3985828, -3677507, -3451864, -3306436, -3244129, -3278244, -3430042, -3718968, -4151920, -4718048, -5389792, -6126619, -6879410, -7595976, -8226999, -8729308, -9065521, -9204102, -9124335, -8825030, -8330206, -7686090, -6949640, -6173870, -5396046, -4631885, -3875202, -3101030, -2271736, -1346995, -296495, 889283, 2194860, 3582581, 4999287, 6383991, 7675836, 8821898, 9783241, 10537097, 11074467, 11395256, 11505639, 11421673, 11177370, 10829241, 10449882, 10111579, 9868543, 9746350, 9741337, 9827900, 9969670, 10129821, 10276558, 10383593, 10429559, 10399875, 10290014, 10105992, 9860059, 9564029, 9224809, 8844972, 8427334]
10762H427334m48080m67007m76014m83462m99380n27882n62919n90440n94980
10753C777170n65873m99329l96693k62390j04917N9741K07182L10857L54551L43331
10743C223630L03930K72300K75204L16673L76458M20212M15678L46978K20622
10734F171685O1498r7285k25015l01345l21326k96719k51486k11910j96182k09152
10724D122763k44091k88668l30940l62464l78113l74776l51773l13147k68698
10715A210093k30879k08397k00820j97897j84439j48548q9030j7704M5182Q0137
10705E7698P6997L8149k4892r8761j74066k46364l13020l70142m12603m36927
10695a903931m44143m39740m29689m14213l84023l23381k19613p3349R7192K60585
$$ y = [8427334, 7979254, 7512247, 7036233, 6552771, 6053391, 5525509, 4962590, 4372150, 3777170, 3211297, 2711968, 2315275, 2052885, 1947968, 2007709, 2214891, 2525748, 2880299, 3223630, 3527560, 3799860, 4075064, 4391737, 4768195, 5188407, 5604085, 5951063, 6171685, 6233183, 6135898, 5910883, 5609538, 5288212, 4991493, 4740007, 4528097, 4331915, 4122763, 3878672, 3590004, 3259064, 2896600, 2518487, 2143711, 1791938, 1478791, 1210093, 979214, 770817, 569997, 372100, 187661, 39113, -49917, -67621, -22439, 57698, 134695, 172844, 147952, 49191, -124875, -371239, -684259, -1054401, -1467004, -1903931, -2348074, -2787814, -3217503, -3631716, -4015739, -4339120, -4558733, -4632082, -4534890, -4274305]
10685d274305L82823M38948M20315L35256K04653N5458q6406k02805k86596l37798
10675c350457l55054l30595k54263j23054N2299K48226M34982N85259O81756P21169
10665a689732P13082O74732O24654N77518N40726N13164M86620M49525L91520
10656C281809L07271J98653P5058m7852j50616k13844k23937j79306r3983M453
10646B957706Q2678J12540Q0153j1644j48875l14861m93687o66589q07932q88494
10636i9005q86075p96073o35055m35353k33713o0034O8288J45140J71689J54099
10626b606092J03110L3184l9457r8708j30478j25441q1503l707R8007K10468L17568
10615b323049M01758M48898M54768M28738L91178L64685L63400L86068M16441
$$ y = [-4274305, -3891482, -3452534, -3032219, -2696963, -2492310, -2436852, -2523258, -2726063, -3012659, -3350457, -3705511, -4036106, -4290369, -4413423, -4361124, -4112898, -3677916, -3092657, -2410901, -1689732, -976650, -301918, 322736, 900254, 1440980, 1954144, 2440764, 2890289, 3281809, 3589080, 3787733, 3862791, 3814939, 3664323, 3450479, 3226542, 3047236, 2953253, 2957706, 3040384, 3152924, 3233077, 3221433, 3072558, 2757697, 2264010, 1597421, 789489, -99005, -985080, -1781153, -2416208, -2851561, -3085274, -3145308, -3077020, -2931880, -2760191, -2606092, -2502982, -2469798, -2509255, -2607963, -2738441, -2863882, -2945385, -2949092, -2851085, -2640617, -2323049, -1921291, -1472393, -1017625, -588887, -197709, 166976, 530376, 916444, 1332885]
10606A332885M29959M03018L21179J83686L239j97650l90993n47631o43076o64445
10596B30171o13951n06021l61256k02761n5053N8752J22999J34970J05448N3913
10586a032789J024l8363n8856o3708o0963n9642o7942r3493j43843k24801l35831
10575b179207m65982n95255p01094p64505p72500p20482o16941m85230l55981
10566g657177k53555j87102j51574j34699j23868j10040q7479m9542J4928J18610
10556h621498K66471M47979O37646Q03767R20296R76230R78265R45894R03023
10547a741927Q71038Q64284Q86826R32367R89463J047994J099606J132226J127352
10538G209229J066118R40183P59337N51161L52083J92612Q4182J6569l2574q4038
$$ y = [1332885, 1762844, 2165862, 2487041, 2670727, 2673966, 2476316, 2085323, 1537692, 894616, 230171, -383780, -889801, -1251057, -1453818, -1508871, -1450119, -1327120, -1192150, -1086702, -1032789, -1031765, -1070128, -1128984, -1192692, -1253655, -1313297, -1381239, -1474732, -1618575, -1843376, -2179207, -2645189, -3240444, -3941538, -4706043, -5478543, -6199025, -6815966, -7301196, -7657177, -7910732, -8097834, -8249408, -8384107, -8507975, -8618015, -8705494, -8755036, -8740108, -8621498, -8355027, -7907048, -7269402, -6465635, -5545339, -4569109, -3590844, -2644950, -1741927, -870889, -6605, 880221, 1812588, 2802051, 3850045, 4949651, 6081877, 7209229, 8275347, 9215530, 9974867, 10526028, 10878111, 11070723, 11154905, 11171474, 11138900, 11054862]
10528A1054862j48340k24399l02786l70426m14452m24152l92609l19683k14563
10519H243452r4245K1737J16789J81747K18939K43640K80057L54810M93657P20657
10509A0781240J054019J498740K043317K664468L336930M044793M791308N600651
10501C5815466O507304P541466Q723760J0069480J1591233J3295900J5179907
10494A08724516J7218497J9337759K1370990K3013866K3794099K3092169K0287190
10487B56839086J5062222P736541o48655q655702j5025280j9120506k0988210
10480B15199496k1108644k0085169j8446931j6576767j4709742j2965029j1388784
10473I9918430r986252q737414p609684o575115n622319m755258l985666l327582
$$ y = [11054862, 10906522, 10682123, 10379337, 10008911, 9594459, 9170307, 8777698, 8458015, 8243452, 8149207, 8170944, 8287733, 8469480, 8688419, 8932059, 9212116, 9566926, 10060583, 10781240, 11835259, 13333999, 15377316, 18041784, 21378714, 25423507, 30214815, 35815466, 42322770, 49864236, 58587996, 68657476, 80248709, 93544609, 108724516, 125943013, 145280772, 166651762, 189665628, 213459727, 236551896, 256839086, 271901308, 279637849, 278989194, 270333492, 255308212, 236187706, 215199496, 194090852, 174005683, 155558752, 138981985, 124272243, 111307214, 99918430, 89932178, 81194764, 73585080, 67009965, 61387646, 56632388, 52646722, 49319140]
10465D9319140k793302k388406k108525j939831j860831j844890j865794j904716
10457C2612845j952309k003912k053175k089572k100231k074178k006777j900807
10449A6431884j762839j599475j418989j236302j073450r52698q87235q74957
10441F625939q97667r26694r34017r02637q28682p15741n69257l95787k04482
10432B50975p187J82268L48163M73715N44176N51276M97177L95694K68340J35099
10422C639696N869j19850k44946l66311m73260n52669n96574o07638n98462n83402
10412d97547n68259n47069n08902m47501l64850k67639j62422n3913N3857J56118
10402c208127K46789L17729L56780L46793K70185J19716r2305l35777n75452p83759
$$ y = [49319140, 46525838, 44137432, 42028907, 40089076, 38228245, 36383355, 34517561, 32612845, 30660536, 28656624, 26603449, 24513877, 22413646, 20339468, 18332691, 16431884, 14669045, 13069570, 11650581, 10414279, 9340829, 8388131, 7500896, 6625939, 5728272, 4801578, 3867561, 2964924, 2136242, 1420501, 851244, 455457, 250975, 243788, 426056, 774219, 1247934, 1792110, 2343386, 2840563, 3236257, 3504597, 3639696, 3645565, 3525715, 3280769, 2914458, 2441198, 1888529, 1291955, 684317, 85855, -497547, -1065806, -1612875, -2121777, -2569278, -2934128, -3201767, -3364189, -3418102, -3364245, -3208127, -2961338, -2643609, -2286829, -1940036, -1669851, -1550135, -1642440, -1978217, -2553669, -3337428]
10392c337428r44512j048339j087153j052635r39159p49319m99023k18096N5733
10383i819931K87049M51788N41539N62933N34211M80869M30574M06492M19947
10374e704529M66253N27329N79692O02795N84352N22899M27938L16944K09814
10365a466513J23604O9328N0239O1840R5224J42637K00197K65206L32183L93139
10355B67084M41559M74541M91234M91247M76718M56045M44191M57056N03045N77390
10345E080110O62751P35353P73109P62472P01828O00355M73094L35507K00912
10336A0325491Q0597j6292q3977j20630j27294j07170o6529j4920L7499Q3819
10326I990594J21695J51602J74288J88792J90667J71044J18443K3381j17234k98519
$$ y = [-3337428, -4281940, -5330279, -6417432, -7470067, -8409226, -9158545, -9657568, -9875664, -9819931, -9532882, -9081094, -8539555, -7976622, -7442411, -6961542, -6530968, -6124476, -5704529, -5238276, -4710947, -4131255, -3528460, -2944108, -2421209, -1993271, -1676327, -1466513, -1342909, -1273581, -1223342, -1161502, -1066278, -923641, -723444, -458238, -126055, 267084, 708643, 1183184, 1674418, 2165665, 2642383, 3098428, 3542619, 3999675, 4502720, 5080110, 5742861, 6478214, 7251323, 8013795, 8715623, 9315978, 9789072, 10124579, 10325491, 10406088, 10389796, 10305819, 10185189, 10057895, 9950725, 9884196, 9869276, 9906775, 9990594, 10112289, 10263891, 10438179, 10626971, 10817638, 10988682, 11107125, 11130506, 11013272, 10714753]
10316A0714753n08375p28360r34264j098573j196479j213622j150346j019107
10308B865627q37103o20627l85105j48744O5767K34414L38564L71639L42392K72914
10298B499738J91777J25444R1793R7718J40338K10223K95015L82011M59345N16467
10288E009869N44799N38259M93068M07648K83831J28560m6217k26568m00494n60033
10278F172722p00742q19290r10274r63863r67292r11887q01886o57014n04383
10269a063909l64942k45069j38664l5444P1838J83969K94402L90227M55606M76855
10259B4869M47074L69670K60262J44545N0147l681j1197K1999Q3254J54945K16733
10248A758620K50985K47962K05660J26169J5099j15234k45930l58864m45852n11014
$$ y = [10714753, 10206378, 9478018, 8543754, 7445181, 6248702, 5035080, 3884734, 2865627, 2028524, 1407897, 1022792, 874048, 939815, 1174229, 1512793, 1884432, 2226824, 2499738, 2691515, 2816959, 2908752, 3006470, 3146808, 3357031, 3652046, 4034057, 4493402, 5009869, 5554668, 6092927, 6585995, 6993643, 7277474, 7406034, 7359817, 7133249, 6732755, 6172722, 5471980, 4652690, 3742416, 2778553, 1811261, 899374, 97488, -559526, -1063909, -1428851, -1673920, -1812584, -1848028, -1776190, -1592221, -1297819, -907592, -451986, 24869, 471943, 841613, 1101875, 1246420, 1296567, 1292886, 1281689, 1303688, 1386942, 1541887, 1758620, 2009605, 2257567, 2463227, 2589396, 2604495, 2489261, 2243331, 1884467, 1438615, 927601]
10238I27601n65063o17349o71369p24587p70791q02928q15043q02783p63448o97120
10228f302880o09006n10823m18582l46659l01300k78083k65125k49618k23011
10219i505087j82386j29002o6454N67O7614J32563J97678K69303L53690M50733
10209h410781N50771O38042O98269P23396P09820O54072N52738M07862K31873
10200c243938M6063j26766k69269l71553m29069m40247m05660l28006k12628o9823
10190e850896Q1637K13947K96479L06953K40670J12344m9365k10850l42938m28563
10180e630582m66381m68114m50233m24200l90871l41860k66175j57611j9261J36046
10170h479242K89228M22214N26603O07900O80106P53759Q28052Q94459R47023
$$ y = [927601, 362538, -254811, -926180, -1650767, -2421558, -3224486, -4039529, -4842312, -5605760, -6302880, -6911886, -7422709, -7841291, -8187950, -8489250, -8767333, -9032458, -9282076, -9505087, -9687473, -9816475, -9882929, -9882362, -9814748, -9682185, -9484507, -9215204, -8861514, -8410781, -7860010, -7221968, -6523699, -5800303, -5090483, -4436411, -3883673, -3475811, -3243938, -3197875, -3324641, -3593910, -3965463, -4394532, -4834779, -5240439, -5568445, -5781073, -5850896, -5769259, -5555312, -5258833, -4951880, -4711210, -4598866, -4648231, -4859081, -5202019, -5630582, -6096963, -6565077, -7015310, -7439510, -7830381, -8172241, -8438416, -8596027, -8615288, -8479242, -8190014, -7767800, -7241197, -6633297, -5953191, -5199432, -4371380, -3476921, -2529898]
10161b529898R87819J022625J053032J073194J072300J038185R59275Q26507O37101
10152F140140L99425J36037j17701l20743m37632m49444l59082j89076K5889K47996
10142E075809M44572N94327O90129P36968P45604P24755O76500N98225M90078
10133A0776967L61633K31314J18515L5113j7382m5255n8780o8842q2763r9741
10123A1150779j09936r9985o2288k117O1593J02088R4854K7699r4123k50867m17579
10112A0400118n73407p05356q05932q69157q89600q65322q01328p09499o03989
10103C576528m94783l83144k61220j15642O6565K91818N55286Q38742J112027
10094E186177J338994J487033J535890J480683J327798J088506P76643M11982
$$ y = [-2529898, -1542079, -519454, 533578, 1606772, 2679072, 3717257, 4676532, 5503039, 6140140, 6539565, 6675602, 6557901, 6237158, 5799526, 5350082, 4991000, 4801924, 4827813, 5075809, 5520381, 6114708, 6804837, 7541805, 8287409, 9012164, 9688664, 10286889, 10776967, 11138600, 11369914, 11488429, 11523542, 11506160, 11460905, 11402125, 11333283, 11250520, 11150779, 11040843, 10940858, 10878570, 10876453, 10938046, 11040134, 11134988, 11162687, 11068564, 10817697, 10400118, 9826711, 9121355, 8315423, 7446266, 6556666, 5691344, 4890016, 4180517, 3576528, 3081745, 2698601, 2437381, 2321739, 2388304, 2680122, 3235408, 4074150, 5186177, 6525171, 8012204, 9548094, 11028777, 12356575, 13445081, 14221724, 14633706]
10086A4633706K4453l47248o64572r01065j049884j122334j138982j119450j076420
10077G238204j015219r36626q39907p24801n93333m52473l16635k06865j44793
10068B007552j43870k03211l06993m27895n32436n88324n73741m85089l38632
10059a592639j65273j308J22124J88989K03925J88641J69471J63771J73639J89041
10049c59619J96101J85491J57620J22220R1660P1818N7816L8656O722l6284q1519
10038D50682j19965j47455j64692j74688j80888j86002j89598j84784j57514r1157
10028a146061K5477J91682L93363O06284Q01615R52246J039286J057383J016086
10019D937361R35188Q35564P30402O21098M98919L50597J65852n5306k98236n34820
$$ y = [14633706, 14658159, 14310911, 13646339, 12745274, 11695390, 10573056, 9434074, 8314624, 7238204, 6222985, 5286359, 4446452, 3721651, 3128318, 2675845, 2359210, 2152345, 2007552, 1863682, 1660471, 1353478, 925583, 393147, -195177, -768918, -1254007, -1592639, -1757912, -1759220, -1637096, -1448107, -1244182, -1055541, -886070, -722299, -548660, -359619, -163518, 21973, 179593, 301813, 393473, 465291, 523107, 561763, 568485, 532201, 450682, 330717, 183262, 18570, -156118, -337006, -523008, -712606, -897390, -1054904, -1146061, -1120584, -928902, -535539, 70745, 872360, 1824606, 2863892, 3921275, 4937361, 5872549, 6708113, 7438515, 8059613, 8558532, 8909129, 9074981, 9019675, 8721439, 8186619]
10009H186619p30249q53198q86379q34116p22619n90313m71352l81410l14342
10000B402641k51348j76782r1263j4148K6660J1342o0332j69970k91136l99902
9990I85762m78875n15763n01819m33731l18057j73604k7724R2589J68994J94163
9980a008065J69232J01401M327j01090j89409k37799k34623j84018j02088o607
9970a788739R0752J81726K51865K77277K35840J25414k7230j75851k76697l08545
9960a414188k79131k16130j50086r9803o6957m0201n036M5741J06392J60818J91204
9949a767377J85985J42355O5167l3768j36206k21614k75553k97286l00453l05224
9939b943974l25986l61917l96501m06369l73498k93501j77080m6224P2500J56246
$$ y = [8186619, 7456370, 6603172, 5716793, 4882677, 4160058, 3569745, 3098393, 2716983, 2402641, 2151293, 1974511, 1883248, 1869100, 1895760, 1907102, 1846770, 1676800, 1385664, 985762, 506887, -8876, -510695, -944426, -1262483, -1436087, -1463811, -1371222, -1202228, -1008065, -838833, -737432, -733105, -834195, -1023604, -1261403, -1496026, -1680044, -1782132, -1788739, -1697987, -1516261, -1264396, -987119, -751279, -625865, -653095, -828946, -1105643, -1414188, -1693319, -1909449, -2059535, -2159338, -2226295, -2266496, -2271532, -2225791, -2119399, -1958581, -1767377, -1581392, -1439037, -1373870, -1407638, -1543844, -1765458, -2041011, -2338297, -2638750, -2943974, -3269960, -3631877, -4028378, -4434747, -4808245, -5101746, -5278826, -5325050, -5252550, -5096304]
9929e096304J93540J87942J55662J18008R2138Q4330Q9069R4129Q8468O8774M2234
9918c882010K4164L0325O7222J27746J96994K64363L31731M10674N10419O25215
9908a293157P30986P95944P99324P44719O59173N82146N54233O09332P67707J028806
9898E979213J364013J707609J951971J968359J667347J069235L20408l76200q70068
9889A4781887j127254j212202j223292j239468j300337j408761j542632j671358
9881D056583j770668j827129j832433j777076j650696j447589j172274q41753
9873h263035m83036j26666J99281M70704O66660P72281P85912P23488O14254M90470
9863d149687L78675K96577K54076K55207K99462L82079M92980O14690P21882P85984
$$ y = [-5096304, -4902764, -4714822, -4559160, -4441152, -4349014, -4264684, -4175615, -4081486, -3993018, -3924244, -3882010, -3857846, -3827521, -3760299, -3632553, -3435559, -3171196, -2839465, -2428791, -1918372, -1293157, -562171, 233773, 1033097, 1777816, 2436989, 3019135, 3573368, 4182700, 4950407, 5979213, 7343226, 9050835, 11002806, 12971165, 14638512, 15707747, 16028155, 15651955, 14781887, 13654633, 12442431, 11219139, 9979671, 8679334, 7270573, 5727941, 4056583, 2285915, 458786, -1373647, -3150723, -4801419, -6249008, -7421282, -8263035, -8746071, -8872737, -8673456, -8202752, -7536092, -6763811, -5977899, -5254411, -4640157, -4149687, -3771012, -3474435, -3220359, -2965152, -2665690, -2283611, -1790631, -1175941, -454059, 331925]
9853C31925P84927P12544N80332M10299K25306M4143j18215k50412l47678m14927
9843A958244m64653n08361n46778n66518n46901m72740l44185j77528J812J68792
9833a498816L06375M09226M82141N33232N65801N74880N51228M89491L94114K78861
9823C086533J60360N0095m9844j44423k38794l32016m15554m76729n04069m91041
9813F44518m37104l47745k35054j17475j5727N4693Q9282R4510Q3989P5230Q6890
9802b3993J33061K15688L22207M32478N29234O02697O47391O57968O29893N63297
9792D709921M64200L41195K01073M7462j17073k88034m57288o13151p42120q32004
9782B714181q75333q70670q20507p27091n89413m04163j71525R6301L69220O02534
$$ y = [331925, 1116852, 1829396, 2409728, 2820027, 3045333, 3089476, 2971261, 2720849, 2373171, 1958244, 1493591, 985230, 438452, -128066, -674967, -1147707, -1491892, -1669420, -1667608, -1498816, -1192441, -783215, -301074, 232158, 797959, 1372839, 1924067, 2413558, 2807672, 3086533, 3246893, 3296988, 3247144, 3102721, 2863927, 2531911, 2116357, 1639628, 1135559, 644518, 207414, -140331, -375385, -492860, -508587, -453894, -364612, -270102, -186113, -110883, -23993, 109068, 324756, 646963, 1079441, 1608675, 2211372, 2858763, 3516731, 4146624, 4709921, 5174121, 5515316, 5716389, 5763851, 5646778, 5358744, 4901456, 4288305, 3546185, 2714181, 1838848, 968178, 147671, -579420, -1168833, -1572996, -1744521, -1648220, -1279000, -676466]
9772f76466P50834P85073P01941N21293K77006Q875k42494m40275n56748n77683
9762E51356n04318l52859j51262O7264K72676M44819N74947O61870P05553P02331
9752B972377O45270N30354L64706J70385k0397j76741k80610l32014l45741l42385
9742C185204l39041l44246l58337l76900l93949m03182l98309l74441l31312k76697
9732d11210k26539j99755k09594k56983l30525m12583m86204n38243n58994n42064
9722d172694m86620l99849k96094j92093j01448l1606J6115M5227O2759P7489
9712e478814R7186J25559J60613J95218K19586K25054K08971J79308J55178J59395
9702c752746K04325K79819L53947L89299L64866K87736J86430R2270K3810j5736
$$ y = [-676466, 74368, 859441, 1561382, 2082675, 2359681, 2368556, 2126062, 1685787, 1129039, 551356, 47038, -305821, -457083, -389819, -117143, 327676, 902623, 1564493, 2270046, 2972377, 3617647, 4148001, 4512707, 4683092, 4662695, 4485954, 4205344, 3873330, 3527589, 3185204, 2846163, 2501917, 2143580, 1766680, 1372731, 969549, 571240, 196799, -134513, -411210, -637749, -837504, -1047098, -1304081, -1634606, -2047189, -2533393, -3071636, -3630630, -4172694, -4659314, -5059163, -5355257, -5547350, -5648798, -5680404, -5664289, -5619062, -5556303, -5478814, -5381628, -5256069, -5095456, -4900238, -4680652, -4455598, -4246627, -4067319, -3912141, -3752746, -3548421, -3268602, -2914655, -2525356, -2160490, -1872754, -1686324, -1594054, -1570244, -1585980]
9692a585980l0507k3506N028N3283J13347J71430K13226K31317K29720K22283
9682d00359K25359K49412K94873L54449M19448M85464N53523O26141P01005P66602
9672D275917Q03112P89440P14234N85701M33107K95814K04501J66954J68585J85857
9662H623222K00897K07416K07691K06621K07158K07435J99077J67847R8514j6519
9652A0309359j68911l32723m73041n61035n85298n51333m71052l52158j96229
9643F617579n601K07660M18093N91146O93249P02551O15525M47204K25958j4288
9633A0499076k41586m31568n70865o58483p05329p31750p63276q24723r32721
9624D638775j087592j268276j435609j545641j567118j492640j337459j128927
$$ y = [-1585980, -1616487, -1639993, -1634965, -1581682, -1468335, -1296905, -1083679, -852362, -622642, -400359, -175000, 74412, 369285, 723734, 1143182, 1628646, 2182169, 2808310, 3509315, 4275917, 5079029, 5868469, 6582703, 7168404, 7601511, 7897325, 8101826, 8268780, 8437365, 8623222, 8824119, 9031535, 9239226, 9445847, 9653005, 9860440, 10059517, 10227364, 10325878, 10309359, 10140448, 9807725, 9334684, 8773649, 8188351, 7637018, 7165966, 6813808, 6617579, 6611978, 6819638, 7237731, 7828877, 8522126, 9224677, 9840202, 10287406, 10513364, 10499076, 10257490, 9825922, 9255057, 8596574, 7891245, 7159495, 6396219, 5571496, 4638775, 3551183, 2282907, 847298, -698343, -2265461, -3758101, -5095560, -6224487]
9616f224487q95014o57869m32268k25577l7176J41462L23542N20212P33706R54754
9606e798715J165163J342410J463304J507365J461795J326746J116792Q57107
9598D441967N77369L07135P2711j06611k22921k81484k97345k87738k64511k30814
9588C707758j83886j21682m8385K5414Q7567J29677J48460J43077J12847N9216
9578D060063r030p3242j10069j02132m5906M9598J71059L07772M52105N95448
9568E295666P25130Q24886Q78482Q74890Q12825P01740N57649L96189K27780N7463
9558A1352700j12068k77062m30389n60701o53852o97439o87253o32319n54505
9549F747112m81008m32597m14401m15195m15242l96759l50461k76455j81922p8526
$$ y = [-6224487, -7119501, -7777370, -8209638, -8435215, -8472391, -8330929, -8007387, -7487175, -6753469, -5798715, -4633552, -3291142, -1827838, -320473, 1141322, 2468068, 3584860, 4441967, 5019336, 5326471, 5399182, 5292571, 5069650, 4788166, 4490821, 4203083, 3938572, 3707758, 3523872, 3402190, 3353805, 3379219, 3466786, 3596463, 3744923, 3888000, 4000847, 4060063, 4051033, 3977791, 3867722, 3765590, 3719684, 3769282, 3940341, 4248113, 4700218, 5295666, 6020796, 6845682, 7724164, 8599054, 9411879, 10113619, 10671268, 11067457, 11295237, 11352700, 11240632, 10963570, 10533181, 9972480, 9318628, 8621189, 7933936, 7301617, 6747112, 6266104, 5833507, 5419106, 5003911, 4588669, 4191910, 3841449, 3564994, 3383072, 3304546]
9539C304546J9699R8435J45362J52252J16201L9596p0755k04238l46369m79321
9529B775408n84961o50092o70740o52098o04024n35253m49804l47125k25377q6278
9519b030344O0922J99396L09986L79204M04483L92816L54224K95628K19966J30855
9509G17136L8759l6511o9613l8145O8680K44873M66892O96623Q88155R98394R98954
9498D974197Q84162O71376L94440R4598j87492m17840n74241o50042o54656o09145
9488C925357n38167m62202l93315l34584k81657k25923j60000q4251j0116M3213
9478A478355N7705K5975m3873j30528k07984k55890k65824k40199j86713j14489
9468A16535l4629L8243Q8188J03844Q3766L7584j7098o0465p7328o2831k3836
$$ y = [3304546, 3324245, 3422680, 3568042, 3720294, 3836495, 3876091, 3805336, 3601098, 3254729, 2775408, 2190447, 1540355, 869615, 217517, -386507, -921760, -1371564, -1718689, -1944066, -2030344, -1969422, -1770026, -1460040, -1080836, -676353, -283537, 70687, 366315, 586281, 717136, 755895, 719384, 649771, 611626, 680306, 925179, 1392071, 2088694, 2976849, 3975243, 4974197, 5858359, 6529735, 6924175, 7018773, 6831281, 6413441, 5839200, 5189158, 4534502, 3925357, 3387190, 2924988, 2531673, 2197089, 1915432, 1689509, 1529509, 1445258, 1435142, 1478355, 1536060, 1562035, 1518162, 1387634, 1179650, 923760, 657936, 417737, 231024, 116535, 81906, 120149, 208337, 312181, 395947, 433531, 416433, 355968, 278640, 215809, 191973]
9457A91973K5372P0229J00968J13651J09538R5350Q3299Q7609J17214J69004K26903
9446A391110K68099K72684K31334J47808L6634q1896j87514k65841l13016l36902
9436A162500l52793l74921m08043m43901m64663m51643l95067k99776j83454o8333
9426b280094K8831J02854J59769K11160K66243L25022L75577L97655L72037K91134
9416B50188J64481J5469j28195k43777l17512l43856l23577k62927j72889o7301
9406a429896L9997J38055K20995K88518L43630L88908M24821M51482M70482M83190
9396A820182M87123M75880M44385L94210L33726K73527K22190J85259J66183J66627
9386D969292J85471K17340K51912K74595K68824K19560J17741l4655k20608m08513
$$ y = [191973, 217345, 287574, 388542, 502193, 611731, 707081, 790380, 877989, 995203, 1164207, 1391110, 1659209, 1931893, 2163227, 2311035, 2347669, 2265773, 2078259, 1812418, 1499402, 1162500, 809707, 434786, 26743, -417158, -881821, -1333464, -1728531, -2028307, -2211761, -2280094, -2251263, -2148409, -1988640, -1777480, -1511237, -1186215, -810638, -412983, -40946, 250188, 414669, 430138, 301943, 58166, -259346, -603202, -926779, -1189706, -1362595, -1429896, -1389899, -1251844, -1030849, -742331, -398701, -9793, 415028, 866510, 1336992, 1820182, 2307305, 2783185, 3227570, 3621780, 3955506, 4229033, 4451223, 4636482, 4802665, 4969292, 5154763, 5372103, 5624015, 5898610, 6167434, 6386994, 6504735, 6470080, 6249472, 5840959]
9376E840959n59314o38178o25126n20234l43017j27655Q5032K57941L67158M06050
9366D143616L82033L09264K02603P6024n5717j75870k67867l20558l33045l15198
9356C645285k82797k50518k27352k16561k18443k32655k58475k93352l31318l62659
9346I71155l75700l60097l09992k25770j14398J1532J37112K50708L48457M33404
9336G66411N09379N75413O25193O49864O39986N86766M85708L41795J70033j1254
9326E339294j88389l53801n01344o22990p11164p63315p83552p80563p64471p44346
9316h74641p26755p15828p14457p24384p43476p62308p64019p29281o44614n10990
9306g910753l49182j97127r6534p2977j20942k04254k72221k81594k12259p0176
$$ y = [5840959, 5281645, 4643467, 4018341, 3498107, 3155090, 3027435, 3112467, 3370408, 3737566, 4143616, 4525649, 4834913, 5037516, 5113540, 5057823, 4881953, 4614086, 4293528, 3960483, 3645285, 3362488, 3111970, 2884618, 2668057, 2449614, 2216959, 1958484, 1665132, 1333814, 971155, 595455, 235358, -74634, -300404, -414802, -403270, -266158, -15450, 333007, 766411, 1275790, 1851203, 2476396, 3126260, 3766246, 4353012, 4838720, 5180515, 5350548, 5339294, 5150905, 4797104, 4295760, 3672770, 2961606, 2198291, 1414739, 634176, -130295, -874641, -1601396, -2317224, -3031681, -3756065, -4499541, -5261849, -6025868, -6755149, -7399763, -7910753, -8259935, -8457062, -8553596, -8626573, -8747515, -8951769, -9223990, -9505584, -9717843, -9788019]
9296i788019J20537L29553N29531O99842Q26356R00188R16856Q75971P81784O44897
9286c162504M84050L25023J94499J10526P4889P2305P6485N8922l152j19883k83095
9275b171935m65532o29346p41484p86087p65521o91509n75580m26116k51719o5478
9265g570307J15015K72800L98145M90886N56050N96380O08233N83719N16417M06308
9255c026354K61931R9708n9171j93512k86666l28802l16672k52125j41184N427
9245d237420J70645L30604M57985N29648N35362M82744L95207L03123K32067J93711
9235f06324J83778J87267J87306J73342J45816J15547R7136R9237J18582J43173
9225H44860J62047J72975J81708J94546K11032K21545K10208J61007O4915p4219
$$ y = [-9788019, -9667482, -9337929, -8808398, -8108556, -7282200, -6382012, -5465156, -4589185, -3807401, -3162504, -2678454, -2353431, -2158932, -2048406, -1973517, -1901212, -1824727, -1765805, -1768957, -1888840, -2171935, -2637467, -3266813, -4008297, -4794384, -5559905, -6251414, -6826994, -7253110, -7504829, -7570307, -7455292, -7182492, -6784347, -6293461, -5737411, -5141031, -4532798, -3949079, -3432662, -3026354, -2764423, -2664715, -2723886, -2917398, -3204064, -3532866, -3849538, -4101663, -4242847, -4237420, -4066775, -3736171, -3278186, -2748538, -2213176, -1730432, -1335225, -1032102, -800035, -606324, -422546, -235279, -47973, 125369, 271185, 386732, 483868, 583105, 701687, 844860, 1006907, 1179882, 1361590, 1556136, 1767168, 1988713, 2198921, 2359928, 2424843, 2350624]
9215B350624k37066l91338m99963n33552m82525l62549k09034o2829M5632J06159
9205b76441J28964J36093J48306J73657K04055K22150K14460J81983J41251J15273
9195A389751J20819J60342K22983K92442L55245M04666M39874M62893M75018M73013
9185D797046M46710L81115K64207R6408j04959l09452m82876n96912o35723n98626
9175C256938m98706l57450j97587l8009J06644K23529L00691L30607L15838K71550
9165C714045K21301J88108J86815K22022K90171L80921M75598N46230N60380M92583
9155G278174L36790J12008j43039l84126n77304p08116p80512q08575q07679p89347
9145B728274p59506p18738o64696n96523n17982m35954l56066k81384k16724j73128
$$ y = [2350624, 2113558, 1722220, 1222257, 688705, 206180, -156369, -365403, -428232, -382600, -276441, -147477, -11384, 136922, 310579, 514634, 736784, 951244, 1133227, 1274478, 1389751, 1510570, 1670912, 1893895, 2186337, 2541582, 2946248, 3386122, 3849015, 4324033, 4797046, 5243756, 5624871, 5889078, 5985486, 5880527, 5571075, 5088199, 4491287, 3855564, 3256938, 2758232, 2400782, 2203195, 2165186, 2271830, 2495359, 2796050, 3126657, 3442495, 3714045, 3935346, 4123454, 4310269, 4532291, 4822462, 5203383, 5678981, 6225211, 6785591, 7278174, 7614964, 7726972, 7583933, 7199807, 6622503, 5914387, 5133875, 4325300, 3517621, 2728274, 1968768, 1250030, 585334, -11189, -529171, -965125, -1321191, -1602575, -1819299, -1992427]
9135a992427j65319k02129k78216l74921m69529n45243n95201o20339o25453o16743
9125f485520o00655n82383n63480n40055n03268m42743l51804k31404q9766O2442
9115a0328636K17438L71613N22535O65591P93765Q99927R79159J030033J055485
9106c793090J062907J061976J060366J060229J058313J049332J029254R95749
9098D585036R46367Q77301P84626O66847N26018L66040J89571l577k14626m41326
9088H282277o73651q93081j076454j202156j255116j228912j125716r55124p32243
9079h60176m75331k03892O2241L03322N00312O36298O99203O85703O03577M69291
9069B420548L01105J12899q6598k89661m84700o54181p76733q33753q18122p39110
$$ y = [-1992427, -2157746, -2359875, -2638091, -3013012, -3482541, -4027784, -4622985, -5243324, -5868777, -6485520, -7086175, -7668558, -8232038, -8772093, -9275361, -9718104, -10069908, -10301312, -10391078, -10328636, -10111198, -9739585, -9217050, -8551459, -7757694, -6857767, -5878608, -4848575, -3793090, -2730183, -1668207, -607841, 452388, 1510701, 2560033, 3589287, 4585036, 5531403, 6408704, 7193330, 7860177, 8386195, 8752235, 8941806, 8938229, 8723603, 8282277, 7608626, 6715545, 5639091, 4436935, 3181819, 1952907, 827191, -127933, -860176, -1335507, -1539399, -1477158, -1173836, -673524, -37226, 661977, 1347680, 1951257, 2420548, 2721653, 2834552, 2747954, 2458293, 1973593, 1319412, 542679, -291074, -1109196, -1848306]
9059a848306o18566m80490l41406k06660p1979P2122K34058M14777O04931P87248
9049a454271R41085J045266J079431J026959Q80141O45492L46401K0970k86385
9040D245089n37563p11340q05638q31824q07005p48772o71825n84858m89231l82277
9030b325244k64678j47207n1242p80r185o8609j50032k15827k38254k12720j57898
9019c841676j03154p1897p1366r3418j22618j44062j47315j27759q7497l4926
9009d845688J8564O3801R7759J23667J47432J72591J96955K13095K12024J87271
8999c412529J37422O7479j0524p9329j22127j29638j03345n2313J3274Q6588J64198
8988c440844K43450L20106L87674M38354M65178M64772M39236L95444L41719K84288
$$ y = [-1848306, -2466872, -2947362, -3288768, -3495428, -3567407, -3495285, -3261227, -2846450, -2241519, -1454271, -513186, 532080, 1611511, 2638470, 3518611, 4164103, 4510504, 4531474, 4245089, 3707526, 2996186, 2190548, 1358724, 551719, -197053, -868878, -1453736, -1942967, -2325244, -2589922, -2737129, -2788371, -2789151, -2798336, -2866945, -3016977, -3232804, -3471058, -3683778, -3841676, -3944830, -4016727, -4088093, -4181511, -4304129, -4448191, -4595506, -4723265, -4810762, -4845688, -4827124, -4763323, -4665564, -4541897, -4394465, -4221874, -4024919, -3811824, -3599800, -3412529, -3275107, -3207628, -3218152, -3297481, -3419608, -3549246, -3652591, -3704904, -3691630, -3605042, -3440844, -3197394, -2877288, -2489614, -2051260, -1586082, -1121310, -682074, -286630, 55089, 339377]
8978C39377K25996J67336J07898M7204j4400p4613j28874j71150j94504j90932
8968A13338j52484p5049L7443J71851L07955M21583M88487M90324M21430K91908
8958B516786J24834m9627k00466l03159l48092l44491l14186k78121k46088k16413
8948C40977j82295j37402p8112m881P5723J50266K01416K14001J80644J03848
8938H64185n749j32552k58313l63931m32534m53979m28192l65282k82975k02865
8928b062187j45742j26136j47896k03656k78771l57398m27343m80886n11049n06292
8918e247356m49554l25485j32062J12500L73381O10309P88561Q85397Q92605Q16878
8908a674826O77307M99101L05063J08872q6320k83365m82925o75955q41014r48870
$$ y = [339377, 565373, 732709, 840607, 887811, 873411, 798798, 669924, 498774, 304270, 113338, -39146, -114195, -76752, 95099, 403054, 824637, 1313124, 1803448, 2224878, 2516786, 2641620, 2591993, 2391527, 2088368, 1740276, 1395785, 1081599, 803478, 557390, 340977, 158682, 21280, -56832, -61713, 14010, 164276, 365692, 579693, 760337, 864185, 858436, 725884, 467571, 103640, -328894, -782873, -1211065, -1576347, -1859322, -2062187, -2207929, -2334065, -2481961, -2685617, -2964388, -3321786, -3749129, -4230015, -4741064, -5247356, -5696910, -6022395, -6154457, -6041957, -5668576, -5058267, -4269706, -3384309, -2491704, -1674826, -997519, -498418, -193355, -84483, -170803, -454168, -937093, -1613048, -2454062, -3402932]
8898c402932r73163r02795p49923n48814l45154j80651q0169m6695o4843j09767
8888g404906j57205j90870k04807k01041j85734j67059j54789j58455j82550k21958
8878i229374k62432k87202k85188k55008k02017j30965l9978P8676K31040M13191
8868i969257O09423P97733R56980J070650J127950J125230J067431R66375Q35424
8859a412061O84174N16920L34966J40676n9055k51405m19287n45229o15653o24635
8849b250589n77591m93323m00486l26772k86036k72620k67296k49888k09412j46372
8839e480385o9247R552P5215J11047J01184L6461p9988k32285l97924n56125o92172
8828g174667p95638q56456q64317q12717p04432n54349l87428k31322j05119r443
$$ y = [-3402932, -4376095, -5278890, -6028813, -6577627, -6922781, -7103432, -7183601, -7230296, -7295139, -7404906, -7562111, -7752981, -7957788, -8158829, -8344563, -8511622, -8666411, -8824866, -9007416, -9229374, -9491806, -9779008, -10064196, -10319204, -10521221, -10652186, -10692164, -10613488, -10382448, -9969257, -9359834, -8562101, -7605121, -6534471, -5406521, -4281291, -3213860, -2247485, -1412061, -727887, -210967, 123999, 264675, 205620, -45785, -465072, -1010301, -1625954, -2250589, -2828180, -3321503, -3721989, -4048761, -4334797, -4607417, -4874713, -5124601, -5334013, -5480385, -5549632, -5540080, -5464865, -5353818, -5252634, -5216173, -5296161, -5528446, -5926370, -6482495, -7174667, -7970305, -8826761, -9691078, -10503795, -11208227, -11762576, -12150004, -12381326, -12486445, -12495888]
8818a2495888P5011J77386L20401N08153P24619R41651J130428J270562J354209
8809e993468J385481J376800J343504J297212J239587J160509J043818Q78531
8801C731974O68535M34726K08761K1727j07263j77422k03953k08740k10813k22325
8791C935207k49230k91867l44016l93721m28319m40606m31011m04802l68037l25893
8781B57705k83074k44060k12487j91064j81917j85289j95864k00552j82107j27407
8771a746116l3920Q9791K27065L55591M50367M90883M70842M02695L11273K20288
8761A238759J41302P1569J46q2519j76522k69596l41047l70892l49105k79890
8751d17795j79371o9025L1862J12146J71435K17999K62522L10961L60458M00074
$$ y = [-12495888, -12420877, -12243491, -11923090, -11414937, -10690318, -9748667, -8618239, -7347677, -5993468, -4607987, -3231187, -1887683, -590471, 649116, 1809625, 2853443, 3731974, 4400509, 4835235, 5043996, 5065723, 4958460, 4781038, 4577085, 4368345, 4157532, 3935207, 3685977, 3394110, 3050094, 2656373, 2228054, 1787448, 1356437, 951635, 583598, 257705, -25369, -269429, -481916, -672980, -854897, -1040186, -1236050, -1436602, -1618709, -1746116, -1780036, -1690245, -1463180, -1107589, -657222, -166339, 304503, 707198, 1018471, 1238759, 1380061, 1451630, 1451776, 1369257, 1192735, 923139, 582092, 211200, -137905, -417795, -597166, -666191, -634329, -522183, -350748, -132749, 129773, 440734, 801192, 1201266]
8741A201266M15608L96769L44080K71387K00671J51235J30725J34392J51628J72922
8731C570683J91818K02658J98874J74644J27828O0153k5964j29552k48210l72936
8721C749996m87826n76895o31634o51788o40126n98319n27735m32233l19105j98449
8711a314114q2520J5954Q7638J30101J46466J39006J03508L0700q5086k36278
8701a064625l98997n39136o24278o34863n69669m43956k81804j06389O6875K30820
8691d366022L81282N11070O08536O62250O68181O33234N71779M97557M17692L33447
8681I19006K46228J62880R6476O2768P4049J31965K22479L17802L86919M09073
8671C029645L81293L15904K31092J40773M8574n1175j65181k90447m09607m97227
$$ y = [1201266, 1616874, 2013643, 2357723, 2629110, 2829781, 2981016, 3111741, 3246133, 3397761, 3570683, 3762501, 3965159, 4164033, 4338677, 4466505, 4526658, 4500694, 4371142, 4122932, 3749996, 3262170, 2685275, 2053641, 1401853, 761727, 163408, -364327, -796560, -1115665, -1314114, -1396634, -1380680, -1293042, -1162941, -1016475, -877469, -773961, -743261, -828347, -1064625, -1463622, -2002758, -2627036, -3261899, -3831568, -4275524, -4557328, -4663717, -4596842, -4366022, -3984740, -3473670, -2865134, -2202884, -1534703, -901469, -329690, 167867, 585559, 919006, 1165234, 1328114, 1424590, 1487358, 1561407, 1693372, 1915851, 2233653, 2620572, 3029645, 3410938, 3726842, 3957934, 4098707, 4147281, 4096106, 3930925, 3640478, 3230871, 2733644]
8661B733644n32289n06418m22644k89308j16860Q0673K84045M71059O21682P22407
8651C045991P67729P59157P02716O05739M74109L11497J21534q7736k99739m89392
8641E911605o29358p00562p00961o46903n66061m86266m26775l96563l98614m34321
8631E25221n02414n93845o90002p68799q14004q19356p85093p12492o02115m56100
8621f218999k81653r3719Q4759K27198L12719L36517L15312K84394K86387L54985
8611d392100M99641O98961R07384J072053J150706J122661R90717P76522N13000
8602C339545K36808j7609k22508l60781m28829m36318m01437l43625k77957k13712
8592H73577j56274j09266p5099n4573m6926n0216o0643p0495o7064l5162L6763
$$ y = [2733644, 2201355, 1694937, 1272293, 982985, 866125, 946798, 1230843, 1701902, 2323584, 3045991, 3813720, 4572877, 5275593, 5881332, 6355441, 6666938, 6788472, 6700736, 6400997, 5911605, 5282247, 4581685, 3880724, 3233821, 2667760, 2181494, 1754719, 1358156, 959542, 525221, 22807, -571038, -1261040, -2029839, -2843843, -3663199, -4448292, -5160784, -5762899, -6218999, -6500652, -6594371, -6509612, -6282414, -5969695, -5633178, -5317866, -5033472, -4747085, -4392100, -3892459, -3193498, -2286114, -1214061, -63355, 1059306, 2050023, 2826545, 3339545, 3576353, 3558744, 3336236, 2975455, 2546626, 2110308, 1708871, 1365246, 1087289, 873577, 717303, 608037, 532938, 478365, 431439, 381223, 320580, 250085, 183021, 147859, 184622]
8581A84622J50562K96574M57184O12825P46404Q44540Q97122Q97067Q40566P27246
8571F654712N60991L52155J19621j10366l09662m55137n33267n41044m84158l73903
8561D879942k24358n1717J23918K77258L81316M16125L77591K79608J47436P106
8551F614225j21886k27477l02661l44368l54082l36831k97131k35212j48022l4823
8541D211732R7504K34133L57187M52005N10629N31332N16078M68098L89980K82300
8531H050978J44601j9596j96765l62952m91950n66596n84601n55960m96170m20600
8521D500389l41942k69686k09567j61706j18671o7818N1Q1149J57912K09883K27543
8510D007537K17234J94232J71580J53890J38678J21230R7767O4829J6786n5027
$$ y = [184622, 335184, 631758, 1088942, 1701767, 2448171, 3292711, 4189833, 5086900, 5927466, 6654712, 7215703, 7567858, 7687479, 7577113, 7267451, 6812314, 6279047, 5738003, 5253845, 4879942, 4655584, 4603867, 4727785, 5005043, 5386359, 5802484, 6180075, 6459683, 6607119, 6614225, 6492339, 6264862, 5962201, 5617833, 5263751, 4926920, 4629789, 4394577, 4246555, 4211732, 4309236, 4543369, 4900556, 5352561, 5863190, 6394522, 6910600, 7378698, 7768678, 8050978, 8195579, 8175983, 7979218, 7616266, 7124316, 6557720, 5973119, 5417159, 4920989, 4500389, 4158447, 3888761, 3679194, 3517488, 3398817, 3330999, 3331050, 3412199, 3570111, 3779994, 4007537, 4224771, 4419003, 4590583, 4744473, 4883151, 5004381, 5102148, 5166977, 5183763, 5128736]
8500E128736j59362k99089m65336o35650p79072q67738q89641q54540p88422p20067
8490a330181o68689o39619o27733o23533o17744o03909n79660n46159n05155m55769
8480g198151l94473l18410k28008j25715j3320J07834K34256L60324M82610O03356
8470f489697P27469Q54585R73828J066459J114598J109556J054464R60586Q41180
8461B213028P07711N69479M33443L01769J69915L0268j18974k67394l95509m85815
8451C157921n32552n42825n30436n09509m92245m88809n05105n38733n77744o04943
8441b164980o04897n68740m95613l92390k71912j48236l0221Q1001J87464K86792
8431d121732L69220M21522M33004L98337L17621J97293N1986r6932k28889l33260
$$ y = [5128736, 4969374, 4670285, 4204949, 3569299, 2790227, 1922489, 1032848, 178308, -610114, -1330181, -1998870, -2638489, -3266222, -3889755, -4507499, -5111408, -5691068, -6237227, -6742382, -7198151, -7592624, -7911034, -8139042, -8264757, -8278077, -8170243, -7935987, -7575663, -7093053, -6489697, -5762228, -4907643, -3933815, -2867356, -1752758, -643202, 411262, 1371848, 2213028, 2920739, 3490218, 3923661, 4225430, 4395345, 4425613, 4306639, 4039245, 3643736, 3157921, 2625369, 2082544, 1552108, 1042599, 550354, 61545, -443560, -982293, -1560037, -2164980, -2769877, -3338617, -3834230, -4226620, -4498532, -4646768, -4676989, -4595988, -4408524, -4121732, -3752512, -3330990, -2897986, -2499649, -2182028, -1984735, -1932749, -2029681, -2258570, -2591830]
8421b591830m11930m71983n14886n32584n14345m57418l71167k71306j70616p4438
8411f382503J6961J04044J86731K66458L47801M36819N37096O46895P59874Q68499
8401b211325R66879J050574J114045J148701J143866J090432R85072Q33067O48195
8392F769506M49047K52896P0725r2581k32922l41461m04338m08090l46079k21672
8382E495031m8365J50427L41876M87775N54113N22367L95819J97336l8744k75683
8372G781952m81469o33806p22755p50634p29389o76619o10392n43042m76448m03272
8362A754126l15208k12351j05567j0080O3161J11047J36099J43199J38067J26030
8352A828523J09342Q5086M6932r652q2860j64008k40471k99803l33820l42154
$$ y = [-2591830, -3003760, -3475743, -3990629, -4523213, -5037558, -5494976, -5866143, -6137449, -6308065, -6382503, -6365542, -6261498, -6074767, -5808309, -5460508, -5023689, -4486593, -3839698, -3079824, -2211325, -1244446, -193872, 920173, 2068874, 3212740, 4303172, 5288244, 6121311, 6769506, 7218553, 7471449, 7542174, 7449593, 7216671, 6875210, 6470872, 6062782, 5716703, 5495031, 5446666, 5597093, 5938969, 6426744, 6980857, 7503224, 7899043, 8096379, 8057635, 7781952, 7300483, 6666677, 5943922, 5193288, 4463899, 3787280, 3176888, 2633846, 2157398, 1754126, 1438918, 1226567, 1121000, 1110920, 1174081, 1285128, 1421227, 1564426, 1702493, 1828523, 1937865, 2022951, 2069883, 2060231, 1977371, 1813363, 1572892, 1273089, 939269, 597115]
8342E97115l33943l25542l33826l67257m18697m64303m70968m10642k74364p7737
8332b880164J45382L56359N24314O32191O76241O62196O01767N10985M09157L15972
8322A954400K46039K03338J79354J56769J17521N1893l5499j26432j96926k28282
8312B322175k14533j62130q3038J2860J20331K34519L43661M25779M53900M07878
8302C861402K85192J03907j03550l01622m62462n72453o32634o53593o47922o24570
8292B51695n87417n36770m70741l85377k75340j37109K6446K04049L79296N37280
8282i93988O69357P72465Q44202Q78698Q67314Q04274O93281N49878L96826K54983
8272E737290J35828M0726l3827r0377j28815j48765j52586j46118j37054j32579
$$ y = [597115, 263172, -62370, -396196, -763453, -1182150, -1646453, -2117421, -2528063, -2802427, -2880164, -2734782, -2378423, -1854109, -1221918, -545677, 116519, 718286, 1229271, 1638428, 1954400, 2200439, 2403777, 2583131, 2739900, 2857421, 2909314, 2873815, 2747383, 2550457, 2322175, 2107642, 1945512, 1862474, 1875334, 1995665, 2230184, 2573845, 2999624, 3453524, 3861402, 4146594, 4250501, 4146951, 3845329, 3382867, 2810414, 2177780, 1524187, 876265, 251695, -335722, -872492, -1343233, -1728610, -2003950, -2141059, -2114613, -1910564, -1531268, -993988, -324631, 447834, 1292036, 2170734, 3038048, 3842322, 4535603, 5085481, 5482307, 5737290, 5873118, 5913844, 5880017, 5789640, 5660825, 5512060, 5359474, 5213356, 5076302, 4943723]
8262D943723j37805j55670j87577k33268k89266l47445l96109m23847m23595l94243
8252A954898l39738k67331j85724j02734k2885N2979J25005J90167K40478K65906
8242A911021K60787K29181J84648J43463J15559R9780Q6757O6764L6635J657k7784
8231C108468m2451m0203k8329k0298k8542n8115j05452j62519k23015k86853l60707
8220A751984m54080n72374p10446q50628r67044j034607j038336r78138q66303
8211e719972p19645n52170l72985j88743o113J68306L29030M71835N93809O94220
8201e302428P74380Q34899Q73051Q84931Q72223Q46835Q27330Q28924Q55249Q97858
8191C193252R41942R71900R72758R29603Q29887O69410M56749K10931m6363k97034
$$ y = [4943723, 4805918, 4650248, 4462671, 4229403, 3940137, 3592692, 3196583, 2772736, 2349141, 1954898, 1615160, 1347829, 1162105, 1059371, 1036486, 1089465, 1214470, 1404637, 1645115, 1911021, 2171808, 2400989, 2585637, 2729100, 2844659, 2944439, 3031196, 3097960, 3134595, 3136252, 3108468, 3066017, 3025814, 2997485, 2977187, 2948645, 2890530, 2785078, 2622559, 2399544, 2112691, 1751984, 1297904, 725530, 15084, -835544, -1802588, -2837195, -3875531, -4853669, -5719972, -6439617, -6991787, -7364772, -7553515, -7559628, -7391322, -7062292, -6590457, -5996648, -5302428, -4528048, -3693149, -2820098, -1935167, -1062944, -216109, 611221, 1440145, 2295394, 3193252, 4135194, 5107094, 6079852, 7009455, 7839342, 8508752, 8965501, 9176432, 9130069, 8833035]
8181H833035n26582p20130q60320r29800r16179q15865o35213l89759j02502J98820
8171C135505M85885P34421R26701J050472J096475J058612R37769P45644N04416
8162A0675900K41860j5205k46334m40706n97771p24771q31429r23563r98442j044687
8152E094852j047315r95370q87880p35827n60810l91296k55848j73807j47922
8143a01223j64412k01159k38334k64619k76457k72638k49386k00622j24198k9144
8133b122192O3535J29084J50487J24395N8409l5155j42424k47433l32983l86160
8123b740437m04634l96719l73880l42388l01660k49443j87724j24303o9906l3674
8113e224768j8934k0557k5384j6422K0220Q8532J79179K71746L42196L71682L51892
$$ y = [8833035, 8306453, 7586323, 6726003, 5796203, 4880024, 4064159, 3428946, 3039187, 2936685, 3135505, 3621390, 4355811, 5282512, 6332984, 7429459, 8488071, 9425840, 10171484, 10675900, 10917760, 10902555, 10656221, 10215515, 9617744, 8892973, 8061544, 7137981, 6139539, 5094852, 4047537, 3052167, 2164287, 1428460, 867650, 476354, 220506, 46699, -101223, -265635, -466794, -705128, -969747, -1246204, -1518842, -1768228, -1968850, -2093048, -2122192, -2058657, -1929573, -1779086, -1654691, -1596282, -1631437, -1773861, -2021294, -2354277, -2740437, -3145071, -3541790, -3915670, -4258058, -4559718, -4809161, -4996885, -5121188, -5191094, -5224768, -5243702, -5264259, -5289643, -5306065, -5285845, -5197313, -5018134, -4746388, -4404192, -4032510, -3680618]
8102c680618K85401J83411O3707n1111j36735j72176j45331n6759Q0333K44224
8092c385654M11169N61445O83068P73085Q36652Q83652R23440R59119R83293R77386
8082D606655R16710P81434N68590K97587N718k62635m67143n80271n93499n19759
8072D753387l90114k45361j25668o0582o0528j12923j86910k46720k66735k39359
8062B818487j72347p9907K4351J28017K16265K70796K75519K25531J31630J6285
8052C854627r5544j84308k39055k56777k40235j95886j32556o0588R245O7254
8042B526177J05881J20024J07627P1806K3291j9833l6864j2087N8578J65141K86243
8031C395984L95920M72190N04786M98819M71760M43687M25198M10146L78076L04743
$$ y = [-3680618, -3395217, -3211806, -3148099, -3199210, -3335945, -3508121, -3653452, -3710211, -3629878, -3385654, -2974485, -2413040, -1729972, -956887, -120235, 763417, 1686857, 2645976, 3629269, 4606655, 5523365, 6304799, 6873389, 7170976, 7176694, 6914059, 6446916, 5866645, 5273146, 4753387, 4363273, 4117912, 3992244, 3931662, 3871134, 3758211, 3571301, 3324581, 3057846, 2818487, 2646140, 2566233, 2590584, 2718601, 2934866, 3205662, 3481181, 3706712, 3838342, 3854627, 3759083, 3574775, 3335720, 3078943, 2838708, 2642822, 2510266, 2449678, 2458923, 2526177, 2632058, 2752082, 2859709, 2931515, 2954806, 2934973, 2898109, 2886022, 2944600, 3109741, 3395984, 3791904, 4264094, 4768880, 5267699, 5739459, 6183146, 6608344, 7018490, 7396566, 7701309]
8021G701309J73770j6706k53561n11699p58760r61742j095397j149345j129858
8012A998011j055525r49818q34468p25119o29169n45896m69472l94087l18709
8003c924252k48703j93445j61222j54259j66827j87700k05271k11779k04023j81397
7993e838878j44283r4649l7310K1100P6016J28564J85328K53779L36011M24345
7983d689977N01134N43818N33765M64160L41537J80285m083j96460l78454n25494
7973c229769o09895o09282n15704l41197j17496J10818K98711M14462M48840M15218
7963c735294L41385K58269J91426J57250J62071K02180K65525L36543M02818M59243
7953i58584N06928N48517N84049O09770O19245O05053N60320M80014L62089K08609
$$ y = [7701309, 7875079, 7858373, 7604812, 7093113, 6334353, 5372611, 4277214, 3127869, 1998011, 942486, -7332, -841800, -1566919, -2196088, -2741984, -3211456, -3605543, -3924252, -4172955, -4366400, -4527622, -4681881, -4848708, -5036408, -5241679, -5453458, -5657481, -5838878, -5983161, -6077810, -6115120, -6094020, -6018004, -5889440, -5704112, -5450333, -5114322, -4689977, -4188843, -3645025, -3111260, -2647100, -2305563, -2125278, -2129361, -2325821, -2704275, -3229769, -3839664, -4448946, -4964650, -5305847, -5423343, -5312525, -5013814, -4599352, -4150512, -3735294, -3393909, -3135640, -2944214, -2786964, -2624893, -2422713, -2157188, -1820645, -1417827, -958584, -451656, 96861, 680910, 1290680, 1909925, 2514978, 3075298, 3555312, 3917401, 4126010]
7943D126010K7172j67907l56341n15886o28936o88518p00309o79733o45930o15984
7933h46362o01778o09491o39634o86164p35693p69851p71971p34786o63703n72997
7923g632430m77705l86844l01887k20190j40108o3809L727N8228R9050J29729
7913h932239J56717J88038K32631K99353L93997N14344O46193P64888Q44080Q67457
7903d024541Q35922P65724O80105O01060N45905N28018N57241O36643P57086Q95760
7893B778923J022921J113607J156072J151634J108522J035633R39409Q23626O91083
7884A1821430N45490L91014K28982N5677j34150l39233n46031p30399q65664r32319
7874I494797r25087q55182p47148o31742n37787m84865m77782n04622n41164n61616
$$ y = [4126010, 4153182, 3985275, 3628934, 3113048, 2484112, 1795594, 1095285, 415552, -230378, -846362, -1448140, -2057631, -2697265, -3383429, -4119122, -4888973, -5660944, -6395730, -7059433, -7632430, -8110135, -8496979, -8798866, -9019056, -9159164, -9222973, -9219246, -9161018, -9061968, -8932239, -8775522, -8587484, -8354853, -8055500, -7661503, -7147159, -6500966, -5736078, -4891998, -4024541, -3188619, -2422895, -1742790, -1141730, -595825, -67807, 489434, 1126077, 1883163, 2778923, 3801844, 4915451, 6071523, 7223157, 8331679, 9367312, 10306721, 11130347, 11821430, 12366920, 12757934, 12986916, 13042593, 12908443, 12569210, 12023179, 11292780, 10427116, 9494797, 8569710, 7714528, 6967380, 6335638, 5797851, 5312986, 4835204, 4330582, 3789418, 3227802]
7864C227802n50281n07278m45463l81470l26672k82776k43414j99262j42410o7555
7854H1221K9018J50003K95292M57673O18228P46098Q07129P79709O68291N04287
7844E136949L33005J95704J17507J04481J46193K19724K95192L44038L48375L06635
7834G547803K32103J45457O5429J594m7865r2339j40994j96395k54390l09730
7824F950673l62148m18107m87508n77362o84985p94047q77076r05013q59258p39382
7814B45787n62737l57353j52528K8449J71294K69913L24019L37521L18504K80284
7804I03153K41277K20806K30736K67948L14869L49388L57482L39573L07976K79388
7794C812596K67891K81321L21107L84039M63725N50864O33990P02040P47201P65023
$$ y = [3227802, 2677521, 2170243, 1724780, 1343310, 1016638, 733862, 490448, 291186, 148776, 81221, 110239, 260242, 555534, 1013207, 1631435, 2377533, 3184662, 3964371, 4632662, 5136949, 5469954, 5665658, 5783165, 5887646, 6033839, 6253563, 6548755, 6892793, 7241168, 7547803, 7779906, 7925363, 7990792, 7992386, 7944521, 7852182, 7711188, 7514793, 7260403, 6950673, 6588525, 6170418, 5682910, 5105548, 4420563, 3626516, 2749440, 1844427, 985169, 245787, -316950, -674303, -826831, -798382, -627088, -357175, -33156, 304365, 622869, 903153, 1144430, 1365236, 1595972, 1863920, 2178789, 2528177, 2885659, 3225232, 3533208, 3812596, 4080487, 4361808, 4682915, 5066954, 5530679, 6081543, 6715533, 7417573, 8164774, 8929797]
7784H929797P51944P03725O17086M92772L36629J57856l3650k28687m18567n94255
7774A0714650p46346q66610r50560r98945j016121j005487r65520q90736p78284
7765B496041o34987m78413l30787k11182j31398r5639j00515j34416j78924k14305
7755a4525k26915k13732j80562j35056p9636r918Q0576J93789L23385M54644N66500
7744G58550O36254O48332O03689N22127M33315L61605L15234K86567K61744K32306
7734E059723K01025J78680J74769J89467K12414K28053K23018J91268J35855O7661
7724F861933J781m7440p0674o5279l4262J5805P6302J37497J89708K24906K38358
7713G528635K30085K06023J77837J59972J64491J96633K53533L25650L99549M61725
$$ y = [8929797, 9681741, 10385466, 11002552, 11495324, 11831953, 11989809, 11956159, 11727472, 11308905, 10714650, 9968304, 9101694, 8151134, 7152189, 6136068, 5130581, 4165061, 3274325, 2496041, 1861054, 1382641, 1051854, 840672, 709274, 613635, 513120, 378704, 199780, -14525, -241440, -455172, -635734, -770790, -850426, -860344, -779768, -585979, -262594, 192050, 758550, 1394804, 2043136, 2646825, 3168952, 3602267, 3963872, 4279106, 4565673, 4827417, 5059723, 5260748, 5439428, 5614197, 5803664, 6016078, 6244131, 6467149, 6658417, 6794272, 6861933, 6863714, 6816274, 6745600, 6680321, 6646059, 6661864, 6738166, 6875663, 7065371, 7290277, 7528635, 7758720, 7964743, 8142580, 8302552, 8467043, 8663676, 8917209, 9242859, 9642408, 10104133]
7703A0104133N03145N21575N19017M96407M51376L81267K86706J70528L3411j27337
7693A3340228l12697n14530p12510q78271r84070j011302r55614q27899o51554
7684F491781m56776k73116j22603j5587M9826Q5284J07360J31216J64389K03442
7674F365216K35625K45435K22821J68302R1903P334p3465j41807j90954k15931
$$ y = [10104133, 10607278, 11128853, 11647870, 12144277, 12595653, 12976920, 13263626, 13434154, 13467565, 13340228, 13027531, 12513001, 11800491, 10922220, 9938150, 8926848, 7971234, 7143335, 6491781, 6035005, 5761889, 5639286, 5623699, 5673525, 5758809, 5866169, 5997385, 6161774, 6365216, 6600841, 6846276, 7069097, 7237399, 7329302, 7336636, 7263171, 7121364, 6930410, 6714479]
$$ [...]
##END NTUPLES=NMR SPECTRUM
##END=
