##TITLE=31Pdec_DE-34_oil_d6_TFA
 DMSO-d6
 64 sc
 6.6.2024
##JCAMPDX= 6.0         $$ Bruker NMR JCAMP-DX V2.0
##DATA TYPE= NMR SPECTRUM
##DATA CLASS= NTUPLES
##ORIGIN= UXNMR, Bruker Analytische Messtechnik GmbH
##OWNER= root
$$ XWIN-NMR		Version 3.5
$$ Thu Jun  6 16:27:42 2024 Russian Standard Time (UT+4h)  she@DPX200
##.OBSERVE FREQUENCY= 81.013821
##.OBSERVE NUCLEUS= ^31P
##.ACQUISITION MODE= SIMULTANEOUS
##.ACQUISITION SCHEME= undefined
##.AVERAGES= 40
##.DIGITISER RES= 16
##SPECTROMETER/DATA SYSTEM= spect
##.PULSE SEQUENCE= zgpg30
##.SOLVENT NAME= CDCl3
##.SHIFT REFERENCE= (INTERNAL, CDCl3, 0, 248.564)
##AUDIT TRAIL= $$ (NUMBER, WHEN, WHO, WHERE, WHAT)
$$ ##TITLE= Audit trail, XWIN-NMR		Version 3.5
$$ ##JCAMPDX= 5.01
$$ ##ORIGIN= Bruker BioSpin GmbH
$$ ##OWNER= she
$$ F:/spectra/data/she/nmr/P31/1/pdata/1/auditp.txt
$$ ##AUDIT TRAIL=  $$ (NUMBER, WHEN, WHO, WHERE, WHAT)
(   1,<2024-06-06 16:26:34.15 +0400>,<she>,<DPX200>,
      <created by zg, POWCHK disabled, PULCHK disabled
       configuration hash MD5:
       00 E9 B6 7A A2 85 ED C7 34 08 36 98 17 FE 4E 26
       data hash MD5: 32K
       32 8C 93 92 C9 BF F0 67 48 BE 5C ED CF B2 D3 AD>)
(   2,<2024-06-06 16:26:36.64 +0400>,<she>,<DPX200>,
      <Start of raw data processing
       efp BC_mod = 2 LB = 10 FT_mod = 6 PKNL = 1 PHC0 = -247.1606 PHC1 = 124.8 SI = 64K 
       data hash MD5: 64K
       DE 0C 26 A2 A0 7D 25 68 05 0B 4B 04 93 C8 58 64>)
(   3,<2024-06-06 16:27:04.07 +0400>,<she>,<DPX200>,
      <pk PHC0 = 6.345619 PHC1 = -65.4 
       data hash MD5: 64K
       7A CE 23 7B D2 3A 6E 1D 08 85 80 FB 89 92 E8 4B>)
(   4,<2024-06-06 16:27:07.67 +0400>,<she>,<DPX200>,
      <abs ABSG = 5 
       data hash MD5: 64K
       8A CE AA 93 8E 99 AE 04 5A A9 B7 D1 4C DD CB B2>)
$$ ##END=
$$ 
$$ hash MD5
$$ 87 2A 57 F8 96 C6 25 6C 06 B7 64 3D F8 99 04 9C
##$RELAX= 
##$RELAX= 
##$RELAX= 
##$RELAX= 
##$RELAX= 
##$RELAX= 
##$RELAX= 
##$RELAX= 
##$RELAX= 
$$ Bruker specific parameters
$$ --------------------------
##$DU= <F:/spectra>
##$EXPNO= 1
##$NAME= <P31>
##$PROCNO= 1
##$TYPE= <nmr>
##$USER= <she>
##$AMP= (0..31)
100 100 100 100 100 100 100 100 100 100 100 100 100 100 100 100 100 100 
100 100 100 100 100 100 100 100 100 100 100 100 100 100 
##$AQSEQ= 0
##$AQ_mod= 1
##$AUNM= <au_zg>
##$AUTOPOS= <>
##$BF1= 81.014009
##$BF2= 200.13
##$BF3= 200.13
##$BF4= 200.13
##$BF5= 200.13
##$BF6= 200.13
##$BF7= 200.13
##$BF8= 200.13
##$BYTORDA= 1
##$CFDGTYP= 0
##$CFRGTYP= 5
##$CHEMSTR= <none>
##$CNST= (0..31)
1 1 145 1 1 1 1 1 1 1 1 1 1 1 1 1 1 1 1 1 1 1 1 1 1 1 1 1 1 1 1 1 
##$CPDPRG= <waltz16>
##$CPDPRG1= <>
##$CPDPRG2= <waltz16>
##$CPDPRG3= <>
##$CPDPRG4= <mlev>
##$CPDPRG5= <mlev>
##$CPDPRG6= <mlev>
##$CPDPRG7= <mlev>
##$CPDPRG8= <mlev>
##$CPDPRGB= <>
##$CPDPRGT= <>
##$D= (0..31)
0 1 0 0 0 0 0 0 0 0 0 0.03 2e-05 3e-06 0 0 0 0 0 0 0 0 0 0 0 0 0 0 0 0 
0 0 
##$DATE= 1717676793
##$DBL= (0..7)
120 120 120 11 120 120 24 19 
##$DBP= (0..7)
150 150 150 150 150 150 150 150 
##$DBP07= 0
##$DBPNAM0= <>
##$DBPNAM1= <>
$$ [...]
##$SUBNAM3= <"">
##$SUBNAM4= <"">
##$SUBNAM5= <"">
##$SUBNAM6= <"">
##$SUBNAM7= <"">
##$SUBNAM8= <"">
##$SUBNAM9= <"">
##$SW= 501.771253377433
##$SWIBOX= (0..15)
0 1 3 0 0 0 0 0 0 0 0 0 0 0 0 0 
##$SW_h= 40650.406504065
##$TD= 32768
##$TD0= 1
##$TE= 0
##$TE2= 300
##$TE3= 300
##$TEG= 300
##$TL= (0..7)
0 120 53 12 22 120 120 120 
##$TP= (0..7)
150 150 150 150 150 150 150 150 
##$TP07= 0
##$TPNAME0= <>
##$TPNAME1= <>
##$TPNAME2= <>
##$TPNAME3= <>
##$TPNAME4= <>
##$TPNAME5= <>
##$TPNAME6= <>
##$TPNAME7= <>
##$TPOAL= (0..7)
0.5 0.5 0.5 0.5 0.5 0.5 0.5 0.5 
##$TPOFFS= (0..7)
0 0 0 0 0 0 0 0 
##$TUNHIN= 0
##$TUNHOUT= 0
##$TUNXOUT= 0
##$USERA1= <user>
##$USERA2= <user>
##$USERA3= <user>
##$USERA4= <user>
##$USERA5= <user>
##$V9= 5
##$VALIST= <valist>
##$VCLIST= <CCCCCCCCCCCCCCC>
##$VD= 0
##$VDLIST= <DDDDDDDDDDDDDDD>
##$VPLIST= <PPPPPPPPPPPPPPP>
##$VTLIST= <TTTTTTTTTTTTTTT>
##$WBST= 1024
##$WBSW= 4
##$XGAIN= (0..3)
0 0 0 0 
##$XL= 0
##$YL= 0
##$YMAX_a= 1566
##$YMIN_a= -1569
##$ZGOPTNS= <>
##$ZL1= 120
##$ZL2= 120
##$ZL3= 120
##$ZL4= 120
##$ABSF1= 248.5645
##$ABSF2= -253.2056
##$ABSG= 5
##$ABSL= 3
##$ALPHA= 0
##$AQORDER= 0
##$ASSFAC= 0
##$ASSFACI= 0
##$ASSFACX= 0
##$ASSWID= 0
##$AUNMP= <proc_1d>
##$AZFE= 0.1
##$AZFW= 0.5
##$BCFW= 0
##$BC_mod= 2
##$BYTORDP= 0
##$COROFFS= 0
##$CY= -3
##$DATMOD= 1
##$DC= 0
##$DFILT= <>
##$DTYPP= 0
##$F1P= 0
##$F2P= 0
##$FCOR= 1
##$FTSIZE= 65536
##$FT_mod= 6
##$GAMMA= 0
##$GB= 0
##$INTBC= 1
##$INTSCL= 6.047779e-11
##$ISEN= 30
##$LB= 10
##$LEV0= 0
##$LPBIN= 0
##$MAXI= 10000
##$MC2= 0
##$MEAN= 0
##$ME_mod= 0
##$MI= 50
##$NCOEF= 0
##$NC_proc= -11
##$NLEV= 6
##$NOISF1= 182.463
##$NOISF2= 159.3651
##$NSP= 0
##$NTH_PI= 0
##$NZP= 0
##$OFFSET= 248.5645
##$PC= 4
##$PHC0= -240.815
##$PHC1= 59.4
##$PH_mod= 1
##$PKNL= yes
##$PPARMOD= 0
##$PSCAL= 0
##$PSIGN= 0
##$REVERSE= no
##$SF= 81.0140089999694
##$SI= 65536
##$SIGF1= 159.3651
##$SIGF2= -187.1042
##$SINO= 113.3802
##$SIOLD= 16384
##$SREGLST= <1H.CDCl3>
##$SSB= 0
##$STSI= 65536
##$STSR= 0
##$SW_p= 40650.406504065
##$SYMM= 0
##$S_DEV= 0
##$TDeff= 32768
##$TDoff= 0
##$TI= <>
##$TILT= no
##$TM1= 0
##$TM2= 0
##$TOPLEV= 0
##$USERP1= <user>
##$USERP2= <user>
##$USERP3= <user>
##$USERP4= <user>
##$USERP5= <user>
##$WDW= 1
##$XDIM= 65536
##$YMAX_p= 317461657
##$YMIN_p= -178404794
$$ End of Bruker specific parameters
$$ ---------------------------------
##NTUPLES= NMR SPECTRUM
##VAR_NAME=  FREQUENCY,     SPECTRUM/REAL,   SPECTRUM/IMAG
##SYMBOL=    X,             R,               I
##VAR_TYPE=  INDEPENDENT,   DEPENDENT,       DEPENDENT
##VAR_FORM=  AFFN,          ASDF,            ASDF
##VAR_DIM=   65536,         65536,           65536
##UNITS=     HZ,            ARBITRARY UNITS, ARBITRARY UNITS
##FACTOR=    0.620285442955139, 1,           1
##FIRST=     20137.2065510682, 0,            0
##LAST=      -20513.1999529968, 0,           0
##MIN=       -20513.1999529968, -178404794,  0
##MAX=       20137.2065510682, 317461657,    0
$$ Real data points
##PAGE= N=1
##DATA TABLE= (X++(R..R)), XYDATA
$$ [...]
12999b3193808o26226l29626o2800J19119J93275J78561J23793Q3836R6228J69430
$$ -23193808 -23820034 -24149660 -24212460 -24093341 -23900066 -23721505 -23597712 -23513876 -23417648 -23248218
12989b3248218K87393M26211N72572P33660R32029J186921J494647J824971K137364
$$ -23248218 -22960825 -22534614 -21962042 -21228382 -20296353 -19109432 -17614785 -15789814 -13652450
12980a3652450K399911K590551K682765K638869K426194K044464J539458R92058
$$ -13652450 -11252539 -8661988 -5979223 -3340354 -914160 1130304 2669762 3661820
12972C661820M92353J13442j07510j77820j43487o8515q872M701l0693r5358j53815
$$ 3661820 4154173 4267615 4160105 3982285 3838798 3770283 3761411 3766112 3735419 3640061 3486246
12961C486246j67800j21719m9202l3974j71541n12865j029567j622220k159884
$$ 3486246 3318446 3196727 3147525 3113551 2942010 2429145 1399578 -222642 -2382526
12952b382526k523782k636203k469982k042854j405451o31857J84977R38762J522216
$$ -2382526 -4906308 -7542511 -10012493 -12055347 -13460798 -14092655 -13907678 -12968916 -11446700
12943a1446700J846080J861311J580550J089542N33195O9132j93966k36843j21547
$$ -11446700 -9600620 -7739309 -6158759 -5069217 -4536022 -4466890 -4660856 -4897699 -5019246
12934e019246O0459K48302M38469O61407R30307J209378J434044J568427J648058
$$ -5019246 -4958787 -4710485 -4272016 -3610609 -2680302 -1470924 -36880 1531547 3179605
12925C179605J766643K015609K424357K942449L466520L885731M118880M130594
$$ 3179605 4946248 6961857 9386214 12328663 15795183 19680914 23799794 27930388
12917B7930388L925583L528384K963577K250684J413706M90403m70476j419800
$$ 27930388 31855971 35384355 38347932 40598616 42012322 42502725 42032249 40612449
12909D0612449k313955l112059l771388m248452m507317m533075m344719l997695
$$ 40612449 38298494 35186435 31415047 27166595 22659278 18126203 13781484 9783789
12901I783789l569475l134958k748323k441001k229595k120982k108265k160806
$$ 9783789 6214314 3079356 331033 -2109968 -4339563 -6460545 -8568810 -10729616
12893a0729616k217944k197736k025327j669144j161520n88868n8925L34710N36106
$$ -10729616 -12947560 -15145296 -17170623 -18839767 -20001287 -20590155 -20649080 -20314370 -19778264
12884a9778264N35684L66467R1847k10058m61962o03093o03274m67612k25717
$$ -19778264 -19242580 -18876113 -18784266 -18994324 -19456286 -20059379 -20662653 -21130265 -21355982
12875b1355982Q8327M50694Q49471J277628J725200K173436K590332K928487L128540
$$ -21355982 -21267655 -20816961 -19967490 -18689862 -16964662 -14791226 -12200894 -9272407 -6143867
12866f143867L132272K906579K470558J907287J343658R01532O45959N60589N63199
$$ -6143867 -3011595 -105016 2365542 4272829 5616487 6518019 7163978 7724567 8287766
12857H287766N50378M45086K21035j05683n04010r49301j424606j909187k370392
$$ 8287766 8838144 9283230 9504265 9398582 8894572 7945271 6520665 4611478 2241086
12848B241086k765880l051203l186395l141894k907288k501836j978511j412822
$$ 2241086 -524794 -3575997 -6762392 -9904286 -12811574 -15313410 -17291921 -18704743
12840a8704743q77695m18038m0399K78116N69469Q53060J120620J335741J453646
$$ -18704743 -19582438 -20000476 -20040875 -19762759 -19193290 -18340230 -17219610 -15883869 -14430223
12831a4430223J453561J361572J244775J178802J210002J334506J503971J653047
$$ -14430223 -12976662 -11615090 -10370315 -9191513 -7981511 -6647005 -5143034 -3489987
12823c489987J732529J729417J664735J575534J494752J437239J394193J338761
$$ -3489987 -1757458 -28041 1636694 3212228 4706980 6144219 7538412 8877173
12815H877173J242821J094066Q98220O66214M04400J21336j58871l97005n56428
$$ 8877173 10119994 11214060 12112280 12778494 13182894 13304230 13145359 12748354 12191926
12806A2191926o20393n93611m92148l36108j50979K9093J64764K23026J91014
$$ 12191926 11571533 10977922 10485774 10149666 9998687 10027780 10192544 10415570 10606584
12797A0606584Q3535o2264k04863l19187m06270m84451n68974o56580p28184p68461
$$ 10606584 10690119 10627855 10422992 10103805 9697535 9213084 8644110 7987530 7259346 6490885
12787F490885p87103q24443r35325j160363j501654j916454k332164k674784k895168
$$ 6490885 5703782 4879339 3944014 2783651 1281997 -634457 -2966621 -5641405 -8536573
12778h536573k977852k929428k760091k476890k094170j648129j198147q10282
$$ -8536573 -11514425 -14443853 -17203944 -19680834 -21775004 -23423133 -24621280 -25431562
12770b5431562n33618l84054l43455l72332m28073m79870n15168n37017n53937
$$ -25431562 -25965180 -26349234 -26692689 -27065021 -27493094 -27972964 -28488132 -29025149 -29579086
12761b9579086n66451n58695n04194l84569k05643N246K19382M25096O27867Q34555
$$ -29579086 -30145537 -30704232 -31208426 -31592995 -31798638 -31793392 -31574010 -31148914 -30521047 -29686492
12751b9686492J039215J224280J374713J489892J580770J656438J717226J764521
$$ -29686492 -28647277 -27422997 -26048284 -24558392 -22977622 -21321184 -19603958 -17839437
12743a7839437J815732J903041K051550K256880K483717K684227K817312K854845
$$ -17839437 -16023705 -14120664 -12069114 -9812234 -7328517 -4644290 -1826978 1027867
12735A027867K778458K578337K259251J848346J394577R54433N69832K51555k2732
$$ 1027867 3806325 6384662 8643913 10492259 11886836 12841269 13411101 13662656 13639924
12726A3639924k97815o24216j038490j543571k099165k632560l065742l340304
$$ 13639924 13342109 12717893 11679403 10135832 8036667 5404107 2338365 -1001939
12718a001939l426299l318941l035372k614366k111310j584230j078811o25184
$$ -1001939 -4428238 -7747179 -10782551 -13396917 -15508227 -17092457 -18171268 -18796452
12710a8796452k49213J4733J28127P4406j10898l33502m69101m12836j21809L68975
$$ -18796452 -19045665 -19030932 -18902805 -18828399 -18939297 -19272799 -19741900 -20154736 -20276545 -19907570
12700a9907570R60598J525892J952219K173399K177245J990063J654145J215362
$$ -19907570 -18946972 -17421080 -15468861 -13295462 -11118217 -9128154 -7474009 -6258647
12692f258647P24215K39270j79334m86372o64979p24582o85419n65382l81200
$$ -6258647 -5534432 -5295162 -5474496 -5960868 -6625847 -7350429 -8035848 -8601230 -8982430
12683h982430j58947O1711K37239L35982L47155K78919J50586j4748j94599l68360
$$ -8982430 -9141377 -9079666 -8842427 -8506445 -8159290 -7880371 -7729785 -7744533 -7939132 -8307492
12673h307492n16325o18485o55291o10476m74391k46835O0844M25846Q17792J204921
$$ -8307492 -8823817 -9442302 -10097593 -10708069 -11182460 -11429295 -11368451 -10942605 -10124813 -8919892
12663h919892J557778J847516K041967K106099K011130J750872J357355R02818
$$ -8919892 -7362114 -5514598 -3472631 -1366532 644598 2395470 3752825 4655643
12655D655643M77554J49151p1350k29219l90089n96042q44234j094882j294262
$$ 4655643 5133197 5282348 5210998 4981779 4591690 3995648 3151414 2056532 762270
12646G62270j398313j390322j286811j126159r46525p72374o20756n14392m78922
$$ 762270 -636043 -2026365 -3313176 -4439335 -5385860 -6158234 -6778990 -7293382 -7772304
12637g772304n20431o04769o61690o14427m13737n5554M21508R47901J435361
$$ -7772304 -8292735 -8897504 -9559194 -10173621 -10587358 -10642912 -10221404 -9273503 -7838142
12628g838142J793415J956766J914339J715463J439999J151667Q71342N87611
$$ -7838142 -6044727 -4087961 -2173622 -458159 981840 2133507 3004849 3592460
12620C592460K87356k2898l17492n65374p43639q44860q79224q73460q65078q88321
$$ 3592460 3879816 3856918 3539426 2974052 2230413 1385553 506329 -367131 -1232209 -2120530
12610b120530r53903j036042j083142j050665r31299p56346n68553l92210k24645
$$ -2120530 -3074433 -4110475 -5193617 -6244282 -7175581 -7931927 -8500480 -8892690 -9117335
12601i117335n0266J39554L36592N19314O62305P41706P33791O13727L63401j3481
$$ -9117335 -9167601 -9028047 -8691455 -8172141 -7509836 -6768130 -6034339 -5420612 -5057211 -5070692
12591e070692m82091r84061j459261j867783k198748k461679k666876k809215
$$ -5070692 -5552783 -6536844 -7996105 -9863888 -12062636 -14524315 -17191191 -20000406
12583b0000406k868648k827559k688868k477152k221991j940342j633936j301529
$$ -20000406 -22869054 -25696613 -28385481 -30862633 -33084624 -35024966 -36658902 -37960431
12575c7960431r53036o13641l14967p8607R7211K36690L68914N06129O36306P36119
$$ -37960431 -38913467 -39527108 -39842075 -39920682 -39823471 -39586781 -39217867 -38711738 -38075432 -37339313
12565c7339313P91234Q05551P94439P72288P46412P19690O96659O87485P08242
$$ -37339313 -36548079 -35742528 -34948089 -34175801 -33429389 -32709699 -32013040 -31325555 -30617313
12556c0617313P78487R17056J134736J423084J744496K035320K228796K287237
$$ -30617313 -29838826 -28921770 -27787034 -26363950 -24619454 -22584134 -20355338 -18068101
12548a8068101K220027K072605J895358J717039J541496J366967J209435J107408
$$ -18068101 -15848074 -13775469 -11880111 -10163072 -8621576 -7254609 -6045174 -4937766
12540d937766J099319J189591J333878J460171J510485J470614J368913J251131
$$ -4937766 -3838447 -2648856 -1314978 145193 1655678 3126292 4495205 5746336
12532E746336J151037J072271R87975Q56538O44095L41490k9848m21369p68804
$$ 5746336 6897373 7969644 8957619 9814157 10458252 10799742 10769894 10348525 9579721
12523I579721j012425j120313j099557r86328q23803o45732m72950l17353j87250
$$ 9579721 8567296 7446983 6347426 5361098 4537295 3891563 3418613 3101260 2914010
12514B914010r2374m4924n0804r4130j29956r7110N5662L49580P73475J293115
$$ 2914010 2821636 2776712 2725908 2631778 2501822 2404712 2460374 2809954 3583429 4876544
12504D876544J859303K410270K874273L178050L258749L073969K609530J888141
$$ 4876544 6735847 9146117 12020390 15198440 18457189 21531158 24140688 26028829
12496B6028829R76186k1323r82736j799175k394545k728847k792372k601771k200037
$$ 26028829 27005015 26983692 26000956 24201781 21807236 19078389 16286017 13684246 11484209
12487A1484209j653586j040834m35311J06995N48604Q62918J029376J039285R06807
$$ 11484209 9830623 8789789 8354478 8461473 9010077 9872995 10902371 11941656 12848463
12478A2848463O71307L83281Q0407k30470n71336r68090j416201j861976k217056
$$ 12848463 13519770 13903051 13983458 13752988 13181652 12213562 10797361 8935385 6718329
12469F718329k397602k358455k100489j657637j085400m59350J29088N92942Q80036
$$ 6718329 4320727 1962272 -138217 -1795854 -2881254 -3340604 -3211516 -2618574 -1738538
12460a738538R91905R75518Q92269P85230O65220N20075L34117J01404j72191
$$ -1738538 -746633 228885 1121154 1906384 2571604 3091679 3425796 3527200 3355009
12451C355009m71796p75876j060379j307416j513656j690256j853865k017288
$$ 3355009 2883213 2107337 1046958 -260458 -1774114 -3464370 -5318235 -7335523
12443g335523k187974k372201k575125k790214k984640l096366l052912k803318
$$ -7335523 -9523497 -11895698 -14470823 -17261037 -20245677 -23342043 -26394955 -29198273
12435b9198273k342031j710586r82090k42584M24590R54755J317946J526061J623704
$$ -29198273 -31540304 -33250890 -34232980 -34475564 -34050974 -33096219 -31778273 -30252212 -28628508
12426b8628508J667156J703334J757791J834034J920816J999699K045456K022028
$$ -28628508 -26961352 -25258018 -23500227 -21666193 -19745377 -17745678 -15700222 -13678194
12418a3678194J887403J614694J215636P43097K67513j53307m89349p36094r04261
$$ -13678194 -11790791 -10176097 -8960461 -8217364 -7949851 -8103158 -8592507 -9328601 -10232862
12409a0232862j007284j048224j014097q86809o65125l77839p5304J92679L95080
$$ -10232862 -11240146 -12288370 -13302467 -14189276 -14854401 -15232240 -15307544 -15114865 -14719785
12400a4719785N26319O05113O69191P64849R32098J191608J538761J943713K353658
$$ -14719785 -14193466 -13588353 -12919162 -12154313 -11222215 -10030607 -8491846 -6548133 -4194475
12391d194475K698126K902593K911614K711853K339690J864990J359303Q68545
$$ -4194475 -1496349 1406244 4317858 7029711 9369401 11234391 12593694 13462239
12383A3462239M07009k6179m22613p51472r68246j039259r63036p72099n16528
$$ 13462239 13869248 13843069 13420456 12668984 11700738 10661479 9698443 8926344 8409816
12374H409816k46289n717J64598K32266J85545L9119j78658m48844p73846j166024
$$ 8409816 8163527 8157810 8322408 8554674 8740219 8779338 8600680 8151836 7377990 6211966
12364F211966j622278k106965k559853k926557l189367l372035l510829l614495
$$ 6211966 4589688 2482723 -77130 -3003687 -6193054 -9565089 -13075918 -16690413
12356a6690413l649141l564079l337324l001059k625208k273640j968262j685273
$$ -16690413 -20339554 -23903633 -27240957 -30242016 -32867224 -35140864 -37109126 -38794399
12348c8794399j378946j009663n59049l4284N28706J064523J491945J744869J803242
$$ -38794399 -40173345 -41183008 -41742057 -41776341 -41247635 -40183112 -38691167 -36946298 -35143056
12339c5143056J701972J514025J324008J209346J232443J436637J838573K415703
$$ -35143056 -33441084 -31927059 -30603051 -29393705 -28161262 -26724625 -24886052 -22470349
12331b2470349L096093L764313M291942M581653M597876M366119L949484L425735
$$ -22470349 -19374256 -15609943 -11318001 -6736348 -2138472 2227647 6177131 9602866
12323I602866K876269K379464J998965J769618J690032J724347J809075J863025
$$ 9602866 12479135 14858599 16857564 18627182 20317214 22041561 23850636 25713661
12315B5713661J803717J571662J155608O05843K5846m57327p33563p46098n10086
$$ 25713661 27517378 29089040 30244648 30850491 30876337 30419010 29685447 28939349 28429263
12306B8429263j05690L51748P50894J014260J107192J029877Q05807M75871R4991
$$ 28429263 28323573 28675321 29426215 30440475 31547667 32577544 33383351 33859222 33954213
12297C3954213k77040n92169q29259r97515j126401j249938j394156j570652j774789
$$ 33954213 33677173 33085004 32255745 31258230 30131829 28881891 27487735 25917083 24142294
12288B4142294j987854k183472k336348k429602k459109k435377k381608k324932
$$ 24142294 22154440 19970968 17634620 15205018 12745909 10310532 7928924 5603992
12280E603992k282296k248870k196170k080797j861183j519728j082272o19802
$$ 5603992 3321696 1072826 -1123344 -3204141 -5065324 -6585052 -7667324 -8287126
12272h287126k22452M3539J68435K00660K19395K96884M69412P27065J023182
$$ -8287126 -8509578 -8466039 -8297604 -8096944 -7877549 -7580665 -7111253 -6384188 -5361006
12263e361006J296889J497174J598152J601526J528939J409849J270032J123282
$$ -5361006 -4064117 -2566943 -968791 632735 2161674 3571523 4841555 5964837
12255E964837R67541P87220N63797K91468j2495l11685n65525p42089q20969p91017
$$ 5964837 6932378 7719598 8283395 8574863 8562368 8250683 7685158 6943069 6122100 5331083
12245E331083o51199m14504j07992K34417N82637R17937J232987J524669J784929
$$ 5331083 4679884 4265380 4157388 4391805 4974442 5892379 7125366 8650035 10434964
12236A0434964J997295K142207K206054K184991K079265J882201J573729J127395
$$ 10434964 12432259 14574466 16780520 18965511 21044776 22926977 24500706 25628101
12228B5628101N31287j89457r66148j702719k303564k695797k839228k728519
$$ 25628101 26159388 25969931 25003783 23301064 20997500 18301703 15462475 12733956
12220A2733956k391655j883546j274726o40312n2977M22897P40341Q80349Q57244
$$ 12733956 10342301 8458755 7184029 6543717 6490740 6913637 7653978 8534327 9391571
12211I391571P14867N14631L17633J63371N2693n2038k02303m25850p02572r72711
$$ 9391571 10106438 10621069 10938702 11102073 11154766 11102728 10900425 10474575 9772003 8799292
12201H799292j169575j249528j199605j027758p54214m12930n5281K55567M60661
$$ 8799292 7629717 6380189 5180584 4152826 3398612 2985682 2930401 3185968 3646629
12192C646629N22273M32455K10927j03162m59510q01969j072658j218379j200700
$$ 3646629 4168902 4601357 4812284 4709122 4249612 3447643 2374985 1156606 -44094
12183d4094j006689o55189j95307L02007P54952J081702J213261J111198P85010
$$ -44094 -1050783 -1705972 -1901279 -1599272 -844320 237382 1450643 2561841 3346851
12174C346851K95147k67520q16665j297406j688923j986471k180073k245431k151500
$$ 3346851 3641998 3374478 2557813 1260407 -428516 -2414987 -4595060 -6840491 -8991991
12165h991991j878520j434044q54795j91876N09244J216573J899638K508360K963512
$$ -8991991 -10870511 -12304555 -13159350 -13351226 -12841982 -11625409 -9725771 -7217411 -4253899
12156d253899L172338L064311K627051J921757J070911K25585m74663r39107j150787
$$ -4253899 -1081561 1982750 4609801 6531558 7602469 7828054 7353391 6414284 5263497
12147E263497j166288j082751r85603r10427q44920p62578o53534n28195m00526
$$ 5263497 4097209 3014458 2028855 1118428 273508 -489070 -1142604 -1670799 -2071325
12138b071325k72916j32485M6871L01220O68443J172997J809540K533481L261895
$$ -2071325 -2344241 -2476726 -2429855 -2128635 -1460192 -287195 1522345 4055826 7317721
12129G317721L885598M292180M394356M151618L576575K728179J699391O02730
$$ 7317721 11203319 15495499 19889855 24041473 27618048 30346227 32045618 32648348
12121C2648348m46781j349013k031618k456477k621643k560281k335777k031856
$$ 32648348 32201567 30852554 28820936 26364459 23742816 21182535 18846758 16814902
12113A6814902j736926j522983j424128j426163j476675j511265j479108j353925
$$ 16814902 15077976 13554993 12130865 10704702 9228027 7716762 6237654 4883729
12105D883729j131149q22576m55960p6145K61507N08864O45826O89829O86175
$$ 4883729 3752580 2930004 2474044 2397899 2659406 3168270 3814096 4503925 5190100
12096E190100O84647P15638P76276Q30237Q20757O92896M16147l635n28268j102650
$$ 5190100 5874747 6590385 7366661 8196898 9017655 9710551 10126698 10123063 9594795 8492145
12086H492145j671150k186115k606053k889112k992463k884443k563900k071281
$$ 8492145 6820995 4634880 2028827 -860285 -3852748 -6737191 -9301091 -11372372
12078a1372372j480652q77025l33731R9783M01241N76270O57467O96225P44991
$$ -11372372 -12853024 -13730049 -14063780 -13963997 -13562756 -12986486 -12329019 -11632794 -10887803
12069a0887803Q37413R77776J143593J295462J387812J379945J247865R92293
$$ -10887803 -10050390 -9072614 -7929021 -6633559 -5245747 -3865802 -2617937 -1625644
12061a625644O37313K21013k15186o35326j017366j359596j677504j987226k284634
$$ -1625644 -988331 -767318 -982504 -1617830 -2635196 -3994792 -5672296 -7659522 -9944156
12052i944156k536623k693615k715610k593723k353390k040225j701079j373054
$$ -9944156 -12480779 -15174394 -17890004 -20483727 -22837117 -24877342 -26578421 -27951475
12044b7951475j083733q56580p12282o60503o85587p39324p53343o68589m62631
$$ -27951475 -29035208 -29891788 -30604070 -31264573 -31950160 -32689484 -33442827 -34111416 -34574047
12035c4574047j56504J99621N49057Q48713J082092J259866J404109J524419J605067
$$ -34574047 -34730551 -34530930 -33981873 -33133160 -32051068 -30791202 -29387093 -27862674 -26257607
12026b6257607J614114J525497J336079J068720P64152M67830K17462L6659o3163
$$ -26257607 -24643493 -23117996 -21781917 -20713197 -19949045 -19481215 -19263753 -19227094 -19290257
12017a9290257p7535p417J37447L35119N52185P48873Q87289R40365Q96957P59031
$$ -19290257 -19367792 -19375209 -19237762 -18902643 -18350458 -17601585 -16714296 -15773931 -14876974 -14117943
12007a4117943N33811K29958j36731n34677r18695j248445j510648j723865j918148
$$ -14117943 -13584132 -13354174 -13490905 -14025582 -14944277 -16192722 -17703370 -19427235 -21345383
11998b1345383k105641k267160k363134k354917k218515j947546j554622j076559
$$ -21345383 -23451024 -25718184 -28081318 -30436235 -32654750 -34602296 -36156918 -37233477
11990c7233477n77498j40198J55847K59349J61645j04136m72775q58355j169151
$$ -37233477 -37810975 -37951173 -37795326 -37535977 -37374332 -37478468 -37951243 -38809598 -39978749
11981c9978749j330445j309092j124530q37811n25455k50192l7471J33248L13043
$$ -39978749 -41309194 -42618286 -43742816 -44580627 -45106082 -45356274 -45393745 -45260497 -44947454
11972d4947454N48150Q48539J184009J505600J769355J945812K019021J986435
$$ -44947454 -44399304 -43550765 -42366756 -40861156 -39091801 -37145989 -35126968 -33140533
11964c3140533J863379J687213J514746J408794J416207J548496J777314K045851
$$ -33140533 -31277154 -29589941 -28075195 -26666401 -25250194 -23701698 -21924384 -19878533
11956a9878533K285619K430176K427339K253185J923499J494232J047906O70277
$$ -19878533 -17592914 -15162738 -12735399 -10482214 -8558715 -7064483 -6016577 -5346300
11948e346300M25429L38611L94053N47220P42454R26726J057775J109967J078066
$$ -5346300 -4920871 -4582260 -4188207 -3640987 -2898533 -1971807 -914032 195935 1274001
11939A274001R75121Q22650O38230M29023J96227n3826l02587n23594o94105q02769
$$ 1274001 2249122 3071772 3710002 4139025 4335252 4281426 3978839 3455245 2761140 1958371
11929A958371q47164q26088p35639n73041l45526p8760J81230L76918M57598L98329
$$ 1958371 1111207 285119 -450520 -1023561 -1369087 -1447847 -1266617 -889699 -432101 -33772
11919c3772K08174p7373m13981p62168j085609j337456j453998j372937j069522
$$ -33772 174402 97029 -316952 -1079120 -2164729 -3502185 -4956183 -6329120 -7398642
11910g398642n81298J651N74841J058170J413689J641083J762177J805359J795393
$$ -7398642 -7979940 -7978289 -7403448 -6345278 -4931589 -3290506 -1528329 277030 2072423
11901B072423J749740J679444J591534J491267J383502J271824J155719J029699
$$ 2072423 3822163 5501607 7093141 8584408 9967910 11239734 12395453 13425152
11893A3425152Q88025P31431N67029L98634K16863J399k63046n69791q87758j177599
$$ 13425152 14313177 15044608 15611637 16010271 16227134 16228533 15965487 15395696 14507938 13330339
11883A3330339j414963j603607j769902j945292k149607k382250k620279k821773
$$ 13330339 11915376 10311769 8541867 6596575 4446968 2064718 -555561 -3377334
11875c377334k935592k915664k732568k378632j872106j265073o44786j10690
$$ -3377334 -6312926 -9228590 -11961158 -14339790 -16211896 -17476969 -18121755 -18232445
11867a8232445K71229N05778O64532Q41512J103899J470672J921061K413079K897912
$$ -18232445 -17961216 -17455438 -16790906 -15949394 -14845495 -13374823 -11453762 -9040683 -6142771
11858f142771L329843L673312L904490M007367L971234L793802L485297L066856
$$ -6142771 -2812928 860384 4764874 8772241 12743475 16537277 20022574 23089430
11850B3089430K564791K007771J429310Q70418L76259j4348k82159m35844n09248
$$ 23089430 25654221 27661992 29091302 29961720 30337979 30323631 30041472 29605628 29096380
11841B9096380n48442n96074o79608q04032r50050j084517j185343j264737j365675
$$ 29096380 28547938 27951864 27272256 26468224 25518174 24433657 23248314 21983577 20617902
11832B0617902j527258j747612j978198k152706k222295k171333k013499j782584
$$ 20617902 19090644 17343032 15364834 13212128 10989833 8818500 6805001 5022417
11824E022417j522782j271776j037189p82883m43092L8368O68990J395901K128244
$$ 5022417 3499635 2227859 1190670 407787 -35305 3063 672053 2067954 4196198
11815D196198K775883L279369L618206L801245L849698L780590L596183L286127
$$ 4196198 6972081 10251450 13869656 17670901 21520599 25301189 28897372 32183499
11807C2183499K844955K294718J692987J115238O23080K42790l1612k18742l32702
$$ 32183499 35028454 37323172 39016159 40131397 40754477 40997267 40965655 40746913 40414211
11798D0414211l79669l64705k97741j91033m8978J40844M04452P62229J202843
$$ 40414211 40034542 39669837 39372096 39181063 39132085 39272929 39677381 40439610 41642453
11789D1642453J668093K061248K275574K227067J876928J240886L89482n61454
$$ 41642453 43310546 45371794 47647368 49874435 51751363 52992249 53381731 52820277
11781E2820277j476849k244157k811849l198077l460242l645463l756049l751877
$$ 52820277 51343428 49099271 46287422 43089345 39629103 35983640 32227591 28475714
11773B8475714l584838l240270k756824k211588j682199j215279q23782n08735
$$ 28475714 24890876 21650606 18893782 16682194 14999995 13784716 12960934 12452199
11765A2452199k79405j51466j27733j83736k74705l60665m30917n09547o37498
$$ 12452199 12172794 12021328 11893595 11709859 11435154 11074489 10643572 10134025 9496527
11756I496527q43647j124668j445882j760090k030786k245706k413169k543652
$$ 9496527 8652880 7528212 6082330 4322240 2291454 45748 -2367421 -4911073
11748d911073k630378k646330k562557k371790k095103j767631j421307j081442
$$ -4911073 -7541451 -10187781 -12750338 -15122128 -17217231 -18984862 -20406169 -21487611
11740b1487611p73275n22547l45111k36890j74518j23469m4543J01293L41649
$$ -21487611 -22260886 -22783433 -23128544 -23365434 -23539952 -23663421 -23707964 -23606671 -23265022
11731b3265022O73402J048253J380134J577579J584296J404427J099575P61637
$$ -23265022 -22591620 -21543367 -20163233 -18585654 -17001358 -15596931 -14497356 -13735719
11723a3735719M74920K83243J77713J15573O1968K4611N1385J91419M52546P88028
$$ -13735719 -13260799 -12977556 -12799843 -12684270 -12622302 -12597691 -12546306 -12354887 -11902341 -11114313
11713a1114313J115946J350913J430413J332662J087361P75229N10148M04394
$$ -11114313 -9998367 -8647454 -7217041 -5884379 -4797018 -4021789 -3511641 -3107247
11705c107247N27040Q73509J364180J876330K291110K527272K548651K356031
$$ -3107247 -2580207 -1706698 -342518 1533812 3824922 6352194 8900845 11256876
11697A1256876J979601J473805R06356L40927j76584o20736r81729j260141j463373
$$ 11256876 13236477 14710282 15616638 15957565 15780981 15160245 14178516 12918375 11455002
11688A1455002j601903j685088j717886j699074j621450j476360j264532j009812
$$ 11455002 9853099 8168011 6450125 4751051 3129601 1653241 388709 -621103
11680f21103p65307o01373n75170o97264r17829j144089j278939j257485j064601
$$ -621103 -1386410 -1987783 -2562953 -3260217 -4178046 -5322135 -6601074 -7858559 -8923160
11671h923160p33246l32452M8980L22661M23286L27552O0573l14679p20590j088363
$$ -8923160 -9656406 -9988858 -9939878 -9617217 -9193931 -8866379 -8805806 -9120485 -9841075 -10929438
11661a0929438j369547j533755j562701j451841j219138r09279n83633k98973
$$ -10929438 -12298985 -13832740 -15395441 -16847282 -18066420 -18975699 -19559332 -19858305
11653a9858305q7768M8990J34615K01571K77614L80559N22515P16350R74123J294482
$$ -19858305 -19946073 -19897083 -19762468 -19560897 -19283283 -18902724 -18380209 -17663859 -16689736 -15395254
11643a5395254J648934J982605K235784K375007K412185K396808K384246K399790
$$ -15395254 -13746320 -11763715 -9527931 -7152924 -4740739 -2343931 40315 2440105
11635B440105K422078K397823K278998K057279J771772J485642J249888J079659
$$ 2440105 4862183 7260006 9539004 11596283 13368055 14853697 16103585 17183244
11627A7183244R55178Q39964P00711N19115K95789M9114j90283l89356n22847
$$ 17183244 18138422 18978386 19679097 20198212 20494001 20543115 20352832 19963476 19440629
11618A9440629n77697n49154m33139k22940Q4944M78023R15780J326561J617567
$$ 19440629 18862932 18313778 17880639 17657699 17742643 18220666 19136446 20463007 22080574
11609B2080574J696235J496981J005056K68284o10921j504010k294755k909481
$$ 22080574 23776809 25273790 26278846 26547130 25936209 24432199 22137444 19227963
11601A9227963l325056l554821l625620l560501l373220l071725k665318k172355
$$ 19227963 15902907 12348086 8722466 5161965 1788745 -1282980 -3948298 -6120653
11593f120653j626795j080310n95911k32613k6843K0351n5849j95187l30747m07745
$$ -6120653 -7747448 -8827758 -9423669 -9656282 -9683125 -9662774 -9718623 -9913810 -10244557 -10652302
11583a0652302l96157k93051j14994J14789L78648O71362R98064J362150J748076
$$ -10652302 -11048459 -11341510 -11456504 -11341715 -10963067 -10291705 -9293641 -7931491 -6183415
11574f183415K110532K380680K489478K395644K103035J660603J148157O55439
$$ -6183415 -4072883 -1692203 797275 3192919 5295954 6956557 8104714 8760153
11566H760153K60235R704r0572p5697q475M0661J3427j22260l66226o88201j038218
$$ 8760153 9020388 9030092 8939520 8863823 8855348 8896009 8909436 8787176 8420950 7732749 6694531
11555F694531j364597j635535j854887k059776k294868k575025k861649l072098
$$ 6694531 5329934 3694399 1839512 -220264 -2515132 -5090157 -7951806 -11023904
11547a1023904l117859k946855k565496k032061j428129q22567k46239L07828
$$ -11023904 -14141763 -17088618 -19654114 -21686175 -23114304 -23936871 -24183110 -23875282
11539b3875282Q59617J412585J941261K399141K733255K895790K856682K619744
$$ -23875282 -23015665 -21603080 -19661819 -17262678 -14529423 -11633633 -8776951 -6157207
11531f157207K231180J766667J301633Q86810N44350K77159P3979r4216k73381
$$ -6157207 -3926027 -2159360 -857727 29083 573433 850592 924571 830355 556974
11522E56974n09212q19943j179000j520908j766474j852589j754014j490348j115432
$$ 556974 47762 -772181 -1951181 -3472089 -5238563 -7091152 -8845166 -10335514 -11450946
11513a1450946o92623k69155J34256N14142Q67276J181106J435540J609966J690602
$$ -11450946 -12143569 -12412724 -12278468 -11764326 -10897050 -9715944 -8280404 -6670438 -4979836
11504d979836J677699J590566J464922J340933J248499J198154J180622J172635
$$ -4979836 -3302137 -1711571 -246649 1094284 2342783 3540937 4721559 5894194
11496E894194J146262J079224R62339Q01357O14593M29346K75826J75194J24489
$$ 5894194 7040456 8119680 9082019 9883376 10497969 10927315 11203141 11378335 11502824
11487A1502824R0325K1575j23036l50069o26634q99037j121650j275740j365447
$$ 11502824 11593149 11614724 11491688 11141619 10514985 9615948 8494298 7218558 5853111
11478E853111j396848j361538j242539j037496p75040n07021k84726j40840q6844
$$ 5853111 4456263 3094725 1852186 814690 39650 -467371 -752097 -892937 -979781
11469i79781j17048k10157l32017m46129n26533n60986n42726m63035l15195j06522
$$ -979781 -1096829 -1306986 -1639003 -2085132 -2611665 -3172651 -3715377 -4178412 -4493607 -4600129
11459d600129J34101L61945N33971O28408O54609O47429O52142P11427Q58551
$$ -4600129 -4466028 -4104083 -3570112 -2941704 -2287095 -1639666 -987524 -276097 582454
11450E82454J109723J450623J826047K147929K324328K293967K046940J623740
$$ 582454 1692177 3142800 4968847 7116776 9441104 11735071 13782011 15405751
11442A5405751J097921N53067O3455l16761n57036o51530o20257n07060l69930
$$ 15405751 16503672 17056739 17120194 16803433 16246397 15594867 14974610 14467550 14097620
11433A4097620k64748k29813k79062m06214n94805q25590j076853j321731j530250
$$ 14097620 13832872 13603059 13323997 12917783 12322978 11497388 10420535 9098804 7568554
11424G568554j677365j749323j741737j653204j483715j240883r47932o46730
$$ 7568554 5891189 4141866 2400129 746925 -736790 -1977673 -2925605 -3572335
11416c572335l92931k41675k24130l24126m73240n75643n51512l72012o6316K97191
$$ -3572335 -3965266 -4206941 -4431071 -4755197 -5228437 -5804080 -6355592 -6727604 -6793920 -6496729
11406f496729O39541Q95750J029074J033529R25970P33109M81279J93911j04481
$$ -6496729 -5857188 -4961438 -3932364 -2898835 -1972865 -1239756 -758477 -564566 -669047
11397f69047l83544o08293p49198p96319p65603o88225n87975m64598k97140o3257
$$ -669047 -1052591 -1660884 -2410082 -3206401 -3972004 -4660229 -5248204 -5712802 -6009942 -6073199
11387f073199K43117O08530J008357J414975J798417K121696K338842K402572
$$ -6073199 -5830082 -5221552 -4213195 -2798220 -999803 1121893 3460735 5863307
11379E863307K282374J984274J558589J087946O62345L55206K07518K17621L36521
$$ 5863307 8145681 10129955 11688544 12776490 13438835 13794041 14001559 14219180 14555701
11370A4555701M77623N46269M75326K41962j43962o61602j284435j964707k619168
$$ 14555701 15033324 15579593 16054919 16296881 16152919 15491317 14206882 12242175 9623007
11361I623007l140069l430974l442929l185965k711888k085941j368243o12139
$$ 9623007 6482938 3051964 -390965 -3576930 -6288818 -8374759 -9743002 -10355141
11353a0355141J28913P97696J338368J709553J901277J947085J918697J896967
$$ -10355141 -10226228 -9428532 -8090164 -6380611 -4479334 -2532249 -613552 1283415
11345A283415J931391K013619K082558K055489J864951J484279R35782K81909
$$ 1283415 3214806 5228425 7310983 9366472 11231423 12715702 13651484 13933393
11337A3933393l97392j032138j580654k029149k375842k614013k727934k703851
$$ 13933393 13536001 12503863 10923209 8894060 6518218 3904205 1176271 -1527580
11329a527580k544560k272409j916359j494377j008130m56341J42589P35855J242155
$$ -1527580 -4072140 -6344549 -8260908 -9755285 -10763415 -11219756 -11077167 -10341312 -9099157
11320i099157J578893J697411J605679J365444J068825Q10287O62813O56631P63361
$$ -9099157 -7520264 -5822853 -4217174 -2851730 -1782905 -972618 -309805 346826 1110187
11311A110187R01021R71014R11933P35298N18848L63518L41422M61702O68620
$$ 1110187 2011208 2982222 3894155 4629453 5148301 5511819 5853241 6314943 6983563
11302F983563Q71927R94534J011209R55314Q91009Q71988R13966R93812J067262
$$ 6983563 7855490 8850024 9861233 10816547 11707556 12579544 13493510 14487322 15554584
11293A5554584J088592J022670Q51310N79050K36942j22340m40942o76442q14023
$$ 15554584 16643176 17665846 18517156 19096206 19333148 19210808 18769866 18093424 17279401
11284A7279401q64075q51112q05508p62249p60525q36800j012904j287176j633072
$$ 17279401 16415326 15564214 14758706 13996457 13235932 12399132 11386228 10099052 8465980
11275H465980k002704k332670k552574k596740k417445j999152j372808o21247
$$ 8465980 6463276 4130606 1578032 -1018708 -3436153 -5435305 -6808113 -7429360
11267g429360J37884P91923J272444J566735J697680J693321J568337J324283
$$ -7429360 -7291476 -6499553 -5227109 -3660374 -1962694 -269373 1298964 2623247
11259B623247R64210N12813K7289m15356p51413r59347j061397j100111j111597
$$ 2623247 3587457 4100270 4127559 3712203 2960790 2001443 940046 -160065 -1271662
11250a271662j112305j100785j068833j015851r56911r14314q95472q76831q12908
$$ -1271662 -2383967 -3484752 -4553585 -5569436 -6526347 -7440661 -8336133 -9212964 -10025872
11241a0025872o66884m37730j61585J11162L41863N13702O24819O76689O68751
$$ -10025872 -10692756 -11130486 -11292071 -11180909 -10839046 -10325344 -9700525 -9023836 -8355085
11232h355085O01071M80750L25883J61501P374j32329k64432l87066m73029m74664
$$ -8355085 -7754014 -7273264 -6947381 -6785880 -6778506 -6910835 -7175267 -7562333 -8035362 -8510026
11222h510026l48071p5663L30005Q38467J414295K020237K613210L142607L555836
$$ -8510026 -8858097 -8933760 -8603755 -7765288 -6350993 -4330756 -1717546 1425061 4980897
11213D980897L806772L859841L689264L280594K638759J796637Q15409k23198
$$ 4980897 8787669 12647510 16336774 19617368 22256127 24052764 24868173 24644975
11205B4644975j225105k089510k718063l032964k999423k641138k039936j317259
$$ 24644975 23419870 21330360 18612297 15579333 12579910 9938772 7898836 6581577
11197F581577o01567P358M61728P65452R52423J057767J097740J065802R42825
$$ 6581577 5980010 5987368 6449096 7214548 8166971 9224738 10322478 11388280 12331105
11188A2331105P14140L85142j1116m17157p63728r87283j047031r37390o92895
$$ 12331105 13045245 13430387 13419271 13002114 12238386 11251103 10204072 9266682 8573787
11179H573787l83162r6363Q6961J22545K1818j48980k93627l26385k09472L2293
$$ 8573787 8190625 8094262 8181223 8303768 8325586 8176606 7882979 7556594 7347122 7379415
11169G379415L28535O02381Q07754R41992J028063J083048J098768J048465R10455
$$ 7379415 7707950 8310331 9118085 10060077 11088140 12171188 13269956 14318421 15228876
11160A5228876O87406M07749J12130j63813m01628o03776p88943r81895j202077
$$ 15228876 15916282 16324031 16436161 16272348 15870720 15266944 14478001 13496106 12294029
11151A2294029j453063j713656j935577k055886k023861j826738j495020j083332
$$ 12294029 10840966 9127310 7191733 5135847 3111986 1285248 -209772 -1293104
11143a293104o41571j95694K52019P05611J152999J555393J860602K034692K088517
$$ -1293104 -1934675 -2130369 -1878350 -1172739 -19740 1535653 3396255 5430947 7519464
11134G519464K074835K053159K045648K016999J895382J621766J193773O74502
$$ 7519464 9594299 11647458 13693106 15710105 17605487 19227253 20421026 21095528
11126B1095528J62196k57504n47197p23868q38249r44205j075089j233324j390680
$$ 21095528 21257724 21000220 20453023 19729155 18890906 17946701 16871612 15638288 14247608
11117A4247608j497745j504539j387214j164606q90922o29864m29731l12615k76358
$$ 14247608 12749863 11245324 9858110 8693504 7802582 7172718 6742987 6430372 6154014
11108F154014l02977l70240m61497n66068o69222p43101p51476o68723n00626
$$ 6154014 5851037 5480797 5019300 4453232 3784010 3040909 2289433 1620710 1120084
11099A120084k92502j17218m6898j22880l40800o56282j003107j313324j535236
$$ 1120084 827582 710364 663466 540586 199786 -456496 -1459603 -2772927 -4308163
11090d308163j646582j656279j592369j485675j361039j235352j112944r78422
$$ -4308163 -5954745 -7611024 -9203393 -10689068 -12050107 -13285459 -14398403 -15376825
11082a5376825p99634n47891k22950J38966M83051P67042R82111J148302J289175
$$ -15376825 -16176459 -16724350 -16947300 -16808334 -16325283 -15558241 -14576130 -13427828 -12138653
11073a2138653J406046J470958J441397J285040J000658O26573K32689j02569
$$ -12138653 -10732607 -9261649 -7820252 -6535212 -5534554 -4907981 -4675292 -4777861
11065d777861l19358l91333l21688j30780J49690M73883P81172J006453J098833
$$ -4777861 -5097219 -5488552 -5810240 -5941020 -5791330 -5317447 -4536275 -3529822 -2430989
11056b430989J039474Q49491N81595K96586L9295j65002k89037k81120p3355L77532
$$ -2430989 -1391515 -542024 39571 336157 375452 210450 -78587 -359707 -433062 -55530
11046e5530J051121J861282K691409L437170M030542M442890M677996M762351
$$ -55530 995591 2856873 5548282 8985452 13015994 17458884 22136880 26899231
11038B6899231M733542M626884M462087M233544L910892L454994K842920K084302
$$ 26899231 31632773 36259657 40721744 44955288 48866180 52321174 55164094 57248396
11030E7248396J217465K94184o27831j479234k175246k631576k799670k700859
$$ 57248396 58465861 58760045 58132214 56652980 54477734 51846158 49046488 46345629
11022D6345629k433543k140818j950270j918832k016149k155034k245227k234602
$$ 46345629 43912086 41771268 39820998 37902166 35886017 33730983 31485756 29251154
11014B9251154k118523j924564j691774j456533j245688j075784r60405r23969
$$ 29251154 27132631 25208067 23516293 22059760 20814072 19738288 18777883 17853914
11006A7853914j009354j263823j703386k278785k872890l339686l564798l510629
$$ 17853914 16844560 15580737 13877351 11598566 8725676 5385990 1821192 -1689437
10998a689437l219263k775882k262427j733408j220699p46904l25603M9553M06577
$$ -1689437 -4908700 -7684582 -9947009 -11680417 -12901116 -13648020 -13973623 -13924070 -13517493
10989a3517493P76446J166237J545992J858586K043874K062142J907225J607152
$$ -13517493 -12741047 -11574810 -10028818 -8170232 -6126358 -4064216 -2156991 -549839
10981e49839J214347P89224L82786K4759k77570n29568p34119q79689r38432q77041
$$ -549839 664508 1453732 1836518 1861277 1583707 1054139 320020 -559669 -1498101 -2375142
10971b375142o77530l57961K1533L76410O31326P48385P32455O14194M26053J86764
$$ -2375142 -3052672 -3410633 -3389100 -3012690 -2381364 -1632979 -900524 -286330 139723 326487
10961C26487r8823m25660p68860j073743j269662j304538j176193r34347o50354
$$ 326487 227664 -197996 -966856 -2040599 -3310261 -4614799 -5790992 -6725339 -7375693
10952g375693l78034j32911J01001L47324O13204Q78531J103894J250608J296560
$$ -7375693 -7753727 -7886638 -7785637 -7438313 -6825109 -5946578 -4842684 -3592076 -2295516
10943b295516J236715J075015Q23047N07757J73527j31575l75582n51153o69639
$$ -2295516 -1058801 16214 839261 1347018 1520545 1388970 1013388 462235 -207404
10934b07404p51783q22866r08633j026695j175690j330105j446633j482449j418474
$$ -207404 -959187 -1782053 -2690686 -3717381 -4893071 -6223176 -7669809 -9152258 -10570732
10925a0570732j274060j100816r56099q72073q39446q13624p36254n59030k60959
$$ -10570732 -11844792 -12945608 -13901707 -14773780 -15613226 -16426850 -17163104 -17722134 -17983093
10916a7983093J42750N99789J030424J349837J496393J450846J236602R06348
$$ -17983093 -17840343 -17240554 -16210130 -14860293 -13363900 -11913054 -10676452 -9770104
10908i770104N28403J78871o4969j35682R145L71841R06072J522476K111386K572823
$$ -9770104 -9241701 -9062830 -9127799 -9263481 -9254336 -8882495 -7976423 -6453947 -4342561 -1769738
10898a769738K837026K869296K668283K266747J729242J135778N53948J6643m80335
$$ -1769738 1067288 3936584 6604867 8871614 10600856 11736634 12290582 12307225 11826890
10889A1826890r61793j449543j942619k408017k785906l009395l031429k844592
$$ 11826890 10865097 9415554 7472935 5064918 2279012 -730383 -3761812 -6606404
10881f606404k481918j999269j453515q91848l54051J23981N15099Q09827J017461
$$ -6606404 -9088322 -11087591 -12541106 -13432954 -13787005 -13663024 -13147925 -12338098 -11320637
10872a1320637J156210J241799J284135J290870J269531J223718J146587J017307
$$ -11320637 -10164427 -8922628 -7638493 -6347623 -5078092 -3854374 -2707787 -1690480
10864a690480Q04993M82594M7977m59928r65302j382444j648046j737425j661390
$$ -1690480 -885487 -402893 -354916 -814844 -1780146 -3162590 -4810636 -6548061 -8209451
10855h209451j457396j183366r06482o79476n14497l74824j93229R2785N06301
$$ -8209451 -9666847 -10850213 -11756695 -12436171 -12950668 -13325492 -13518721 -13425936 -12919635
10846a2919635J012879J530197J964544K253642K386859K391220K299594K126855
$$ -12919635 -11906756 -10376559 -8412015 -6158373 -3771514 -1380294 919300 3046155
10838C046155J865857J499116J017756M40496j76743p49465j190988j444124j501530
$$ 3046155 4912012 6411128 7428884 7869380 7692637 6943172 5752184 4308060 2806530
10829B806530j404154j218818j007775q07953o30206m73141l35907k19878j23014
$$ 2806530 1402376 183558 -824217 -1632170 -2262376 -2735517 -3071424 -3291302 -3414316
10820c414316l8273L9102J03132J39028J36794J03529O0420K5149m517n1515j44648
$$ -3414316 -3452589 -3413487 -3310355 -3171327 -3034533 -2931004 -2870584 -2845435 -2849952 -2901467 -3046115
10809c046115l00407n14258p66397j036813j316711j605313j894139k153653k334840
$$ -3046115 -3346522 -3860780 -4627177 -5663990 -6980701 -8586014 -10480153 -12633806 -14968646
10800a4968646k383315k253774j917865j368958o29924K36622J124839J901187
$$ -14968646 -17351961 -19605735 -21523600 -22892558 -23522482 -23285860 -22161021 -20259834
10792b0259834K443235K686701K650633K419174K090208J727581J348780R48698
$$ -20259834 -17816599 -15129898 -12479265 -10060091 -7969883 -6242302 -4893522 -3944824
10784c944824N33043J33126k06388m53201o05801o93363p61158q52290r92626
$$ -3944824 -3411781 -3278655 -3485043 -3938244 -4544045 -5237408 -5998566 -6850856 -7843482
10775g843482j181016j387736j564544j663544j654029j527812j293984r72021
$$ -7843482 -9024498 -10412234 -11976778 -13640322 -15294351 -16822163 -18116147 -19088168
10767a9088168n88823j76887K31980O16202R69009J292341J584963J835522K024535
$$ -19088168 -19676991 -19853878 -19621898 -19005696 -18036687 -16744346 -15159383 -13323861 -11299326
10758a1299326K129086K124364J985831J699473J277584P66614K36819k41490
$$ -11299326 -9170240 -7045876 -5060045 -3360572 -2082988 -1316374 -1079555 -1321045
10750a321045o19815q80019j029676j091362j091042j046177r55855q00550n57896
$$ -1321045 -1940860 -2820879 -3850555 -4941917 -6032959 -7079136 -8034991 -8835541 -9393437
10741i393437k27388J55608N30723Q41167J057307J178419J215562J172441J039678
$$ -9393437 -9620825 -9465217 -8934494 -8093327 -7036020 -5857601 -4642039 -3469598 -2429920
10732b429920Q05527M73031O8984l62559p77171j146786j469227j767372k074675
$$ -2429920 -1624393 -1151362 -1082378 -1444937 -2222108 -3368894 -4838121 -6605493 -8680168
10723h680168k408230k743154l009028l116888l002066k657065k138596j550672
$$ -8680168 -11088398 -13831552 -16840580 -19957468 -22959534 -25616599 -27755195 -29305867
10715b9305867j015101o39476m88160n61425p91021j059436j238670j229039r77544
$$ -29305867 -30320968 -30960444 -31448604 -32010029 -32801050 -33860486 -35099156 -36328195 -37305739
10706c7305739m73460K62414J180302K198354L205929M078710M701870M995311
$$ -37305739 -37779199 -37516785 -36336483 -34138129 -30932200 -26853490 -22151620 -17156309
10698a7156309M934658M558172L952197L220628K456066J726900J079938N48270
$$ -17156309 -12221651 -7663479 -3711282 -490654 1965412 3692312 4772250 5320520
10690E320520J55847q2560j63430r6792R1108L55151O32778Q55362R69003R53490
$$ 5320520 5476367 5393807 5230377 5133585 5224693 5579844 6212622 7067984 8036987 8990477
10680H990477Q25838O26243L97245J68541m8207k56610m67622o90401r27059j173337
$$ 8990477 9816315 10442558 10839803 11008344 10960137 10703527 10235905 9545504 8618445 7445108
10670G445108j421354j659469j869575k025703k096027k048291j858975j524663
$$ 7445108 6023754 4364285 2494710 469007 -1627020 -3675311 -5534286 -7058949
10662g058949j068379n33110L5705O05807J159576J681279K141587K492830K680839
$$ -7058949 -8127328 -8660438 -8624733 -8018926 -6859350 -5178071 -3036484 -543654 2137185
10653B137185K667385K448163K053739J535323R51252L66778j39329m81218n94766
$$ 2137185 4804570 7252733 9306472 10841795 11793047 12159825 12020496 11539278 10944512
10644A0944512m72682j76848J85711N07657P18103P95550P62648O73679N96509
$$ 10944512 10471830 10294982 10480693 10988350 11706453 12502003 13264651 13938330 14534839
10635A4534839N87768O70605Q30222J029478J228491J392672J491105J498293
$$ 14534839 15122607 15793212 16623434 17652912 18881403 20274075 21765180 23263473
10627B3263473J404618J227968J016194Q35977P50498P93332R49788J155178J311444
$$ 23263473 24668091 25896059 26912253 27748230 28498728 29292060 30241848 31397026 32708470
10618C2708470J316524J098902O47772K4751o54661j265633j721542j998238k125001
$$ 32708470 34024994 35123896 35771668 35796419 35141758 33876125 32154583 30156345 28031344
10609B8031344k153914k130179k080159k017083j950013j882887j806082j695055
$$ 28031344 25877430 23747251 21667092 19650009 17699996 15817109 14011027 12315972
10601A2315972j524790j291398j022713p67257n67269m33213l36322k23391m3533
$$ 12315972 10791182 9499784 8477071 7709814 7142545 6709332 6373010 6149619 6106086
10592F106086K28833N84242R82813J370001J697062J935177K074284K110278K034689
$$ 6106086 6334919 6919161 7901974 9271975 10969037 12904214 14978498 17088776 19123465
10583A9123465J836359J511177J070885N47239r160n38289r88589j334160j578510
$$ 19123465 20959824 22471001 23541886 24089125 24079965 23541676 22553087 21218927 19640417
10574A9640417j741877j842562j886056j868315j788428j659256j506196j353638
$$ 19640417 17898540 16055978 14169922 12301607 10513179 8853923 7347727 5994089
10566E994089j208765j054252q54931n75498k01016K50148P28043J166061J501061
$$ 5994089 4785324 3731072 2876141 2300643 2099627 2349775 3077818 4243879 5744940
10557E744940J692519J738316J681751J600058J572365J642723J802413K003739
$$ 5744940 7437459 9175775 10857526 12457584 14029949 15672672 17475085 19478824
10549A9478824K194049K343726K447702K503779K492608K380371K138800J759459
$$ 19478824 21672873 24016599 26464301 28968080 31460688 33841059 35979859 37739318
10541C7739318J251981O38069m7989p59707j449309k080863k630012l071190l368680
$$ 37739318 38991299 39629368 39581379 38821672 37372363 35291500 32661488 29590298 26221618
10532B6221618l481634l378382l050612k520423j835477j054673k37110N55481
$$ 26221618 22739984 19361602 16310990 13790567 11955090 10900417 10663307 11218788
10524A1218788J250420J767141K036217K022307J738872J250179O58042P3568
$$ 11218788 12469208 14236349 16272566 18294873 20033745 21283924 21941966 22015534
10516B2015534m14462p56081r34262r46554p88365m46564R3655Q32768J744625
$$ 22015534 21601072 20844991 19910729 18964175 18175810 17729246 17822901 18655669 20400294
10507B0400294K778684L873181M968777O020684P011532P957998Q902791R899050
$$ 20400294 23178978 27052159 32020936 38041620 45053152 53011150 61913941 71812991
10499G1812991J1001062J2259262J3709125J5360074J7197899J9189026K1255452
$$ 71812991 82814053 95073315 108782440 124142514 141340413 160529439 181784891
10492A81784891K3212687K4699808K5144825K3821097K0063620J3640996N093733
$$ 181784891 204997578 229697386 254842211 278663308 298726928 312367924 317461657
10485C17461657m262744j2792540j9200435k2964046k4311612k3887371k2398833
$$ 317461657 313198913 300406373 281205938 258241892 233930280 210042909 187644076
10478A87644076k0413936j8300920j6248393j4323366j2534365j0871903r325227
$$ 187644076 167230140 148929220 132680827 118357461 105823096 94951193 85625966
10471H5625966p893029o591697n450282m494507l737083l180087k817432k629678
$$ 85625966 77732937 71141240 65690958 61196451 57459368 54279281 51461849 48832171
10463D8832171k578099k606277k649558k649387k568438k398487k155262j866069
$$ 48832171 46254072 43647795 40998237 38348850 35780412 33381925 31226663 29360594
10455B9360594j560706j267573j010023q03449o57968n84234n93518o89314q57458
$$ 29360594 27799888 26532315 25522292 24718843 24060875 23476641 22883123 22193809 21336351
10446B1336351j062276j252285j376348j405738j349251j248994j158182j114313
$$ 21336351 20274075 19021790 17645442 16239704 14890453 13641459 12483277 11368964
10438A1368964j121304j148883j151723j099292r94946q68967p54621o70250o16517
$$ 11368964 10247660 9098777 7947054 6847762 5852816 4983849 4229228 3558978 2942461
10429B942461n80482n40768m78162l89424k89636j96389j11811k2561Q3303K02349
$$ 2942461 2361979 1821211 1343049 953625 663989 467600 355789 333228 416531 618880
10419F18880L18947M21709N18753O39004Q15260J056942J330252J561720J666163
$$ 618880 937827 1359536 1878289 2517293 3332553 4389495 5719747 7281467 8947630
10410H947630J583728J305187Q72342L55755j73917o62964j074354j380055j558843
$$ 8947630 10531358 11836545 12708887 13064642 12890725 12227761 11153407 9773352 8214509
10401H214509j603102j528203j375090j199232j046135r25414q03460o25829l57577
$$ 8214509 6611407 5083204 3708114 2508882 1462747 537333 -266127 -891956 -1249533
10392a249533j4002L38690O11187P29060O61601M31231J03866k32721m93814o19112
$$ -1249533 -1263535 -924845 -313658 415402 1077003 1508234 1612100 1379379 885565 266453
10382B66453n86371m14804j56782J20443L56773N15884N89799N92603N50581M93900
$$ 266453 -319918 -734722 -891504 -771061 -414288 101596 691395 1283998 1834579 2328479
10372B328479M48122M22738M01125L41499J92161q6366n03019j027198j590059
$$ 2328479 2776601 3199339 3600464 3941963 4134124 4047758 3544739 2517541 927482
10363I27482k096643k448204k569912k435381k078425j583903j056533n80969
$$ 927482 -1169161 -3617365 -6187277 -8622658 -10701083 -12284986 -13341519 -13922488
10355a3922488j96546R8376L20944M80458N72445N87747N26148M06643K69605
$$ -13922488 -14119034 -14020658 -13699714 -13219256 -12646811 -12059064 -11532916 -11126273 -10856668
10346a0856668J67323J45202K24077L94029O20574Q55939J049514J157063J150410
$$ -10856668 -10689345 -10544143 -10320066 -9926037 -9305463 -8449524 -7400010 -6242947 -5092537
10337e092537J028087Q24832O13486M88868N29811P54900J102888J457504J702747
$$ -5092537 -4064450 -3239618 -2626132 -2137264 -1607453 -852553 250335 1707839 3410586
10328C410586J770432J652325J382162J013295O08546K37344l3702j61026j44833
$$ 3410586 5181018 6833343 8215505 9228800 9837346 10074690 10040988 9879962 9735129
10319I735129l4049R3124J64565J42412K4199j80385m73513q73019j396396k040517
$$ 9735129 9701080 9794204 9958769 10101181 10125380 9944995 9471482 8598463 7202067 5161550
10309E161550k768453l505617m146570m575139m693394m446417l834497k915843
$$ 5161550 2393097 -1112520 -5259090 -9834229 -14527623 -18974040 -22808537 -25724380
10301b5724380j803779o51890L80389J172481J672579J895507J895794J739408
$$ -25724380 -27528159 -28180049 -27799660 -26627179 -24954600 -23059093 -21163299 -19423891
10293a9423891J491275J217012R84647Q54641Q59945R90214J194000J400107J546307
$$ -19423891 -17932616 -16715604 -15730957 -14876316 -14016371 -13026157 -11832157 -10432050 -8885743
10284h885743J600814J567940J477673J367033J266351J199673J192628J270124
$$ -8885743 -7284929 -5716989 -4239316 -2872283 -1605932 -406259 786369 2056493
10276B056493J436835J657627J862165J975896J953099J787257J497844J111614
$$ 2056493 3493328 5150955 7013120 8989016 10942115 12729372 14227216 15338830
10268A5338830O53621J48323l77185q92801j366753j766131k057943k214893k226279
$$ 15338830 15992451 16140774 15763589 14870788 13504035 11737904 9679961 7465068 5238789
10259E238789k106188j888977j611548j294850r38728n33747q1131L91721Q29496
$$ 5238789 3132601 1243624 -367924 -1662774 -2601502 -3135249 -3216380 -2824659 -1995163
10250a995163J163056J332411J305674J084312O96889J92006l62945q81855j269680
$$ -1995163 -832107 500304 1805978 2890290 3587179 3779185 3416240 2534385 1264705
10241A264705j446956j380625j102857p03389k98027Q755J51013J16668m5305
$$ 1264705 -182251 -1562876 -2665733 -3369122 -3667149 -3658394 -3507381 -3390713 -3436018
10232c436018k32931l26998k47627K610L42180O57992Q59724R06182P99963N70994
$$ -3436018 -3668949 -3995947 -4243574 -4240964 -3898784 -3240792 -2381068 -1474886 -674923 -103929
10222a03929K66819n0756l14068m69262m99460m35072l40072k79301k85984l48234
$$ -103929 162890 112134 -201934 -671196 -1170656 -1605728 -1945800 -2225101 -2511085 -2859319
10212b859319m19076m39862l62300j59786J73278O29178J193715J845513K548417
$$ -2859319 -3278395 -3718257 -4080557 -4240343 -4067065 -3437887 -2244172 -398659 2149758
10203B149758L245495L863665M328720M580523M579455M305938L762745K984142
$$ 2149758 5395253 9258918 13587638 18168161 22747616 27053554 30816299 33800441
10195C3800441K043024J041899Q4061p60472j470802k060416k543418k909642
$$ 33800441 35843465 36885364 36969425 36208953 34738151 32677735 30134317 27224675
10187B7224675l128494l175090l052280k788551k417410j962068j441791q92496
$$ 27224675 24096181 20921091 17868811 15080260 12662850 10700782 9258991 8366495
10179H366495l78836J7586K28266K26424L7621k70203o08455q90378j047554j039874
$$ 8366495 7987659 8005245 8233511 8459935 8497556 8227353 7618898 6728520 5680966 4641092
10169D641092q61802n46402j63663J92131M26125M69913L01999m4514m89853r31532
$$ 4641092 3779290 3232888 3069225 3261356 3687481 4157394 4459393 4414879 3925026 2993494
10159B993494j277497j472561j504152j389003j155678q34709m56485n2881L38796
$$ 2993494 1715997 243436 -1260716 -2649719 -3805397 -4640106 -5096591 -5149472 -4810676
10150d810676O72593Q99121R82229R17427P36856M94439K38781j0168k63913n41448
$$ -4810676 -4138083 -3238962 -2256733 -1339306 -602450 -108011 130770 120602 -143311 -684759
10140f84759q34608j094720j257754j287229j195746j029987q40896o66844n33566
$$ -684759 -1519367 -2614087 -3871841 -5159070 -6354816 -7384803 -8225699 -8892543 -9426109
10131i426109m56757m39216m67832n17158n59664n77280n67873n43027n19784
$$ -9426109 -9882866 -10322082 -10789914 -11307072 -11866736 -12444016 -13011889 -13554916 -14074700
10122a4074700n13561n35123n87848o63926p45816q16128q65831q88203q63143
$$ -14074700 -14588261 -15123384 -15711232 -16375158 -17120974 -17937102 -18802933 -19691136 -20554279
10113b0554279p51873n13707j33305L64557R24271J484201J997794K437756K786184
$$ -20554279 -21306152 -21819859 -21953164 -21588607 -20664336 -19180135 -17182341 -14744585 -11958401
10104a1958401L025965L144341L142881L038831K852995K596817K273777J895038
$$ -11958401 -8932436 -5788095 -2645214 393617 3246612 5843429 8117206 10012244
10096A0012244J493188J118553Q18902O20142N25352N31141O41980Q65979J196172
$$ 10012244 11505432 12623985 13442887 14063029 14588381 15119522 15761502 16627481 17823653
10087A7823653J595235J994417K304253K431849K302546J879844J173419K33260
$$ 17823653 19418888 21413305 23717558 26149407 28451953 30331797 31505216 31738476
10079C1738476q59360j996408l051569l904593m475250m744412m747515m547981
$$ 31738476 30879116 28882708 25831139 21926546 17451296 12706884 7959369 3411388
10071C411388m210409l786766l315045k821379k317451j794114j221564n65380
$$ 3411388 -799021 -4585787 -7900832 -10722211 -13039662 -14833776 -16055340 -16620720
10063a6620720J85515R96554J787674K458714K927517L161157L184053L058851
$$ -16620720 -16435205 -15438651 -13650977 -11192263 -8264746 -5103589 -1919536 1139315
10055A139315K852094K605713K329622K013544J643672J211274P12230J45929
$$ 1139315 3991409 6597122 8926744 10940288 12583960 13795234 14507464 14653393
10047A4653393m79261j135779j771263k315645k700712k883377k861187k671815
$$ 14653393 14174132 13038353 11267090 8951445 6250733 3367356 506169 -2165646
10039b165646k376325k034986j689133j357741j046367p57837m95445k57228k7084
$$ -2165646 -4541971 -6576957 -8266090 -9623831 -10670198 -11428035 -11923480 -12180708 -12207792
10030a2207792K28613N52642R77270J502694K087675K661596L152774L514077
$$ -12207792 -11979179 -11426537 -10449267 -8946573 -6858898 -4197302 -1044528 2469549
10022B469549L726465L779518L651261L312722K757968K031491J224752M44301
$$ 2469549 6196014 9975532 13626793 16939515 19697483 21728974 22953726 23398027
10014B3398027k19854p03549r61910r68078p24634k73447L12084R49303J564050
$$ 23398027 23178173 22474624 21512714 20544636 19820002 19546555 19858639 20807942 22371992
10005B2371992K091429K468247K635896K559362K248405J763605J204074O84271
$$ 22371992 24463421 26931668 29567564 32126926 34375331 36138936 37343010 38027281
9997C8027281L04930J19803J09030J79761K04851Q2781k16584o45484j106969
$$ 38027281 38332211 38452014 38561044 38740805 38945656 39028437 38811853 38166369 37059400
9988C7059400j494552j721054j731786j508948j072842m78611J94384Q57884J428186
$$ 37059400 35564848 33843794 32112008 30603060 29530218 29051607 29245991 30103875 31532061
9979C1532061J834335K024031J971758J688329J224746O62835R2860m10951q02603
$$ 31532061 33366396 35390427 37362185 39050514 40275260 40938095 41030955 40620004 39817401
9970C9817401j059543j171609j138760r79672p37594m70408k29562m6467O1206
$$ 39817401 38757858 37586249 36447489 35467817 34730223 34259815 34030253 33983786 34044992
9961C4044992P1417n0838l38852p93741j361738j940130k412725k693421k749867
$$ 34044992 34116409 34065571 33726719 32932978 31571240 29631110 27218385 24524964 21775097
9952B1775097k595095k261258j781282j189974n32849J34475P57237J290396J699898
$$ 21775097 19180002 16918744 15137462 13947488 13414639 13549114 14306351 15596747 17296645
9943A7296645J964378K083414K083937K012763J916935J826827J752743J691919
$$ 17296645 19261023 21344437 23428374 25441137 27358072 29184899 30937642 32629561
9935C2629561J635695J571772J484985J361874J197346R94130P49352M38043J3296
$$ 32629561 34265256 35837028 37322013 38683887 39881233 40875363 41624715 42062758 42076054
9926D2076054n68672j313359k167366l025378l760250m262645m474659m403473
$$ 42076054 41507382 40194023 38026657 35001279 31241029 26978384 22503725 18100252
9918A8100252m109411l675841l175630k647238k089009j475244p86953l8808P14202
$$ 18100252 13990841 10315000 7139370 4492132 2403123 927879 140926 102118 816320
9909H16320J393046J924498K270658K439474K459631K327709J966146J226942
$$ 816320 2209366 4133864 6404522 8843996 11303627 13631336 15597482 16824424
9901A6824424o4661k060786m854559q446512j2699048j7279380k1612390k4900129
$$ 16824424 16759763 14698977 9844418 1397906 -11301142 -28580522 -50192912 -75093041
9893g5093041k6286548k5178144k1570655j6139032r979074m158300O31312M154097
$$ -75093041 -101379589 -126557733 -148128388 -164267420 -174246494 -178404794 -177773482 -173619385
9885a73619385O505917P938239Q724576R084849R162630R044755Q792468Q452007
$$ -173619385 -167113468 -159175229 -150450653 -141365804 -132203174 -123158419 -114365951 -105913944
9877a05913944Q045853P570302P010671O361261N636141M869658M110216L410275
$$ -105913944 -97868091 -90297789 -83287118 -76925857 -71289716 -66420058 -62309842 -58899567
9869e8899567K817302K367903K079268J934599J875402J819777J705557J530098
$$ -58899567 -56082265 -53714362 -51635094 -49700495 -47825093 -46005316 -44299759 -42769661
9861d2769661J355351J271252J340711J563020J879406K211717K499565K708389
$$ -42769661 -41414310 -40143058 -38802347 -37239327 -35359921 -33148204 -30648639 -27940250
9853b7940250K814048K791700K625232K326847J945642J554737J223179R88505
$$ -27940250 -25126202 -22334502 -19709270 -17382423 -15436781 -13882044 -12658865 -11670360
9845a1670360Q45404P55081O65442N27922L07149j0087m04335q20814j185275
$$ -11670360 -10824956 -10069875 -9404433 -8876511 -8569362 -8579449 -8983784 -9804598 -10989873
9836a0989873j435874j554453j577677j579094j631242j770701j986001k229627
$$ -10989873 -12425747 -13980200 -15557877 -17136971 -18768213 -20538914 -22524915 -24754542
9828b4754542k439445k557187k543385k390342k125888j799409j455909j117611
$$ -24754542 -27193987 -29751174 -32294559 -34684901 -36810789 -38610198 -40066107 -41183718
9820d1183718p87094m65447j66665Q3076K56302L34053L09526J87805j6086k80995
$$ -41183718 -41970812 -42436259 -42602924 -42519848 -42263546 -41929493 -41619967 -41432162 -41448248 -41729243
9810d1729243n83968r01164j204684j460740j634581j700155j646751j477507
$$ -41729243 -42313211 -43214375 -44419059 -45879799 -47514380 -49214535 -50861286 -52338793
9802e2338793j202560q34234l89523J02873N99922J052222J416761J661351J756683
$$ -52338793 -53541353 -54375587 -54765110 -54662237 -54062315 -53010093 -51593332 -49931981 -48175298
9793d8175298J668513J365676Q44016J49283o18823j326975j845090k083791k015026
$$ -48175298 -46506785 -45141109 -44297093 -44147810 -44766633 -46093608 -47938698 -50022489 -52037515
9784e2037515j667195j102518l94281L85669J173388J921330K606934L231398
$$ -52037515 -53704710 -54807228 -55201509 -54815840 -53642452 -51721122 -49114188 -45882790
9776d5882790L804289M323051M762681N083146N247225N233338N034646M650379
$$ -45882790 -42078501 -37755450 -32992769 -27909623 -22662398 -17429060 -12394414 -7744035
9768g744035M082064L339454K449361J458721M30185n66236j462585k201664k742926
$$ -7744035 -3661971 -322517 2126844 3585565 4015750 3449514 1986929 -214735 -2957661
9759b957661l064840l166013l066428k805676k434682k004052j556961j128787
$$ -2957661 -6022501 -9188514 -12254942 -15060618 -17495300 -19499352 -21056313 -22185100
9751b2185100p46905m25923j64834M3898J97365K76061K60113J54281m019j61295
$$ -22185100 -22932005 -23357928 -23522762 -23478864 -23281499 -23005438 -22745325 -22591044 -22595063 -22756358
9741b2756358k70583l00337k32063o1672J93147M92615P88722J042996J235688
$$ -22756358 -23026941 -23327278 -23559341 -23621013 -23427866 -22935251 -22146529 -21103533 -19867845
9732a9867845J367214J458805J549785J681919J872025K090807K266438K313325
$$ -19867845 -18500631 -17041826 -15492041 -13810122 -11938097 -9847290 -7580852 -5267527
9724e267527K167886J811115J270846O10610q4013p16900j192992j433961j398195
$$ -5267527 -3099641 -1288526 -17680 592930 508917 -207983 -1400975 -2834936 -4233131
9715d233131j099100o10023m5155M80577Q91188J164540J318238J385195J398213
$$ -4233131 -5332231 -5942254 -5987409 -5506832 -4615644 -3451104 -2132866 -747671 650542
9706F50542J385132J365296J344399J312808J250486J136422R60233P32441M85043
$$ 650542 2035674 3400970 4745369 6058177 7308663 8445085 9405318 10137759 10622802
9697A0622802K56809P3083o0828j47170j80199j45031k9147J67402M29494P27665
$$ 10622802 10879611 10952694 10891866 10744696 10564497 10419466 10390319 10557721 10987215 11714880
9687A1714880J019647J256828J397661J422278J340974J192798J032886R10307
$$ 11714880 12734527 13991355 15389016 16811294 18152268 19345066 20377952 21288259
9679B1288259Q46268Q27190Q17559P80450O89303N27690K86124l8034m40980r15814
$$ 21288259 22134527 22961717 23779276 24559726 25249029 25776719 26062843 26024809 25583829 24668015
9669B4668015j452646k028926k596888l084712l418859l553880l487169l249522
$$ 24668015 23215369 21186443 18589555 15504843 12085984 8532104 5044935 1795413
9661A795413k883427k427464j914088j374692q43017l52716P1080M22930P22261
$$ 1795413 -1088014 -3515478 -5429566 -6804258 -7647275 -7999991 -7928911 -7505981 -6783720
9652f783720J001714J278902J530713J695295J707554J543672J238776Q63367
$$ -6783720 -5782006 -4503104 -2972391 -1277096 430458 1974130 3212906 4076273
9644D076273M78731J07583k61172o45950j050923j462723j857900k209014k488099
$$ 4076273 4555004 4662587 4401415 3755465 2704542 1241819 -616081 -2825095 -5313194
9635e313194k672436k751251k726315k606205k403325k139633j853921j598052
$$ -5313194 -7985630 -10736881 -13463196 -16069401 -18472726 -20612359 -22466280 -24064332
9627b4064332j418630j334104j322548j330039j296668j184013r85151p13344
$$ -24064332 -25482962 -26817066 -28139614 -29469653 -30766321 -31950334 -32935485 -33648829
9619c3648829l85549j9179L58794P07964R85639J162251J225477J173200J008412
$$ -33648829 -34034378 -34053557 -33694763 -32986799 -32001160 -30838909 -29613432 -28440232 -27431820
9610b7431820P42835M02550K7542l34114o32930q25340q82800p98178n84135k66910
$$ -27431820 -26688985 -26286435 -26258893 -26593007 -27225937 -28051277 -28934077 -29732255 -30316390 -30583300
9600c0583300J15483N11239Q62351J129568J319345J485593J697004J991991K354115
$$ -30583300 -30467817 -29956578 -29094227 -27964659 -26645314 -25159721 -23462717 -21470726 -19116611
9591a9116611K722352L024319L209325L264670L210614L079064K887579K623292
$$ -19116611 -16394259 -13369940 -10160615 -6895945 -3685331 -606267 2281312 4904604
9583D904604K248470J729126J072521L47982l29463q47952j148742j243343j191728
$$ 4904604 7153074 8882200 9954721 10302703 9973240 9125288 7976546 6733203 5541475
9574E541475j066247r30066q35766q28190r37406j166456j489709j867855k266079
$$ 5541475 4475228 3545162 2709396 1881206 943800 -222656 -1712365 -3580220 -5846299
9565e846299k656441l002926l249875l335010l222995k931115k522409k069778
$$ -5846299 -8502740 -11505666 -14755541 -18090551 -21313546 -24244661 -26767070 -28836848
9557b8836848j619658j183152p59188l68379o7801O7334j8172l28963q12661j372743
$$ -28836848 -30456506 -31639658 -32398846 -32767225 -32835026 -32767692 -32785864 -33114827 -33927488 -35300231
9547c5300231j888351k236658k318802k084453j544791p69146J31146J027359
$$ -35300231 -37188582 -39425240 -41744042 -43828495 -45373286 -46142432 -46011286 -44983927
9539d4983927J803641K384752K748099K914263K925397K826139K653195K431635
$$ -44983927 -43180286 -40795534 -38047435 -35133172 -32207775 -29381636 -26728441 -24296806
9531b4296806K177078J904944J642094J429132J306128J288811J352442J436891
$$ -24296806 -22119728 -20214784 -18572690 -17143558 -15837430 -14548619 -13196177 -11759286
9523a1759286J472609J413637J258576J046885Q33035O55694N21892M14444L13308
$$ -11759286 -10286677 -8873040 -7614464 -6567579 -5734544 -5078850 -4556958 -4142514 -3829206
9514c829206K12995J24892O7475N5950R9173K02159L66812N86391Q37429J078413
$$ -3829206 -3616211 -3491319 -3423844 -3367894 -3268721 -3066562 -2699750 -2113359 -1275930 -197517
9504a97517J260581J344656J310396J153789Q81918N17338J07195k80887n82769
$$ -197517 1063064 2407720 3718116 4871905 5753823 6271161 6378356 6097469 5514700
9495E514700p64281q27294p93757o86694n24419l26011j16826P2337K11654K81305
$$ 5514700 4750419 3923125 3129368 2442674 1918255 1592244 1475418 1547755 1759409 2040714
9485B040714K79024K21266J37252O1156K7263O5876J95105M09854O75973R36246
$$ 2040714 2319738 2541004 2678256 2739412 2766675 2832551 3027656 3437510 4113483 5049729
9475E049729J128505J210172J178242J070933R45148Q42401P67710O95452N92746
$$ 5049729 6178234 7388406 8566648 9637581 10582729 11425130 12192840 12888292 13481038
9466A3481038M40171K40663K1344j67477k61853k08372M318L26133O55083Q74877
$$ 13481038 13921209 14161872 14183216 14015739 13753886 13545514 13549832 13875965 14531048 15405925
9456A5405925R01332P11836L43458j33465o44698j127255j530940j818664j972219
$$ 15405925 16307257 17019093 17362551 17229086 16584388 15457133 13926193 12107529 10135310
9447A0135310j997049j916509j757363j538928j275529r88409p13200m91989l51780
$$ 10135310 8138261 6221752 4464389 2925461 1649932 661523 -51677 -543666 -895446
9438h95446k84172k43745j71432l0536J67780L65821M85264M61787K72180n5225
$$ -895446 -1179618 -1423363 -1594795 -1625331 -1457551 -1091730 -606466 -144679 127501 72276
9428G2276m49925q25936j115232j291244j370648j396045j413207j455209j535859
$$ 72276 -377649 -1203585 -2318817 -3610061 -4980709 -6376754 -7789961 -9245170 -10781029
9419a0781029j648184j764428j838718j816082j649056j316613q34857k51408
$$ -10781029 -12429213 -14193641 -16032359 -17848441 -19497497 -20814110 -21648967 -21900375
9411b1900375L73435R84898J538638J993139K303534K429554K355230K103144
$$ -21900375 -21526940 -20542042 -19003404 -17010265 -14706731 -12277177 -9921947 -7818803
9403g818803J727303J286931Q22164L52191j05624n18779q45312j057083j155324
$$ -7818803 -6091500 -4804569 -3982405 -3630214 -3735838 -4254617 -5099929 -6157012 -7312336
9394g312336j161663j094687r56550p40976m50639j04779K68307O43141J000960
$$ -7312336 -8473999 -9568686 -10525236 -11266212 -11716851 -11821630 -11553323 -10910182 -9909222
9385i909222J324258J590235J770162J834228J757521J526244J147020O57708
$$ -9909222 -8584964 -6994729 -5224567 -3390339 -1632818 -106574 1040446 1698154
9377A698154J29293l51250p12126r21610r89593r49713q41234p02971n73737m87602
$$ 1698154 1827447 1476197 764071 -157539 -1147132 -2096845 -2938079 -3641050 -4214787 -4702389
9367d702389m62994m95377n60386o24293o55273o32824n54373m35466l00817j71103
$$ -4702389 -5165383 -5660760 -6221146 -6845439 -7500712 -8133536 -8687909 -9123375 -9424192 -9595295
9357i595295n5302M6993J37768K13578K61324K58488J82784L1946j58490l17638
$$ -9595295 -9650597 -9603604 -9465836 -9252258 -8990934 -8732446 -8549662 -8517716 -8676206 -8993844
9347h993844l66682k54046K5700M38157R29109J440438J914233K291685K518245
$$ -8993844 -9360526 -9614572 -9588872 -9150715 -8221606 -6781168 -4866935 -2575250 -57005
9338e7005K558476K411367K113115J723995J308544R19999N91752L33319J31613
$$ -57005 2501471 4912838 7025953 8749948 10058492 10978491 11570243 11903562 12035175
9329A2035175l9044k00961l61870n17020o61338p98977r40965j093997j253119
$$ 12035175 11996131 11795170 11433300 10916280 10254942 9455965 8515000 7421003 6167884
9320F167884j407869j557259j717634j912265k148682k401408k613643k717209
$$ 6167884 4760015 3202756 1485122 -427143 -2575825 -4977233 -7590876 -10308085
9312a0308085k660105k427750k046904j570296j053120n38277n7273L62195O94186
$$ -10308085 -12968190 -15395940 -17442844 -19013140 -20066260 -20604537 -20661810 -20299615 -19605429
9303a9605429R18834J024062J000352Q36266N24884P9601m55880j017043j542888
$$ -19605429 -18686595 -17662533 -16662181 -15825915 -15301031 -15221430 -15677310 -16694353 -18237241
9294a8237241j993805k347628k583660k678683k622907k436046k159700j827851
$$ -18237241 -20231046 -22578674 -25162334 -27841017 -30463924 -32899970 -35059670 -36887521
9286c6887521j442157r75088l99208K79723J009673J708624K299418K739316L025311
$$ -36887521 -38329678 -39304766 -39703974 -39424251 -38414578 -36705954 -34406536 -31667220 -28641909
9277b8641909L176328L210653L136210K956531K682472K338071J956452J571121
$$ -28641909 -25465581 -22254928 -19118718 -16162187 -13479715 -11141644 -9185192 -7614071
9269g614071J211947R08363O91566N87009O01345P17919R06471J135677J374346
$$ -7614071 -6402124 -5493761 -4802195 -4215186 -3613841 -2895922 -1989451 -853774 520572
9260E20572J582522J707438J695683J516916J183310P50174K94642j16736m53146
$$ 520572 2103094 3810532 5506215 7023131 8206441 8956615 9251257 9134521 8681375
9251H681375p23792r60805j191802j416679j600532j688778j639224j453356j185957
$$ 8681375 7957583 6996778 5804976 4388297 2787765 1098987 -540237 -1993593 -3179550
9242c179550r25233p55381p23411q25680j016011j227939j400756j499434j520442
$$ -3179550 -4104783 -4860164 -5583575 -6409255 -7425266 -8653205 -10053961 -11553395 -13073837
9233a3073837j481587j402960j291587j138576r27555o47024l00371Q8879M78188
$$ -13073837 -14555424 -15958384 -17249971 -18388547 -19316102 -19963126 -20263497 -20174618 -19696430
9224a9696430Q15389J054770J172714J174475J088771R54037Q04554O63995N48207
$$ -19696430 -18881041 -17826271 -16653557 -15479082 -14390311 -13436274 -12631720 -11967725 -11419518
9215a1419518M71222M45347M72890N37743O08284O53848O64092O56483O66185
$$ -11419518 -10948296 -10502949 -10030059 -9492316 -8884032 -8230184 -7566092 -6909609 -6243424
9206f243424P26447Q53792J045237J282260J533480J756781J908834J962380J918835
$$ -6243424 -5516977 -4663185 -3617948 -2335688 -802208 954573 2863407 4825787 6744622
9197F744622J804169J651848J488132J328946J184003J059526R57284Q72792P94862
$$ 6744622 8548791 10200639 11688771 13017717 14201720 15261246 16218530 17091322 17886184
9188A7886184P06924N90727M32674K30838K5k27198m05750m92185m65629l45106
$$ 17886184 18593108 19183835 19616509 19847347 19847372 19620174 19214424 18722239 18256610 17911504
9178A7911504j89598p5898o5061j77788l93832o73314r81494j297670j605207
$$ 17911504 17721906 17646008 17580947 17403159 17009327 16336013 15354519 14056849 12451642
9169A2451642j878502k084115k195714k206722k128700j980854j783580j559097
$$ 12451642 10573140 8489025 6293311 4086589 1957889 -22965 -1806545 -3365642
9161c365642j330843j116439r20851p38982n67897m19958l27716l35250m75472
$$ -3365642 -4696485 -5812924 -6733775 -7472757 -8040654 -8460612 -8788328 -9123578 -9599050
9152i599050p41913j073736j370613j534315j512836j321328j031643p40177n30396
$$ -9599050 -10340963 -11414699 -12785312 -14319627 -15832463 -17153791 -18185434 -18925611 -19456007
9143a9456007m45479m81130n98407p45293q74263r52019r64092r14545q18564
$$ -19456007 -19901486 -20382616 -20981023 -21726316 -22600579 -23552598 -24516690 -25431235 -26249799
9134b6249799o90846n38449l62850j67432L4972K16671L35353L47023K31185J1677
$$ -26249799 -26940645 -27479094 -27841944 -28009376 -27974404 -27757733 -27422380 -27075357 -26844172 -26832495
9124b6832495k48520m80713o47904p56614q36708r10786r80552j037537j081485
$$ -26832495 -27081015 -27561728 -28209632 -28966246 -29802954 -30713740 -31694292 -32731829 -33813314
9115c3813314j124919j178567j231572j245629j171098r76891o75380l25379j0226
$$ -33813314 -34938233 -36116800 -37348372 -38594001 -39765099 -40741990 -41417370 -41742749 -41752975
9106d1752975J95055K48333J48593o6472l27686n49403o55500o06660m11978j18326
$$ -41752975 -41557920 -41309587 -41160994 -41227466 -41555152 -42104555 -42760055 -43366715 -43778693 -43897019
9096d3897019K11995N20406P62041R08340R44529Q64803O71228L80314L1344l16450
$$ -43897019 -43685024 -43164618 -42402577 -41494237 -40549708 -39684905 -39013677 -38633363 -38602019 -38918469
9086c8918469o03129p93221q88891r22417r35335r59778j012051j095905j206251
$$ -38918469 -39521598 -40314819 -41203710 -42126127 -43061462 -44021240 -45033291 -46129196 -47335447
9077d7335447j327770j432511j483715j446837j300317j038139o63904j84040
$$ -47335447 -48663217 -50095728 -51579443 -53026280 -54326597 -55364736 -56028640 -56212680
9069e6212680L91036J035419J694315K284289K716681K934245K934714K762176
$$ -56212680 -55821644 -54786225 -53091910 -50807621 -48090940 -45156695 -42221981 -39459805
9061c9459805K474854K118195J723017J321472R58696O87686N52539N72304P33283
$$ -39459805 -36984951 -34866756 -33143739 -31822267 -30863571 -30175885 -29623346 -29051042 -28317759
9052b8317759R92395J290957J573686J803787J967439K068986K123082K147837
$$ -28317759 -27325364 -26034407 -24460721 -22656934 -20689495 -18620509 -16497427 -14349590
9044a4349590K159260K168006K180699K204027K243979K295152K327054K282632
$$ -14349590 -12190330 -10022324 -7841625 -5637598 -3393619 -1098467 1228587 3511219
9036C511219K096649J725635J172889M97081j99006p98871j213432j412255j422970
$$ 3511219 5607868 7333503 8506392 9003473 8804467 8005596 6792164 5379909 3956939
9027C956939j298933j082923p96071m53302q1892K75898N73971P74822Q57005
$$ 3956939 2658006 1575083 779012 325710 243818 519716 1093687 1868509 2725514
9018B725514Q18570O76783M62691K11168n0217l09508n71347q47785j142835j441208
$$ 2725514 3544084 4220867 4683558 4894726 4844509 4535001 3963654 3115869 1973034 531826
9008E31826j708124j897245j960976j863909j601094j211428p69266l51378q86
$$ 531826 -1176298 -3073543 -5034519 -6898428 -8499522 -9710950 -10480216 -10831594 -10832480
8999a0832480K83262N23830P30836Q84479R47348Q92598P23711M71404J73490
$$ -10832480 -10549218 -10025388 -9294552 -8410073 -7462725 -6570127 -5846416 -5375012 -5201522
8990e201522j43749m67962p87885j080050j310025j448192j483998j422137j263891
$$ -5201522 -5345271 -5813233 -6601118 -7681168 -8991193 -10439385 -11923383 -13345520 -14609411
8981a4609411r95815o03165r9328M56568R72785J361640J575432J621296J550647
$$ -14609411 -15605226 -16208391 -16307719 -15851151 -14878366 -13516726 -11941294 -10319998 -8769351
8972h769351J433502J332583J286193J299413J340988J349560J254956J009870
$$ -8769351 -7335849 -6003266 -4717073 -3417660 -2076672 -727112 527844 1537714
8964A537714O15035J24239l69518p57078r39847q57751n10315M1389O95135J339395
$$ 1537714 2152749 2276988 1907470 1150392 210545 -647206 -1157521 -1116132 -420997 918398
8954I18398J880920K259450K450065K458288K312972K059010J748510J429572
$$ 918398 2799318 5058768 7508833 9967121 12280093 14339103 16087613 17517185
8946A7517185J137002Q90798P01473N73165M98479M51012L88241K69150P6098
$$ 17517185 18654187 19544985 20246458 20819623 21318102 21769114 22157355 22426505 22502603
8937B2502603j75605m47441o97373q92656j008104j018568r00137o43427k68316
$$ 22502603 22326998 21879557 21182184 20289528 19281424 18262856 17362719 16719292 16450976
8928A6450976J71761N97482R18176J050212R38696N77359J6460o47873j299151
$$ 16450976 16622737 17220219 18138395 19188607 20127303 20704662 20721122 20073249 18774098
8919A8774098j829655k162714k263201k136527j819287j365823q35365k83101
$$ 18774098 16944443 14781729 12518528 10382001 8562714 7196891 6361526 6078425
8911F078425K43942P08459J084728J361124J540556J636371J664135J632554J537942
$$ 6078425 6322367 7030826 8115554 9476678 11017234 12653605 14317740 15950294 17488236
8902A7488236J365937J100928P38549K93991j97972o89827j131762j482777j718159
$$ 17488236 18854173 19955101 20693650 20987641 20789669 20099842 18968080 17485303 15767144
8893A5767144j828144j809036j657463j376566r88522n38186q1861L29179O59324
$$ 15767144 13939000 12129964 10472501 9095935 8107413 7569227 7487366 7816545 8475869
8884H475869Q93770J042986J142180J236456J353748J483056J574165J558628
$$ 8475869 9369639 10412625 11554805 12791261 14145009 15628065 17202230 18760858
8876A8760858J379284J016706N06218o0893n58632q67439r18317p17395l38984
$$ 18760858 20140142 21156848 21663066 21602173 21043541 20176102 19257785 18540390 18201406
8867A8201406J06808N13682Q07371R53051R45494P94993N20951J53705k65073
$$ 18201406 18308214 18821896 19629267 20582318 21527812 22322805 22843756 22997461 22732388
8858B2732388o90114j083174j415975j664360j804761j822858j730560j575971
$$ 22732388 22042274 20959100 19543125 17878765 16074004 14251146 12520586 10944615
8850A0944615j433450j373857j429281j573365j731845j818891j776091j589812
$$ 10944615 9511165 8137308 6708027 5134662 3402817 1583926 -192165 -1781977
8842a781977j281420q84972m30472O0533N70356J076449J542698J916606K137892
$$ -1781977 -3063397 -3948369 -4378841 -4318308 -3747952 -2671503 -1128805 787801 2925693
8833B925693K156854J952639J541369R72304L17447l39688r14773j333990j545983
$$ 2925693 5082547 7035186 8576555 9548859 9866306 9526618 8611845 7277855 5731872
8824E731872j531994j310661r34404m76162r392M10558P54093J011773J184920
$$ 5731872 4199878 2889217 1954813 1478651 1469259 1879817 2633910 3645683 4830603
8815D830603J284614J339023J394437J498311J672770J900718K136153K328154
$$ 4830603 6115217 7454240 8848677 10346988 12019758 13920476 16056629 18384783
8807A8384783K440016K455951K378903K222413J998017J706277J343730R25355
$$ 18384783 20824799 23280750 25659653 27882066 29880083 31586360 32930090 33855445
8799C3855445N02711J56383l6832l9309J32682M20103P45940J037748J240036
$$ 33855445 34358156 34514539 34477707 34438398 34571080 34991183 35737123 36774871 38014907
8790C8014907J318746J263913J091746Q41059N59968K87653M2339j77016l77782
$$ 38014907 39333653 40597566 41689312 42530371 43090339 43377992 43420331 43243315 42865533
8781D2865533n60017p12676q22626q87950r21951r43631r65737r94262j037690
$$ 42865533 42305516 41592840 40770214 39882264 38960313 38016682 37050945 36056683 35018993
8772C5018993j110228j220313j355961j485967j580357j632244j659718j683891
$$ 35018993 33908765 32688452 31332491 29846524 28266167 26633923 24974205 23290314
8764B3290314j701316j675677j557506j316369r60605n34293j00836K74096N37520
$$ 23290314 21588998 19913321 18355815 17039446 16078841 15544548 15443712 15717808 16255328
8755A6255328O63069O57759N53873L90559J99764M251j79494l43079m91464o43454
$$ 16255328 16918397 17576156 18130029 18520588 18720352 18724603 18545109 18202030 17710566 17067112
8745A7067112q24235j054536j341339j671355k008470k298949k486470k531684
$$ 17067112 16242877 15188341 13847002 12175647 10167177 7868228 5381758 2850074
8737B850074k425315k186837j850480j449160j007700n49211j07074K71956N43490
$$ 2850074 424759 -1762078 -3612558 -5061718 -6069418 -6618629 -6725703 -6453747 -5910257
8728e910257O93467P56322Q03741R06109J090419J320351J508661J554487J388166
$$ -5910257 -5216790 -4460468 -3656727 -2750618 -1660199 -339848 1168813 2723300 4111466
8719D111466J002400M53627j64987p58209j249443j585028j735349j700246j511577
$$ 4111466 5113866 5567493 5402506 4644297 3394854 1809826 74477 -1625769 -3137346
8710c137346j223959q96402n75511k87856m2290J61376L23489M41758N15090N47897
$$ -3137346 -4361305 -5257707 -5833218 -6121074 -6163364 -6001988 -5678499 -5236741 -4721651 -4173754
8700d173754N50062N34750N17796N15981N39196N80410O15402O18189N81815N26643
$$ -4173754 -3623692 -3088942 -2571146 -2055165 -1515969 -935559 -320157 298032 879847 1406490
8690A406490M88398M94983N48406O21467O68508O44434N25504L23049Q0761j45881
$$ 1406490 1894888 2389871 2938277 3559744 4228252 4872686 5398190 5721239 5802000 5656119
8680E656119l15882m18154m69539n01545n44109o11338o94966p72036q24124q52502
$$ 5656119 5340237 4922083 4452544 3950999 3406890 2795552 2100586 1328550 504426 -348076
8670c48076q75406r10914r62147j015767j050936j049830j004225r16903p99331
$$ -348076 -1223482 -2134396 -3096543 -4112310 -5163246 -6213076 -7217301 -8134204 -8933535
8661h933535o69309n51027m74115m65593n36166o72276q43132j018071j179572
$$ -8933535 -9602844 -10153871 -10627986 -11093579 -11629745 -12302021 -13145153 -14163224 -15342796
8652a5342796j322225j441146j521330j536523j458606j272262r87546o43016
$$ -15342796 -16665021 -18106167 -19627497 -21164020 -22622626 -23894888 -24882434 -25525450
8644b5525450k94506Q902K50418M56176O81778R82599J387444J890541K460360
$$ -25525450 -25819956 -25811054 -25560636 -25104460 -24422682 -23440083 -22052639 -20162098 -17701738
8635a7701738L051569L608955M064560M339660M360897M087280L532053K764368
$$ -17701738 -14650169 -11041214 -6976654 -2636994 1723903 5811183 9343236 12107604
8627A2107604J889507J020870K57366l31334p16852r21020j011286j075090j182899
$$ 12107604 13997111 15017981 15275347 14944013 14227161 13306141 12294855 11219765 10036866
8618A0036866j362054j595184j836248k028539k118604k069592j871658j539621
$$ 10036866 8674812 7079628 5243380 3214841 1096237 -973355 -2845013 -4384634
8610d384634j097483n66687K8277O47466J238671J758211K185282K510782K712987
$$ -4384634 -5482117 -6048804 -6020527 -5373061 -4134390 -2376179 -190897 2319885 5032872
8601E032872K749781K579796K194891J636407R82792L18290k96049q31625j280097
$$ 5032872 7782653 10362449 12557340 14193747 15176539 15494829 15198780 14367155 13087058
8592A3087058j634513j882174k014104k038162j979203j863968j704797j498281
$$ 13087058 11452545 9570371 7556267 5518105 3538902 1674934 -29863 -1528144
8584a528144j241263r50942o72451m67361l90200m67469o91002j027468j434704
$$ -1528144 -2769407 -3720349 -4392800 -4860161 -5250361 -5717830 -6408832 -7436300 -8871004
8575h871004j871574k295886k658588k908120l008699k959844k798373k575427
$$ -8871004 -10742578 -13038464 -15697052 -18605172 -21613871 -24573715 -27372088 -29947515
8567b9947515k320983k021202j628009j097483m30115L17046J053794J695897
$$ -29947515 -32268498 -34289700 -35917709 -37015192 -37445307 -37128261 -36074467 -34378570
8559c4378570K192473K529580K716618K769302K699911K519468K249300J932739
$$ -34378570 -32186097 -29656517 -26939899 -24170597 -21470686 -18951218 -16701918 -14769179
8551a4769179J637404J444417J426216J616940J985670K431982K818352L027007
$$ -14769179 -13131775 -11687358 -10261142 -8644202 -6658532 -4226550 -1408198 1618809
8543A618809L003842K760170K340837J793739J164926N11932q8934n56621q35815
$$ 1618809 4622651 7382821 9723658 11517397 12682323 13194255 13105321 12548700 11712885
8534A1712885r24763q79562p86743p18286o98336p03053o89292o28833n27117
$$ 11712885 10788122 9908560 9121817 8403531 7705195 7002142 6312850 5684017 5156900
8525E156900m20671l59294l83115n04922p04778r37419j147440j287451j335895
$$ 5156900 4736229 4376935 3993820 3488898 2784120 1846701 699261 -588190 -1924085
8516a924085j308284j252866j228041j271776j380330j507819j586696j559917
$$ -1924085 -3232369 -4485235 -5713276 -6985052 -8365382 -9873201 -11459897 -13019814
8508a3019814j410872j176564r35744p75980p55281q76627j087290j302545j441819
$$ -13019814 -14430686 -15607250 -16542994 -17318974 -18074255 -18950882 -20038172 -21340717 -22782536
8499b2782536j459643j358335j179705r81471q07440o63048n09082k79760Q4065
$$ -22782536 -24242179 -25600514 -26780219 -27761690 -28569130 -29232178 -29741260 -30021020 -29936955
8490b9936955O06479J267038K008247K749211L399645L877258M131335M165057
$$ -29936955 -29330476 -28063438 -26055191 -23305980 -19906335 -16029077 -11897742 -7732685
8482g732685M039751L848869L670404L527744L387735L195827K918126K558909
$$ -7732685 -3692934 155935 3826339 7354083 10741818 13937645 16855771 19414680
8474A9414680K149283J726376J320791R53389O34577L65136J42226l1865j47934
$$ 19414680 21563963 23290339 24611130 25564519 26199096 26564232 26706458 26674593 26526659
8465B6526659k01020k07402k12324k79492m67429q05651j281010j837812k392049
$$ 26526659 26325639 26118237 25905913 25626421 25158992 24353341 23072331 21234519 18842470
8456A8842470k857161l171877l314698l296083l136989k853917k461893j985647
$$ 18842470 15985309 12813432 9498734 6202651 3065662 211745 -2250148 -4235795
8448d235795j459897r13147l51219K38757Q62243J490084K052893K460516K631690
$$ -4235795 -5695692 -6608839 -6960058 -6721301 -5859058 -4368974 -2316081 144435 2776125
8439B776125K518890K123599J501487P53543J009o46707j114861j369080j411570
$$ 2776125 5295015 7418614 8920101 9673644 9674653 9027946 7913085 6544005 5132435
8430E132435j279406j044548q04052o53852o56390q21895j114008j472412j836019
$$ 5132435 3853029 2808481 2004429 1350577 694187 -127708 -1241716 -2714128 -4550147
8421d550147k155988k398263k540885k571793k491506k320013k099053j880083
$$ -4550147 -6706135 -9104398 -11645283 -14217076 -16708582 -19028595 -21127648 -23007731
8413b3007731j700351j564319j446417j313775j151724r74433q14222o95899o12773
$$ -23007731 -24708082 -26272401 -27718818 -29032593 -30184317 -31158750 -31972972 -32668871 -33281644
8404c3281644n23496l76972j50480J27011L83955N40663N45495L92147J12424
$$ -33281644 -33805140 -34182112 -34332592 -34205581 -33821626 -33280963 -32735468 -32343321 -32230897
8395c2230897k45439o35828j020481j361053j612098j724640j659757j404190
$$ -32230897 -32476336 -33112164 -34132645 -35493698 -37105796 -38830436 -40490193 -41894383
8387d1894383r79833m42281J32069O64732J090319J363403J461636J392325J201420
$$ -41894383 -42874216 -43316497 -43184428 -42519696 -41429377 -40065974 -38604338 -37212013 -36010593
8378c6010593R74328Q18794Q31359J061439J490980K039572K590442L023542L244533
$$ -36010593 -35036265 -34217471 -33386112 -32324673 -30833693 -28794121 -26203679 -23180137 -19935604
8369a9935604L206712K924905K475585J977031J553068J295052J237285J352449
$$ -19935604 -16728892 -13803987 -11328402 -9351371 -7798303 -6503251 -5265966 -3913517
8361c913517J565120J777969J902853J885573J713748J406603R97971N26787L8865
$$ -3913517 -2348397 -570428 1332425 3217998 4931746 6338349 7336320 7863107 7901972
8352G901972m09093p52780r30199q92307o14512j12689N42724J231802J817652
$$ 7901972 7492879 6740099 5809900 4917593 4303081 4190392 4733116 5964918 7782570
8343G782570K190389K295270K133161J744046J190005N43841j18603p24454j208881
$$ 7782570 9972959 12268229 14401390 16145436 17335441 17879282 17760679 17036225 15827344
8334A5827344j521381j634671j553661j319419j003468o89775m46513k99056k21893
$$ 15827344 14305963 12671292 11117631 9798212 8794744 8104969 7658456 7359400 7137507
8325G137507j57940n3436J14929L34247N65841P59444Q65923Q50162P03601M50885
$$ 7137507 6979567 6926131 7041060 7375307 7941148 8700592 9566515 10416677 11120278 11571163
8315A1571163J46450j37244l26148l63868k30704M6064L99630P47370J016557
$$ 11571163 11717613 11580369 11254221 10890353 10659649 10705713 11105343 11852713 12869270
8306A2869270J158148J148295R87644P04060L52725N162k70842m28489m46363
$$ 12869270 14027418 15175713 16163357 16867417 17220142 17225304 16954462 16525973 16079610
8297A6079610l21789o4987K96184P04275J069361J289594J291097J063952O70293
$$ 16079610 15757821 15692834 15989018 16693293 17762654 19052248 20343345 21407297 22077590
8288B2077590K19334j75096m33102n30035m97706m08248l45873l75592n20903
$$ 22077590 22296924 22121828 21688726 21158691 20660985 20252737 19906864 19531272 19010369
8279A9010369p60372j042847j310225j514225j622188j617004j497696j281633
$$ 19010369 18249997 17207150 15896925 14382700 12760512 11143508 9645812 8364179
8271H364179j004733p16571m70531l12483k73567l69432n99595r38204j320501
$$ 8364179 7359446 6642875 6172344 5859861 5586294 5216862 4617267 3679063 2358562
8262B358562j644822j803871j731152j431063r75512m76785n3442K05053K71419
$$ 2358562 713740 -1090131 -2821283 -4252346 -5227858 -5704643 -5758085 -5553032 -5281613
8253e281613J94853P8052K3042Q0510K36511M39945O44420Q34712J027121J253322
$$ -5281613 -5086760 -5008708 -4985666 -4905156 -4668645 -4228700 -3584280 -2749568 -1722447 -469125
8243d69125J541874J903157K316450K722673L033311L160036L050967K709621
$$ -469125 1072749 2975906 5292356 8015029 11048340 14208376 17259343 19968964
8235A9968964K185227J545316Q50793J45066n44019j196682j795035k321300k757833
$$ 19968964 22154191 23699507 24550300 24695366 24151347 22954665 21159630 18838330 16080497
8226A6080497l084002l271425l287481l113220k765298k301306j798653j320063
$$ 16080497 12996495 9725070 6437589 3324369 559071 -1742235 -3540888 -4860951
8218d860951q89752m94801j07623K86617O73892J014346J260311J375860J345599
$$ -4860951 -5750703 -6245504 -6353127 -6066510 -5392618 -4378272 -3117961 -1742101 -396502
8209c96502J172169Q73622M89362Q7490k44078m28499m33592k79393j2671L26656
$$ -396502 775667 1649289 2138651 2226141 1982063 1553564 1119972 840579 827908 1154564
8199A154564P16156J134444J541712J880035K091756K138105K006993J712827
$$ 1154564 1870720 3005164 4546876 6426911 8518667 10656772 12663765 14376592
8191A4376592J293369Q02597K98107j71392n70472q72130j050845j081486r47238
$$ 14376592 15669961 16472558 16770665 16599273 16028801 15156671 14105826 13024340 12077102
8182A2077102o54509k47784J87198N42374P26033P01010M97315J90841j34658
$$ 12077102 11422593 11174809 11362007 11904381 12630414 13331424 13828739 14019580 13884922
8173A3884922m15135o10362o94180o48568m68676j71820J99432N83575R13488
$$ 13884922 13469787 12859425 12165245 11516677 11048001 10876181 11075613 11659188 12572676
8164A2572676J133014J211309J147710R62975O82737L26560q7788n29097r41802
$$ 12572676 13705690 14916999 16064709 17027684 17710421 18036981 17949193 17420096 16478294
8155A6478294j252942j396875j343323j110906p58376l59720K3416L59866O49651
$$ 16478294 15225352 13828477 12485154 11374248 10615872 10256152 10279568 10639434 11289085
8146A1289085R05186J121598J256236J236595R96221N16312j53681r07124j614823
$$ 11289085 12194271 13315869 14572105 15808700 16804921 17321233 17167552 16260428 14645605
8137A4645605k165824k496762k598327k499845k246550j886220j469305j052969
$$ 14645605 12479781 9983019 7384692 4884847 2638297 752077 -717228 -1770197
8129a770197o98624m61100l73689m34480o00660p98318r48258r95658r25996p59540
$$ -1770197 -2468821 -2929921 -3303610 -3738090 -4338750 -5137068 -6085326 -7080984 -8006980 -8766520
8119h766520n33044k83917m4495J58279L06176L97595M52891N09051O03443P53898
$$ -8766520 -9299564 -9583481 -9627976 -9469697 -9163521 -8765926 -8313035 -7803984 -7200541 -6446643
8109f446643R44565J124493J221707J169426R33606N28762J5839n13732r59258
$$ -6446643 -5502078 -4377585 -3155878 -1986452 -1052846 -524084 -508245 -1021977 -1981235
8100a981235j231607j271348j061670o32599n4516N77770J165509J624336J895736
$$ -1981235 -3212842 -4484190 -5545860 -6178459 -6232975 -5655205 -4489696 -2865360 -969624
8091i69624J952986J805970J503899J127430P64310M76178K74763J21434m9739
$$ -969624 983362 2789332 4293231 5420661 6184971 6661149 6935912 7057346 7007607
8082G007607k97147o41017j051545j462809j805227k036195k149073k158187k077481
$$ 7007607 6710460 6069443 5017898 3555089 1749862 -286333 -2435406 -4593593 -6671074
8073f671074j913285j673546j376224j040759o68895k38489K75635Q67297J480003
$$ -6671074 -8584359 -10257905 -11634129 -12674888 -13343783 -13582272 -13306637 -12439340 -10959337
8064a0959337K020462K396166K553624K496959K280934J986909J697036J477383
$$ -10959337 -8938875 -6542709 -3989085 -1492126 788808 2775717 4472753 5950136
8056E950136J369696J386304J508128J691790J886505K050224K152541K164588
$$ 5950136 7319832 8706136 10214264 11906054 13792559 15842783 17995324 20159912
8048B0159912K049988J771114J310438O90722k4359p52313j419989j977151k391203
$$ 20159912 22209900 23981014 25291452 25982174 25957815 25205502 23785513 21808362 19417159
8039A9417159k637815k701996k587538k321460j946744j509512j049330n94667
$$ 19417159 16779344 14077348 11489810 9168350 7221606 5712094 4662764 4068097
8031D068097j61983K39582N95617Q71983J012685R59120O82198K05327l98648
$$ 4068097 3906114 4145696 4741313 5613296 6625981 7585101 8267299 8472626 8073978
8022H073978j034185j615411k086705k426383k639051k744779k770738k746760
$$ 8073978 7039793 5424382 3337677 911294 -1727757 -4472536 -7243274 -9990034
8014i990034k702511k662290k636498k614637k566788k456025k256755j968935
$$ -9990034 -12692545 -15354835 -17991333 -20605970 -23172758 -25628783 -27885538 -29854473
8006b9854473j619299j247643q87054n53254k52003L565J85589K65729K40305
$$ -29854473 -31473772 -32721415 -33608469 -34161723 -34413726 -34410161 -34224572 -33958843 -33718538
7997c3718538J41694K2472p5152j37234j67693j61184q6578J01339M29456Q78375
$$ -33718538 -33576844 -33554372 -33629524 -33766758 -33934451 -34095635 -34182213 -34080874 -33651418 -32773043
7987c2773043J379647J838934K168115K308003K236089J965566J541754J034333
$$ -32773043 -31393396 -29554462 -27386347 -25078344 -22842255 -20876689 -19334935 -18300602
7979a8300602N21833P2469k68155m77248n49130m93762l40797j39500N5388K08911
$$ -18300602 -17778769 -17706300 -17974455 -18451703 -19000833 -19494595 -19835392 -19974892 -19919504 -19710593
7969a9710593L24829M40372N97143Q09536J053767J279850J430257J453282J316012
$$ -19710593 -19385764 -18945392 -18348249 -17538713 -16484946 -15205096 -13774839 -12321557 -11005545
7960a1005545J023392O32663K43134m1841j58041j01666P8749L08010N13862O53399
$$ -11005545 -9982153 -9349490 -9106356 -9148197 -9306238 -9407904 -9329155 -9021145 -8507283 -7853884
7950g853884P29807P89296Q93330J077976J324650J560751J688178J622454J325489
$$ -7853884 -7124077 -6334781 -5441451 -4363475 -3038825 -1478074 210104 1832558 3158047
$$ [...]
##END NTUPLES=NMR SPECTRUM
##END=
