##TITLE=31Pdec_DE-34_K
 DMSO-d6, 64 sc
 2.11.2024
##JCAMPDX= 6.0         $$ Bruker NMR JCAMP-DX V2.0
##DATA TYPE= NMR SPECTRUM
##DATA CLASS= NTUPLES
##ORIGIN= UXNMR, Bruker Analytische Messtechnik GmbH
##OWNER= root
$$ XWIN-NMR		Version 3.5
$$ Sat Nov  2 15:02:29 2024 Russian Standard Time (UT+4h)  she@DPX200
##.OBSERVE FREQUENCY= 81.013821
##.OBSERVE NUCLEUS= ^31P
##.ACQUISITION MODE= SIMULTANEOUS
##.ACQUISITION SCHEME= undefined
##.AVERAGES= 64
##.DIGITISER RES= 17
##SPECTROMETER/DATA SYSTEM= spect
##.PULSE SEQUENCE= zgpg30
##.SOLVENT NAME= DMSO
##.SHIFT REFERENCE= (INTERNAL, DMSO, 0, 198.062)
##AUDIT TRAIL= $$ (NUMBER, WHEN, WHO, WHERE, WHAT)
$$ ##TITLE= Audit trail, XWIN-NMR		Version 3.5
$$ ##JCAMPDX= 5.01
$$ ##ORIGIN= Bruker BioSpin GmbH
$$ ##OWNER= she
$$ F:/spectra/data/she/nmr/P31/2/pdata/1/auditp.txt
$$ ##AUDIT TRAIL=  $$ (NUMBER, WHEN, WHO, WHERE, WHAT)
(   1,<2024-11-02 15:01:32.46 +0400>,<she>,<DPX200>,
      <created by zg, POWCHK disabled, PULCHK disabled
       configuration hash MD5:
       00 E9 B6 7A A2 85 ED C7 34 08 36 98 17 FE 4E 26
       data hash MD5: 32K
       02 5B AE 30 7C AF AF 0C 0E 84 6C A9 0E 68 C0 8F>)
(   2,<2024-11-02 15:01:35.26 +0400>,<she>,<DPX200>,
      <Start of raw data processing
       efp BC_mod = 2 LB = 1.5 FT_mod = 6 PKNL = 1 PHC0 = 2211.26 PHC1 = 219.6882 SI = 64K 
       data hash MD5: 64K
       CB F0 CB 61 4A 3E F1 5D 2F E5 5A 70 51 3F 99 F2>)
(   3,<2024-11-02 15:02:02.40 +0400>,<she>,<DPX200>,
      <pk PHC0 = 28.34994 PHC1 = -61.2 
       data hash MD5: 64K
       BE 46 FE 8C 5B F7 73 AF 17 DF 64 26 DD 27 6A E7>)
(   4,<2024-11-02 15:02:06.18 +0400>,<she>,<DPX200>,
      <abs ABSG = 5 
       data hash MD5: 64K
       92 AD A3 B6 52 D6 7F 6F 02 D9 C7 89 E3 D6 56 AE>)
$$ ##END=
$$ 
$$ hash MD5
$$ 32 B4 0C 11 A7 3F FA F4 BE E2 E3 B3 1C A8 4C 92
##$RELAX= 
##$RELAX= 
##$RELAX= 
##$RELAX= 
##$RELAX= 
##$RELAX= 
##$RELAX= 
##$RELAX= 
$$ Bruker specific parameters
$$ --------------------------
##$DU= <F:/spectra>
##$EXPNO= 2
##$NAME= <P31>
##$PROCNO= 1
##$TYPE= <nmr>
##$USER= <she>
##$AMP= (0..31)
100 100 100 100 100 100 100 100 100 100 100 100 100 100 100 100 100 100 
100 100 100 100 100 100 100 100 100 100 100 100 100 100 
##$AQSEQ= 0
##$AQ_mod= 1
##$AUNM= <au_zg>
##$AUTOPOS= <>
##$BF1= 81.014009
##$BF2= 200.13
##$BF3= 200.13
##$BF4= 200.13
##$BF5= 200.13
##$BF6= 200.13
##$BF7= 200.13
##$BF8= 200.13
##$BYTORDA= 1
##$CFDGTYP= 0
##$CFRGTYP= 5
##$CHEMSTR= <none>
##$CNST= (0..31)
1 1 145 1 1 1 1 1 1 1 1 1 1 1 1 1 1 1 1 1 1 1 1 1 1 1 1 1 1 1 1 1 
##$CPDPRG= <waltz16>
##$CPDPRG1= <>
##$CPDPRG2= <waltz16>
##$CPDPRG3= <>
##$CPDPRG4= <mlev>
##$CPDPRG5= <mlev>
##$CPDPRG6= <mlev>
##$CPDPRG7= <mlev>
##$CPDPRG8= <mlev>
##$CPDPRGB= <>
##$CPDPRGT= <>
##$D= (0..31)
0 1 0 0 0 0 0 0 0 0.06 0 0.03 2e-05 3e-06 0 0 0.0002 0 0 0 0 0 0 0 0 0 
0 0 0 0 0 0 
##$DATE= 1730545292
##$DBL= (0..7)
120 120 120 11 120 120 24 19 
##$DBP= (0..7)
150 150 150 150 150 150 150 150 
##$DBP07= 0
##$DBPNAM0= <>
##$DBPNAM1= <>
$$ [...]
##$SUBNAM3= <"">
##$SUBNAM4= <"">
##$SUBNAM5= <"">
##$SUBNAM6= <"">
##$SUBNAM7= <"">
##$SUBNAM8= <"">
##$SUBNAM9= <"">
##$SW= 400.765351723535
##$SWIBOX= (0..15)
0 1 3 0 0 0 0 0 0 0 0 0 0 0 0 0 
##$SW_h= 32467.5324675325
##$TD= 32768
##$TD0= 1
##$TE= 0
##$TE2= 300
##$TE3= 300
##$TEG= 300
##$TL= (0..7)
0 120 53 12 22 120 120 120 
##$TP= (0..7)
150 150 150 150 150 150 150 150 
##$TP07= 0
##$TPNAME0= <>
##$TPNAME1= <>
##$TPNAME2= <>
##$TPNAME3= <>
##$TPNAME4= <>
##$TPNAME5= <>
##$TPNAME6= <>
##$TPNAME7= <>
##$TPOAL= (0..7)
0.5 0.5 0.5 0.5 0.5 0.5 0.5 0.5 
##$TPOFFS= (0..7)
0 0 0 0 0 0 0 0 
##$TUNHIN= 0
##$TUNHOUT= 0
##$TUNXOUT= 0
##$USERA1= <user>
##$USERA2= <user>
##$USERA3= <user>
##$USERA4= <user>
##$USERA5= <user>
##$V9= 5
##$VALIST= <valist>
##$VCLIST= <CCCCCCCCCCCCCCC>
##$VD= 0
##$VDLIST= <DDDDDDDDDDDDDDD>
##$VPLIST= <PPPPPPPPPPPPPPP>
##$VTLIST= <TTTTTTTTTTTTTTT>
##$WBST= 1024
##$WBSW= 4
##$XGAIN= (0..3)
0 0 0 0 
##$XL= 0
##$YL= 0
##$YMAX_a= 3488
##$YMIN_a= -12019
##$ZGOPTNS= <>
##$ZL1= 120
##$ZL2= 120
##$ZL3= 120
##$ZL4= 120
##$ABSF1= 198.0616
##$ABSF2= -202.7028
##$ABSG= 5
##$ABSL= 3
##$ALPHA= 0
##$AQORDER= 0
##$ASSFAC= 0
##$ASSFACI= 0
##$ASSFACX= 0
##$ASSWID= 0
##$AUNMP= <proc_1d>
##$AZFE= 0.1
##$AZFW= 0.5
##$BCFW= 0
##$BC_mod= 2
##$BYTORDP= 0
##$COROFFS= 0
##$CY= -3
##$DATMOD= 1
##$DC= 0
##$DFILT= <>
##$DTYPP= 0
##$F1P= 0
##$F2P= 0
##$FCOR= 1
##$FTSIZE= 65536
##$FT_mod= 6
##$GAMMA= 0
##$GB= 0
##$INTBC= 1
##$INTSCL= 9.790993e-09
##$ISEN= 30
##$LB= 1.5
##$LEV0= 0
##$LPBIN= 0
##$MAXI= 10000
##$MC2= 0
##$MEAN= 0
##$ME_mod= 0
##$MI= 50
##$NCOEF= 0
##$NC_proc= -8
##$NLEV= 6
##$NOISF1= 182.463
##$NOISF2= 159.3651
##$NSP= 0
##$NTH_PI= 0
##$NZP= 0
##$OFFSET= 198.0616
##$PC= 4
##$PHC0= 2239.61
##$PHC1= 158.4882
##$PH_mod= 1
##$PKNL= yes
##$PPARMOD= 0
##$PSCAL= 0
##$PSIGN= 0
##$REVERSE= no
##$SF= 81.0140089999434
##$SI= 65536
##$SIGF1= 159.3651
##$SIGF2= -187.1042
##$SINO= 113.3802
##$SIOLD= 16384
##$SREGLST= <1H.CDCl3>
##$SSB= 0
##$STSI= 65536
##$STSR= 0
##$SW_p= 32467.5324675325
##$SYMM= 0
##$S_DEV= 0
##$TDeff= 32768
##$TDoff= 0
##$TI= <>
##$TILT= no
##$TM1= 0
##$TM2= 0
##$TOPLEV= 0
##$USERP1= <user>
##$USERP2= <user>
##$USERP3= <user>
##$USERP4= <user>
##$USERP5= <user>
##$WDW= 1
##$XDIM= 65536
##$YMAX_p= 191046179
##$YMIN_p= -289843540
$$ End of Bruker specific parameters
$$ ---------------------------------
##NTUPLES= NMR SPECTRUM
##VAR_NAME=  FREQUENCY,     SPECTRUM/REAL,   SPECTRUM/IMAG
##SYMBOL=    X,             R,               I
##VAR_TYPE=  INDEPENDENT,   DEPENDENT,       DEPENDENT
##VAR_FORM=  AFFN,          ASDF,            ASDF
##VAR_DIM=   65536,         65536,           65536
##UNITS=     HZ,            ARBITRARY UNITS, ARBITRARY UNITS
##FACTOR=    0.49542278885378, 1,            1
##FIRST=     16045.7642231865, 0,            0
##LAST=      -16421.768244346, 0,            0
##MIN=       -16421.768244346, -289843540,   0
##MAX=       16045.7642231865, 191046179,    0
$$ Real data points
##PAGE= N=1
##DATA TABLE= (X++(R..R)), XYDATA
$$ [...]
##PAGE= N=2
##DATA TABLE= (X++(I..I)), XYDATA
7461h850929M722014M477716J691400O3857m61306k034487l407726j941755K39041
7452e502175j252584m625505l222259L447229P375017L756014j791557k157545
7444c973365R14034J071668k309179m273858k359611J194222L988487N240934
7436e06668L909557l29567m540407m941277j739559J664620L542701M441229L967598
7427E468227J215330j992187k642085j399742j589019l032538j780304K848583
7419b903735N949253M056121L2660j997483k499379l579961l843716j048170K469442
7410c364968K385860n18462j166679J657495L145079J11782l797827l622200m07859
7401e577779J031507r7935L77376M390906P556648M734998k537267p340527n736251
$$ y = [-8850929, -4128915, 348801, 2040201, 2104058, 1642752, -391735, -3799461, -5741216, -5502175, -6754759, -11380264, -14602523, -11155294, -3780277, -24263, -1815820, -3973365, -3059331, -1987663, -4296842, -8570700, -10930311, -9736089, -5747602, -506668, 3402889, 3073322, -1467085, -6408362, -8147921, -6483301, -2940600, 1500629, 5468227, 6683557, 4691370, 2049285, 649543, -939476, -3972014, -5752318, -2903735, 3045518, 7101639, 7134299, 5136816, 2637437, -942524, -4786240, -5834410, -3364968, -979108, -1497570, -2664249, -1006754, 2138325, 2250107, -1547720, -5169920, -5577779, -4546272, -4644207, -4266831, 124075, 7680723, 12415721, 9878454, 2537927, -3198324]
7392c198324q96007K027829K371693K795285L528986J869444k251444m353187
7384A894275j460206K947834L421285O0907k346865j718138p35616j223012j050969
7375b10505J463688L895898L300354P26998q95075j258970j780936j858622J63383
7366C546213K943895K914539m78425l570502l448377j373977o6937k9399j77431
7357B59599j86940l10265n3754J190490K779013L388101K565649Q63610r84776
7348I510727k187083j908174l04672Q04275n31813l996952o845537o481993k963389
7339a4904611J244432L793545M306842L612249K002709n26654k686565k585554
7331e743607o75151J55804j123114j533484J371829M861743M422317N89535j758117
$$ y = [-3198324, -4094331, -2066502, 305191, 3100476, 6629462, 8498906, 6247462, 1894275, 434069, 3381903, 6803188, 6864095, 4517230, 2799092, 2063476, 840464, -210505, 1253183, 5149081, 8449435, 9176433, 8281358, 7022388, 5241452, 3382830, 3546213, 6490108, 9404647, 8926222, 5355720, 1907343, 533366, 466429, 437030, 259599, 72659, -237606, -291360, 899130, 3678143, 7066244, 9631893, 10495503, 9510727, 7323644, 5415470, 5110798, 5915073, 5383260, 1386308, -5459229, -11941222, -14904611, -13660179, -9866634, -5559792, -1947543, 55166, -471488, -3158053, -5743607, -6418758, -6262954, -7386068, -8919552, -7547723, -2685980, 1736337, 2325872, 567755]
7322E67755o99531N95535k01318j044847J84514J933919K229788K220331L325043
7313I111189L799838J718906r86865j342102m09767j486035m316906n293256l111665
7304b316663l09773J114295J980821L070766L273929J915029M08805J80140P35842
7295A0053191Q93375M26322l43370j258896k004729k215776k185264k293883j851479
7286g80509q9266J810781J673954l98079j732348o96392J218967J786877R50222
7277C744207K95180P07628J509261J388488k10304k233997k797237j451244K7802
7268I79784J65357K2143J164540K533597J909134j46611q72735J59121L52192
7259F266522j387740k627339j298524J116060K019407J118430l02469j587491
$$ y = [567755, -131776, 463759, 262441, -782406, -597892, 1336027, 3565815, 5786146, 9111189, 12911027, 14629933, 13643068, 12300966, 11891199, 10405164, 6088258, 795002, -2316663, -2626436, -1512141, 468680, 3539446, 6813375, 8728404, 9137209, 9317349, 10053191, 10946566, 11372888, 11029518, 9770622, 7765893, 5550117, 3364853, 1070970, -780509, -869775, 941006, 2614960, 2216881, 484533, -211859, 1007108, 2793985, 3744207, 4039387, 4747015, 6256276, 7644764, 7434460, 5200463, 2403226, 951982, 979784, 1145141, 1167284, 2331824, 4865421, 6774555, 6627944, 5755209, 5914330, 6266522, 4878782, 2251443, 952919, 2068979, 4088386, 5206816, 4904347, 3316856]
7251C316856k448232k130710n10035J254609K319514K920677K713952N85576k548863
7242E473344l316972m13516K704044K297777l53414j231222K36549Q52313r16697
7233E332206k777289k538529j225535r31355j673466j986515j386027o95657l98856
7224h281023J10038J456921L100821L740579K981793K061666K231082K772912
7216A0174789J865433m95593k010724j245972J99849l4377j742534k625615j495294
7207B589962M45941J322456M66936j309936k505850k122000o57798L32459K5065
7198a412765q22744j026686j64456J581088L506758L891813J132321l495147n806945
7189b616763l185077J940024M805390L766651J310223J94975N00616N48592q04675
$$ y = [3316856, 868624, -1262086, -1772121, -517512, 1802002, 4722679, 7436631, 8022207, 5473344, 2156372, 1742856, 4446900, 6744677, 6391263, 5160041, 5396590, 6248903, 5332206, 2554917, 16388, -1209147, -2140502, -3813968, -5800483, -7186510, -7882167, -8281023, -8170985, -6714064, -3613243, 127336, 3109129, 5170795, 7401877, 10174789, 12040222, 11544629, 9533905, 8287933, 8487782, 8453405, 6710871, 4085256, 2589962, 3035903, 4358359, 4825295, 3515359, 1009509, -1112491, -1770289, -1437830, -1412765, -2235509, -3262195, -3426651, -1845563, 1661195, 5553008, 6685329, 3190182, -2616763, -5801840, -3861816, 943574, 4710225, 6020448, 6215423, 6716039, 7264631, 6459956]
7180F459956l175565n016061m748409k116462J530005M412599N343077L728767
7172F417907o7746l933384n173817l433668j044650L17936J339437K293058J342478
7163a942449j849700l345432L44489O109247P254537K576491k063582k249677
7155D833924o74885j834129m716581m690397q86216K420724J849658r75677k441560
7146g115139j670194m81202l9135L27286J203518J933392K022173K232029L146321
7137A559049L655386K320684l12752k278288k710698k197082r51966J218993K975880
7128C279206J932021j873515m998045m434638r61308K364012L461550K035546
7120H04829r50549l287423k853602l66819J004331R1765m67484J430161L789916
$$ y = [6459956, 3284391, -1731670, -6480079, -8596541, -7066536, -2653937, 2689140, 6417907, 6350161, 2416777, -2757040, -6190708, -7235358, -6917422, -5577985, -3284927, -1942449, -3792149, -7137581, -6793092, -683845, 6570692, 9147183, 7083601, 4833924, 4159039, 2324910, -2391671, -7082068, -7968284, -5547560, -3697902, -4673579, -7115139, -8785333, -9266535, -9305670, -8978384, -7774866, -5841474, -3819301, -1587272, 1559049, 5214435, 7535119, 7222367, 4944079, 2233381, 36299, -915667, 303326, 3279206, 5211227, 3337712, -1660333, -6094971, -7056279, -4692267, -1230717, 804829, -145720, -3433143, -6286745, -6653564, -5649233, -5557468, -6024952, -4594791, -804875]
7111h04875L707232J713871M1856j225909k868115l327834p89299K760949L618972
7102B826848J855147P70202J268204Q91384j365906l283595l180694j957995n83854
7093b760259J206722K832551K579210M59986j265157j293123o44377l83220m19851
7084C12482p68849j411654j044162J072597K421300Q0298l957580m647089j293828
7075i236485J669322J956668K121312L496208L212150J3962k401153j547556o99336
7066a414908k867990m722151j882348L131565M118859L47517l039935k662695
7058h992086j2308K354720L190796J556543k306169n221880m000955n8489K238514
7049a1251314J457888n8537o19880o09340J60970K372623M301888L119635k95105
$$ y = [-804875, 2902357, 4616228, 4658084, 3432175, 564060, -2763774, -3553073, -792124, 2826848, 4681995, 5452197, 6720401, 7611785, 6245879, 2962284, -218410, -2176405, -2760259, -1553537, 1279014, 3858224, 4318210, 3053053, 1759930, 1115553, 732333, 312482, -456367, -1868021, -2912183, -1839586, 581714, 662012, -3295568, -7942657, -9236485, -7567163, -5610495, -3489183, 7025, 3219175, 3233137, 831984, -715572, -1414908, -4282898, -9005049, -10887397, -7755832, -3636973, -3289456, -6329391, -8992086, -9004394, -6649674, -3458878, -1902335, -4208504, -9430384, -13431339, -13489828, -11251314, -9793426, -9851963, -10471843, -11081183, -10920213, -8547590, -4245702, -1126067, -1421172]
7040a421172j825340k77302R87255p6214r01999P56617K377869N89570k960067
7031b750783l464010L02787M433182N106903K776676M85638j54491r9198p59216
7022E877488k050524k960712l322090l809530m009419k067223K380914O030573
7014c930523M875207o01614n233234m958091j264848J285344Q17884k79128O55322
7005h633681K807687L294000J400049m53581k61649R82234J492098J666558K652334
6996D946049L314735J680399j241600k521377k075117k498166l754019k618216
6988d767312J151706L058148R81191q11435J322708L918040K112976j914850k506436
6979B544736O3496P34414j006408m47503L151384M061483o77732n615920m318133
$$ y = [-1421172, -3246512, -3523814, -2536559, -2612773, -3514772, -2758155, -380286, 209284, -2750783, -6214793, -5912006, -1478824, 3628079, 6404755, 6890393, 6735902, 6636704, 5877488, 3826964, 866252, -2455838, -6265368, -10274787, -12342010, -9961096, -3930523, 944684, 343070, -4890164, -9848255, -11113103, -9827759, -9009875, -9289003, -8633681, -5825994, -2531994, -1131945, -1585526, -1847175, -864941, 627157, 2293715, 4946049, 8260784, 9941183, 8699583, 6178206, 4103089, 1604923, -2149096, -4767312, -3615606, -557458, 423733, -387702, 935006, 4853046, 6966022, 5051172, 2544736, 2608232, 3342646, 2336238, 1888735, 5040119, 9101602, 8423870, 2807950, -1510183]
6970a510183J710208N432814L145556k244908n340039l452140J348979M318770
6962C409057L140140P84508J410028M189900M520673J133065k144855k463997
6954A3978519j552596j698571k144306j682110j382102k262899l066102k580916
6946b391083j604843p09796J131143L772765M769579L192160J603528J935925
6938A1699378K409299J007616j102486k346806l686911n628643n560440j902751
6930e111744J981794K280573O34705R38805K398299J069684k863279m877944l192633
6921f741740j036128j074861j966639j701580o20024M10773J754883L405481M067665
6912c502170L164473J789525P89583j48035q58970l01492J374273K345456J623236
$$ y = [-1510183, 200025, 5632839, 8778395, 6533487, 1193448, -2258692, -909713, 3409057, 6549197, 7333705, 8743733, 12933633, 17454306, 18587371, 16442516, 13978519, 12425923, 10727352, 8583046, 6900936, 5518834, 3255935, 189833, -2391083, -3995926, -4705722, -3574579, 198186, 4967765, 8159925, 9763453, 11699378, 14108677, 15116293, 14013807, 11667001, 7980090, 2351447, -3208993, -5111744, -3129950, -849377, -214672, 724133, 3122432, 4192116, 1328837, -3549107, -6741740, -7777868, -8852729, -10819368, -12520948, -13140972, -12730199, -10975316, -7569835, -3502170, -337697, 1451828, 2241411, 2093376, 1234406, 932914, 2307187, 4652643, 6275879]
6903F275879K99647n11395j203065k132217k141405l3641L234470M955848L272652
6894A2016773p99534l946945l727095j459599q54687l093573m938249l210713
6886a0013622O08747K574370J693280L18003m7658k38207r00208j410209j533006
6877h948510j597286r17689J325408L544181L021358J95270j299617L04557K671825
6868a700503L237215K432267J562248K43695j900371l128353j671149J169317
6860B44366K137703j25966l647122n255910l533007l4125K274085K316559K039336
6851c584081L101189L727186J431037k032697k220458J200398L319276J110828
6843F052678k227225k446760k79420Q27877K07419l79010n82501j264321j727578
$$ y = [6275879, 6575526, 6064131, 4861066, 2728849, 587444, 553803, 3788273, 8744121, 12016773, 11217239, 7270294, 3543199, 2083600, 1228913, -1864660, -6802909, -10013622, -9404875, -6830505, -5137225, -4819222, -4866880, -5105087, -6005295, -7415504, -8948510, -10545796, -11463485, -10138077, -6593896, -3572538, -3377268, -4676885, -4372328, -1700503, 1536712, 3968979, 5531227, 5774922, 3874551, 746198, -924951, 244366, 2382069, 2256103, -1391019, -6646929, -10179936, -10214061, -7939976, -5623417, -3584081, -482892, 3244294, 4675331, 2642634, 422176, 1622574, 4941850, 6052678, 3825453, 1378693, 1099273, 1927150, 2134569, 1755559, 1173058, -91263, -1818841]
6834a818841o92887P41217M44897r26299p12565J307424K435893J308004k96834
6825A790009n40954J16610M86600M17087J15900m74770q21416O3317J875939K868131
6815E896453K112323N83645n96203j619046k969153m097569l914337j988517R45195
6806e647209L040738K359256q40978l290439k068323J390216K853740R42162j434663
6797b695500j885721j721453k706282l483443j857332J313269L344242L555952
6789f136268L111543K095516j80425k486222k482925l30379J435533J837517K136962
6780i99148K138618l54484m740942o111707j686597M091130M866236J057685j160822
6771b900031J027147L692852K816187l327r04254K85481O08347j165468l265668
$$ y = [-1818841, -2511728, -1770511, -1325614, -2251913, -2964478, -1657054, 778839, 2086843, 1790009, 1249055, 1365665, 1852265, 2269352, 2385252, 1910482, 1089066, 1152383, 3028322, 5896453, 8008776, 8592421, 7996218, 6377172, 3408019, -689550, -4603887, -6592404, -5647209, -2606471, -247215, -1088193, -4378632, -6446955, -5056739, -2202999, -1260837, -2695500, -4581221, -6302674, -9008956, -12492399, -14349731, -13036462, -9692220, -6136268, -3024725, -929209, -1109634, -3595856, -6078781, -6409160, -4973627, -3136110, -999148, 1139470, 784986, -3955956, -10067663, -11754260, -7663130, -2796894, -1739209, -2900031, -1872884, 1819968, 4636155, 4632828, 3728574, 4014055, 4622402, 3456934, 191266]
6762A91266l926015l189411j771696j03105J264484J795093J803578K040561K332705
6753D37460J728958J76498r94780o89145M86272P27426j184114m467546o498405
6744a0277376m944776l60709L856609M804180K875250O07872l59594q7306R14701
6735b971149J931719J515295j165950m187000m041514J65694N059125O481977
6727B788197L787717m7947j829301r67682N69639N65716j069026k284095j519763
6718f545K70284J112852Q41068R22642J826717K414204K064063J527625J218572
6709A2191482M67511q30876j545991j164482p67300j243487j997923k322926k506251
6700B79757k619743j890994m34777J55517o61656j092307L1100R13088l00326
$$ y = [191266, -3734749, -6924160, -8695856, -8798961, -7534477, -5739384, -3935806, -1895245, 437460, 2166418, 2342916, 1348136, 658991, 1145263, 1872689, 688575, -3778971, -10277376, -15222152, -15582861, -11726252, -6922072, -4046822, -3438950, -3798544, -3885850, -2971149, -1039430, 475865, -690085, -4877085, -8918599, -8752905, -3693780, 2788197, 6575914, 6527967, 4698666, 3730984, 4300623, 4866339, 3797313, 1513218, -6545, 263739, 1376591, 2217659, 3140301, 4967018, 7381222, 9445285, 10972910, 12191482, 12658993, 11828117, 10282126, 9117644, 8350344, 7106857, 5108934, 2786008, 279757, -2339986, -4230980, -4665757, -4510240, -5171896, -6264203, -6233103, -5320015, -5620341]
6691e620341j976569j236172J374093K651810J760629J179512K308847L286474
6683C728283K290056M02957l74859n0211M5272n48011j404947k284447k789941
6674i85848j925518M76707K550834K253516K31753o98639Q06390K809058K591508
6665H109761K1069k605352l608543l490332l209707k321345r0342K351286K815815
6656b027690J117753m77337m53385J07157o5274o9726J214103K322221R80751
6647B648573j940644l040045j145271J113783J229355n8997q38985j173904k249483
6638e455618l591131l275970q02897J780592K054782q1885k138703j373012K386244
6629a0497598O250445P031653M415121P66804j911882l564187m531366m135605
$$ y = [-5620341, -7596910, -8833082, -7458989, -4807179, -3046550, -1867038, 441809, 3728283, 6018339, 6421296, 6046437, 5996226, 6041498, 5493487, 4088540, 1804093, -985848, -2911366, -2434659, 116175, 2369691, 2601444, 1902805, 2709195, 5518253, 8109761, 8130830, 5525478, 1916935, -1573397, -4783104, -7104449, -7194791, -4843505, -2027690, -909937, -1387274, -1840659, -1733502, -1798776, -1868502, -654399, 1667822, 2648573, 707929, -2332116, -3477387, -2363604, -1134249, -1193246, -2032231, -3206135, -5455618, -9046749, -12322719, -13125616, -11345024, -9290242, -9372127, -11510830, -12883842, -10497598, -4247153, 2784500, 7199621, 7966425, 6054543, 2490356, -2041010, -6176615]
6621f176615j864986J093766K733449K233190M17074j235575j535530l55332R17915
6612c772644N80585j074297j699203J8595K445720L343794K789468K114234J212973
6603E959225p52125k702482k459895k54356J304620J305473J774313L622511M215996
6594A2013280J353215k456171k853223J54278K130769N38381j974248j857811
6586G048470K29892P73088j379166l480463k607748P96735L754290M125519K293875
6577A1554492j31525k269703m078919n009440l777501k64865L049280L003490
6569B075309n41690l992200l805449m16157K404512J826797j152166l147199k182026
6560h930269L38026J554164P36399q359Q90738J779797L64296j889254j072806
$$ y = [-6176615, -8041601, -6947835, -4214386, -1981196, -1564122, -2799697, -4335227, -4690559, -3772644, -3192059, -4266356, -5965559, -5946964, -3501244, -157450, 2632018, 4746252, 5959225, 5207100, 2504618, 44723, -209633, 1094987, 2400460, 4174773, 7797284, 12013280, 13366495, 10910324, 8057101, 8211379, 10342148, 10880529, 8906281, 7048470, 7278362, 8051450, 6672284, 3191821, 584073, 1380808, 5135098, 9260617, 11554492, 11422967, 9153264, 5074345, 64905, -3712596, -3977461, -928181, 2075309, 1533619, -2458581, -6264030, -6680187, -4275675, -2448878, -3601044, -6748243, -8930269, -8592243, -7038079, -6301680, -6310039, -5419301, -3639504, -3275208, -5164462, -6237268]
6551f237268K926785N080284K213285j877895j783765J445402K137285j239318
6543B664795m264537l760595j651725k30661J373632L366203K659233j894820
6535a738475n345379k653231L514913O127803L463043J00517j092682k096778
6527B79731m013046l990291n19322K773225K212729j94441Q4574L236848N133720
6518E003727L284026n47839l420926m144265l003347r28848N54511L37282p19339
6509c585018n25948J485025L434033L269549J123290j048910j603681o22883M91468
6500B416925N81622j22450n06855j8083R18516J704220J796110K59451l238902
6491C790554o519864o064925j539426K737345K997485J159600J891161N445201
$$ y = [-6237268, -3310483, 1769801, 3983086, 2105191, 321426, 1766828, 3904113, 2664795, -1599742, -5360337, -7012062, -7242723, -5869091, -2502888, 156345, -1738475, -7083854, -9737085, -6222172, -94369, 3368674, 3469191, 2376509, 279731, -3733315, -7723606, -8242928, -5469703, -3256974, -3451415, -3366841, -129993, 5003727, 8287753, 7739914, 4318988, 174723, -2828624, -3757472, -3202961, -2865679, -3585018, -4110966, -2625941, 808092, 4077641, 5200931, 4152021, 2548340, 1925457, 2416925, 2998547, 2876097, 2369242, 2351159, 3269675, 4973895, 6770005, 7029456, 3790554, -2729310, -8794235, -10333661, -7596316, -4598831, -3439231, -1548070, 3897131]
6483C897131O975935L364663k614925o230542o118144m024806j710730k64478
6475f725896n20517j699385j109473K288068N317071M397959Q80826p10585P60153
6466B878221J955819P69216r15181j406087k134125m031930m581487j856197J285740
6457h036011J080195j028866o55477K219988L113986L30707k429724j993143J3762
6448g384583P07584J18708l78555n98446k03534K100758N488760O129482K318670
6439H298844k274683l618775k682565k160416j021055K660087N882887L905275
6431H989599j687373m374120k316681l41604j310390j995181O9266J840399O82999
6422d43086k71308K446789N862901M651157m90019l830606k669850K49512J686125
$$ y = [3897131, 10873066, 14237729, 11622804, 5392262, -725882, -4750688, -6461418, -6725896, -7246413, -8945798, -10055271, -7767203, -2450132, 1947827, 2828653, 2118068, 2878221, 4834040, 5603256, 4688075, 3281988, 1147863, -2884067, -7465554, -9321751, -8036011, -6955816, -7984682, -8640159, -6420171, -3306185, -2975478, -5405202, -7398345, -7384583, -6676999, -6558291, -6936846, -7535292, -7738826, -5638068, -149308, 5980174, 8298844, 6024161, 2405386, -277179, -2437595, -3458650, -798563, 5084324, 8989599, 7302226, 2928106, 611425, 269821, -1040569, -3035750, -2966484, -1126085, -443086, -714394, 1732395, 7595296, 12246453, 11756434, 7925828, 5255978, 5505490, 7191615]
6413G191615J151250m54390j902641j567204O75001K012686J17898k915252l374104
6404I34859j660344j236549k482818k264521L8138R05198j397609l544558k129513
6395a2837717J443087L561937L229690J810351K23701j059475r81771O31201J773787
6386b205209O15653j740295k641654j198247J261449L106885L432212K204470
6378B835264P04234P49027K253935K833979J136531r54757j140179k41247p57917
6369G418870k933702m546476m068045j976669O59590K922801L614793K007064
6361C098226q62188l003265l472535k518453m73355K010451L344457K391780N0685
6352E65803j975485l141688l243303j136668L167424O396614N323467J544340
$$ y = [7191615, 8342865, 7888475, 5985834, 4418630, 5093631, 7106317, 7224215, 4308963, 934859, -725485, -1962034, -4444852, -6709373, -6671235, -5766037, -7163646, -10708204, -12837717, -11394630, -7832693, -4603003, -2792652, -2568951, -3628426, -4610197, -3978996, -2205209, -1589556, -3329851, -5971505, -7169752, -5908303, -2801418, 630794, 2835264, 3539498, 4288525, 6542460, 9376439, 10512970, 9558213, 8418034, 8176787, 7418870, 4485168, -61308, -4129353, -6106022, -5446432, -2523631, 1091162, 3098226, 2236038, -767227, -4239762, -6758215, -7231570, -5221119, -1876662, 515118, 565803, -1409682, -4551370, -7794673, -8931341, -5763917, 632697, 5956164, 7500504]
6344G500504o05801m92181j273856l378612l069814O94040L172546J049764j715422
6335A881168K0202L913076L301662k474237o861103n432603j108301J417524J887677
6326c454935K594022L648142L315058J392160m28227r65769o07734l37225p32059
6317D423433j511464j580242k06860J648244K216159J218203r4995j229926k823254
6308B059298m302418l519820K2559L569654M316002K634860O17387r36802k219951
6299B240769k604866j419992K63052O76495k28071j006431q37203j3123R77520
6290a951850J536329J045143J53858N99625K158246J679523k327177n975740m408978
6281g491021J125332M635146L609610J562749J574569J700670r06707m674743
$$ y = [7500504, 6894703, 6402522, 5128666, 1750054, -1319760, -625720, 2546826, 3596590, 1881168, 1901370, 5814446, 9116108, 6641871, -219232, -5651835, -6760136, -5342612, -3454935, -860913, 2787229, 6102287, 7494447, 7066220, 6100451, 5492717, 5155492, 4423433, 2911969, 1331727, 1124867, 2773111, 4989270, 6207473, 6112478, 4882552, 2059298, -2243120, -5762940, -5740381, -2170727, 2145275, 4780135, 5397522, 4460720, 2240769, -364097, -1784089, -1521037, -844542, -1072613, -2079044, -2916247, -2929370, -1951850, -415521, 629622, 783480, 1383105, 3541351, 5220874, 2893697, -3082043, -7491021, -6365689, -1730543, 1879067, 3441816, 5016385, 6717055, 5810348, 1135605]
6273A135605n468969k049151K753065N289718L960404k9928l463279l752764j696141
6264c321440l21106o34726p44618J15006k11332k694264m241848j940788K013508
6255a1981608L135887J104155k19947J268059L469291L894790K813782J631583
6247E115992O19280l50452n40709O05273J995997J781571l90793k746956l249127
6238B840076j838721l25316J50430O32065K269808L697103K625861l10609k104293
6229G636404k028278k408171l719830k867918J228975M166161J954406k564546
6221A397203l683713j061836R23330N69814J47837L36249q13295k622743j222033
6212f029187L709021O635788L616299j841559l679723j070242K025331K773573
$$ y = [1135605, -4333364, -6382515, -3629450, 1660268, 5620672, 5590744, 2127465, -1625299, -3321440, -3642546, -4277272, -5021890, -4906884, -5118216, -7812480, -12054328, -13995116, -11981608, -8845721, -7741566, -7961513, -6693454, -3224163, 670627, 3484409, 5115992, 5735272, 5384820, 4844111, 5449384, 7445381, 9226952, 8836159, 6089203, 2840076, 1001355, 676039, 826469, 1458534, 3728342, 7425445, 10051306, 9740697, 7636404, 5608126, 3199955, -519875, -3387793, -2158818, 2007343, 3961749, 1397203, -2286510, -3348346, -2425016, -1855202, -1707365, -1371116, -2184411, -4807154, -6029187, -2320166, 4315622, 7931921, 6090362, 2410639, 1340397, 3365728, 6139301]
6204F139301J571900k63530j740348j815923l22946J020819L59225j817070l233583
6195a02155k498428l27619J322721Q61586j260679k241964K37625M560582O445455
6186F997124M239127P89656q00519r08509j559932l114440m428720m514901k704389
6177f005503Q65066L762261K798212j344376l727818j451774K411667L558034
6169H65769K185597R41860P0171j406252k027141j29135J756928j79575m215551
6160b137329m362913Q99393N889026N293074N92748l069971l311089j536214J49752
6151a593523P59942L65446j91160j72233k5314n46157j037734j00612J629014
6142i12331J763049j92318j655044m95014K043552L155272J929689k6751n92812
$$ y = [6139301, 7711201, 7447671, 5707323, 3891400, 3568454, 4589273, 4948498, 3131428, -102155, -2600583, -2928202, -1605481, -743895, -2004574, -4246538, -4008913, 551669, 6997124, 11236251, 12025907, 11225388, 10316879, 8756947, 5642507, 1213787, -3301114, -6005503, -5140437, -1378176, 1420036, 75660, -3652158, -5103932, -2692265, 865769, 3051366, 3993226, 4063397, 2657145, 630004, 500869, 2257797, 2078222, -2137329, -6500242, -5600849, 288177, 5581251, 6173999, 3104028, -207061, -1743275, -1593523, -833581, -468135, -659295, -831528, -856842, -1402999, -2440733, -2541345, -912331, 850718, 658400, -996644, -1491658, 551894, 3707166, 5636855, 5610104, 5017292]
6133E017292P46981K146691J054591k377328m495079k619100P85950J243930j231195
6124B72733k469677q80806N10504k79182j079135k22887N3855j917182l148626
6115i160403m99259L546000M165636J438071l71158L27748J072418N33885K28985
6106A281923M05732j060540l956573m188050K59897N099097M933002N73681k486978
6097H61191j813259l81206j048654k405240j891549l70615p14111k841184l228053
6088a3832680J759L914240M438424J828693J81873J756598M077159L507211p7563
6079E795714l638748m921419m328613l153248j642589N16271K679607L220048
6071e472977J254384j890081l480368k093160P21500K137241J276631j29898k96587
$$ y = [5017292, 5764273, 7910964, 8965555, 6588227, 2093148, -525952, 259998, 1503928, 272733, -2196944, -3077750, -2567246, -2846428, -3925563, -4148450, -4094595, -6011777, -9160403, -9659662, -6113662, -1948026, -509955, -881113, -553365, 519053, 1052938, 1281923, 1687655, 627115, -3329458, -7517508, -7257611, -2158514, 2774488, 3348169, 861191, -952068, -1333274, -2381928, -4787168, -6678717, -7049332, -7763443, -10604627, -13832680, -13830921, -9916681, -5478257, -3649564, -3467691, -1711093, 2366066, 5873277, 5795714, 2156966, -2764453, -7093066, -10246314, -11888903, -11372632, -8693025, -5472977, -4218593, -6108674, -9589042, -11682202, -10960702, -8823461, -7546830, -7676728, -7973315]
6062g973315O24932J554702K215262K845155L063713K261797P62266m58528j058454
6053C837530j463501j751746j211764O67990L082260M150465K667405k11538j730328
6044H036773p99419K56723j212224l910448l899670m74213K214695Q58924k438126
6035a366985l629284k408395j331256r84904K42269K354041L551701L778950M631468
6026D837605N315265K882701k099622m390598j346435K275213P02110m190522
6018C985717n398791j022932L121644K085839j520345k056648J025490L270922
6010C490896K220415M96314J150987K938898K471629l60754j988002m90964J247759
6001A1177178m33142m362339n736359k796465O75945P89497j162239j335448N15828
$$ y = [-7973315, -7348383, -5793681, -3578419, -733264, 2330449, 4592246, 5354512, 4895984, 3837530, 2374029, 622283, -589481, 78509, 3160769, 7311234, 9978639, 9767101, 8036773, 7237354, 7494077, 6281853, 2371405, -1528265, -2002478, 212217, 1071141, -1366985, -4996269, -7404664, -8735920, -9720824, -9478555, -7124514, -3572813, 206137, 4837605, 10152870, 13035571, 10935949, 6545351, 5198916, 7474129, 8176239, 3985717, -1413074, -2436006, 685638, 2771477, 1251132, -805516, 219974, 3490896, 5711311, 6207625, 7358612, 10297510, 12769139, 12408385, 10420383, 9929419, 11177178, 10744036, 6381697, 645338, -2151127, -1475182, -685685, -1847924, -3183372, -2667544]
5992b667544J066214o90716j454201R71755L496389J920161k504664m239445r71711
5983e073762L345551L955647J118287j315826j213579K83153J467379J812528
5975D379378J113179q38200l123464l992701l077413j920169j558508j067812
5967a0085710M51153J958000K135933J743751K237905K773888J069341k632140
5959c47879m937020l587519l61632J657989K014903K275436K787992K413372J099209
5950C014851L25683N67672M37879o45589p86941J726959N273065O389896M019215
5941B0322690L85696k287613l902366m816483m218464j709086R44736J583577
5933F302687M74406m73752p73022j495776k488312k011922L4260R74305q55779
$$ y = [-2667544, -1601330, -2292046, -3746247, -2774492, 721897, 2642058, 137394, -4102051, -5073762, -1728211, 2227436, 3345723, 2029897, 816318, 1099471, 2566850, 4379378, 5492557, 4654357, 1530893, -2461808, -5539221, -7459390, -9017898, -10085710, -9634557, -7676557, -5540624, -3796873, -1558968, 1214920, 2284261, -347879, -5284899, -8872418, -9234050, -7576061, -5561158, -3285722, -497730, 1915642, 3014851, 3340534, 3908206, 4346085, 3700496, 2913555, 4640514, 9913579, 16303475, 20322690, 20708386, 18420773, 14518407, 9701924, 5483460, 3774374, 4719110, 6302687, 6777093, 6303341, 5530319, 4034543, 1546231, -465691, -431431, 542874, -312905]
5924c12905l033475k077918J449852L399643J527979j689326k394661R0526K959110
5915h1175L246322O75125k356368l140533j202527J445988K653902K144833P36165
5906D121732j336757l856578n165365l483859J55353K419569J827909M97907P71361
5897d048728J985244K116427J061759K87152J58034k87667j230140j594848p71242
5888b324009O33458J845623K483472K068957L38184j736099k484563j534563k96399
5879a005939p9245n71618n73756M55222J877685K379524J022154j519191k992035
5870a007199j877874M79415J358636K61399n99398K81909J731277K262115K431173
5861E321453L113479L024498M27560l340461m655063k230938J178922K449518
$$ y = [-312905, -3346380, -5424298, -3974446, -574803, 953176, -736150, -3130811, -3040285, -81175, 3165147, 3840272, 1483904, -1656629, -2859156, -1413168, 1240734, 3385567, 4121732, 2784975, -1071603, -6236968, -9720827, -9565474, -7145905, -5317996, -4820089, -4048728, -2063484, 52943, 1114702, 1401854, 1559888, 1272221, 42081, -1552767, -2324009, -1690551, 155072, 2638544, 4707501, 5045685, 3309586, 825023, -709540, -1005939, -1085184, -1656802, -2230558, -1775336, 102349, 2481873, 3504027, 1984836, -1007199, -2885073, -2405658, -1047022, -785623, -1385021, -1103112, 628165, 2890280, 5321453, 8434932, 11459430, 11886990, 8546529, 3891466, 1660528, 2839450, 5288968]
5853E288968J632954P50130N64006J42121j186457l009488m615696n210571l631229
5844i275262M33222M663800N423016K009493j781081j974530O68022K118070R03526
5835C188276l42211L11317Q46185j087019l782932l838293j460102J76724K89596
5826e698459J139827K877894K209593j740876m292527j453134L561819M318909
5818I23046J02180l596847l078422n32315N18721p0953m85261j3388J145873K835660
5808b251706L983928K699884r61571m045585m129983k162953m20432O00632J483560
5799e204226J829697J146605N57427J283170K225788J334754j090015k603223
5791e20023j955318l68547M89838K35143m95943p51901N7722J137202O88752j403086
$$ y = [5288968, 6921922, 7672052, 8236058, 8378179, 7191722, 4182234, -433462, -5644033, -9275262, -8842040, -4178240, 1244776, 3254269, 1473188, -501342, 166680, 2284750, 3188276, 2846065, 3157382, 4003567, 2916548, -866384, -4704677, -6164779, -5988055, -5698459, -4558632, -1680738, 528855, -1212021, -5504548, -6957682, -3395863, 923046, 1025226, -2571621, -5650043, -6182358, -5663637, -5734590, -6219851, -6233239, -5087366, -2251706, 1732222, 4432106, 3470535, -575050, -4705033, -6867986, -7288418, -6687786, -5204226, -3374529, -2227924, -1670497, -387327, 1838461, 3173215, 2083200, -520023, -2475341, -2843888, -2354050, -2118907, -2614850, -3366751, -3309029, -2171827, -1483075, -2886161]
5781b886161k448961m73926K285176K094809p12827k091906l28051J635584R84660
5772a941603r05641j065704O96183K174722K017285O03933j215381k410163j681048
5763c727417R81090L065601J715339k707058o554635o736003l712471l31332J517193
5754a6489693K271630K904989K927357J392195m88446J08691L354487N163830
5746A145040K288773k437677l334667J42885K673097J063094j283117j66274K867168
5737B958322L385792J002751p10868j12177P64807K69273o50020q81272p64752
5728E261856l83214J052651K911125K663972o59340m400651n389465l694828j557240
5719d195134P3743J753180L068346K487981J990k127710k136484q47899n4636
$$ y = [-2886161, -5335122, -5809048, -3523872, -1429063, -2141890, -4233796, -4561847, -2926263, -1941603, -2847244, -3912948, -3216765, -1042043, 975242, 1579175, 363794, -2046369, -3727417, -2746327, 319274, 2034613, -672445, -7227080, -13963083, -17675554, -18006886, -16489693, -14218063, -11313074, -8385717, -6993522, -7481968, -7373277, -4018790, 1145040, 3433813, 996136, -2338531, -2195646, 477451, 1540545, 257428, 91154, 2958322, 6344114, 7346865, 6635997, 6523820, 7288627, 7557900, 6907880, 6026608, 5261856, 4878642, 5931293, 8842418, 11506390, 10847050, 6446399, 1056934, -2637894, -4195134, -4121391, -2368211, 700135, 3188116, 3190106, 1062396, -1074088, -1921987, -1976623]
5710a976623r8159l30098q66510k047282k715651j248953J535451K802008J802794
5701c143023J165986K538034L361567P12956l379022m043057m99943K757999K213899
5692A685396n38264j937825p96647J788419M081143L810500m61599o106216p391219
5683e866312k263932M237771O168142L933332K018147J689257N23012j743810
5675H695607j973288Q49628L060759J296615k833087n209362m430865k486768
5667c030761j321419p24646L92945J850591K009486j47329l134116m148389k410578
5658a0664216q8046P06620K67036k87178q75693j091277P21600M425430O245670
5649f40054L429299q45226j285967J775102L064873N94552j804154j124220M87511
$$ y = [-1976623, -2074782, -2404880, -3271390, -5318672, -8034323, -9283276, -7747825, -4945817, -3143023, -1977037, 560997, 3922564, 4635520, 1256498, -2786559, -3286502, -528503, 1685396, 1147132, -790693, -1587340, 201079, 4282222, 8092722, 7631123, 1524907, -5866312, -8130244, -3892473, 2275669, 6209001, 8227148, 9916405, 10439417, 8695607, 6722319, 7571947, 10632706, 11929321, 9096234, 3886872, -543993, -3030761, -4352180, -5076826, -4683881, -2833290, -823804, -971133, -4105249, -8253638, -10664216, -10752262, -10045642, -9778606, -10065784, -10941477, -12032754, -11311154, -6885724, -640054, 2789245, 1944019, 658052, 2433154, 5498027, 6092579, 4288425, 3164205, 3651716]
5640C651716R5975j441708j861038j185394m35628O01102J851308J717072k62789
5631B730616j858350j465701n29831m83585j11935J369981J615692j004111l474964
5622c212188k162557J176647J818762p24374k447362j290659N83576J128574R56435
5613d173146R26531P97766R87710K303296L317168J615510j534105j785856J507279
5604C962153L348009N11650l090327k329258R93907R77338k894896m675265r73567
5595d170256L965133M571856J585413j45998P03234P09965k093909m723864l614928
5586c213354R6843K137002P62578j567569j949820k80909J647450K469324J835269
5577A936814M3544j965627l147660l532376l927089m033885k332202J274508M266396
$$ y = [3651716, 3747691, 2305983, 444945, -740449, -1176077, -574975, 1276333, 2993405, 2730616, 872266, -593435, -1123266, -1606851, -1718786, -348805, 1266887, 262776, -3212188, -5374745, -4198098, -2379336, -3103710, -5551072, -6841731, -6258155, -5129581, -4173146, -3246615, -2448849, -1461139, 842157, 4159325, 5774835, 4240730, 2454874, 3962153, 7310162, 7821812, 4731485, 2402227, 3396134, 4373472, 1478576, -3196689, -4170256, -205123, 4366733, 5952146, 5806148, 6509382, 7219347, 5125438, 401574, -3213354, -3116511, -979509, -216931, -1784500, -3734320, -4015229, -2367779, 101545, 1936814, 1980358, 14731, -3132929, -6665305, -10592394, -14626279, -16958481, -15683973, -11417577]
5568a1417577M411914K588288J019627q5462j872730l542551k528625J505336
5560i921780N117502M757775P31909l446666m755455k976698j32789J572213J595533
5551g458456J220253J616464J994601O96562j851118k737290P420M534727O819479
5542D842642M786117M1178m021008m923967k363463J837661M680924M069019Q81997
5533I831100j524994q17285J545892J969340r12887m679715o195718m884052k148032
5524g816351R52037L708867M500097K103956j490251k051604J803109O093202
5516G803062N676479K27113n350928o186616k086613K971739N107629L919700
5508A2081565J824325O05862l99186k363493m615888n618445n221007m041058
$$ y = [-11417577, -7005663, -4417375, -3397748, -3483210, -5355940, -8898491, -11427116, -9921780, -4804278, -46503, 685406, -2761260, -7516715, -10493413, -10626202, -9053989, -7458456, -6238203, -4621739, -2627138, -1930576, -3781694, -6518984, -6511564, -1976837, 4842642, 9628759, 9669937, 5648929, 724962, -1638501, 199160, 4880084, 8949103, 9831100, 8306106, 7488821, 9034713, 11004053, 10091166, 5411451, -784267, -5668319, -7816351, -6864314, -3155447, 1344650, 3448606, 1958355, -93249, 1709860, 7803062, 13479541, 13706654, 8355726, 2169110, 82497, 3054236, 8161865, 12081565, 13905890, 14511752, 14112566, 11749073, 7133185, 1514740, -3706267, -7747325]
5500g747325j571543K472927N548118M421516J87470k393525j366507L52740N89886
5491D93757J172134L198025L651069O13216k151092q01199J629095j60279m409919
5482C234807m479289K79094L032160k296m288712m750948k771548j790145j105856
5473a2642733J216824L115883J489816j906435k582850j07293J883053J838720
5465g695015J825467K647661J989624j054621l311579j781712J948066M110106
5457a322003L890487L413930L498118K508182j07502j878611o13690K049775K614987
5448A4053673N04187j514255j651135j267534j878495k532090j964067j268870
5440B481414j975147k960871k093776L4337J042774Q30250J341032K367521J390521
$$ y = [-7747325, -9318868, -6845941, -1297823, 3123693, 3311163, 917638, -448869, -96129, 493757, 1665891, 4863916, 8514985, 9128201, 6977109, 6175910, 7805005, 7644726, 3234807, -1244482, -965388, 2066772, 2064476, -2224236, -6975184, -9746732, -11536877, -12642733, -11425909, -8310026, -6820210, -8726645, -11309495, -11416788, -9533735, -7695015, -5869548, -3221887, -1232263, -2286884, -5598463, -7380175, -5432109, -1322003, 2568484, 5982414, 9480532, 11988714, 11881212, 10002601, 9388911, 11438686, 14053673, 14557860, 13043605, 11392470, 10124936, 8246441, 5714351, 3750284, 2481414, 506267, -2454604, -4548380, -4514043, -3471269, -2641019, -1299987, 1067534, 2458055]
5431B458055j567233k771024k96852K656267K513683N49060K35192J528492J479483
5422F785123n05341j729511o44041Q66397M28992j807278l998069m825088m095292
5413i524108k342391n29152O70411J629525L048149M428042M268894J970632j362826
5404B257176m100673n096071l601160L15523M717483O588373M815344J599361
5396G495356j41722j19862k78785j562747k601369j797514N52817K773528L521035
5387G840737K454302J33078j988895k319769r05348J63523q02216k797440l496337
5378a718365k346618p63221K88493R51043Q97497n33823k211776j705802J064256
5369f078316K988508J986505r6633n07995O00776J453052J751490J928015R23685
$$ y = [2458055, 890822, -1880202, -2177054, 479213, 2992896, 3541956, 3777148, 5305640, 6785123, 6279782, 4550271, 3906230, 4772627, 5201619, 3394341, -603728, -5428816, -9524108, -11866499, -12395651, -11725240, -10095715, -7047566, -2619524, 1649370, 3620002, 2257176, -1843497, -6939568, -10540728, -10225205, -5507722, 1080651, 5895995, 7495356, 7353634, 7233772, 6954987, 5392240, 2790871, 993357, 1546174, 4319702, 7840737, 10295039, 10428117, 8439222, 6119453, 5214105, 5377628, 4575412, 1777972, -1718365, -4064983, -4828204, -4539711, -3588668, -2691171, -3224994, -5436770, -7142572, -6078316, -3089808, -1103303, -1199936, -1707931, -1107155, 345897, 2097387, 4025402, 4949087]
5360D949087k226308n461241n382054j757729K027689K974414J087682j488199
5352e276659k137409N46293M664658N656837J455674m080191n615677l102058
5344g888532r18331j260199k163719j731274m03447J188443K997580L870451K558668
5335c750360O02397N85911J518460J42282k975660l570271q07790R68400n60336
5326g846967j993196m22212J654169J178965j37079M91789J653545P53801o91823
5317e359008L32704K560025K227702m64585j367607J247462M225951M034093R98184
5308H434921j685463j667164J60636O27748j641190l515052j123618L748017M964097
5299H302932Q70705k841706j665327J112497L29778k760076l310277q75270J040070
$$ y = [4949087, 2722779, -2738462, -8120516, -9878245, -7850556, -4876142, -3788460, -5276659, -7414068, -6867775, -2203117, 3453720, 4909394, 829203, -4786474, -7888532, -8806863, -10067062, -12230781, -13962055, -14365502, -13177059, -10179479, -6309028, -3750360, -3147963, -2562052, -1043592, -901310, -3876970, -7447241, -8255031, -7286631, -7846967, -9840163, -10262375, -8608206, -7429241, -7566320, -7074531, -5420986, -4667185, -5359008, -5026304, -2466279, -238577, -703162, -2070769, -823307, 3402644, 7436737, 8434921, 6749458, 5082294, 5242930, 5870678, 4229488, 714436, -409182, 3338835, 8302932, 9173637, 6331931, 4666604, 5779101, 6108879, 3348803, 38526, -836744, 203326]
5290B03326J338300J635099J591041n09826l202365l113095n48706J023935Q34184
5281g48107J253181K470531J905048m81301j337037L68746J404006k84278k282295
5272B268494j839873J58524J347709J135725J1339j865655l697731l806277j804475
5263h092220O74514K226913K866744K631162J278195j55089N7484J508347J838054
5254D834104N23479Q087J847611L877966K845902j356642n368166n782509k421857
5245i92025J537771K873576J759396Q21410Q43159l2338j988061k019563Q68371
5236C671696K611346l8386l787970l567925l32313J167355J88237l27147k27296
5227f42403j767696l572609j885662K040487K727653n43776k429541o02755Q45397
$$ y = [203326, 1541626, 3176725, 4767766, 4257940, 1055575, -2057520, -2606226, -1582291, -748107, 505074, 2975605, 4880653, 4399352, 3062315, 3431061, 4835067, 4550789, 2268494, 428621, 587145, 1934854, 3070579, 3081918, 1216263, -2481468, -6287745, -8092220, -7417706, -5190793, -2324049, 307113, 1585308, 1430219, 1487703, 2996050, 4834104, 5357583, 5365670, 7213281, 11091247, 13937149, 12580507, 7212341, 1429832, -992025, 545746, 3419322, 5178718, 6000128, 6843287, 6810949, 4822888, 2803325, 3671696, 6283042, 6244656, 2456686, -1111239, -1443552, -276197, -87960, -415107, -642403, -2410099, -5982708, -7868370, -5827883, -3100230, -3644006, -6073547, -6676302, -5830905]
5218e830905p11157k013362m34324J482298J584285K199349M609680N131009J395386
5209G412259k530870k399225o66697j675633l774704k222191K598144N618609
5201B359692M391000J174077j303840k205724j640796o74364j243668l405017
5193b548640m244630j981129J022882J980043J800201K408356K718154J040598
5185B195835q90563m23603J321823J354597q2632l67495O24065M57548j538143
5176B651432l291253l132074j381870O65355J415074j38292k401623k010505J337534
5167f286222L428292J361177k156828l415764l244311l864891l469871P06589
5159a6941829O067260P216906L916579J022001Q23395P37877j030369k521878
$$ y = [-5830905, -6542062, -8555424, -8989748, -7507450, -5923165, -3723816, 885864, 6016873, 7412259, 4881389, 2482164, 1815467, 139834, -3634870, -5857061, -3258917, 2359692, 6750692, 7924769, 6620929, 4415205, 2774409, 2100045, 856377, -2548640, -6793270, -8774399, -7751517, -5771474, -3971273, -1562917, 1155237, 2195835, 1305272, 881669, 2203492, 3558089, 3475457, 3107962, 3732027, 4189575, 2651432, -639821, -3771895, -5153765, -4488410, -3073336, -3211628, -5613251, -7623756, -6286222, -2857930, -1496753, -3653581, -7069345, -10313656, -14178547, -17648418, -16941829, -10874569, -3657663, 258916, 1280917, 2104312, 2842189, 1811820, -710058]
5151g10058j887750k75457M11123k84095k000731l771668l604214n90740K867520
5142i846070L781047K837972K745868L242276J764378j325347k560264p69446
5134a29586J403482J971093J684002R45452j266082m089192m239456o93836L147212
5125a266911L863823K035154K21881o06983q58545o51816k36351n16394j583934
5116C99924k023895j028517k9298q23375k801668l356795j057092K288498L263765
5107e168453Q17888j985537j478744J602875K824120K67484k703378k378032L96726
5098g805051K551797L475162M355939M797133L319676R1341l392139o028821o580272
5089e215235l815745M26804J480603j575022l134234Q19632N605813M645533l9608
$$ y = [-710058, -2597808, -2873265, -2462142, -2746237, -4746968, -8518636, -12122850, -12713590, -9846070, -6065023, -3227051, -481183, 2761093, 4525471, 3200124, 639860, -129586, 1273896, 3244989, 4928991, 5874443, 4608361, 519169, -3720287, -4414123, -1266911, 2596912, 4632066, 4853947, 4246964, 3388419, 2736603, 2500252, 1983858, 399924, -1623971, -2652488, -2681786, -3505161, -6306829, -9663624, -10720716, -8432218, -5168453, -4350565, -6336102, -7814846, -6211971, -3387851, -3120367, -5823745, -8201777, -7805051, -5253254, -1778092, 2577847, 7374980, 10694656, 10785997, 7393858, 1365037, -5215235, -9030980, -8604176, -7123573, -8698595, -11832829, -11013197, -5407384, -761851, -801459]
5080h01459j455721O37447L69084k545818j518019M496375O697596p19265j0855233
5071e695013j3238366p395803j101151J239509J997939L827373N688107N763927
5063h913478M349235K770738J600016O87703n2123k37677O49810K141979K539219
5054E535422J064336m21253J38233J430381L46058l043719n105979l636187l33128
5045d025836K298970L647348L783303K346007j86922k222222k835931k145266
5037F59451j15011K654623L528514N01940l896943m995452k426813l26390p14461
5028e130542j100657J45017O26582j521098l717900k573093J136941L855361L887961
5019d391428K501022J569782J623258J499891m05028l586360m846564k202394
$$ y = [-801459, -2257180, -1619733, -1250649, -3796467, -5314486, -818111, 5879485, 5160220, -5695013, -18933379, -26329182, -27430333, -26190824, -24192885, -20365512, -14677405, -8913478, -4564243, -1793505, -193489, 494214, 442091, 204414, 854224, 2996203, 5535422, 6599758, 6178505, 6316738, 7747119, 8093177, 5049458, -56521, -3692708, -4025836, -1726866, 1920482, 5703785, 8049792, 7862870, 5640648, 2804717, 659451, 544440, 3199063, 6727577, 7229517, 3332574, -1662878, -4089691, -4416081, -5130542, -6231199, -6086182, -5459600, -6980698, -10698598, -13271691, -12134750, -8279389, -4391428, -1890406, -320624, 1302634, 2802525, 2397497, -1188863, -6035427, -8237821]
5011h237821J648849K568577P44123j82921J069272K491182L143774L913587L905120
5002A1063742R10733l851514o143844m834403l160781k929504k133465L51288
4994a0727748K378272K564499K454949L002548K922915J960666J672474J734228
4986G962803j15304l187190l623782o24880J803892R85774j184584k628886l760380
4977d372537m176113j949911J841143L192184J782174J968856N010725O303495
4969I600016L232793k33168l16280Q63591K37057q15444j64370O22193m29122
4960A2597266k032152k656173l103573l309444j278634K037406K027836k351559
4952A930973n953351n133079k524696j066188N75428K981809K816867r06617l390937
$$ y = [-8237821, -6588972, -4020395, -3276272, -3459193, -2389921, 101261, 3245035, 7158622, 11063742, 11974475, 8122961, 1979117, -2855286, -6016067, -8945571, -11079036, -10727748, -8349476, -5784977, -3330028, -327480, 2595435, 4556101, 6228575, 7962803, 7847499, 4660309, 1036527, 411647, 2215539, 3201313, 2016729, -612157, -4372537, -8548650, -10498561, -8657418, -5465234, -3683060, -1714204, 3296521, 9600016, 12832809, 12599641, 12283361, 13146952, 13384009, 12568565, 12404195, 13026388, 12597266, 10565114, 7908941, 4805368, 1495924, 217290, 2254696, 4282532, 1930973, -4022378, -9155457, -11680153, -12746341, -12170913, -9189104, -6372237, -7278854, -10669791]
4943a0669791j457244J295321J106383j0004N91795J037589m24797j341907k0524
4934i893179J093418P61389J355094K593979M23013m285394m649042L05088K349175
4925i946459k028032m955340j073998K920566Q56475j767315J069186M136425
4917a0788492J325630k029414P97313M480297R72845n562707o057032j848529
4909a8710089j16888n36832J274306L419097K556522K163039M742165M103644
4901a105036k887958o729636n98518N557381J150759o109423m146714K026382
4893a2842763J262338k616063o12200J948684k960248o959501p33669M712008
4885a8801414k228299q036290K051369J1268846j298106j7618151r213293P038968
$$ y = [-10669791, -12127035, -10831714, -9725331, -9735335, -9143540, -8105951, -8530748, -9872655, -9893179, -8799761, -8038372, -6683278, -4089299, -3666286, -7951680, -12600722, -12295634, -9946459, -11974491, -16929831, -18003829, -15083263, -14226788, -15994103, -14924917, -10788492, -9462862, -11492276, -10694963, -6214666, -5241821, -10804528, -16861560, -18710089, -18826977, -19363809, -18089503, -14670406, -12113884, -9950845, -5208680, -1105036, -3992994, -10722630, -11321148, -5763767, -4613008, -10722431, -14869145, -12842763, -11580425, -14196488, -14808688, -12860004, -15820252, -22779753, -23513422, -18801414, -21029713, -29066003, -27014634, -15745788, -17043894, -34662045, -43875338, -36836370]
4877c6836370m387838k7839155k0994250n465573m8008802j31366626j36515239
4870d11413853p786424J42237226J68986146Q1439178O284252N049526K3344397
4863H140448J0299877r686560m140279Q135539J125171j0764843n893263M318922
4855A535012J409010n489552q97475O821167L609400l250697q85809M449904R97004
4846H297964n624815l978813J976055K257507k40814K126283N068503M70615p361004
4837B991481q594174l779412M9851K058912M791061N803901K844994M21987J674011
4828H262612J336914l988175p071091j667839N235618L666440l688248o771324
4820d685093l389632R13432L362921M979060N044154K613289J40170n45433j664310
$$ y = [-36836370, -41224208, -69063363, -90057613, -95523186, -143531988, -274898614, -411413853, -419200277, -276963051, -107976905, -26537727, -20253475, -15203949, 8140448, 18440325, 8753765, 4613486, 12749025, 13874196, 3109353, -2783910, 1535012, 2944022, -2545530, -3443005, 3378162, 6987562, 3736865, 2851056, 7300960, 8297964, 2673149, -1305664, 670391, 2927898, 2687084, 4813367, 9881870, 10352485, 2991481, -5602693, -9382105, -9332254, -7273342, -2482281, 3321620, 6166614, 6588601, 8262612, 9599526, 5611351, -1459740, -3127579, 2108039, 5774479, 2086231, -4685093, -8074725, -7161293, -3798372, 1180688, 6224842, 8838131, 8978301, 8432868, 6768558]
4811F768558m071706m207781j178544P6122k290487k764226J425135M561175K927016
4802A245262J695951M236435M454729j558684o087044k180516L602891K157337
4794G566361k698106k037061K003167J159093l291864l384799P02886J832005
4786A851682m99267k70375K841435L254320O76130J91867J507672q84176o382573
4777B286715p608941k360554L083507M065995K629863J330550j17960q74230R32157
4768C367102L119416J412351k883230l994702q41620J826676J717337J314837
4760E038167J531329L21856j625814j084223Q18834p80064n460576o411612p27569
4751h379672N735333O638718K760424j357449l412103l340443j461060R50040
$$ y = [6768558, 2696852, -1510929, -2689473, -2613351, -4903838, -7668064, -6242929, -1681754, 1245262, 2941213, 7177648, 11632377, 10073693, 3986649, 1806133, 5409024, 7566361, 4868255, 2831194, 4834361, 5993454, 2701590, -683209, 19677, 1851682, 1352415, 1082040, 3923475, 7177795, 7853925, 8045792, 9553464, 8669288, 2286715, -5322226, -7682780, -4599273, -533278, 2096585, 3427135, 3309175, 2434945, 3367102, 6486518, 7898869, 5015639, 1020937, 179317, 2005993, 3723330, 5038167, 6569496, 6891352, 5265538, 4181315, 5000149, 4220085, -1240491, -7652103, -8379672, -2644339, 3994379, 6754803, 5397354, 1985251, -1355192, -2816252, -1866212]
4743a866212K168589K197498J782249j00291l917792o001309k613269L087117
4735e263420M160750k7537l126530j776521K68673n13569k181801j759242L22143
4726i897054K426069L914455L657493Q23289j894693p69779K517152K521184j063165
4717B234951k602398j47488J305409r90680k320629J099069M938263L570906r35339
4708F152064k663538j010492j7742j028897j714732j066122l64844J72353J502526
4699c9424K817401K102460l40791j865891j169934K78511P29219K89428J79092
4690B980071Q67711J330655J69525k225932l263621j192958K008172K770618O78896
4681D123137j259294j054017J67698P86380P09650J78592q69920j560614o22230
$$ y = [-1866212, 302377, 2499875, 4282124, 4181833, 264041, -5737268, -8350537, -5263420, -1102670, -1130207, -4256737, -6033258, -5764585, -6278154, -8459955, -10219197, -9897054, -7470985, -3556530, 100963, 924252, -970441, -1740220, 776932, 3298116, 2234951, -367447, -514935, 790474, -200206, -2520835, -1421766, 3516497, 7087403, 6152064, 3488526, 2478034, 2460292, 1431395, -283337, -1349459, -1714303, -1541950, -39424, 2777977, 4880437, 4539646, 2673755, 1503821, 1782332, 2511551, 2800979, 2980071, 3847782, 5178437, 5347962, 3122030, -141591, -1334549, 673623, 3444241, 4123137, 2863843, 1809826, 1977524, 2763904, 3473554, 3652146, 2782226, 1221612, 599382]
4672E99382J201309J567229k65115k899754n290005o982572o352504k294844K343544
4663a8373330L177700O12259n22139J676331L874935L597932K465786J623953
4655a866573n86583l764687l783006L68838L261016J020189k133722p22260K802304
4646e404484K173447k230665m092968j188702K087475K521315K215470L349705
4638e69407L971977J700809j773743k660698J29827L948802N280482K899968j046217
4629A1881800l023041j918661k57107o16744k174939k618241j995337j925827
4621b648097j993654l14778K447918L144215R55876j023534m22720R36402J95017
4612A276645k007190k679767j149044n329j177117k999687k309667J331061M768277
$$ y = [599382, 1800691, 3367920, 3102805, 203051, -5086954, -12069526, -18422030, -20716874, -18373330, -15195630, -14583371, -15105510, -13429179, -9554244, -5956312, -3490526, -1866573, -2453156, -6217843, -10000849, -9632011, -6370995, -5350806, -7484528, -8206788, -5404484, -3231037, -5461702, -9554670, -10743372, -8655897, -6134582, -3919112, -569407, 3402570, 5103379, 3329636, 668938, 798765, 4747567, 10028049, 12928017, 11881800, 8858759, 6940098, 6682991, 6066247, 3891308, 1273067, -722270, -2648097, -4641751, -4956529, -2508611, 635604, 1591480, 567946, 145226, 1081628, 1276645, -730545, -3410312, -4559356, -4564685, -5741802, -8741489, -11051156, -9720095, -4951818]
4603d951818M874563K176415m5135N3751R55718M93520r67147j463021p30011
4594C96835n97387j834700k414623k24055L399505M606675J814082j877214k184952
4585A084166J182410M406788M492696K486300J107738R84719P61041k79346j557961
4576A4668551k567535l197990l050653j926961o89201l02703m55518l27316O6296
4567B216970N73725J651722K745160J750888j391605k664438P33957M803635L409095
4558A3829109k307680n054041k331914K50315j360599l342358j334741J754918
4550A03009R18035k293895k707376l90049R7068k002712k671531m40399J456614
4541g931236J274026J522238L664437M931490K994056j86548j926865k735182
$$ y = [-4951818, -77255, 2099160, 2054025, 2107776, 3063494, 3557014, 2589867, 1126846, 396835, -200552, -2035252, -4449875, -4673930, -1274425, 3332250, 5146332, 3269118, 1084166, 2266576, 6673364, 11166060, 13652360, 14760098, 15744817, 16505858, 16226512, 14668551, 12101016, 8903026, 5852373, 3925412, 3236211, 2933508, 2477990, 2150674, 2216970, 2790695, 4442417, 7187577, 8938465, 7546860, 4882422, 5616379, 10420014, 13829109, 11521429, 6467388, 4135474, 4385789, 3025190, -317168, -1651909, 103009, 1021044, -1272851, -3980227, -4370276, -4273208, -6275920, -8947451, -9387850, -7931236, -6657210, -5134972, -1470535, 3460955, 6455011, 6268463, 4341598, 1606416]
4533A606416l668217l060446L25674L379107K294468j141637j474630K360611
4525F21346N365327L809290P3371j860999k055295k566360k643112l17169K559575
4516B985974J680540k942382n951252l884825L16141K166126J543271Q62223L74931
4507b849253r40487j910110p18496J283014J365197K01420O73396K352945J779764
4498A237390j385356l135659j269045J495597K225426J647878J354149R22692
4490C093072J59489N95003K079767J395651k567921n525927l457719J160964K937841
4481a29780J245231j42845L80818Q47426M16521P88999K283898K536575M00342
4472H627185k074912l021003l353490m241806m264367j424298L141895N750601
$$ y = [1606416, -2061801, -5122247, -4796573, -1417466, 877002, -264635, -1739265, 621346, 5986673, 9795963, 9869334, 8008335, 5953040, 3386680, 743568, 426399, 2985974, 4666514, 1724132, -4227120, -8111945, -7795804, -5629678, -4086407, -3224184, -2849253, -3789740, -5699850, -6418346, -5135332, -3770135, -3568715, -2895319, -542374, 1237390, -147966, -3283625, -4552670, -3057073, -831647, 816231, 2170380, 3093072, 3252561, 3847564, 5927331, 7322982, 4755061, -770866, -4228585, -3067621, -129780, 1115451, 972606, 1353424, 2200850, 2617371, 3406370, 5690268, 8226843, 8627185, 6552273, 3531270, 177780, -4064026, -8328393, -9752691, -6610796, -860195]
4464h60195M483977J364829l37580J0554K97859q55485k109820j781877p43304
4455e31042r67379j959671j253906J414164L153064K014964l77211j528268j233773
4446a269058o62957k40543J02504K59208O92290K031428L069485J597117j677754
4437C901720l020497j131928N26664q09477k785294k120869j04940R6515q90593
4428f338699k62540J331037O35100k350605l944473k350347L55401K194014L552986
4419g178126M783432M828723L284888J293882l40847j732388k335764j205546
4411A398254P99917J410355M4226j502411j806685j378274j261096j794456k771842
4402f862012l301136j965551J202839L745194L726701K520876K283574K127760
$$ y = [-860195, 3623782, 4988611, 4651031, 4661585, 4959444, 4103959, 1994139, 212262, -531042, -1498421, -3458092, -4711998, -3297834, -144770, 1870194, 1492983, -35285, -1269058, -1932015, -2172558, -2070054, -1810846, -1118556, 912872, 3982357, 5579474, 3901720, 881223, -250705, 275959, -533518, -3318812, -5439681, -5544621, -5448106, -6338699, -6601239, -5270202, -4635102, -6985707, -10930180, -13280527, -12925126, -10731112, -7178126, -2394694, 2434029, 5718917, 7012799, 6671952, 4939564, 2603800, 1398254, 2198171, 3608526, 3652752, 2150341, 343656, -1034618, -2295714, -4090170, -6862012, -10163148, -12128699, -10925860, -7180666, -3453965, -933089, 1350485, 3478245]
4394C478245M8596k594003k569334k58255O86160o38884j141328N61065J605835
4385h21903r6814k198297j798938K0666L46381r87293j600923r5571K666292M903937
4375C37537N099628K751119q70793l442013l786802k673039j313756k44108L26061
4366c816166N11391J097656K363790K856837J267852q80292r30274O56615O79344
4357C806753j779513l771654k895272m45057J179150J669525J862787J769795
4349A396514J193504O38352K86829m05964j152697o09402J364019L010382L107966
4340H829503K230152Q46986j563637m428343n450535l622504r34486M21284P55334
4331b916246J356754K116432K319014K192310K008100J065470q21570k138966
$$ y = [3478245, 3526841, 932838, -1636496, -1894751, -1208591, -1847475, -2988803, -2427738, -821903, -918717, -3117014, -4915952, -4895286, -4548905, -5536198, -7137121, -7232692, -4566400, 337537, 5437165, 8188284, 7317491, 3875478, 88676, -2584363, -3898119, -4142227, -3816166, -3304775, -2207119, 156671, 3013508, 4281360, 3401068, 2470794, 3127409, 3806753, 2027240, -1744414, -4639686, -5084743, -3905593, -2236068, -373281, 1396514, 2590018, 3228370, 3515199, 3109235, 1956538, 1347136, 2711155, 5721537, 8829503, 11059655, 11906641, 10343004, 5914661, 464126, -3158378, -4092864, -3671580, -2916246, -1559492, 556940, 2875954, 5068264, 7076364, 8141834, 7320264, 5181298]
4323E181298j593068j17869N16871J15369k83309k36221r4613j00192l24505q22453
4313B241308j085645j95314J744793L144239K510272j53922l596166n892560m992338
4304f275333n44862M451644N754082K501625j685250k864382o62594K336480L393550
4295F404960J327173k715633n452393m144117P7388L036966K299716l93675j959920
4286a519535j474013j18653O96228K71039j063623j940317j278532K99627J482277
4277d645502K207984K990198L065849J478664n80999j097696l96286j99814j61143
4268B661255J304286L180442K748968K95359j235956j467851k789538m687590
4260I375l262818J703291M512712J530145l054412l229999N11074K820130J067735
$$ y = [5181298, 3588230, 3470361, 3987232, 4102601, 3819292, 3583071, 3488458, 3388266, 3063761, 2241308, 1155663, 960349, 2705142, 5849381, 8359653, 8205731, 4609565, -1282995, -6275333, -6820195, -2368551, 3385531, 5887156, 4201906, 1337524, 674930, 3011410, 6404960, 7732133, 5016500, -435893, -4580010, -4502622, -1465656, 834060, 440385, -1519535, -2993548, -3112201, -2415973, -2144934, -3208557, -5148874, -6427406, -6127779, -4645502, -2437518, 552680, 3618529, 5097193, 4516194, 3418498, 3022212, 2822398, 2661255, 3965541, 7145983, 9894951, 10190310, 8954354, 7486503, 4696965, 9375, -3253443, -1550152, 2962560, 4492705, 1438293, -1791706, -1280632, 1539498, 2607233]
4251B607233k388166m037000k524138P81877K801979J650325p40962j091811j3875
4242b954538j121789m272345m510647K26448N158458N378126K220024l18863j329493
4233a524619j532206j54611K533425L157335J05580k743200j561112J291692J366972
4224I39256n82703o41067J205137J464794o79497k514099k376537r76469J002801
4215c158384K932572K993235M75531j916970j505390J06364k47027j893345j477586
4206c691000J640845M688955N242175K859697j495018m925388l664023K099507
4198B755750O575123M912980o58559m393770m318228k606483j240686r13291j957319
4189a844483l119919j918711J089579J912876k27626n55610L283475O284660L963821
$$ y = [2607233, 219067, -3817933, -6342071, -5560194, -2758215, -1107890, -1848852, -2940663, -2954538, -4076327, -8348672, -12859319, -12632871, -7474413, -2096287, 123737, -195126, -1524619, -3056825, -3211436, -678011, 2479324, 2584904, -158296, -1719408, -427716, 939256, 356553, -284514, 920623, 2385417, 1705920, -808179, -3184716, -4161185, -3158384, -225812, 2767423, 3242954, 1325984, -179406, -73042, -320069, -2213414, -3691000, -2050155, 2638800, 7880975, 10740672, 9245654, 4320266, 656243, 2755750, 9330873, 14243853, 13585294, 9191524, 4873296, 2266813, 1026127, 112836, -1844483, -4964402, -6883113, -5793534, -3880658, -4108284, -4663894, -1380419, 4904241, 8868062]
4180H868062k62979j295394n46202j462689k207830o3997J960036O57833l80451
4171E266389K389149M071182p34417o845428n994542p27925P15269q41393J483534
4162a218182O295497O133437J699941R4374O91276k755266p344636m011704M988217
4153D572954P731113K352085j393947r45629l245165o880379k043369Q567510
4145H715173J0502904L818493M497237J3020854R898880n280451k478710K8705272
4137G1399652M8044062J7341108l7816166n8446332l2402601l085802j187212
4130C846709r812248n499101M363796L271144l719998k792246L705137M916842
4122a719965J380502M74384J624584M12262n76351K343597M267893m94289p091413
$$ y = [8868062, 8605083, 7309689, 6763487, 5300798, 3092968, 3028971, 4989007, 5646840, 5266389, 7655538, 11726720, 10992303, 4146875, -1847667, -2575592, -1860323, -2701716, -1218182, 5077315, 11210752, 12910693, 13005067, 13696343, 10941077, 3596441, -415263, 4572954, 12304067, 14656152, 13262205, 12316576, 9071411, 2191032, 147663, 8715173, 19218077, 23036570, 27533807, 40554661, 50453541, 45173090, 42694380, 71399652, 119443714, 136784822, 98968656, 40522324, 8119723, 5033921, 3846709, -5965539, -11464640, -7100844, -3829700, -7549698, -10341944, -6636807, -1719965, -339463, 134921, 1759505, 2171767, 1595416, 3939013, 8206906, 7712617, 621204]
4113F21204p259864k314610P91346J146682K039968K276896r22769m113472k056769
4104i791388K839723M053512J415731r0500L07940p15310k641409j455481K433645
4095c643537M001310J669254p99732r04439j31219M65328J976537L973707L922896
4086A0530105J516558l37866P4212J224130J392604N92795j076754l797375o081730
4077D036679n539551k511397k00294j94147m16837J245464L587656L976840J971678
4068E956091n96754k144539k441655j806015o65633J13119k41205j052352m51137
4059c330080J967601L549416J477111k773863m196942m84319M702583O373707
4051G285214M047164P39802j726782l271959l137649q85051R99244l96284l462448
$$ y = [621204, -6638660, -8953270, -8161924, -7015242, -4975274, -2698378, -3621147, -7734619, -9791388, -6951665, -2898153, -1482422, -1572922, -1264982, -1980292, -4621701, -6077182, -3643537, 357773, 2027027, 1227295, 322856, 191637, 656965, 2633502, 6607209, 10530105, 12046663, 11708797, 11783009, 13007139, 14399743, 14992538, 13915784, 10118409, 4036679, -1502872, -4014269, -4214563, -4408710, -4825547, -3580083, 7573, 3984413, 5956091, 5359337, 3214798, 773143, -1032872, -1698505, -1585386, -1826591, -2878943, -3330080, -1362479, 2186937, 3664048, 890185, -3306757, -3791076, 911507, 7285214, 11332378, 12072180, 10345398, 7073439, 3935790, 3050739, 4049983, 3653699, 191251]
4042A91251l710860n93595J546734J61683k039891j763602M68358K302205K682490
4033g55227J430272j137843k716756n28029L965379N315951J180082m076993n208963
4024b532127k524339N5757O48166K50408n0292M503N13873J181426J427164J468602
4014D43141J720649J169082j038960k645136o91104L038473L646473P92101p59236
4005E675483M72751K09998l055965m103498k6452L445225Q05808l762814l128818
3996c468282J093138J843131j345943k324070Q13517L207211J947500j38006o90738
3987I37458j347739l213951m170639k693458j72731J923523L498310L855975K175237
3978G91985K14386M52492J546164J53677k876643l409372j296966q07481k826639
$$ y = [191251, -3519609, -4113204, -2566470, -2404787, -4444678, -6208280, -5739922, -3437717, -755227, 675045, -462798, -3179554, -3707583, 257796, 5573747, 6753829, 2676836, -2532127, -5056466, -5000709, -4352543, -4102135, -4152427, -4147924, -3634051, -2452625, -1025461, 443141, 2163790, 3332872, 2293912, -351224, -1042328, 1996145, 5642618, 6434719, 5675483, 6148234, 6358232, 3302267, -801231, -827683, 2617542, 3423350, -339464, -3468282, -2375144, -532013, -1877956, -4202026, -3388509, -181298, 1766202, 1628196, 937458, -410281, -3624232, -7794871, -10488329, -10661060, -8737537, -5239227, -1383252, 791985, 1006371, 1458863, 3005027, 3158704, 282061, -3127311, -4424277, -5231758, -8058397]
3969h058397l001283K94532K497173N34158j886050p29191J770937J727619M81522
3960f368980J519445L719128L236960K12468j581324p45814O03556J044709J105365
3951B745513P13962p43462j836061j49867L597555N564900L650353j01758k654747
3942A0786388l379469l403129l259460k384895l31863K128302L127641J354869
3934D638384k116881m425339l803174r88567K399821N194071N861661K838624
3926I598600k624869o101290m747408q06593J826311K635996L317062L516563
3918F614372J594740j328105k238609j117990j007225k740717l606303k288629
3910f118466j107604j521477j304546J088297K846384J163605j371702j84477
$$ y = [-8058397, -11059680, -10765148, -8267975, -7733817, -9619867, -10349058, -8578121, -6850502, -6368980, -4849535, -1130407, 2106553, 2319021, 737697, -8117, 595439, 1640148, 2745513, 3459475, 2716013, 879952, 730085, 4327640, 9892540, 13542893, 13441135, 10786388, 7406919, 4003790, 744330, -1640565, -1972428, 155874, 3283515, 4638384, 2521503, -1903836, -5707010, -6695577, -4295756, 898315, 6759976, 9598600, 6973731, 872441, -3874967, -4681560, -2855249, -219253, 3097809, 6614372, 8209112, 6881007, 4642398, 3524408, 2517183, -223534, -3829837, -6118466, -7226070, -8747547, -10052093, -8963796, -6117412, -4953807, -6325509, -6509986]
3902f509986L864222N193203J703071k188132k080238N41158J361583m23774j825967
3893c64860r47780P47745J152398K97377m06426l78919k28728m22755n98101l02409
3883a452458K86778Q59579J747877L340056M716620L998792P85042k631258l628546
3874H022482k377700j357696k009932l267030l449124k198291k34907J457717
3866e414481J821716M91194j128193j004709O56346J277322m67971k534549k265036
3857h568361J82418K536182L201026K000664l73704k164947j503940O73587O71103
3848c345972k685253n089401k458722K396896L303545j46487k235118r6658K483551
3839g873619J966631N62311J644793L719915K996907n20679l371353l636563k351222
$$ y = [-6509986, -2645764, 2547439, 4250510, 2062378, -17860, 523298, 1884881, 1461107, -364860, -1312640, -564895, 587503, 884880, 478454, 99535, -129193, -551948, -1150049, -1452458, -1165680, -306101, 1441776, 4781832, 9498452, 13497244, 14282286, 11651028, 8022482, 5644782, 4287086, 2277154, -989876, -4439000, -6637291, -6872198, -5414481, -3592765, -3101571, -4229764, -5234473, -4578127, -3300805, -3768776, -6303325, -8568361, -8385943, -5849761, -2648735, -648071, -1021775, -3186722, -4690662, -4017075, -3345972, -6031225, -11120626, -13579348, -11182452, -7878907, -8025394, -10260512, -10357170, -7873619, -5906988, -5344677, -3699884, 20031, 3016938, 2496259, -875094, -4511657, -6862879]
3830f862879q63015M08759J114311J063662P79700N78478N585p69035o23506K09783
3820d958157l35677k615414l663553j456495J574675K132054R47154P74003J456392
3811f145018R01178l89155R107J807381K160725M81778p02376p1684Q19973P98908
3801c29183P69116J373601J772097J446040P37623o63493l075927m658740l125035
3792e753901R4453R99372r18058j583831J235247M172883L232243n53353l115709
3783b190654k740741q31984J028841K260405K512464J738848N85161k68879l85003
3774A708458R70061L827504N698945L393004k297134o413775n864894k991947
3766a969778j297069m70884J639772M514481N722086M731387K818032K32398l381965
$$ y = [-6862879, -7725894, -7317135, -6202824, -5139162, -4359462, -3780984, -3775399, -4544434, -5167940, -4958157, -5293834, -7909248, -11572801, -13029296, -11454621, -9322567, -8375413, -7601410, -6145018, -5243840, -5632995, -5623888, -3816507, -1655782, -1174004, -1876380, -1948064, -1128091, -329183, 439933, 1813534, 3585631, 5031671, 5769294, 5105801, 2029874, -2628866, -5753901, -5659448, -4660076, -5578134, -7161965, -5926718, -1753835, 1478408, 925055, -2190654, -4931395, -5763379, -4734538, -2474133, 38331, 1777179, 2362340, 2093461, 1708458, 2678519, 6506023, 12204968, 15597972, 13300838, 6887063, 1022169, -1969778, -3266847, -3737731, -2097959, 2416522, 8138608, 12869995, 15688027, 15920425, 12538460]
3757A2538460o354007n990014k444127R67508J782296P48541j55304k01479J76189
3748A068063N70550J004575J727704K685662K887492J029105k512091n272927
3740C188133n412616l852997k420745j077683J042784K830894K114277o44114
3732d232067k178830p60804J427446J539989M1991l59428J067058K000345N91521
3723h62779j574452j468470J024202K599971J007450j651007j707357J015698
3715a616744L118884K325750o6479j793192k373716k325323j653571m23287O89771
3706d117907J489483K375374K549830K60190l751914n355000j884706L752023
3698d682627O294598M274159N92742j884827k612808j957277m16308O94970K04078
$$ y = [12538460, 6184453, 194439, -2249688, -1282180, 500116, 1248657, 1093353, 891874, 1068063, 1638613, 2643188, 4370892, 7056554, 9944046, 10973151, 8461060, 3188133, -2224483, -6077480, -8498225, -9575908, -8533124, -5702230, -3587953, -4232067, -6410897, -7171701, -5744255, -4204266, -4162275, -4521703, -3454645, -1454300, -862779, -2437231, -3905701, -2881499, -281528, 725922, -925085, -2632442, -1616744, 1502140, 3827890, 3761411, 1968219, -405497, -2730820, -4384391, -4807678, -4117907, -2628424, -253050, 2296780, 2556970, -1194944, -6549944, -8434650, -4682627, 1611971, 5886130, 6478872, 4594045, 1981237, 23960, -392348, 302622, 506700]
3689E06700r84578q87382M80251R67522m91788k294287k212087L09000L929938
3680f76711O180103M815950K11282l866534l946576j283944l19270k523637m465298
3671e874635k951637N57812K501477K132406J484355J569759J230468k51155j616445
3662a217595j517707n17870p3031k41047L35801K185126L876087L698876J714892
3653H243532o17404k208501k729021j920870j06925R35787l54920k574048k526438
3644c858808J18567J811166J46253k584869k992604j425360k93808N46540K907139
3635e625784N566678M708590k05534m542989m067185Q5352L551890L874170J876132
3626E221320n15738k044642k418923k074739j438495k44642J621080K770509J454506
$$ y = [506700, -477878, -1365260, -885009, 82513, -409275, -2703562, -4915649, -4606649, -676711, 5503392, 10319342, 10530624, 6664090, 2717514, 1433570, 1114300, -1409337, -5874635, -8826272, -8268460, -5766983, -3634577, -2150222, -580463, 650005, 398850, -1217595, -2735302, -3253172, -3326203, -3567250, -3231449, -1046323, 2829764, 6528640, 8243532, 7626128, 5417627, 2688606, 767736, 660811, 1596598, 1241678, -1332370, -3858808, -3740241, -1929075, -1782822, -4367691, -7360295, -8785655, -9079463, -8532923, -5625784, -59106, 4649484, 4443950, -99039, -4166224, -4080872, -528982, 3345188, 5221320, 4705582, 2660940, 242017, -1832722, -3271217, -3515859, -1894779, 875730, 2330236]
3617B330236j562711l094857j450809J285973K059990N94275r91845j195332k26734
3608b251814J136412K159311J956123L09143j165754j26783L485733O463790N436435
3599A7402596Q15586l329281l752082j631613p89235k740954m983843m572168
3591c580994j916139J29230R321j122361j380032k61965J240252J828116J172778
3582c881794L97119R01274K394420K911443J321427j191077k815758l034230k031291
3573e028467J20700K308910K262482l19816k135248l51878K988152L624547J186030
3564D655412p44858k59484Q25475Q12524M04882K28281o01366k074073k395368
3555H51425j073611k54614j278286k373951j694143l70274l20278q62613M7668
$$ y = [2330236, 767525, -2327332, -3778141, -2492168, -432178, 162097, -829748, -2025080, -2251814, -1115402, 1043909, 3000032, 3309175, 2143421, 2016638, 5502371, 11966161, 17402596, 18218182, 14888901, 11136819, 9505206, 8715971, 5975017, 991174, -3580994, -5497133, -5367903, -5358582, -6480943, -7860975, -8122940, -6882688, -5054572, -3881794, -3484675, -2583401, -188981, 2722462, 4043889, 2852812, 37054, -2997176, -5028467, -4907767, -2598857, -336375, -656191, -2791439, -3143317, -155165, 3469382, 4655412, 3910554, 3651070, 4476545, 5289069, 5693951, 5922232, 5320866, 3246793, 851425, -222186, -476800, -1755086, -4129037, -5823180, -6193454, -6513732, -7376345, -7328677]
3546g328677K393134M127650L950467K310072K05841j604251k674741l159004
3538a779509l490504l272145j558015J214772L023943K804642J714135J011452
3530c31229L93743m54619n76178L27353L41278k139993n292067n365862j162119
3521a4259693M308037O587089L743182j742978m792969k598590K054894L864230
3513b836798J545587j028457p80147O05942M15201m58897M30317K511435L077934
3504C482117J658791L34153J24060j26213j230248k313470k245158q98614R17636
3495b96946J704459K74105k175789k299691J115767M354417K858976k530546o212580
3486c207828m752592o29056J573707O53950o79027K96266L026039M486423L059211
$$ y = [-7328677, -4935543, -807893, 3142574, 5452646, 5658487, 4054236, 1379495, -1779509, -5270013, -8542158, -10100173, -8885401, -5861458, -3056816, -1342681, -331229, 62514, -392105, -968283, -640930, -299652, -2439645, -7731712, -13097574, -14259693, -9951656, -3364567, 378615, -1364363, -6157332, -8755922, -6701028, -2836798, -1291211, -2319668, -3099815, -2493873, -2078672, -2537569, -2107252, 404183, 3482117, 5140908, 5475061, 5599121, 5472908, 4242660, 1929190, -315968, -1214582, -296946, 1407513, 1681618, -494171, -2793862, -1678095, 2676322, 5535298, 3004752, -3207828, -7960420, -8589476, -7015769, -6361819, -7040846, -6744580, -3718541, 767882, 3827093]
3477C827093O54481k15820m08079k348244m605680k675293L329301O687459L296503
3468G541721j541904o66568M154819N431716J684353j549956j923642l337585
3460I792954p025936p391118r14158O764849P910135K827379k126303l653196
3452F184606l452815l037621j955368p35459j042681k404868k253889J48743K600675
3443e948677L272332K626453J531825m0234j570267j529678L12043J890006J633910
3434B177713P90789J144255J538202p34335m992631o439854k150158M117387N924998
3425A376366K333087j243443r02295P61536j80892k233425j059740K924970M556683
3416F332847J708565j623883j594082J64938O9768j647640k003973l07672J133799
$$ y = [3827093, 4481574, 4265754, 3857675, 1509431, -3096249, -5771542, -2442241, 4245218, 7541721, 5999817, 5333249, 9488068, 14919784, 16604137, 15054181, 13130539, 9792954, 2767018, -4624100, -5538258, 1226591, 9136726, 11964105, 9837802, 6184606, 2731791, -305830, -2261198, -2996657, -4039338, -6444206, -8698095, -8549352, -5948677, -2676345, -49892, 1481933, 1441699, -128568, -1658246, -1346203, 543803, 2177713, 2968502, 4112757, 5650959, 4916624, -76007, -6515861, -8666019, -4548632, 1376366, 3709453, 2466010, 1563715, 2325251, 2144359, -89066, -1148806, 1776164, 6332847, 8041412, 6417529, 4823447, 4988385, 5058153, 3410513, 1406540, 1098868, 2232667]
3407B232667O86847q82827k161146k412102j187839J432615L872931L896971J100975
3398F579092k299272l670482k435658r3722J685016K440523K497885J854908K82126
3389F840416j529689k072272r56227K42290Q1299p57802q99858o97409j391708
3380a140960k560968k514296q81571J218841L140400M568516M045808O45023l012300
3371C508493k820706J144053M309536L792079J518176O9451q80873k160242k693670
3362E786297j886028j244869j212602K98515L411408L960182m65072n322620m729688
3353a404477j1698K524582R57037o48024K56824J139968m52436k801076l125602
3344c564902j495322L24757J474963J821367J185918J40922o773J006033J998072
$$ y = [2232667, 2919514, 2036687, -124459, -2536561, -3724400, -2291785, 1581146, 5478117, 6579092, 4279820, 609338, -1826320, -1920042, -235026, 2205497, 4703382, 6558290, 6840416, 5310727, 3238455, 2282228, 2524518, 2605817, 1848015, 948157, 250748, -1140960, -3701928, -6216224, -7097795, -5878954, -2738554, 1829962, 5875770, 6520793, 3508493, 687787, 1831840, 6141376, 9933455, 11451631, 11521082, 10640209, 8479967, 5786297, 3900269, 2655400, 1442798, 1741313, 5152721, 9112903, 8647831, 3325211, -1404477, -1416175, 1108407, 2065444, 1417420, 1674244, 2814212, 2361776, -439300, -3564902, -5060224, -4735467, -3260504, -1439137, -253219, -112297, -119070, 886963, 2885035]
3335B885035K162526J754079Q01289r96494k826836l160938j948216o25989J40235
3326a815309P09880N59202j289677l610703l547402p19518J840516J979357J187645
3317d706009J690838L028808L181228J319479j988903n566429p289608m982326
3309a5312922N45833N027585N251248K724111J026758R70228O95742m12693o52333
3300a36443J065762L358113M078813K546070m38826l663968n893497n975257l649405
3291h708638l79129J410712P07694o90940j90186K058405L081285J312574q64187
3282b262410n45684J233891J080160j526232l570185l050700j205103L26620J656564
3273g863079K951587L230379K236712J302279J019383J72434j687022k802277
$$ y = [2885035, 5047561, 6801640, 7602929, 6606435, 3779599, 618661, -1329555, -1955544, -1815309, -1105429, -546227, -1835904, -5446607, -8994009, -9713527, -7873011, -5893654, -4706009, -3015171, 13637, 3194865, 4514344, 2525441, -3040988, -10330596, -15312922, -14767089, -9739504, -4488256, -1764145, -737387, 232841, 928583, 515890, -136443, 929319, 4287432, 8366245, 10912315, 10473489, 6809521, 916024, -5059233, -8708638, -9087767, -7677055, -6969361, -7660301, -7850487, -5792082, -2710797, -1398223, -2262410, -2808094, -1574203, -494043, -2020275, -5590460, -8641160, -9846263, -9519643, -7863079, -4911492, -1681113, 555599, 1857878, 2877261, 3049695, 1362673, -1439604]
3265a439604j928640m33442K4570l1885M40102P64937L7484p51638j90052J252731
3255b255437K271823K736169K847233J817915n31360k248326j559837L69227J030712
3246D478119j07863j684840k544850j957292N77312L599891L695496q3030l643962
3237B328981k870026N04937J690165J2935j058876k45130M6056j209845j778457
3228b579260m51646R54976J271994J746167K550816J462315j790803l563978j531872
3219a931291J242014P23877k120100l301157j841461P811J458827L949325O986221
3210E174066P009245K156900m072794o127706k784248J447873J693084j650143
3202B846277l928966k546489m0427K99333n42548L61894K129684J034933k731702
$$ y = [-1439604, -3368244, -3801686, -3777116, -3809001, -3368899, -2603962, -2566478, -3318116, -3508168, -2255437, 16386, 2752555, 5599788, 7417703, 6886343, 4638017, 3078180, 3447407, 4478119, 4370256, 2685416, 140566, -1816726, -1239414, 2360477, 6055973, 5972943, 2328981, -541045, -36108, 1654057, 1666992, 608116, 362986, 409042, -800803, -2579260, -3030906, -2075930, -803936, 942231, 3493047, 4955362, 3164559, -399419, -1931291, -689277, 34600, -2085500, -5386657, -7228118, -7220307, -5761480, -1812155, 5174066, 12183311, 14340211, 10267417, 4139711, 1355463, 2803336, 4496420, 2846277, -1082689, -3629178, -3669605, -3370272, -3912820, -3550926, -1421242, -386309, -3118011]
3193c118011m084109n29327L736395M012525J573094L90461O99495L29796J6541
3184C026860K097330M966939M194381n51446m444359m271992k004961m06170O96908
3175C303490J858313J681446k49894j280492M33472K447566J592936j039628k078019
3166F669190j266131j177919k401092k873777j996617j630019k245879j638150
3158h560394J011337K920172J774583n03848p71148M49079K95944j285993j376387
3149f046655Q09964K183048N18308j914566j652827R52629K586862J795114L24820
3140d43303j43300j15950n78638j179368j153237o63018j08774Q87121K631388
3131h67079M117841L793813J447889j403283k960029k573428j027663J24822k31890
$$ y = [-3118011, -7202120, -7731447, -3995052, 17473, 1590567, 1981028, 2680523, 3010319, 3026860, 5124190, 10091129, 14285510, 13734064, 9289705, 5017713, 3012752, 2606582, 3303490, 5161803, 6843249, 6593355, 5312863, 5746335, 8193901, 9786837, 8747209, 6669190, 5403059, 4225140, 1824048, -1049729, -3046346, -4676365, -6922244, -8560394, -7549057, -4628885, -2854302, -3358150, -4129298, -3680219, -3384275, -4670268, -6046655, -5236691, -3053643, -2535335, -4449901, -6102728, -5150099, -2563237, -768123, -443303, -586603, -702553, -1281191, -2460559, -3613796, -4276814, -4385588, -3498467, -867079, 3250762, 7044575, 8492464, 7089181, 4129152, 1555724, 528061, 652883, 420993]
3122D20993j693250k525533j357667J255394L133031K406099o85920l720224m040044
3113f807121j275621K129069L356562K047935J73167n93507l72758K7827N14373
3104h00074J406581K447340K744639J553624r01577l128867l345666j514211N7573
3095a480638p57833l105219m082161k169359J536319M956074O276805M365711
3087E539699L01596k092598k30048K972180K392520j577151l123354o0037K352604
3078F475411l73242m682374m485484l70317K050903P74327j105985j430980j258532
3069d406273j358544j045832n63213o05492K27006L346113O070109M360259m50293
3060E573840k748760q50866J122650L89356r69174j092822j397708k333101j397791
$$ y = [420993, -1272257, -3797790, -5155457, -3900063, -767032, 1639067, 953147, -2767077, -6807121, -8082742, -5953673, -2597111, -549176, -376009, -969516, -1342274, -1314447, -800074, 606507, 3053847, 5798486, 7352110, 6450533, 3321666, -24000, -1538211, -1480638, -2238471, -5343690, -9425851, -11595210, -10058891, -5102817, 1173988, 5539699, 5841295, 3748697, 3518649, 6490829, 8883349, 7306198, 4182844, 4122807, 6475411, 6102169, 1419795, -3065689, -3436006, -1385103, -610776, -1716761, -3147741, -4406273, -5764817, -6810649, -7373862, -7979354, -7752348, -4406235, 1663874, 6024133, 5573840, 2825080, 1974214, 3096864, 3486220, 2517046, 1424224, 26516, -2306585, -3704376]
3051c704376J837679L683796K320180R93393J964067K237185p47133m010650m194733
3042C79408l249083l825278l381573J012432N649305M821306J4599k380188p92882
3033a751954R49217J457732K882704M489773K584516k177455m257040j721053
3025B456440R25411M32943n77412O84122K312665J829496O25086Q50190J570979
3016A1109920J242151Q05300J315186J346008l77767k243283k180809o56973P21519
3007A1081252J285160M97099k067438m416443l125503J521326M811828M037674
2999A3624955J940041J440146J082356j109912l224886k830003j425515j506504
2991G990678k139829j482739p90587j697074k352816p40938R75433J89897r55308
$$ y = [-3704376, -1866697, 1817099, 4137279, 5130672, 7094739, 9331924, 8584791, 4574141, 379408, -2869675, -6694953, -10076526, -9064094, -3414789, 1406517, 1421116, -959072, -1751954, -802737, 654995, 3537699, 8027472, 10611988, 8434533, 4177493, 2456440, 3381851, 3814794, 3237382, 3921504, 6234169, 8063665, 8688751, 9538941, 11109920, 12352071, 13157371, 14472557, 15818565, 15440798, 13197515, 11016706, 10359733, 11081252, 12366412, 12863511, 10796073, 6379630, 3254127, 4775453, 9587281, 13624955, 15564996, 17005142, 18087498, 16977586, 13752700, 10922697, 9497182, 7990678, 5850849, 4368110, 3577523, 1880449, -472367, -1213305, -237872, -47975, -1003283]
2982a003283N52430K416085R49652j377611L85684M156841L247364k000720l823681
2973C502761L30984L577416J086584k507132j896612J26109j108772l175802j169259
2964a233723K811219K597995j695054l723822r18396K238174J806962l73799q37478
2955F72078M85798J544224J430941N41417l79814k19315J457304K683804Q01311
2946I017748l293892n180297k515385J703669L141607J408700n53536p21921N57369
2937C564062K225953L287849K483404n05483l503459l592630q98703J170295K57507
2928D488795j947363k199009O5834K480377K999020J768805k3230j565264k359896
2919C708069k022011p85482M87801J210479J481007J539090J460649J306904Q29751
$$ y = [-1003283, -450853, 1965232, 2914884, 1537273, 1922957, 6079798, 9327162, 7326442, 3502761, 3833745, 7411161, 8497745, 5990613, 4094001, 4220110, 3111338, -64464, -1233723, 1577496, 4175491, 2480437, -1243385, -2161781, 76393, 1883355, 1509556, 672078, 1157876, 2702100, 4133041, 4674458, 4294644, 4075329, 5532633, 8216437, 9017748, 5723856, 543559, -1971826, -268157, 2873450, 4282150, 3728614, 3006693, 3564062, 5790015, 9077864, 11561268, 11055785, 7552326, 3959696, 3060993, 4231288, 4488795, 2541432, 342423, 408257, 2888634, 5887654, 7656459, 7633229, 6067965, 3708069, 1686058, 900576, 1388377, 2598856, 4079863, 5618953, 7079602, 8386506, 9216257]
2910I216257n78286k532847k982507q32728J361234K54610k720103k489791J790605
2901D86444M444705J657421k212294j288692K398063K350522j501138k594618
2893C740413J370512M568148K300293k179670l546798j871509r6780J513388L607254
2884I405251L882467K89547m070510m362383j034499J250209O68894m80996r13098
2875D634882j820485l019590k359647Q6587J421310O64507J92498J138181J345864
2866B284107k00663p60685J674272M427713L749841O7935l305010m762873m788237
2857a613600l470449q42885J419781J745548J412046K667982M706710M521772
2849A0546905J501509j890157m034056n551253o356496m780300r76278J878055
$$ y = [9216257, 8637971, 6105124, 3122617, 2289889, 3651123, 3905733, 1185630, -1304161, 486444, 4931149, 6588570, 4376276, 3087584, 5485647, 7836169, 6335031, 3740413, 5110925, 9679073, 11979366, 9799696, 6252898, 4381389, 4284609, 5797997, 9405251, 13287718, 13577265, 9506755, 5144372, 4109873, 5360082, 6028976, 5547980, 4634882, 2814397, -205193, -2564840, -2478253, -1056943, -392436, -199938, 938243, 2284107, 2083444, 1322759, 2997031, 7424744, 11174585, 11242520, 7937510, 3174637, -1613600, -5084049, -5926934, -4507153, -2761605, -1349559, 1318423, 6025133, 10546905, 12048414, 10158257, 6124201, 572948, -5783548, -10563848, -11540126, -9662071]
2841i662071J742803N87226J007667K309221K486928K029919K595251L342563
2833F439507K147119k38051r58782K2167l59975k887393m288298k535127k75753
2824b934586m09147j416251n17698R79393l05737l726976m911581k149259J414383
2815a3977459K589963J686463L04464j093825j962580j026231J270812K242203
2807i966190R29039J65746K222187M595311L379495n03148k094747O14144L811849
2798C153686L082605r17232l794601l197919j223589q67351j701135p36379K598109
2789c603806M625653K267193j951864k766788M38957K738359Q89057k312940k845076
2780b521255j161984j51723k18523l2438j58661j952259l998886l543115q17223
$$ y = [-9662071, -7919268, -7332042, -6324375, -4015154, -1528226, 501693, 3096944, 6439507, 8586626, 8348575, 7389793, 7411960, 7051985, 4164592, -123706, -2658833, -2934586, -3343733, -4759984, -5277682, -4298289, -4604026, -8331002, -13242583, -15391842, -13977459, -11387496, -9701033, -9396569, -10490394, -12452974, -13479205, -12208393, -9966190, -9037151, -8871405, -6649218, -2053907, 1325588, 822440, -1272307, -658163, 3153686, 6236291, 5319059, 1524458, -1673461, -2897050, -3764401, -5465536, -6201915, -3603806, 1021847, 3289040, 1337176, -1429612, -990655, 1747704, 2636761, 323821, -2521255, -3683239, -3834962, -4053485, -4085923, -4244584, -6196843, -10195729, -13738844, -14556067]
2771a4556067J690505L579836O097001P757503N167937r78432n247080m483681
2763i72478j606237m57935o21765Q2142J239126J167821K72216m750J26329j51830
2753i27361j14911J010071J925368J247434J41141K74064O52720m48574j804856
2744A955096j084489N71224j00190k707000l089413J97831L410157L283120J416618
2735C852954N77343m0595k493708n342665n103020j494886K222731L867788M156619
2726B02561L918575K717229R41283K85260R00770O86559j074985j947280k40636
2717F389336J747039J134088r21626j406720p60108j797641l871185k948442J505422
2708i29837M493162K716386l25167N0572K382063J884041j523475l131412r05219
$$ y = [-14556067, -12865562, -9285726, -3188725, 4568778, 9736715, 8758283, 3511203, -972478, -2578715, -3036650, -3658415, -3576273, -2337147, -1169326, -897110, -901860, -775531, -927361, -1042272, -32201, 1893167, 3140601, 3281742, 3555806, 4208526, 3759952, 1955096, 870607, 1441831, 1341641, -1365359, -4454772, -4256941, -846784, 2436336, 3852954, 4430297, 4389702, 1895994, -3446671, -8549691, -10044577, -7821846, -3954058, 202561, 4121136, 6838365, 7779648, 8064908, 8965678, 9652237, 8577252, 6629972, 6389336, 8136375, 9270463, 8348837, 6942117, 6182009, 4384368, 513183, -2435259, -929837, 3563325, 6279711, 5954544, 6005116, 8387179, 10271220, 8747745, 5616333, 4711114]
2699D711114J803132J762034n1942j342145k013823k806480l037719j915067l29900
2690c220796N45670J053687J815902K001673N04992k051005l901398m020688k395041
2681i667004N74125L685613M854870K947937n38951k697235k046591L65855K359359
2672a62022K607586J502193L55567k81459j081273k285046k604857j168820L62305
2663b755826j75515j756080j240070J648374L438604K005224l46878n36805J044799
2654A325827J948111J268922k97456k308458m283003m865655l344414j057015
2646a1613141K55991L55841l88650j920431k994100j101730L755588P366498O256171
2637b7963K540963O73189R72795K24518k216926l186058r03686K222491K988664
$$ y = [4711114, 6514246, 8276280, 8224338, 6882193, 4868370, 2061890, -975829, -2890896, -3220796, -2675126, -1621439, 194463, 2196136, 2701128, 650123, -3251275, -7271963, -9667004, -9092879, -5407266, -552396, 2395541, 1856590, -840645, -2887236, -2521381, -162022, 2445564, 3947757, 4303324, 4021865, 2940592, 655546, -1949311, -3118131, -2755826, -2931341, -4687421, -5927491, -4279117, -840513, 1164711, 817833, 281028, 1325827, 3273938, 4542860, 4245404, 1936946, -2346057, -7211712, -10556126, -11613141, -11357150, -11001309, -11389959, -13310390, -16304490, -17406220, -13650632, -6284134, -27963, 2513000, 3186189, 4158984, 4383502, 2166576, -1019482, -1923168, 299323, 3287987]
2628C287987R33611k257834m579919m393206j507607J846402K994063J967484
2620a709019Q64317M21368k83257r59237n6317J975960K536931R94456j0140J152017
2610D927079K195693L13890l498543n639966m307573j099261J036799M33055j954974
2601g593801l246757j553686J653535L348929K961162K587298L086554K565311
2593C808545k37311l410183m252347k505271Q6338J882530J937685K31786j496419
2584c954647r62233J293603J690579j519004n004335m216211P38227N345166O091995
2575d96860L542351M01751j444656j691902r08649J43519Q35424P17900l16097
2566G82781j484551j297654O78388K725029K983688J907779Q45497q97647m544873
$$ y = [3287987, 4221598, 1963764, -2616155, -7009361, -8516968, -6670566, -3676503, -1709019, -844702, -423334, -706591, -1665828, -1722145, 253815, 2790746, 3785202, 3775062, 4927079, 7122772, 7436662, 3938119, -1701847, -6009420, -7108681, -6071882, -5638827, -7593801, -10840558, -12394244, -10740709, -7391780, -4430618, -1843320, 1243234, 3808545, 3571234, 161051, -4091296, -6596567, -6510229, -4627699, -2690014, -2458228, -3954647, -4916880, -3623277, -1932698, -3451702, -8456037, -12672248, -11934021, -6588855, -496860, 3045491, 3447242, 2002586, 310684, -597965, -454446, 380978, 1098878, 782781, -701770, -1999424, -1321036, 1403993, 4387681, 6295460, 7140957, 6243310, 1698437]
2557A698437p776511o260370k82459M229652L381841K70101m47399P20717N58601
2548c907390o79548k59571J551149J778616n1227j365156j210064j386661k414768
2539g944620k224598J8929K196274K847491L479207N224204N665636J777826m985762
2530F054587r115271o955993q88404L103648J711892k451710m195966j761419
2522a4498636J678069K505299R45643m2870J252780L726960M927175L113963j123535
2513B484848m583484m267901j247599L04165j089668k141316k55205K214522K105361
2504f476277P30221R63589J581361n01305l869668l927686k03143K878616K794545
2495f029747J512019O81782o46674k249115j659885J164879K627413J157963j27790
$$ y = [1698437, -6078074, -12338444, -12620903, -8391251, -5009410, -4739309, -5186708, -4465991, -3907390, -4586938, -4846509, -3295360, -1516744, -1567971, -2933127, -4143191, -5529852, -7944620, -10169218, -10150289, -7954015, -5106524, -1627317, 3596887, 9262523, 11040349, 6054587, -3060684, -10016677, -10905081, -7801433, -6089541, -8541251, -12737217, -14498636, -12820567, -10315268, -9369625, -9412495, -8159715, -4432755, 494420, 3608383, 2484848, -2098636, -6366537, -7614136, -7309971, -8399639, -10540955, -10796160, -8581638, -6476277, -5746056, -4782467, -3201106, -3702411, -7572079, -11499765, -11702908, -8824292, -6029747, -4517728, -3835946, -4482620, -6731735, -8391620, -7226741, -4599328, -3441365, -3569155]
2486c569155J105678K440626J181563r46252j003783L11102M93326n01017r75123
2477a463035m27998Q33515K750785L873742J555082l515206o153675l353654J036560
2468d863884K035303O69323Q82665K415911K350664J458073K669000M391467K085435
2459A4093957l370869n565920k210149J276815K69085k520124k393095N0007J173110
2450H02817N45061M40611J005315J79919k121756l227549j416603J864652L902662
2441A975129L398516J072967j337370k441085k044495q24299N32561J318791N47451
2432B198166j860736l849910l044855q7167J714658O52720j340381j778291q72281
2423h268077l88457p82414j082345p63261l08190j81142n5534R78058L347018
$$ y = [-3569155, -2463477, -22851, 1158712, 212460, -791323, -480221, 13105, -487912, -1463035, -1891033, -1057518, 1693267, 5567009, 7122091, 3606885, -2546790, -5900444, -4863884, -2828581, -2159258, -1276593, 1139318, 3489982, 4948055, 7617055, 12008522, 14093957, 10723088, 5157168, 2947019, 4223834, 4492919, 1972795, -420300, -370293, 802817, 1347878, 1788489, 2793804, 2973723, 851967, -2375582, -3792185, -1927533, 1975129, 5373645, 6446612, 5109242, 2668157, 623662, -200637, 331924, 1650715, 2198166, 337430, -3512480, -6557335, -6644502, -4929844, -4277124, -5617505, -7395796, -8268077, -8656534, -9438948, -10521293, -11284554, -11592744, -11773886, -11829420, -10851362, -7504344]
2414g504344N668221N252091J378787k649338k958571k50959J259054N3490r93212
2405g44781N8728J085930J67695o38408J061776L397865L010048N03944p77811
2396G124986k46604l49152j826757k620780j833210j208571j725628j761598l2001
2387d479315K026973K352885J032370l87392j081608j193400p39885O19853K830169
2378I80650M715283M143294q8564n763795q046621m566321J349277M669353M767594
2369B160150M615140M817966K714701j963752m963640l318158J09021P72579j394843
2360C549164l065907k818707j972822j296050k79804O76051M16767n53770m89179
2351e834257N53939O47662o26376j334076n58992p6238j231970k329051j096842
$$ y = [-7504344, -1836123, 3415968, 4794755, 2145417, -813154, -1064113, 194941, 248431, -744781, -686053, 399877, 567572, -70836, 990940, 4388805, 7398853, 7902797, 7124986, 6878382, 6529230, 4702473, 2081693, 248483, -960088, -2685716, -4447314, -4479315, -2452342, -99457, 932913, 545521, -536087, -1729487, -2469372, -1849519, 980650, 5695933, 9839227, 9750663, 3986868, -4059753, -8626074, -7276797, -2607444, 2160150, 6775290, 11593256, 14307957, 12344205, 7380565, 4062407, 4171428, 4944007, 3549164, 483257, -2335450, -4308272, -5604322, -5884126, -5208075, -4791308, -5345078, -5834257, -5280318, -4632656, -5259032, -6593108, -7152100, -7228338, -8460308, -10789359, -11886201]
2342a1886201J727668L406753K864900J253415n34351k538039l875791k742949
2334a2324595O82858L406954L386482K519002L524239M946208K625254l471640
2326E294762p492782m923076J138746M019582J988259r85438j952908j905369
2318d818224j643439L00743L520740M007584P5369l516646j759594K874636L991736
2309C032905R59911p79044J122178K624090P34239j557711r23856M87732r14243
2300D786201l781044m125185j753732K23899Q60154J685293K335665P11637k251538
2291a308650k614353N44288L165201K064101o76196j325085L51909J976613K292026
2282D469854J533544j25097k050773k479968o64122J469532J851783J180934J133572
$$ y = [-11886201, -10158533, -6751780, -3886880, -2633465, -3167816, -5705855, -9581646, -12324595, -11641737, -8234783, -4848301, -2329299, 1194940, 6141148, 8766402, 5294762, -2198020, -7121096, -5982350, -1962768, 25491, -959947, -2912855, -4818224, -6461663, -6160920, -2640180, 1367404, 1442773, -2073873, -3833467, -958831, 3032905, 3992816, 3213772, 4335950, 6960040, 7694279, 6136568, 5212712, 5700444, 4786201, 1005157, -3120028, -4873760, -4649861, -3789707, -2104414, 231251, 942888, -1308650, -3923003, -3378715, -213514, 1850587, 1174391, -150694, 201215, 2177828, 4469854, 6003398, 5878301, 3827528, 1347560, 683438, 2152970, 4004753, 5185687, 6319259]
2273F319259J083584o69941l361259m419299l327870k042683j631128j205231
2265i254568l57224N3121K9109P86809K255582K632946J309866k9663j83540l6411
2255b793973k69515K04604J953601L202384K163140k70106j827116j714313q66927
2246b18221m99664j343006k932770l059837J3285M090785M614980R87603j978264
$$ y = [6319259, 7402843, 6732902, 3371643, -1047656, -4375526, -6418209, -8049337, -9254568, -9611792, -9558671, -9529562, -8742753, -6487171, -3854225, -2544359, -2574022, -2757562, -2793973, -3063488, -2858884, -905283, 2297101, 4460241, 4190135, 2363019, 648706, -218221, -717885, -2060891, -4993661, -8053498, -8040213, -3949428, 665552, 1653155, -325109]
$$ [...]
##END NTUPLES=NMR SPECTRUM
##END=
