##TITLE=31Pdec_DE-32_oil_TFAA
 CDCl3
 64 sc
 20.2.2024
##JCAMPDX= 6.0         $$ Bruker NMR JCAMP-DX V2.0
##DATA TYPE= NMR SPECTRUM
##DATA CLASS= NTUPLES
##ORIGIN= UXNMR, Bruker Analytische Messtechnik GmbH
##OWNER= root
$$ XWIN-NMR		Version 3.5
$$ Tue Feb 20 16:16:28 2024 Russian Standard Time (UT+4h)  she@DPX200
##.OBSERVE FREQUENCY= 81.013821
##.OBSERVE NUCLEUS= ^31P
##.ACQUISITION MODE= SIMULTANEOUS
##.ACQUISITION SCHEME= undefined
##.AVERAGES= 64
##.DIGITISER RES= 16
##SPECTROMETER/DATA SYSTEM= spect
##.PULSE SEQUENCE= zgpg30
##.SOLVENT NAME= CDCl3
##.SHIFT REFERENCE= (INTERNAL, CDCl3, 0, 248.564)
##AUDIT TRAIL= $$ (NUMBER, WHEN, WHO, WHERE, WHAT)
$$ ##TITLE= Audit trail, XWIN-NMR		Version 3.5
$$ ##JCAMPDX= 5.01
$$ ##ORIGIN= Bruker BioSpin GmbH
$$ ##OWNER= she
$$ F:/spectra/data/she/nmr/P31/1/pdata/1/auditp.txt
$$ ##AUDIT TRAIL=  $$ (NUMBER, WHEN, WHO, WHERE, WHAT)
(   1,<2024-02-20 16:15:06.15 +0400>,<she>,<DPX200>,
      <created by zg, POWCHK disabled, PULCHK disabled
       configuration hash MD5:
       00 E9 B6 7A A2 85 ED C7 34 08 36 98 17 FE 4E 26
       data hash MD5: 32K
       02 37 42 D1 F2 FD BC 07 77 CE 54 47 51 7B 7B 93>)
(   2,<2024-02-20 16:15:08.53 +0400>,<she>,<DPX200>,
      <Start of raw data processing
       efp BC_mod = 2 LB = 10 FT_mod = 6 PKNL = 1 PHC0 = -12789.13 PHC1 = -148.5166 SI = 64K 
       data hash MD5: 64K
       62 F8 2A 42 34 29 04 4C DD DA EF C9 4B 01 EB 6E>)
(   3,<2024-02-20 16:15:48.92 +0400>,<she>,<DPX200>,
      <pk PHC0 = -75.82564 PHC1 = 212.6001 
       data hash MD5: 64K
       18 D5 91 FC DC 04 07 3E C7 07 85 FB 4D E5 2C 46>)
(   4,<2024-02-20 16:15:52.23 +0400>,<she>,<DPX200>,
      <abs ABSG = 5 
       data hash MD5: 64K
       10 0C B9 47 18 74 3D 4C A5 E2 5F 6E 0E D0 64 17>)
$$ ##END=
$$ 
$$ hash MD5
$$ C9 A2 6C D8 61 B0 F8 2E F5 8D 6C 8A 94 3F B9 4B
##$RELAX= 
##$RELAX= 
##$RELAX= 
##$RELAX= 
##$RELAX= 
##$RELAX= 
##$RELAX= 
##$RELAX= 
##$RELAX= 
$$ Bruker specific parameters
$$ --------------------------
##$DU= <F:/spectra>
##$EXPNO= 1
##$NAME= <P31>
##$PROCNO= 1
##$TYPE= <nmr>
##$USER= <she>
##$AMP= (0..31)
100 100 100 100 100 100 100 100 100 100 100 100 100 100 100 100 100 100 
100 100 100 100 100 100 100 100 100 100 100 100 100 100 
##$AQSEQ= 0
##$AQ_mod= 1
##$AUNM= <au_zg>
##$AUTOPOS= <>
##$BF1= 81.014009
##$BF2= 200.13
##$BF3= 200.13
##$BF4= 200.13
##$BF5= 200.13
##$BF6= 200.13
##$BF7= 200.13
##$BF8= 200.13
##$BYTORDA= 1
##$CFDGTYP= 0
##$CFRGTYP= 5
##$CHEMSTR= <none>
##$CNST= (0..31)
1 1 145 1 1 1 1 1 1 1 1 1 1 1 1 1 1 1 1 1 1 1 1 1 1 1 1 1 1 1 1 1 
##$CPDPRG= <waltz16>
##$CPDPRG1= <>
##$CPDPRG2= <waltz16>
##$CPDPRG3= <>
##$CPDPRG4= <mlev>
##$CPDPRG5= <mlev>
##$CPDPRG6= <mlev>
##$CPDPRG7= <mlev>
##$CPDPRG8= <mlev>
##$CPDPRGB= <>
##$CPDPRGT= <>
##$D= (0..31)
0 1 0 0 0 0 0 0 0 0 0 0.03 2e-05 3e-06 0 0 0 0 0 0 0 0 0 0 0 0 0 0 0 0 
0 0 
##$DATE= 1708431305
##$DBL= (0..7)
120 120 120 11 120 120 24 19 
##$DBP= (0..7)
150 150 150 150 150 150 150 150 
##$DBP07= 0
##$DBPNAM0= <>
$$ [...]
##$SUBNAM3= <"">
##$SUBNAM4= <"">
##$SUBNAM5= <"">
##$SUBNAM6= <"">
##$SUBNAM7= <"">
##$SUBNAM8= <"">
##$SUBNAM9= <"">
##$SW= 501.771253377433
##$SWIBOX= (0..15)
0 1 3 0 0 0 0 0 0 0 0 0 0 0 0 0 
##$SW_h= 40650.406504065
##$TD= 32768
##$TD0= 1
##$TE= 0
##$TE2= 300
##$TE3= 300
##$TEG= 300
##$TL= (0..7)
0 120 53 12 22 120 120 120 
##$TP= (0..7)
150 150 150 150 150 150 150 150 
##$TP07= 0
##$TPNAME0= <>
##$TPNAME1= <>
##$TPNAME2= <>
##$TPNAME3= <>
##$TPNAME4= <>
##$TPNAME5= <>
##$TPNAME6= <>
##$TPNAME7= <>
##$TPOAL= (0..7)
0.5 0.5 0.5 0.5 0.5 0.5 0.5 0.5 
##$TPOFFS= (0..7)
0 0 0 0 0 0 0 0 
##$TUNHIN= 0
##$TUNHOUT= 0
##$TUNXOUT= 0
##$USERA1= <user>
##$USERA2= <user>
##$USERA3= <user>
##$USERA4= <user>
##$USERA5= <user>
##$V9= 5
##$VALIST= <valist>
##$VCLIST= <CCCCCCCCCCCCCCC>
##$VD= 0
##$VDLIST= <DDDDDDDDDDDDDDD>
##$VPLIST= <PPPPPPPPPPPPPPP>
##$VTLIST= <TTTTTTTTTTTTTTT>
##$WBST= 1024
##$WBSW= 4
##$XGAIN= (0..3)
0 0 0 0 
##$XL= 0
##$YL= 0
##$YMAX_a= 1911
##$YMIN_a= -5455
##$ZGOPTNS= <>
##$ZL1= 120
##$ZL2= 120
##$ZL3= 120
##$ZL4= 120
##$ABSF1= 248.5645
##$ABSF2= -253.2056
##$ABSG= 5
##$ABSL= 3
##$ALPHA= 0
##$AQORDER= 0
##$ASSFAC= 0
##$ASSFACI= 0
##$ASSFACX= 0
##$ASSWID= 0
##$AUNMP= <proc_1d>
##$AZFE= 0.1
##$AZFW= 0.5
##$BCFW= 0
##$BC_mod= 2
##$BYTORDP= 0
##$COROFFS= 0
##$CY= -3
##$DATMOD= 1
##$DC= 0
##$DFILT= <>
##$DTYPP= 0
##$F1P= 0
##$F2P= 0
##$FCOR= 1
##$FTSIZE= 65536
##$FT_mod= 6
##$GAMMA= 0
##$GB= 0
##$INTBC= 1
##$INTSCL= 6.047779e-11
##$ISEN= 30
##$LB= 10
##$LEV0= 0
##$LPBIN= 0
##$MAXI= 10000
##$MC2= 0
##$MEAN= 0
##$ME_mod= 0
##$MI= 50
##$NCOEF= 0
##$NC_proc= -11
##$NLEV= 6
##$NOISF1= 182.463
##$NOISF2= 159.3651
##$NSP= 0
##$NTH_PI= 0
##$NZP= 0
##$OFFSET= 248.5645
##$PC= 4
##$PHC0= -12864.96
##$PHC1= 64.0835
##$PH_mod= 1
##$PKNL= yes
##$PPARMOD= 0
##$PSCAL= 0
##$PSIGN= 0
##$REVERSE= no
##$SF= 81.0140089999694
##$SI= 65536
##$SIGF1= 159.3651
##$SIGF2= -187.1042
##$SINO= 113.3802
##$SIOLD= 16384
##$SREGLST= <1H.CDCl3>
##$SSB= 0
##$STSI= 65536
##$STSR= 0
##$SW_p= 40650.406504065
##$SYMM= 0
##$S_DEV= 0
##$TDeff= 32768
##$TDoff= 0
##$TI= <>
##$TILT= no
##$TM1= 0
##$TM2= 0
##$TOPLEV= 0
##$USERP1= <user>
##$USERP2= <user>
##$USERP3= <user>
##$USERP4= <user>
##$USERP5= <user>
##$WDW= 1
##$XDIM= 65536
##$YMAX_p= 398618213
##$YMIN_p= -218624252
$$ End of Bruker specific parameters
$$ ---------------------------------
##NTUPLES= NMR SPECTRUM
##VAR_NAME=  FREQUENCY,     SPECTRUM/REAL,   SPECTRUM/IMAG
##SYMBOL=    X,             R,               I
##VAR_TYPE=  INDEPENDENT,   DEPENDENT,       DEPENDENT
##VAR_FORM=  AFFN,          ASDF,            ASDF
##VAR_DIM=   65536,         65536,           65536
##UNITS=     HZ,            ARBITRARY UNITS, ARBITRARY UNITS
##FACTOR=    0.620285442955139, 1,           1
##FIRST=     20137.2065510682, 0,            0
##LAST=      -20513.1999529968, 0,           0
##MIN=       -20513.1999529968, -218624252,  0
##MAX=       20137.2065510682, 398618213,    0
$$ Real data points
##PAGE= N=1
##DATA TABLE= (X++(R..R)), XYDATA
$$ [...]
12343A6943204K416989K478035K326516K023055J653011J293096R94730P82804
12335C0911440O57801N96295N55141M84589L47463J35056j29054l99766o30562
12326C2528403p92197q80327r09746r02625q81931q74590r16221j043943j274489
12317B4052334j582727j900694k141309k230581k128738j835109j384764q43603
12309A0004809k99948J51062M27649M78547K92577r8410o22121j178106j664050
12300G492009k009976k201395k274440k286010k281131k277276k266567k224905
12292a0329691k122480j937947j673321j358560j039811p60209n47799m14868
12284b0184686l62201l81631m56296n60170o58350p10576o79962n43141k94499
$$ plain form
12343 16943204 19360193 21838228 24164744 26187799 27840810 29133906 30128636 30911440
12335 30911440 31569241 32165536 32720677 33205266 33552729 33687785 33558731 33158965 32528403
12326 32528403 31736206 30855879 29946133 29043508 28161577 27286987 26370766 25326823 24052334
12317 24052334 22469607 20568913 18427604 16197023 14068285 12233176 10848412 10004809
12309 10004809 9704861 9855923 10283572 10762119 11054696 10956286 10334165 9156059 7492009
12300 7492009 5482033 3280638 1006198 -1279812 -3560943 -5838219 -8104786 -10329691
12292 -10329691 -12452171 -14390118 -16063439 -17421999 -18461810 -19222019 -19769818 -20184686
12284 -20184686 -20546887 -20928518 -21384814 -21944984 -22603334 -23313910 -23993872 -24537013 -24831512
12275b4831512N6501M86990R56444J405150J768402K004005K112106K129193K101081
12266a1811640K056321J994460J886598J681971J323888P79288P0752p13256j443824
12257d175442j999956k309402k358315k169311j769458j175096m04076N00483
12249a5860573J462495K391521L210181L866565M328903M579203M617340M468025
12241A3063660M176500L790364L339069K825889K239040J575426Q59584J42254
12233C2011786n20726j091539j557794j922166k186237k341237k370495k261583
12225A7760009k022004j689967j332680j029807q46687q07478q80811r88139j035040
12216G127396r52129p24309l92423k7665L03685N62058P31721Q03078P61206N91674
$$ plain form
12275 -24831512 -24775011 -24288021 -23331577 -21926427 -20158025 -18154020 -16041914 -13912721 -11811640
12266 -11811640 -9755319 -7760859 -5874261 -4192290 -2868402 -2089114 -2018362 -2731618 -4175442
12257 -4175442 -6175398 -8484800 -10843115 -13012426 -14781884 -15956980 -16361056 -15860573
12249 -15860573 -14398078 -12006557 -8796376 -4929811 -600908 3978295 8595635 13063660
12241 13063660 17240160 21030524 24369593 27195482 29434522 31009948 31869532 32011786
12233 32011786 31491060 30399521 28841727 26919561 24733324 22392087 20021592 17760009
12225 17760009 15738005 14048038 12715358 11685551 10838864 10031386 9150575 8162436 7127396
12216 7127396 6175267 5450958 5058535 5030870 5334555 5896613 6628334 7431412 8192618 8784292
12206H784292K95639j00669n47294r77867j319868j510056j514038j339761j033846
12197G36532o60434k74663R4420M44271P86818J135278J498445J880919K280542
12188G922128K678870L032679L279389L359237L241377K937202K495297J985059
12180C0931238J477794J029326O68165L96598K06860R9862Q8497J82054L67674
12171C5448068O06798Q48964J052764J202575J312456J411591J516545J611002
12163D5010763J653083J606124J465675J260955J034813Q21145O31495M51534
12155E3935587K47597j4997l48481p30462j114628j457853j743022j980575k188923
12146D4604243k370335k502098k550443k496655k355219k170897j998054j877557
$$ plain form
12206 8784292 9079931 8979262 8431968 7454101 6134233 4624177 3110139 1770378 736532
12197 736532 76098 -198565 -104145 340126 1126944 2262222 3760667 5641586 7922128
12188 7922128 10600998 13633677 16913066 20272303 23513680 26450882 28946179 30931238
12180 30931238 32409032 33438358 34106523 34503121 34709981 34809843 34898340 35080394 35448068
12171 35448068 36054866 36903830 37956594 39159169 40471625 41883216 43399761 45010763
12163 45010763 46663846 48269970 49735645 50996600 52031413 52852558 53484053 53935587
12155 53935587 54183184 54168187 53819706 53089244 51974616 50516763 48773741 46793166 44604243
12146 44604243 42233908 39731810 37181367 34684712 32329493 30158596 28160542 26282985
12138B6282985j825313j835605j891734j973475k056164k104886k073182j914461
12130A0608165j605053j165456o61224j76819K21075N02113O60035O88852N78947
12121I650635L40484K5897k81875n15502o67448p94851r80196j275841j667599
12112C833704k076023k391027k518977k416672k097395j614551j042654m69678
12104a0793273M806K82626K97841N1428l73815q31494j156655j217979r56911
12095a4693426m01512L46982J148638J868097K411152K740584K865061K809130
12087i05294K585880K194924J649801J011469L92982p9014l23504l43366k17476
12078E966402n6479M5886L8590q9627l27917o55761j041440j435384j772747j987782
$$ plain form
12138 26282985 24457672 22622067 20730333 18756858 16700694 14595808 12522626 10608165
12130 10608165 9003112 7837656 7176432 6999613 7220688 7722801 8382836 9071688 9650635
12121 9650635 9991119 10017016 9735141 9219639 8552191 7757340 6777144 5501303 3833704
12112 3833704 1757681 -633346 -3152323 -5568995 -7666390 -9280941 -10323595 -10793273
12104 -10793273 -10788467 -10505841 -10208000 -10156572 -10530387 -11361881 -12518536 -13736515 -14693426
12095 -14693426 -15094938 -14747956 -13599318 -11731221 -9320069 -6579485 -3714424 -905294
12087 -905294 1680586 3875510 5525311 6536780 6929762 6850748 6527244 6183878 5966402
12078 5966402 5909923 5955809 5994399 5904772 5576855 4921094 3879654 2444270 671523 -1316259
12068a316259k029413j870292j513056r96572l94358K02186P07582J057618J214370
12059d938194J172791R71983O96890M57350L51148M30445O84738J043164J394901
12050B265216J623088J640971J415772R72575L80164k72240q94978j405056j724298
12041D001214j785793j559117j078979m48297J94570P24020J061857J186882J125658
12032C422015R34260O77940M14983J88306K2582p6957j22624j35902j35134j26518
12022E062951j01448l7950R3500L15354O21528R63574J260197J429402J423947
12013A1031055J248030R47826N85954K16840j25011m21750o60109q20945q80042
12004A1121848q21869o56027m20677j66751O5259K57535M09786N27392O15909
$$ plain form
12068 -1316259 -3345672 -5215964 -6729020 -7725592 -8119950 -7917764 -7210182 -6152564 -4938194
12059 -4938194 -3765403 -2793420 -2096530 -1639180 -1288032 -857587 -172849 870315 2265216
12050 2265216 3888304 5529275 6945047 7917622 8297786 8025546 7130568 5725512 4001214
12041 4001214 2215421 656304 -422675 -870972 -676402 47618 1109475 2296357 3422015
12032 3422015 4356275 5034215 5449198 5637504 5660086 5583129 5460505 5324603 5189469 5062951
12022 5062951 4961503 4923553 5017053 5332407 5953935 6917509 8177706 9607108 11031055
12013 11031055 12279085 13226911 13812865 14029705 13904694 13482944 12822835 12001890 11121848
12004 11121848 10299979 9643952 9223275 9056524 9121783 9379318 9789104 10316496 10932405
11995A0932405O82504P35239P75089P86674P38257N95602L44222P672l49513o37840
11985A4610311p71332o95686m04127O4499O41289J245134J792864K202317K398266
11976B1083535K327473J976051J376811O02910k45242j054864j721607k180065
11968B2165002k433666k560540k678202k876838l160406l438930l582443l499163
11960b065186l180446k684886k085368j425909p14308N8618Q95411J775966K650223
11951f775885L440530M056530M419988M489329M273322L828878L242930K601384
11943B3577006J955299J303916O11522j47386r46780j705313k323927k734671
11935A9589666k925531k930399k800688k581423k302271j979008j617133j216555
$$ plain form
11995 10932405 11614909 12350148 13125237 13911911 14650168 15245770 15589992 15597664 15248151 14610311
11985 14610311 13838979 13143293 12739166 12803665 13444954 14690088 16482952 18685269 21083535
11976 21083535 23411008 25387059 26763870 27366780 27121538 26066674 24345067 22165002
11968 22165002 19731336 17170796 14492594 11615756 8455350 5016420 1433977 -2065186
11960 -2065186 -5245632 -7930518 -10015886 -11441795 -12156103 -12097485 -11202074 -9426108 -6775885
11951 -6775885 -3335355 721175 5141163 9630492 13903814 17732692 20975622 23577006
11943 23577006 25532305 26836221 27447743 27300357 26353577 24648264 22324337 19589666
11935 19589666 16664135 13733736 10933048 8351625 6049354 4070346 2453213 1236658
11927A236658p82325l39933N9307L55790N13290N37590M65836L39891J89621L5700
11917B611425r9510j87945k04069j41652k7974P9722J20359O0279r5971l20029
11907A794635n78538q38736j067315j238461j351001j438130j556755j758761
11899h033062k058204k412962k734784k924207k907470k653780k174742j523293
11891b7422504p95400j16347L99908O97561P95357P59737O60788N47964M56731
11882b4016205M25402M96796P01169J038161J474561J957994K434552K859972
11874a2627598L202053L437462L548265L523214L364832L096423K760798K408034
11866A2713483K078063J786508J519468J239784R05122M93890K8627m16864p35086
$$ plain form
11927 1236658 454333 114400 173707 529497 1042787 1580377 2046213 2386104 2575725 2611425
11917 2611425 2511915 2323970 2119901 1978249 1950275 2029997 2150356 2210635 2114664 1794635
11907 1794635 1216097 377361 -689954 -1928415 -3279416 -4717546 -6274301 -8033062
11899 -8033062 -10091266 -12504228 -15239012 -18163219 -21070689 -23724469 -25899211 -27422504
11891 -27422504 -28217904 -28334251 -27934343 -27236782 -26441425 -25681688 -25020900 -24472936 -24016205
11882 -24016205 -23590803 -23094007 -22392838 -21354677 -19880116 -17922122 -15487570 -12627598
11874 -12627598 -9425545 -5988083 -2439818 1083396 4448228 7544651 10305449 12713483
11866 12713483 14791546 16578054 18097522 19337306 20242428 20736318 20764945 20348081 19612995
11857A9612995q23128o24541j53910N07091J236024J900564K379809K576512K431347
11848B9042763J944601J193736L25170m89697j117861j513676j726998j869685
11840B5788353k062146k386874k865093l456163m069898m585183m876875m851265
11832c365144m476905l790884k876173j829539p43770K93193J199170J911754
11824a3678298K407975K710653K871253K939195K939094K869841K719499K479753
11816H258965K153276J761737J356924J019212Q27752Q14821R40048J106603J204594
11807A9443932J149668R01164M67403r2751o77630j171755j493311j634927j665946
11798A5225847j686236j758103j863848j920323j840074j594859j237841q72834
$$ plain form
11857 19612995 18789867 18165326 18011416 18518507 19754531 21655095 24034904 26611416 29042763
11848 29042763 30987364 32181100 32506270 32016573 30898712 29385036 27658038 25788353
11840 25788353 23726207 21339333 18474240 15018077 10948179 6362996 1486121 -3365144
11832 -3365144 -7842049 -11632933 -14509106 -16338645 -17082415 -16789222 -15590052 -13678298
11824 -13678298 -11270323 -8559670 -5688417 -2749222 189872 3059713 5779212 8258965
11816 8258965 10412241 12173978 13530902 14550114 15377866 16192687 17132735 18239338 19443932
11807 19443932 20593600 21494764 21962167 21869416 21191786 20020031 18526720 16891793 15225847
11798 15225847 13539611 11781508 9917660 7997337 6157263 4562404 3324563 2451729
11790B451729n96324m52660m26550m66349n14379n27891m91561m26479l89764
11781a840228m53049o61202r94767j364870j648086j739132j589639j217730o94415
11772a2203118j18435M14069Q37512J128207J290859J332469J248183J030832
11764e039422O92208K74845j56985n42757q52239j095069j304342j504811j689793
11755a1218365j823545j864090j787813j600501j331827j019862o96219l80431
11747b1722653q4717J76551L79823M93325M90642L74668J95666M2057J390J16545
11737a9536703L66806O80142R60657J115506J077273Q21154L71975k03769q18967
11728a5165926j391775j865071k210091k414241k465418k347633k051455j589555
$$ plain form
11790 2451729 1855405 1402745 976195 509846 -4533 -532424 -1023985 -1450464 -1840228
11781 -1840228 -2293277 -2954479 -3949246 -5314116 -6962202 -8701334 -10290973 -11508703 -12203118
11772 -12203118 -12321553 -11907484 -11069972 -9941765 -8650906 -7318437 -6070254 -5039422
11764 -5039422 -4347214 -4072369 -4229354 -4772111 -5624350 -6719419 -8023761 -9528572 -11218365
11755 -11218365 -13041910 -14906000 -16693813 -18294314 -19626141 -20646003 -21342222 -21722653
11747 -21722653 -21807370 -21630819 -21250996 -20757671 -20267029 -19892361 -19696695 -19654638 -19653248 -19536703
11737 -19536703 -19169897 -18489755 -17529098 -16413592 -15336319 -14515165 -14143190 -14346959 -15165926
11728 -15165926 -16557701 -18422772 -20632863 -23047104 -25512522 -27860155 -29911610 -31501165
11720c1501165j005665l70932K31852P29057J070138J228241J195634R86603O45635
11711b6790602K44044j42206m58154o78846q01028q33319p94917p16860o34656
11702c1606544n69725n09378m01562j75685K17442P72375J425820K081664K640991
11693b6124602L020993L168137L075610K796486K432426K094080J856734J740478
11685e939658J721873J759446J811702J840705J808595J678011J421724J038348
11677G140746N64942P7467l24046n42135n13361k34470K30264P70415J273323
11668H443145J666224J931646K090853K172139K186828K126049J976651J742285
11660B4335820J450915J139283Q25746M97354J26796k92496p23020j092460j330238
$$ plain form
11720 -31501165 -32506830 -32877762 -32645910 -31916853 -30846715 -29618474 -28422840 -27436237 -26790602
11711 -26790602 -26546558 -26688764 -27146918 -27825764 -28626792 -29460111 -30255028 -30971888 -31606544
11702 -31606544 -32176269 -32685647 -33087209 -33262894 -33045452 -32273077 -30847257 -28765593 -26124602
11693 -26124602 -23103609 -19935472 -16859862 -14063376 -11630950 -9536870 -7680136 -5939658
11685 -5939658 -4217785 -2458339 -646637 1194068 3002663 4680674 6102398 7140746
11677 7140746 7705688 7783155 7459109 6916974 6403613 6169143 6399407 7169822 8443145
11668 8443145 10109369 12041015 14131868 16304007 18490835 20616884 22593535 24335820
11660 24335820 25786735 26926018 27751764 28249118 28375914 28083418 27360398 26267938 24937700
11651B4937700j406600j350640j239631j168417j213809j406903j722207k088197
11643A3341296k415690k630342k693577k605905k398490k120621j826046j560180
11635d909555j353742j225823j189162j245427j368423j490607j512904j342108
11627a5637751r35559l23580M04223J135311J767342K224022K458470K454353
11619f453169K227129J821955J307063P63760K72957j01051l24036l96378l48261
11610a230031k29727r8259m759J8037m0728j74436l65765n90980q21532j024558
11600d562738j164548j210266j148028r92524p82061n58127l47387j63272k3212
11591a0952163L8686k2149k37899o00525j041849j434361j621428j470445r25456
$$ plain form
11651 24937700 23531100 22180460 20940829 19772412 18558603 17151700 15429493 13341296
11643 13341296 10925606 8295264 5601687 2995782 597292 -1523329 -3349375 -4909555
11635 -4909555 -6263297 -7489120 -8678282 -9923709 -11292132 -12782739 -14295643 -15637751
11627 -15637751 -16573310 -16896890 -16492667 -15357356 -13590014 -11365992 -8907522 -6453169
11619 -6453169 -4226040 -2404085 -1097022 -333262 -60305 -161356 -485392 -881770 -1230031
11610 -1230031 -1459758 -1558017 -1562776 -1544739 -1585467 -1759903 -2125668 -2716648 -3538180 -4562738
11600 -4562738 -5727286 -6937552 -8085580 -9078104 -9860165 -10418292 -10765679 -10928951 -10952163
11591 -10952163 -10913477 -10935626 -11173525 -11774050 -12815899 -14250260 -15871688 -17342133 -18267589
11582a8267589l3133J068870K194003L161720L844988M193613M228224M016119
11574D406815L647173L219251K828130K553313K439240K479793K615724K750647
11566B6940086K784314K651094K343968J909848J420256R36234M84486N0345m13775
11557C9106856r65735j641956k430423l263798m035801m629573m944885m919396
11549A2275289m544405l872208l008776k089824j247086n76629j20077J35722
11541c047994K41373K57797K32177J88605J35854Q1661L7932J1516p529m3087
11531a911695j13675k12772l04248l31880k33644M0408N02246J100055J715560
11522B50355K198215K421027K325398J934758J341563O82874J11971k35855k82492
$$ plain form
11582 -18267589 -18300722 -17231852 -15037849 -11876129 -8031141 -3837528 390696 4406815
11574 4406815 8053988 11273239 14101369 16654682 19093922 21573715 24189439 26940086
11566 26940086 29724400 32375494 34719462 36629310 38049566 38985800 39470286 39520631 39106856
11557 39106856 38141121 36499165 34068742 30804944 26769143 22139570 17194685 12275289
11549 12275289 7730884 3858676 849900 -1239924 -2487010 -3063639 -3183716 -3047994
11541 -3047994 -2806621 -2548824 -2316647 -2128042 -1992188 -1910527 -1872595 -1861079 -1868608 -1911695
11531 -1911695 -2025370 -2238142 -2542390 -2874270 -3107914 -3067506 -2565260 -1465205 250355
11522 250355 2448570 4869597 7194995 9129753 10471316 11154190 11266161 11030306 10747814
11513A0747814l8062L97114Q69758J233586J396757J333028J065132O45818J47139
11504A7798084l52584p91314j142726j416201j640372j846960k062642k302536
11496F242749k561512k811758l014147l136062l159493l073493k861787k502080
11488a6877583j982537j324388n92241J17912P07379J105817J293635J310751
11480a6241255J247620J216023J307367J558400J942509K386953K800471L096704
11472f85208L210989L113985K820029K382653J876167J374169R37391O09942M12025
11463A6052142L25600K88627K16885M9303k12963n03431p26612q10842p47672
11454A3931037n98270m63813m33919n39712p37846r34382j032876r76041p57443
$$ plain form
11513 10747814 10709752 11106866 11976624 13210210 14606967 15939995 17005127 17650945 17798084
11504 17798084 17445500 16654186 15511460 14095259 12454887 10607927 8545285 6242749
11496 6242749 3681237 869479 -2144668 -5280730 -8440223 -11513716 -14375503 -16877583
11488 -16877583 -18860120 -20184508 -20776749 -20658837 -19951458 -18845641 -17552006 -16241255
11480 -16241255 -14993635 -13777612 -12470245 -10911845 -8969336 -6582383 -3781912 -685208
11472 -685208 2525781 5639766 8459795 10842448 12718615 14092784 15030175 15640117 16052142
11463 16052142 16377742 16666369 16883254 16932557 16719594 16216163 15489551 14678709 13931037
11454 13931037 13332767 12868954 12435035 11895323 11157477 10223095 9190219 8214178 7456735
11445G456735m03313N3716N86610J168277J762116K320098K786415L100893L205423
11436B2036970L060079K664746K071032J373608O84665J03418l08945n41733o29826
11427C0514014o31807o00355n58960m95876l76906j68504J43767N52867J042145
11418B9420385J596423K197845K806982L345783L702248L764284L470452K850596
11410E3154998K030653J194149N17196J07944k2930M7705J93445K84071K23195
11401E7730426k7108m35345r07565j317469j554103j566826j384284j097796q19202
11392D8620728o34587n73739o04391o49834o23536m71260k03576J04378L55270
11383D5319453M89588N17193M94964M72784M54974M03777K73783M9343k36173
$$ plain form
11445 7456735 7053422 7107138 7693748 8862025 10624141 12944239 15730654 18831547 22036970
11436 22036970 25097049 27761795 29832827 31206435 31891100 31994518 31685573 31143840 30514014
11427 30514014 29882207 29281852 28722892 28227016 27850110 27681606 27825373 28378240 29420385
11418 29420385 31016808 33214653 36021635 39367418 43069666 46833950 50304402 53154998
11410 53154998 55185651 56379800 56896996 57004940 56982010 57029715 57223160 57507231 57730426
11401 57730426 57703318 57267973 56360408 55042939 53488836 51922010 50537726 49439930 48620728
11392 48620728 47986141 47412402 46808011 46158177 45534641 45063381 44859805 44964183 45319453
11383 45319453 45809041 46326234 46821198 47293982 47748956 48152733 48426516 48475859 48239686
11374D8239686n08916o89607p37830o75517n70361m91597m73123n08753n74578
11365D3009404o54755p53552q92489j098799j388391j747111k121628k433327
11357C1919352k613766k639880k544301k395920k267340k209286k241227k356916
11349A2650716k537464k759984k991431l171271l202739k971482k389350j439781
11341h812786j97147J192722K561101L766547M719525N375828N718818N754240
11333B0078848N519565N088860M556810M006657L482600K984345K484924J956113
11325E0158722J382376P58061P9766o53507j434650k247943l074346l892645m673064
11316C6402770n372433n937823o314704o455907o335529n966912n408347m742387
$$ plain form
11374 48239686 47730770 47041163 46303333 45627816 45057455 44565858 44092735 43583982 43009404
11365 43009404 42354649 41601097 40708608 39609809 38221418 36474307 34352679 31919352
11357 31919352 29305586 26665706 24121405 21725485 19458145 17248859 15007632 12650716
11349 12650716 10113252 7353268 4361837 1190566 -2012173 -4983655 -7373005 -8812786
11341 -8812786 -9009933 -7817211 -5256110 -1489563 3229962 8605790 14324608 20078848
11333 20078848 25598413 30687273 35244083 39250740 42733340 45717685 48202609 50158722
11325 50158722 51541098 52299159 52378925 51725418 50290768 48042825 44968479 41075834 36402770
11316 36402770 31030337 25092514 18777810 12321903 5986374 19462 -5388885 -10131272
11308a0131272m039839l336885k640232j950401j285346o93380k47671j7574k7960
11299b4370560k35431n42949q42688j055322j144639j111526r82347p99516o13413
11290c1698391m73349m16994m58620n79287p26424q29306q26947o93379m44140
11281c7146837j21730K25978N58410Q44132J061335J200893J263714J247002J131655
11272b9735448Q90089N15717N0960m11546p57565q90632p61219l78056J94693
11263c1283007Q50423J463930J924956K170416K197980K053256J802217J508981
11255a7310848J227659J000960Q56227P99420Q12518Q56880Q83180Q49624P44803
11246i279577O01372M86987M75410O15684R14051J330195J784074K173138K398959
$$ plain form
11308 -10131272 -14171111 -17507996 -20148228 -22098629 -23383975 -24077355 -24325026 -24342600 -24370560
11299 -24370560 -24605991 -25148940 -25991628 -27046950 -28191589 -29303115 -30285462 -31084978 -31698391
11290 -31698391 -32171740 -32588734 -33047354 -33626641 -34353065 -35182371 -36009318 -36702697 -37146837
11281 -37146837 -37268567 -37042589 -36484179 -35640047 -34578712 -33377819 -32114105 -30867103 -29735448
11272 -29735448 -28845359 -28329642 -28278682 -28690228 -29447793 -30338425 -31099644 -31477700 -31283007
11263 -31283007 -30432584 -28968654 -27043698 -24873282 -22675302 -20622046 -18819829 -17310848
11255 -17310848 -16083189 -15082229 -14226002 -13426582 -12614064 -11757184 -10874004 -10024380 -9279577
11246 -9279577 -8678205 -8191218 -7715808 -7100124 -6186073 -4855878 -3071804 -898666 1500293
11237A500293K394636K142194J676364J077325M53342q7221m68406o69224p23879
11228G295424o99972o67012o70436p20766p98564q68396q92995q42510o98828
11219D35945m57110j26321K69952O91678J081585J370222J490704J401554J109452
11210G267661O79386K21140j48619l52127l77471k70073r7389Q7318K62648M37276
11200G709750O36850Q83953J173851J457710J650276J666621J468428J089391
11192A7736830O23023J83114j37014k85922k54253o6015K27610N51535Q14886
11183A9393794R29075Q32179N10851J2140n60514j072310j402671j495738j386860
11174A5759946j182686j001679r11942r06139r25600r11881q50945p86646p99947
$$ plain form
11237 1500293 3894929 6037123 7713487 8790812 9244154 9156933 8688527 8019303 7295424
11228 7295424 6595452 5928440 5258004 4537238 3738674 2870278 1977283 1134773 435945
11219 435945 -21165 -147486 122466 814144 1895729 3265951 4756655 6158209 7267661
11210 7267661 7947047 8168187 8019568 7667441 7289970 7019897 6922508 7009826 7272474 7709750
11200 7709750 8346600 9230553 10404404 11862114 13512390 15179011 16647439 17736830
11192 17736830 18359853 18542967 18405953 18120031 17865778 17799763 18027373 18578908 19393794
11183 19393794 20322869 21155048 21665899 21678039 21117525 20045215 18642544 17146806 15759946
11174 15759946 14577260 13575581 12663639 11757500 10831900 9920019 9069074 8282428 7482481
11165G482481r65475j306666j774675k266558k673750k929739l027467l001528
11157a0463377k894365k730292k509350k218324j847629j401848q98800l62151
11149b5326136J84362P19585J228201J703485K142241K530735K832826K992991
11141a0991710K953473K674350K148893J414351N57601k91031r82162j387318
11133c903553j441398j168661o76206j14374L75605O99027Q18740P50652N56965
11124d103203L34067J84124J73555L00688M94846O50079O76763N46565L10205
11115d32311P9609j7758J08764M77797J032176J664852K258581K719444K993594
11106A0884748L070736K981635K788653K562520K348260K138810J875809J480313
$$ plain form
11165 7482481 6517006 5210340 3435665 1169107 -1504643 -4434382 -7461849 -10463377
11157 -10463377 -13357742 -16088034 -18597384 -20815708 -22663337 -24065185 -24963985 -25326136
11149 -25326136 -25141774 -24422189 -23193988 -21490503 -19348262 -16817527 -13984701 -10991710
11141 -10991710 -8038237 -5363887 -3214994 -1800643 -1243042 -1534073 -2516235 -3903553
11133 -3903553 -5344951 -6513612 -7189818 -7304192 -6928587 -6229560 -5410820 -4660168 -4103203
11124 -4103203 -3769136 -3585012 -3411457 -3110769 -2615923 -1965844 -1289081 -742516 -432311
11115 -432311 -352702 -370460 -261696 216101 1248277 2913129 5171710 7891154 10884748
11106 10884748 13955484 16937119 19725772 22288292 24636552 26775362 28651171 30131484
11098C0131484Q97063J28276p61539j672844k513084l224677l782407m171963
11090A5030309m376555m384317m204164l870851l434658k945542k442718j953306
11082a2581802j498359j100534p84634n65760m30560l26442j70836J20765O02846
11073a6735316J282166K122202L060537M021867M919372N655794O139641O314158
11065A6780421O177898N778933N187616M469521L674070K836227J979381J114489
11057D7998556K41064o44072j533611k401291l203240l887619m410026m752366
11049B7407395m936653n019889n066753n118226n180371n237107n267763n252292
11041a3671659n167117m983930m674666m217411l602173k840298j975592j086254
$$ plain form
11098 30131484 31028547 31156823 30395284 28722440 26209356 22984679 19202272 15030309
11090 15030309 10653754 6269437 2065273 -1805578 -5240236 -8185778 -10628496 -12581802
11082 -12581802 -14080161 -15180695 -15965329 -16531089 -16961649 -17288091 -17458927 -17338162 -16735316
11073 -16735316 -15453150 -13330948 -10270411 -6248544 -1329172 4326622 10466263 16780421
11065 16780421 22958319 28737252 33924868 38394389 42068459 44904686 46884067 47998556
11057 47998556 48239620 47595548 46061937 43660646 40457406 36569787 32159761 27407395
11049 27407395 22470742 17450853 12384100 7265874 2085503 -3151604 -8419367 -13671659
11041 -13671659 -18838776 -23822706 -28497372 -32714783 -36316956 -39157254 -41132846 -42219100
11033d2219100k68344L96657Q75111J194698J424892J632345J840941K025701
11025c3097099K142874K169785K124553K055809K014903K032066K111816K246811
11017a6198482K433766K675148K967160L288915L601832L853268L977196L897922
11009A0496725L547847K897536J982063R07200j70772j087443j720319k023932
11001A4828905k031736j826811j503017j138476p86676m77360k20192j0222J65002
10992F999417L19973M69188O24120P84150R26858J013127J014296R44074Q64949
10983A3960152Q57705R76559J223632J555390J908009K223576K467542K632313
10975B7804878K723884K739313K653890K430809K045734J507164Q61501J83973
$$ plain form
11033 -42219100 -42487444 -42090787 -41215676 -40020978 -38596086 -36963741 -35122800 -33097099
11025 -33097099 -30954225 -28784440 -26659887 -24604078 -22589175 -20557109 -18445293 -16198482
11017 -16198482 -13764716 -11089568 -8122408 -4833493 -1231661 2621607 6598803 10496725
11009 10496725 14044572 16942108 18924171 19831371 19660599 18573156 16852837 14828905
11001 14828905 12797169 10970358 9467341 8328865 7542189 7064829 6844637 6834415 6999417
10992 6999417 7319390 7788578 8412698 9196848 10123706 11136833 12151129 13095203 13960152
10983 13960152 14817857 15794416 17018048 18573438 20481447 22705023 25172565 27804878
10975 27804878 30528762 33268075 35921965 38352774 40398508 41905672 42767173 42951146
10967D2951146m40545r43152j293533j505489j620101j678344j701079j684035
10959C2084868j602749j421570j107152o46109n8232O05992J283268J916711K463162
10950C3518189K890567L176859L314529L312358L187107K951352K610760K174508
10942E7136229J668624J139173O41360K20336j06331l55245n67868p89271j047227
10933E7939780j342532j650415j924991k104112k122513j939511j570824j100749
10925D4184133o58817l70137l07989m74844q17649j262113j743185k217273k656886
10916C3675240l038298l331708l498045l493956l286681k876219k313981j703779
10908A0132573j178036q55567p98667r90791j348375j761911k142306k445061
$$ plain form
10967 42951146 42510601 41567449 40273916 38768427 37148326 35469982 33768903 32084868
10959 32084868 30482119 29060549 27953397 27307288 27249056 27855048 29138316 31055027 33518189
10950 33518189 36408756 39585615 42900144 46212502 49399609 52350961 54961721 57136229
10942 57136229 58804853 59944026 60585386 60805722 60699391 60344146 59776278 58987007 57939780
10933 57939780 56597248 54946833 53021842 50917730 48795217 46855706 45284882 44184133
10925 44184133 43525316 43155179 42847190 42372346 41554697 40292584 38549399 36332126 33675240
10916 33675240 30636942 27305234 23807189 20313233 17026552 14150333 11836352 10132573
10908 10132573 8954537 8098970 7300303 6309512 4961137 3199226 1056920 -1388141
10900a388141k662144k794597k829099k733285k469739k018333j394963o58400
10892a8948701R7701P65676J251013J495160J484147J242080Q19102K84161k77193
10883a1786854p68295j096125j193692j043177o89835k34660J98661N07971O40722
10874a5465284N90306L71483j570n21381j179846j954784k796969l625091m334016
10865b8917152m813731m971155m751210m156710l259260k186726j083925o6132
10857e4206001Q05669J516029K067863K462504K699412K786228K741744K586716
10849c6539836K335329K001571J617687J246842R76983Q98638J076202J519316
10841b4867268K162711K870277L474369L837310L901047L697249L318881K876888
$$ plain form
10900 -1388141 -4050285 -6844882 -9673981 -12407266 -14877005 -16895338 -18290301 -18948701
10892 -18948701 -18851000 -18085324 -16834311 -15339151 -13855004 -12612924 -11793822 -11509661 -11786854
10883 -11786854 -12555149 -13651274 -14844966 -15888143 -16577978 -16812638 -16613977 -16106006 -15465284
10874 -15465284 -14874978 -14503495 -14505065 -15026446 -16206292 -18161076 -20958045 -24583136 -28917152
10865 -28917152 -33730883 -38702038 -43453248 -47609958 -50869218 -53055944 -54139869 -54206001
10857 -54206001 -53400332 -51884303 -49816440 -47353936 -44654524 -41868296 -39126552 -36539836
10849 -36539836 -34204507 -32202936 -30585249 -29338407 -28361424 -27462786 -26386584 -24867268
10841 -24867268 -22704557 -19834280 -16359911 -12522601 -8621554 -4924305 -1605424 1271464
10833A271464K465362K142747J924025J778612J637535J418187J064263N78813
10825A4281008K3117n21563r99075j394666j717386j974990k165931k286847k339332
10816I04335k330124k272549k192673k129761k120689k175149k262311k322413
10808a6901334k296023k150435j888176j537317j132749o98623k41418K39097
10800b6606978P24554J158022J452228J528024J357819R83927N03922L8577k98745
10791a9158650m23801k95320P8195O40618J301293J957673K519641K923499L129728
10782g327124L113332K862375K388143J733542R66017J58683o24283j328623j904494
10773C7568k308143k514615k530518k392172k147540j837269j491248j138818
$$ plain form
10833 1271464 3736826 5879573 7803598 9582210 11219745 12637932 13702195 14281008
10825 14281008 14304125 13782562 12783487 11388821 9671435 7696445 5530514 3243667 904335
10816 904335 -1425789 -3698338 -5891011 -8020772 -10141461 -12316610 -14578921 -16901334
10808 -16901334 -19197357 -21347792 -23235968 -24773285 -25906034 -26604657 -26846075 -26606978
10800 -26606978 -25882424 -24724402 -23272174 -21744150 -20386331 -19402404 -18898482 -18859905 -19158650
10791 -19158650 -19582451 -19877771 -19799576 -19158958 -17857665 -15899992 -13380351 -10456852 -7327124
10782 -7327124 -4213792 -1351417 1036726 2770268 3736285 3894968 3270685 1942062 37568
10773 37568 -2270575 -4785190 -7315708 -9707880 -11855420 -13692689 -15183937 -16322755
10765a6322755q14626n48470l48112j92908m4777J31540L50095N95058Q27525
10756a6367430J008891J129107J218845J332649J512213J754520K005590K182364
10748d223251K207686K038473J676197J163034N73055J078m55999p26796p89987
10739A463490o78377m58098j98813M3457K24527L04669K52243N9506k43354n89628
10729A79622q94504j081284j102568r46417o26406j67598L94620J000192J553330
10720a691013J937239K054691J869868J425029Q24843J99836l34073p06389r03959
10711D676072r60252r27823q49949p48849o34778n20768m22763l43557k62205
10702i94872j48323P808J79081L15641L75089L43711K40011J09103J4909K5728
$$ plain form
10765 -16322755 -17137381 -17685851 -18033963 -18226871 -18271648 -18140108 -17790013 -17194955 -16367430
10756 -16367430 -15358539 -14229432 -13010587 -11677938 -10165725 -8411205 -6405615 -4223251
10748 -4223251 -2015565 22908 1699105 2862139 3435194 3436272 2980273 2253477 1463490
10739 1463490 785113 327015 128202 171659 396186 700855 953098 1012604 769250 179622
10729 179622 -714882 -1796166 -2898734 -3845151 -4471557 -4639155 -4244535 -3244343 -1691013
10720 -1691013 246226 2300917 4170785 5595814 6420657 6620493 6286420 5580031 4676072
10711 4676072 3715820 2787997 1938048 1189199 554421 33653 -389110 -732667 -994872
10702 -994872 -1143195 -1135387 -956306 -640665 -265576 78135 318146 427249 442158 467886
10692D67886J88656N01741R04101J298452J598094J768505J833464J841829J822667
10683A2225395J764348J630826J398215J081907P34596M16986J62092l9917k23809
10674A9150639m13096n97467p42844q21473q31234p87290o98571n55898l45758
10665A3357008p9195J89780L75567L99748K32430r2164m95205q91156j218908
10656A1777905j454352j610225j733098j898684k197711k704105l428568m280822
10648g529660n075522n597584n695824n343364m626821l684526k646152j605622
10640d1805075o20119K84109J105062J854192K544115L181628L766695M291927
10632b5397466M740132N082553N280292N289642N073504M620077L961192L174566
$$ plain form
10692 467886 656542 1158283 2062384 3360836 4958930 6727435 8560899 10402728 12225395
10683 12225395 13989743 15620569 17018784 18100691 18835287 19252273 19414365 19374448 19150639
10674 19150639 18737543 18140076 17397232 16575759 15744525 14957235 14258664 13702766 13357008
10665 13357008 13277813 13467593 13843160 14242908 14475338 14383174 13887969 12996813 11777905
10656 11777905 10323553 8713328 6980230 5081546 2883835 179730 -3248838 -7529660
10648 -7529660 -12605182 -18202766 -23898590 -29241954 -33868775 -37553301 -40199453 -41805075
10640 -41805075 -42425194 -42141085 -41036023 -39181831 -36637716 -33456088 -29689393 -25397466
10632 -25397466 -20657334 -15574781 -10294489 -5004847 68657 4688734 8649926 11824492
10624A1824492K360577J605050R54488M21461J1220k57850l59129k81777n0431
10615A6228101K77779O37655R84073J303408J599460J863927K054451K100405
10607B7049259J937834J552861J002998L97330j52878n75525q39495r25955q10454
10598B8635975m81397K6777O27394J212459J691072K006035K130055K060009J817452
10589C9725831J449884J027299O32452L43584K11651K42661L97886O13690Q29299
10580D5474237J006679J132517J204257J214644J151586J014512Q27952O33575
10572E3659959M65608L33273K24879J24923K6801o5776j43606j97498k23390k26232
10562E3978941k20215k25031k61736l51610n15972p72409j127225j569572k070364
$$ plain form
10624 11824492 14185069 15790119 16744607 17166068 17177288 16919438 16560309 16278532 16228101
10615 16228101 16505880 17143535 18127608 19431016 21030476 22894403 24948854 27049259
10607 27049259 28987093 30539954 31542952 31940282 31787404 31211879 30372384 29446429 28635975
10598 28635975 28154578 28181355 28808749 30021208 31712280 33718315 35848370 37908379 39725831
10589 39725831 41175715 42203014 42835466 43179050 43390701 43633362 44031248 44644938 45474237
10580 45474237 46480916 47613433 48817690 50032334 51183920 52198432 53026384 53659959
10572 53659959 54125567 54458840 54683719 54808642 54835443 54769667 54626061 54428563 54205173 53978941
10562 53978941 53758726 53533695 53271959 52920349 52404377 51631968 50504743 48935171 46864807
10553D6864807k581634l032741l332073l388971l154773k656934j996440j305638
10545B5415603o94180k15037J38539M15138O80515R93685J386770J852262K341822
10536C2315117K778724L081889L194391L104901K851485K506224K149646J846643
10528E3829020J630045J494097J401096J302310J164754R88868Q08528O76567
10520F3295285O42911P30796R19618J146136J326614J386031J277127R85512N28194
10511G2238224n0166o85324j306953j854300k288370k593821k767581k804651
10503E7887058k700467k472930k180591j914862j776006j860275k266158l103638
10495C9612131m493661o558000r397998j3055207j7450760k2302464k7031724
$$ plain form
10553 46864807 44283173 41250432 37918359 34529388 31374615 28717681 26721241 25415603
10545 25415603 24721423 24506386 24644925 25060063 25740578 26734263 28121033 29973295 32315117
10536 32315117 35093841 38175730 41370121 44475022 47326507 49832731 51982377 53829020
10528 53829020 55459065 56953162 58354258 59656568 60821322 61810190 62618718 63295285
10520 63295285 63938196 64668992 65588610 66734746 68061360 69447391 70724518 71710030 72238224
10511 72238224 72188058 71502734 70195781 68341481 66053111 63459290 60691709 57887058
10503 57887058 55186591 52713661 50533070 48618208 46842202 44981927 42715769 39612131
10495 39612131 35118470 28560470 19162472 6107265 -11343495 -33645959 -60677683
10488f0677683l0731937l2329796l0992961k6598833j9913805j2292059n087178
10481b18624252Q15711N107427P888631R454257J0149209J0285136J0090202R696647
10473a55137032R166518Q531043P820802P080080O362580N708104N115912M540983
10465a00811010L923815L237416K521963J883148J449039J306377J454027J800197
10457h3235028K199481K506285K623202K529290K275859J949809J626823J343828
10449f6180451J100593Q76469O45319L84708Q5084k37305n29606p08482o94086
10440f5257757m60154o6134L56651O58746P32097N44496J40213l84649r18195
10431f4654686j366590j674567j827391j835853j713136j458363j059508n13571
$$ plain form
10488 -60677683 -91409620 -123739416 -154732377 -181331210 -201245015 -213537074 -218624252
10481 -218624252 -217808541 -212701114 -204812483 -195358226 -185209017 -174923881 -164833679 -155137032
10473 -155137032 -145970514 -137439471 -129618669 -122538589 -116176009 -110467905 -105351993 -100811010
10465 -100811010 -96887195 -93649779 -91127816 -89244668 -87795629 -86489252 -85035225 -83235028
10457 -83235028 -81035547 -78529262 -75906060 -73376770 -71100911 -69151102 -67524279 -66180451
10449 -66180451 -65079858 -64203389 -63558070 -63173362 -63088278 -63325583 -63855189 -64563671 -65257757
10440 -65257757 -65717911 -65784045 -65427394 -64768648 -64036551 -63492055 -63351842 -63736491 -64654686
10431 -64654686 -66021276 -67695843 -69523234 -71359087 -73072223 -74530586 -75590094 -76103665
10423g6103665J53329Q81817J591794K202585K652828K913936K991637K917167
10415e9798572K737941K511495K294474K123698K005433J928021J884990J880503
10407d2432017J912317J957164J977282J937358J812729J589317J268516Q78098
10399b9099236M75075J31203r1750j61509p8956J33612M49277Q44587J292473
10390b6105224J747242K137274K377148K397906K180285J770124J263605P70450
10382a1461190L79069J43603R2214K39288N85819J107001J738980K379131K906470
10373a889615L216399L253750L027968K605149K084728J571893J150114Q54433
10365A5874819O54220M62731J80393k48795q05268j408658j967109k426370k788766
$$ plain form
10423 -76103665 -75950336 -75068519 -73476725 -71274140 -68621312 -65707376 -62715739 -59798572
10415 -59798572 -57060631 -54549136 -52254662 -50130964 -48125531 -46197510 -44312520 -42432017
10407 -42432017 -40519700 -38562536 -36585254 -34647896 -32835167 -31245850 -29977334 -29099236
10399 -29099236 -28624161 -28492958 -28584708 -28746217 -28825173 -28691561 -28242284 -27397697 -26105224
10390 -26105224 -24357982 -22220708 -19843560 -17445654 -15265369 -13495245 -12231640 -11461190
10382 -11461190 -11082121 -10938518 -10846304 -10607016 -10021197 -8914196 -7175216 -4796085 -1889615
10373 -1889615 1326784 4580534 7608502 10213651 12298379 13870272 15020386 15874819
10365 15874819 16529039 16991770 17172163 16923368 16118100 14709442 12742333 10315963 7527197
10356G527197l094098l377479l632188l801108l799518l551945l023623k239402
10348a8992164j289465l17683N11107J057202J247501J096117O96486J86238l02645
10339a6107306o85304r36965j077305j145198j181906j225491j307407j443016
10331b5109898j616843j773431j827795j698163j345006p92138j18675N69707
10323c3712242J174220J629892J919397K068541K123580K121066K067326J939791
10315a8668429J708709J365516R40968N03999J43094o1930o8191J13406M22892
10306a3599966P76636J097794J334172J458644J459584J329957J061198O47673
10298d434308J03072n21890j137970j640550j948419k038033j952927j778951
$$ plain form
10356 7527197 4433099 1055620 -2576568 -6377676 -10177194 -13729139 -16752762 -18992164
10348 -18992164 -20281629 -20599312 -20088205 -19031003 -17783502 -16687385 -15990899 -15804661 -16107306
10339 -16107306 -16792610 -17729575 -18806880 -19952078 -21133984 -22359475 -23666882 -25109898
10331 -25109898 -26726741 -28500172 -30327967 -32026130 -33371136 -34163274 -34281949 -33712242
10323 -33712242 -32538022 -30908130 -28988733 -26920192 -24796612 -22675546 -20608220 -18668429
10315 -18668429 -16959720 -15594204 -14653236 -14149237 -14006143 -14068073 -14136264 -14022858 -13599966
10306 -13599966 -12823330 -11725536 -10391364 -8932720 -7473136 -6143179 -5081981 -4434308
10298 -4434308 -4331236 -4853126 -5991096 -7631646 -9580065 -11618098 -13571025 -15349976
10290a5349976j597178j445385j314365j175359j009809q18786o14635m11380
10282b3736873k23336o9291K6571M3884j6533j20465k06598k09218q1468J91358
10272b4401969N86302J042986J475902J800671J960435J935611J736707J393937
10264a2469418R52184M66391j0037m41619q20870j163735j494397j832709k191079
10255a9005289k572306k957643l292655l491668l467188l165665k588207j793067
10247d2333688q85297P693P73100J342831J694903J831353J761018J502308J091229
10238c3214550N76529P590n67484j094023j513234j785098j913451j944561j933074
10229d3381356j901337j826089j663286j390235j031963o52680l20558p3769Q6699
$$ plain form
10290 -15349976 -16947154 -18392539 -19706904 -20882263 -21892072 -22710858 -23325493 -23736873
10282 -23736873 -23960209 -24029500 -24002929 -23959045 -23975578 -24096043 -24302641 -24511859 -24593327 -24401969
10272 -24401969 -23815667 -22772681 -21296779 -19496108 -17535673 -15600062 -13863355 -12469418
10264 -12469418 -11517234 -11050843 -11060880 -11502499 -12323369 -13487104 -14981501 -16814210 -19005289
10255 -19005289 -21577595 -24535238 -27827893 -31319561 -34786749 -37952414 -40540621 -42333688
10247 -42333688 -43218985 -43211292 -42438192 -41095361 -39400458 -37569105 -35808087 -34305779 -33214550
10238 -33214550 -32638021 -32630431 -33197915 -34291938 -35805172 -37590270 -39503721 -41448282 -43381356
10229 -43381356 -45282693 -47108782 -48772068 -50162303 -51194266 -51846946 -52167504 -52241273 -52154574
10220e2154574J76925K07872J85301J26878O8924M8226P7097J40249K17952L12474
10210e0592676M53976O82479J020850J457072J945017K418538K806725L045396
10202c6762623L091682K944248K653881K305064J973109J687699J430089J161388
10194a9515463Q55867N15836J63783j75336m84108p46716r35314j005784r11232
10185b2238467o24283j52373M61348J147190J821283K398531K806020K993944
10177a1386807K938728K637596K102910J367041M96448m02915j206397j813368
10169e266764k184653k348562k373311k327036k250573k154500k035300j896726
10161b2837425j763824j682408j702834j853964k122154k452787k778664l056728
$$ plain form
10220 -52154574 -51977649 -51769777 -51584476 -51457598 -51388674 -51340448 -51263351 -51123102 -50905150 -50592676
10210 -50592676 -50138700 -49456221 -48435371 -46978299 -45033282 -42614744 -39808019 -36762623
10202 -36762623 -33670941 -30726693 -28072812 -25767748 -23794639 -22106940 -20676851 -19515463
10194 -19515463 -18659596 -18143760 -17979977 -18155313 -18639421 -19386137 -20321451 -21327235 -22238467
10185 -22238467 -22862750 -23015123 -22553775 -21406585 -19585302 -17186771 -14380751 -11386807
10177 -11386807 -8448079 -5810483 -3707573 -2340532 -1844084 -2246999 -3453396 -5266764
10169 -5266764 -7451417 -9799979 -12173290 -14500326 -16750899 -18905399 -20940699 -22837425
10161 -22837425 -24601249 -26283657 -27986491 -29840455 -31962609 -34415396 -37194060 -40250788
10153d0250788l284821l485985l675380l837240l927532l895635l705669l342846
10145f9405896k807023k108432j275915l68901N26825J327196J984819K504350
10137f9622977K928142L305749L668828M020948M336428M559715M607583M385836
10129c7809748L825688K925586J772120N24356o30345j526461k058412k199148
10121c5176364j996179j544934r49581k92780L68789R87886J512559J893693K110630
10112c3086281K191403K205249K226432K292999K390461K470293K483024K396165
10104a4430255K189411J847066J366344P73342J23703n17838j100504j594832
10096a1343563j986388k268505k438525k493314k423248k210202j833218j279979
$$ plain form
10153 -40250788 -43535609 -47021594 -50696974 -54534214 -58461746 -62357381 -66063050 -69405896
10145 -69405896 -72212919 -74321351 -75597266 -75966167 -75439342 -74112146 -72127327 -69622977
10137 -69622977 -66694835 -63389086 -59720258 -55699310 -51362882 -46803167 -42195584 -37809748
10129 -37809748 -33984060 -31058474 -29286354 -28761998 -29392343 -30918804 -32977216 -35176364
10121 -35176364 -37172543 -38717477 -39667058 -39959838 -39591049 -38603163 -37090604 -35196911 -33086281
10112 -33086281 -30894878 -28689629 -26463197 -24170198 -21779737 -19309444 -16826420 -14430255
10104 -14430255 -12240844 -10393778 -9027434 -8254092 -8130389 -8648227 -9748731 -11343563
10096 -11343563 -13329951 -15598456 -18036981 -20530295 -22953543 -25163745 -26996963 -28276942
10088b8276942n60303K82514J169137J996850K665512L103766L280965L200973
10080a3137528K888757K385384J756619J103060N52745K28989K06189M76501R44855
10071b594429J456236J845348J988678J837705J423058Q35228J95239l74441p74452
10062E838170r46522q83028o25396k48774J64067N46222Q51773J042730J077494
10053F816736R18789N56361K3710o04268j228460j746694k072540k150254j965258
10044a451878j548872r74442l42607K41244O88687R43411R91208Q64828O36334
10035D7913L93031K08252J23998J48501K59142M07503N34116N94436N81357N27068
10025C825317M81974M83777N34570N99402O27894N83592M57951K59144j0226l62669
$$ plain form
10088 -28276942 -28837245 -28554731 -27385594 -25388744 -22723232 -19619466 -16338501 -13137528
10080 -13137528 -10248771 -7863387 -6106768 -5003708 -4450963 -4221974 -4015785 -3539284 -2594429
10071 -2594429 -1138193 707155 2695833 4533538 5956596 6791824 6987063 6612622 5838170
10062 5838170 4891648 4008620 3383224 3134450 3298517 3844739 4696512 5739242 6816736
10053 6816736 7735525 8291886 8315596 7711328 6482868 4736174 2663634 513380 -1451878
10044 -1451878 -3000750 -3975192 -4317799 -4076555 -3387868 -2444457 -1453249 -588421 47913
10035 47913 440944 649196 773194 921695 1180837 1588340 2122456 2716892 3298249 3825317
10025 3825317 4307291 4791068 5325638 5925040 6552934 7136526 7594477 7853621 7843395 7480726
10015G480726q12832j354741j952211k553801l119257l629487m066458m382884
10007a4390945m497234m326340l830326l034414k016602q78923K73655J337980
9999c1363149K211852K805570L071397L032678K784959K460521K178056K008245
9991a0809871J967168K026730K126092K179584K090128J778822J226259M99974
9983C084886k60350r00570j318050j494064j477986j342057j138963q85802n78075
9974f311031k17396J71090N43755Q57242J083789J215025J257955J229703J155087
9965I85219J068589J016632J050662J206574J481954J830860K183624K478195
9957A3302309K681890K792847K825452K791553K688801K502663K220713J848683
$$ plain form
10015 7480726 6667894 5313153 3360942 807141 -2312116 -5941603 -10008061 -14390945
10007 -14390945 -18888179 -23214519 -27044845 -30079259 -32095861 -32974784 -32701129 -31363149
9999 -31363149 -29151297 -26345727 -23274330 -20241652 -17456693 -14996172 -12818116 -10809871
9991 -10809871 -8842703 -6815973 -4689881 -2510297 -420169 1358653 2584912 3084886
9983 3084886 2824536 1923966 605916 -888148 -2366134 -3708191 -4847154 -5732956 -6311031
9974 -6311031 -6528427 -6357337 -5813582 -4956340 -3872551 -2657526 -1399571 -169868 985219
9965 985219 2053808 3070440 4121102 5327676 6809630 8640490 10824114 13302309
9957 13302309 15984199 18777046 21602498 24394051 27082852 29585515 31806228 33654911
9949C3654911J415376R62751N32040J59496j18262k62946k45549o0720K68260
9940C6305357O93356J144926J534794J771026J788051J576696J192968P38117
9932D6745291L20204J6570j45519j83642j36993l7036J17975L73877Q03979J465066
9922D9339772K351662L382325M426686N351866O064536O539756O832284P062048
9914I1350935P373176P883293Q646563R646751J0824043J2121689J3521680J5045980
9906A76414110J6732087J8607527K0664161K2812976K4822514K6275502K6574168
9899C32903045K5017389K0992141J4290668N414970m399737j3585912k0864983
9892C59767581k5672467k8145690k8803828k8223094k6876836k5108060k3144235
$$ plain form
9949 33654911 35070287 36033038 36565078 36724574 36606312 36343366 36097817 36037097 36305357
9940 36305357 36998713 38143639 39678433 41449459 43237510 44814206 46007174 46745291
9932 46745291 47065495 47082065 46936546 46752904 46615911 46578875 46696850 47070727 47874706 49339772
9922 49339772 51691434 55073759 59500445 64852311 70916847 77456603 84288887 91350935
9914 91350935 98724111 106607404 115253967 124900718 135724761 147846450 161368130 176414110
9906 176414110 193146197 211753724 232417885 255230861 280053375 306328877 332903045
9899 332903045 357920434 378912575 393203243 398618213 394218476 380632564 359767581
9892 359767581 334095114 305949424 277145596 248922502 222045666 196937606 173793371
9885A73793371k1117231j9088107j7073079j5067043j3067286j1092380r184880
9878F8103365p400063n796448m433133l363089k616100k180482j996165j965246
9870C8352639j979953j958697j868705j718316j527295j301956j031824p02678
9862B6263215l13365J11915N21764Q49300J031199J022582Q04271L87734j81197
9853C0497418q26769j458488j989091k347141k485387k390199k091777j667627
9845A5240939j230696q99555p59194q30170j062027j354680j598854j719538j703523
9836D082702j596689j473907j403033j424014j545656j749581j995938k232876
9828i338992k409164k484942k439305k275509k019389j706750j367558j022031
$$ plain form
9885 173793371 152676140 133588033 116514954 101447911 88380625 77288245 68103365
9878 68103365 60703302 54906854 50473721 47110632 44494532 42314050 40317885 38352639
9870 38352639 36372686 34413989 32545284 30826968 29299673 27997717 26965893 26263215
9862 26263215 25949850 26061765 26583529 27432829 28464028 29486610 30290881 30678615 30497418
9853 30497418 29670649 28212161 26223070 23875929 21390542 19000343 16908566 15240939
9845 15240939 14010243 13110688 12351494 11521324 10459297 9104617 7505763 5786225 4082702
9836 4082702 2486013 1012106 -390927 -1814941 -3360597 -5110178 -7106116 -9338992
9828 -9338992 -11748156 -14233098 -16672403 -18947912 -20967301 -22674051 -24041609 -25063640
9820b5063640o90782m03951j95248q2727m8677l2147N5171K88862O87128J193692
9810b4292319J703177K108895K338005K358418K169848J797877J293769P27793
9802i794537J67366l49767q24402j275241j705305k086101k372111k527405k537805
9793b3305308k403221k127694j724343j232876p30589l19192q7152o7580k18944
9784c2216899m43235o31620p09680o56287m90186k41239O9962M34125Q45566J295756
9774c2743737J766896K220409K589039K791482K771519K533776K143062J684936
9766a4242618J220396P69884L32421q3970m47452p10688q29937p78421n47346
9757a5317731j39853M31398J136678J917072K682702L331337L778450L977019
$$ plain form
9820 -25063640 -25754422 -26158373 -26353621 -26436348 -26485025 -26517172 -26462001 -26173139 -25486011 -24292319
9810 -24292319 -22589142 -20480247 -18142242 -15783824 -13613976 -11816099 -10522330 -9794537
9802 -9794537 -9627171 -9976938 -10801340 -12076581 -13781886 -15867987 -18240098 -20767503 -23305308
9793 -23305308 -25708529 -27836223 -29560566 -30793442 -31524031 -31843223 -31930375 -31997955 -32216899
9784 -32216899 -32660134 -33291754 -34001434 -34657721 -35147907 -35389146 -35319184 -34885059 -34039493 -32743737
9774 -32743737 -30976841 -28756432 -26167393 -23375911 -20604392 -18070616 -15927554 -14242618
9766 -14242618 -13022222 -12252338 -11919917 -12003887 -12451339 -13162027 -13991964 -14770385 -15317731
9757 -15317731 -15457584 -15026186 -13889508 -11972436 -9289734 -5958397 -2179947 1797072
9749A797072L915544L605152L073447K367879J557689P26467m2776o85290j169840
9740A5145344j502314j710472j818431j832181j747234j565904j304063r83551
9732B681194o23860k44119J30259M71063P65134J030474J307405J621283J943912
9723I082745K188360K244938K032874J536174Q10310l6922q81165j619359k190235
9714A3167720k567987k742204k707446k470397k060425j526834r23343k95043
9706b125959L19633Q75400J311223J558943J566035J316108Q34295J79321n68041
9697E266958j314475j963264k426241k639269k578516k270708j789516j236638
9689a0951669p15231l05746m9349N7988N5834o347r8328k21788l95996o25616
$$ plain form
9749 1797072 5712616 9317768 12391215 14759094 16316783 17043250 17000474 16315184 15145344
9740 15145344 13643030 11932558 10114127 8281946 6534712 4968808 3664745 2681194
9732 2681194 2057334 1813215 1943474 2414537 3179671 4210145 5517550 7138833 9082745
9723 9082745 11271105 13516043 15548917 17085091 17895401 17858479 16977314 15357955 13167720
9714 13167720 10599733 7857529 5150083 2679686 619261 -907573 -1830916 -2125959
9706 -2125959 -1806326 -930926 380297 1939240 3505275 4821383 5655678 5834999 5266958
9697 5266958 3952483 1989219 -437022 -3076291 -5654807 -7925515 -9715031 -10951669
9689 -10951669 -11666900 -11972646 -12021995 -11964007 -11908173 -11914520 -12012848 -12234636 -12630632 -13256248
9679a3256248q74144j065656j120210j001601p40427m11135q1187K24715N18797
9670a7807096Q15852J104399J344472J488077J505746J405044J233080J060927
9662g849499R55870R55240J055700J221308J401540J547373J620819J600375J484112
9653C992838J287921J038229P64879M99239K73102J08320k972j10489k90634o04221
9643F956212j053274j569603k045905k387714k549270k531483k351829k017188
9635i550054j524245q84841j49055N99814J278043J835401K263976K580135K798657
9626g52169K917386K918396K783058K512623K138519J709586J265002Q20709L85092
9617A6698202j4104l23454m87947m87076l58958j99347j30774k48090n66853j011352
$$ plain form
9679 -13256248 -14130392 -15196048 -16316258 -17317859 -18058286 -18469421 -18550608 -18325893 -17807096
9670 -17807096 -16991244 -15886845 -14542373 -13054296 -11548550 -10143506 -8910426 -7849499
9662 -7849499 -6893629 -5938389 -4882689 -3661381 -2259841 -712468 908351 2508726 3992838
9653 3992838 5280759 6318988 7083867 7583106 7856208 7964528 7961556 7851067 7560433 6956212
9643 6956212 5902938 4333335 2287430 -100284 -2649554 -5181037 -7532866 -9550054
9635 -9550054 -11074299 -11959140 -12108195 -11508381 -10230338 -8394937 -6130961 -3550826 -752169
9626 -752169 2165217 5083613 7866671 10379294 12517813 14227399 15492401 16313110 16698202
9617 16698202 16684098 16360644 15872697 15385621 15026663 14827316 14696542 14448452 13881599 12870247
9607A2870247j456154j793767j983159k054283k076299k112933k187753k275635
9599c069736k324307k290927k166810j974217j744861j503716j270897j072514
9591a7417985r43169r13278r89755j144204j317797j442385j467818j379964j199636
9582b8215991r67018p25170n09488l39157k08958q9798N6232K56389N18929Q36410
9572b9387620J187316J530816J806417J950029J920834J721778J402029J041402
9564a6826999P24467N14444M35692M68352N54615O16905N86887M35124J83387
9555a2307126j08968l73712n58589o39513o22732n39473m33088l44050l02969
9546a6230220l34318m59802o88948r99933j329540j588820j700903j637815j432558
$$ plain form
9607 12870247 11414093 9620326 7637167 5582884 3506585 1393652 -794101 -3069736
9599 -3069736 -5394043 -7684970 -9851780 -11825997 -13570858 -15074574 -16345471 -17417985
9591 -17417985 -18361154 -19274432 -20264187 -21408391 -22726188 -24168573 -25636391 -27016355 -28215991
9582 -28215991 -29183009 -29908179 -30417667 -30756824 -30965782 -31055580 -30999348 -30742959 -30224030 -29387620
9572 -29387620 -28200304 -26669488 -24863071 -22913042 -20992208 -19270430 -17868401 -16826999
9564 -16826999 -16102532 -15588088 -15152396 -14684044 -14129429 -13512524 -12925637 -12490513 -12307126
9555 -12307126 -12416094 -12789806 -13348395 -13987908 -14610640 -15150113 -15583201 -15927251 -16230220
9546 -16230220 -16564538 -17024340 -17713288 -18713221 -20042761 -21631581 -23332484 -24970299 -26402857
9537b6402857j160896r06567p29916o53675o69232p55475q93323j062126j222047
9528c4456114j302831j214565q75345k38916O88891J847112L130545M412832N571970
9519b2436421O505765P135388P405731P288682O785922N928114M773710L410262
9511B6797153J952695N30294p37922j769327k532172l040488l333855l458214
9503A4408164l462682l409275l375140l432729l617596l908197m231284m486849
9495a5515588m579102m444926m073879l510991k836567k130011j437321p61515
9487c9289900q1603O11167J280844J838421K167143K173915J842264J256348N78697
9478b7622704q126l63771m25048k04785K31630P92965J383219J917872K336332
$$ plain form
9537 -26402857 -27563753 -28470320 -29200236 -29853911 -30523143 -31278618 -32171941 -33234067 -34456114
9528 -34456114 -35758945 -36973510 -37848855 -38087771 -37398880 -35551768 -32421223 -28008391 -22436421
9519 -22436421 -15930656 -8795268 -1389537 5899145 12685067 18613181 23386891 26797153
9511 26797153 28749848 29280142 28542220 26772893 24240721 21200233 17866378 14408164
9503 14408164 10945482 7536207 4161067 728338 -2889258 -6797455 -11028739 -15515588
9495 -15515588 -20094690 -24539616 -28613495 -32124486 -34961053 -37091064 -38528385 -39289900
9487 -39289900 -39371503 -38760336 -37479492 -35641071 -33473928 -31300013 -29457749 -28201401 -27622704
9478 -27622704 -27630830 -27994601 -28419649 -28624434 -28392804 -27599839 -26216620 -24298748 -21962416
9469b1962416K607331K725444K703371K567765K359605K131362J933432J793943
9461c140163J706515J637205J547023J413788J239025J038710Q29519O23837M37655
9452G333114L03048K70635L92564O91054J132883J631983K084048K409925K574757
9443A8824011K571366K389512K002797J383020N25862n30094j694677k826919
9435B2644878l753915m315723m422596m090618l430357k595893j727461r19322
9427b611007k22116L33629P15696Q86973Q21805N28117N8434m97787j036021j462275
9417b484552j713258j766192j637475j372532j029709o61395k97802N8144M19489
9408a0485282P93594J165281J495958J736733J845789J802769J616923J325705
$$ plain form
9469 -21962416 -19355085 -16629641 -13926270 -11358505 -8998900 -6867538 -4934106 -3140163
9461 -3140163 -1433648 203557 1750580 3164368 4403393 5442103 6271622 6895459 7333114
9452 7333114 7636162 7906797 8299361 8990415 10123298 11755281 13839329 16249254 18824011
9443 18824011 21395377 23784889 25787686 27170706 27696568 27166474 25471797 22644878
9435 22644878 18890963 14575240 10152644 6062026 2631669 35776 -1691685 -2611007
9427 -2611007 -2833123 -2499494 -1783798 -896825 -75020 453097 511531 13744 -1022277 -2484552
9417 -2484552 -4197810 -5964002 -7601477 -8974009 -10003718 -10665113 -10962915 -10904771 -10485282
9408 -10485282 -9691688 -8526407 -7030449 -5293716 -3447927 -1645158 -28235 1297470
9400A297470R82256O38681L36468J06508l0508o9737k6107P3440K03343L41218
9390C853032M54267M89800L89477J21150k99394q15687j357644j862638k275356
9381a302993k536011k580703k366972j909748j293985o42993n8691M22935Q29655
9372a1439506J211748J597040J970455K280536K459612K446667K208450J753764
9364D488766J134279M30345k70864q94400j388000j724521j899745j928658j841768
9355c894566j681809j499661j347439j267005j275523j355469j458862j528324
9347a5308658j523989j439710j301288j152537j036745r74710r42859q67487o52532
9338b5200515k34668L70036J064617J718228K227528K551476K704724K726723
$$ plain form
9400 1297470 2279726 2918407 3254875 3361383 3330875 3261138 3235031 3308471 3511814 3853032
9390 3853032 4307299 4797099 5186576 5307726 5008332 4192645 2835001 972363 -1302993
9381 -1302993 -3839004 -6419707 -8786679 -10696427 -11990412 -12633405 -12692096 -12269161 -11439506
9372 -11439506 -10227758 -8630718 -6660263 -4379727 -1920115 526552 2735002 4488766
9364 4488766 5623045 6053390 5782526 4888126 3500126 1775605 -124140 -2052798 -3894566
9355 -3894566 -5576375 -7076036 -8423475 -9690480 -10966003 -12321472 -13780334 -15308658
9347 -15308658 -16832647 -18272357 -19573645 -20726182 -21762927 -22737637 -23680496 -24547983 -25200515
9338 -25200515 -25435183 -25065147 -24000530 -22282302 -20054774 -17503298 -14798574 -12071851
9330a2071851K654489K513626K322925K100341J864244J631522J415404J223997
9322C654697J060909R29287Q36124P89454P86592Q03473P98283P30662N83149
9313A0972630L70587J34071p5225k15592k70351k49742j75259n8880J00226K93603
9303A0826068M77049N70668M92717K03127k73210q52047j413155j829027j993345
9294F208845j844787j380734o59123K09376J079658J804173K273171K444409K344256
9285A2479244K040144J603126J082853N06206j04246p07140j232265j592787j714145
9276A2360990j564032j168242o04105K7633O40771J190685J673166K097640K458539
9267A7113045K729155K879498K896377K784791K553439K206226J753413J230131
$$ plain form
9330 -12071851 -9417362 -6903736 -4580811 -2480470 -616226 1015296 2430700 3654697
9322 3654697 4715606 5644893 6481017 7270471 8057063 8860536 9658819 10389481 10972630
9313 10972630 11343217 11477288 11402063 11186471 10916120 10666378 10491119 10432239 10532465 10826068
9303 10826068 11303117 11873785 12366502 12569629 12296419 11444372 10031217 8202190 6208845
9294 6208845 4364058 2983324 2324201 2533577 3613235 5417408 7690579 10134988 12479244
9285 12479244 14519388 16122514 17205367 17711573 17607327 16900187 15667922 14075135 12360990
9276 12360990 10796958 9628716 9024611 9052244 9693015 10883700 12556866 14654506 17113045
9267 17113045 19842200 22721698 25618075 28402866 30956305 33162531 34915944 36146075
9259C6146075O98259K24851j44105l92541n23719n45918m68176l06300r1409J26996
9249C4724013K88047L36010K38351n359l68199q08850j283074j747496k156206
9240B9217237k457489k600504k553940k323575j950511j488244r80264m60771
9232A4401939K4780M06232O01982N48839K22219l63989j163125k090926l018812
9223I569139l790228m266783m376084m125089l572961k792392j849903q09181
9215a6013482K59480J276696K157090K812159L154878L114137K661413J837432
9207A259803P57363m18073j534312k486877l231252l758165m059426m113840l904115
9198b1488894l449202k823623k145739j540057j094270q30438p00855o11197m63250
$$ plain form
9259 36146075 36844334 37069185 36925080 36532539 36008820 35462902 34994726 34688426 34597017 34724013
9249 34724013 35012060 35348070 35586421 35581062 35212863 34404013 33120939 31373443 29217237
9240 29217237 26759748 24159244 21605304 19281729 17331218 15842974 14862710 14401939
9232 14401939 14426719 14832951 15434933 15983772 16205991 15842002 14678877 12587951 9569139
9223 9569139 5778911 1512128 -2863956 -6989045 -10562006 -13354398 -15204301 -16013482
9215 -16013482 -15754002 -14477306 -12320216 -9508057 -6353179 -3239042 -577629 1259803
9207 1259803 2017166 1599093 64781 -2422096 -5653348 -9411513 -13470939 -17584779 -21488894
9198 -21488894 -24938096 -27761719 -29907458 -31447515 -32541785 -33372223 -34073078 -34684275 -35147525
9189c5147525j97040J90065O52150J117211J508407J762762J849109J778034J595256
9180b4891571J362885J141948R82767R20808R76246J156510J455497J844059K261546
9171a2789305K626992K870973K963584K915569K757931K523484K241688J937054
9163H047970J620460J279097Q79674L89062k00722q61547j537997k165040k680076
9154D770881l027640l166214l081541k797233k371748j882636j407376j006391
9146a3969898p08991n06845l62421k30452p7726J11182L37813N90195Q37462J032321
9136a2947360J131397J122589J035909R27485Q50116Q31471Q67968R30308R77575
9127d272542R78858R32931Q70291Q33924Q55283R44355J094214J286697J491714
$$ plain form
9189 -35147525 -35344565 -35154500 -34502350 -33385139 -31876732 -30113970 -28264861 -26486827 -24891571
9180 -24891571 -23528686 -22386738 -21403971 -20483163 -19506917 -18350407 -16894910 -15050851 -12789305
9171 -12789305 -10162313 -7291340 -4327756 -1412187 1345744 3869228 6110916 8047970
9163 8047970 9668430 10947527 11827201 12216263 12015541 11153994 9615997 7450957 4770881
9154 4770881 1743241 -1422973 -4504514 -7301747 -9673495 -11556131 -12963507 -13969898
9146 -13969898 -14678889 -15185734 -15548155 -15778607 -15856333 -15745151 -15407338 -14817143 -13979681 -12947360
9136 -12947360 -11815963 -10693374 -9657465 -8729980 -7879864 -7048393 -6180425 -5250117 -4272542
9127 -4272542 -3293684 -2360753 -1490462 -656538 198745 1143100 2237314 3524011 5015725
9118E015725J665498J755314J712260J509444J159642P21424K83771o6789k76615
9109A3479674l33503k51068m4381K83453P33483J288328J895071K471638K934253
9100B2456948L223583L310765L188038K863546K368548J763671J127110N26666
9092D0828875l105m59100q45004j145894j324818j344735j197651r17487n67725
9083C3023356k14657R4060L33680M92904N63679N39674M21020K15601o8476m33849
9073C4966992q98021j484391k202422l026305l886016m682303n322681n756080
9065G708773n979704o013731n869281n540614n026613m356797l594219k811175
9057c1483361k057526j344707o54035L9048P41008J429420K057899K570547K918583
$$ plain form
9118 5015725 6681223 8436537 10148797 11658241 12817883 13539307 13823078 13756289 13479674
9109 13479674 13146171 12895103 12850722 13134175 13867658 15155986 17051057 19522695 22456948
9100 22456948 25680531 28991296 32179334 35042880 37411428 39175099 40302209 40828875
9092 40828875 40825770 40366670 39521666 38375772 37050954 35706219 34508568 33591081 33023356
9083 33023356 32808699 32902759 33236439 33729343 34293022 34832696 35253716 35469317 35400841 34966992
9073 34966992 34068971 32584580 30382158 27355853 23469837 18787534 13464853 7708773
9065 7708773 1729069 -4284662 -10153943 -15694557 -20721170 -25077967 -28672186 -31483361
9057 -31483361 -33540887 -34885594 -35539629 -35500581 -34759573 -33330153 -31272254 -28701707 -25783124
9048b5783124L075818L050926K891078K671430K472717K357578K355508K458247
9040d449822K621855K773479K825419K699197K355927J819635J176584N44673
9032A2366947K7732l19575n01018n66789n91698o49268p85407j002581j265506
9023F712837j524545j738587j882825j943039j908086j769326j526498j192304
9015f772373p88321l34472J55076O61024J143873J545990J816415J938850J940196
9006A306258J877094J814252J805631J881008K039922K256375K492301K711407
8998A8184248K886571L000254L040772K998030K862787K630857K307118J902905
8990C9813542J428976Q94373L16623k65100p89038j189295j425921j508213j494605
$$ plain form
9048 -25783124 -22707306 -19656380 -16765302 -14093872 -11621155 -9263577 -6908069 -4449822
9040 -4449822 -1827967 945512 3770931 6470128 8826055 10645690 11822274 12366947
9032 12366947 12394679 12075104 11574086 11007297 10415599 9766331 8980924 7978343 6712837
9023 6712837 5188292 3449705 1566880 -376159 -2284245 -4053571 -5580069 -6772373
9015 -6772373 -7560694 -7895166 -7740090 -7079066 -5935193 -4389203 -2572788 -633938 1306258
9006 1306258 3183352 4997604 6803235 8684243 10724165 12980540 15472841 18184248
8998 18184248 21070819 24071073 27111845 30109875 32972662 35603519 37910637 39813542
8990 39813542 41242518 42136891 42453514 42188414 41399376 40210081 38784160 37275947 35781342
8981C5781342j466059j488023j584399j737968j912972k081515k235763k379915
8973B0894728k511064k605584k622303k520457k281178j921021j490794j058704
8965C883623o85418m05470k25133j32069j03669j09029j11202p6009J5562J58142
8955B209328L20235M53114N11154M74866L59444K00862L2358j27630k69406l79783
8945C784542m39113m32678l69669k95672k85009m10558p05888j142352j634457
8936a930854k069119k342809k389661k192305j778954j216128n99477l6440L81111
8927a4174636O02419O28048N04266L08863J29363L3728M6925J51843L12389M95111
8917a0961681O73881Q26798R37794R97720R95325R06540P00145L60643r1144n97394
$$ plain form
8981 35781342 34315283 32827260 31242861 29504893 27591921 25510406 23274643 20894728
8973 20894728 18383664 15778080 13155777 10635320 8354142 6433121 4942327 3883623
8965 3883623 3198205 2792735 2567602 2435533 2331864 2222835 2111633 2035624 2051186 2209328
8955 2209328 2529563 2982677 3493831 3968697 4328141 4529003 4561361 4433731 4164325 3784542
8945 3784542 3345429 2912751 2543082 2247410 1962401 1551843 845955 -296397 -1930854
8936 -1930854 -3999973 -6342782 -8732443 -10924748 -12703702 -13919830 -14519307 -14555747 -14174636
8927 -14174636 -13572217 -12944169 -12439903 -12131040 -12001677 -11967949 -11921024 -11769181 -11456792 -10961681
8917 -10961681 -10287800 -9461002 -8523208 -7525488 -6530163 -5623623 -4923478 -4562835 -4653979 -5251373
8907e251373j082979j484040j770360j948637k045296k083940k075113k019576
8899a9761314j913673j752632j537345j282880j017002p66939n50129l79111k68246
8890b9229271k25578k36418k61894k61898k24882j79080j74386k44957l76643
8881c1415007n04137n44607m45959k14608R3950M06761O61035Q17579Q68128Q43171
8871b9433694Q12463Q65467J072705J447574J932207K415883K775058K915831
8863a5196506K803397K469058J990854J454911R19067M02721r2165n50362r32835
8854f731860j197604j334244j380322j402265j453613j543566j638567j689667
8846a8371708j659571j532445j310854j011458o62065k95196O1955L94498O99034
$$ plain form
8907 -5251373 -6334352 -7818392 -9588752 -11537389 -13582685 -15666625 -17741738 -19761314
8899 -19761314 -21674987 -23427619 -24964964 -26247844 -27264846 -28031785 -28581914 -28961025 -29229271
8890 -29229271 -29454849 -29691267 -29953161 -30215059 -30439941 -30619021 -30793407 -31038364 -31415007
8881 -31415007 -31919144 -32463751 -32909710 -33124318 -33030368 -32623607 -31962572 -31144993 -30276865 -29433694
8871 -29433694 -28621231 -27755764 -26683059 -25235485 -23303278 -20887395 -18112337 -15196506
8863 -15196506 -12393109 -9924051 -7933197 -6478286 -5559219 -5156498 -5248663 -5799025 -6731860
8854 -6731860 -7929464 -9263708 -10644030 -12046295 -13499908 -15043474 -16682041 -18371708
8846 -18371708 -20031279 -21563724 -22874578 -23886036 -24548101 -24843297 -24781342 -24386844 -23687810
8837b3687810R76724J225059J431694J573368J621567J551777J349699J012448
8829a2945474N51036k97n74870j079491j420859j539339j431009j149916p93007
8820b0383226m69678k58302j66112j21291j2214K47052O67730J181798J676705
8811a7637538K044372K220884K202933K037131J790756J522634J269255J045943
8803c503630Q52307O75821M97500L04218J01861q4164k27305l25048m07159n14563
8793b630162o64324q32792r73264j051029j062894j027225r61491q72486p64711
8784a0840378o50046n43029m44939l32889j63958J08221N11369J034060J618911
8775i702678K183053K660346L032654L319652L536503L663428L656769L486129
$$ plain form
8837 -23687810 -22711086 -21486027 -20054333 -18480965 -16859398 -15307621 -13957922 -12945474
8829 -12945474 -12394438 -12394735 -12969605 -14049096 -15469955 -17009294 -18440303 -19590219 -20383226
8820 -20383226 -20852904 -21111206 -21277318 -21398609 -21410823 -21163771 -20496041 -19314243 -17637538
8811 -17637538 -15593166 -13372282 -11169349 -9132218 -7341462 -5818828 -4549573 -3503630
8803 -3503630 -2651323 -1975502 -1478002 -1173784 -1071923 -1156087 -1383392 -1708440 -2115599 -2630162
8793 -2630162 -3294486 -4127278 -5100542 -6151571 -7214465 -8241690 -9203181 -10075667 -10840378
8784 -10840378 -11490424 -12033453 -12478392 -12811281 -12975239 -12867018 -12355649 -11321589 -9702678
8775 -9702678 -7519625 -4859279 -1826625 1493027 5029530 8692958 12349727 15835856
8767A5835856L160522K726127K244653J766606J309426Q53188L64424j62837o82778
8758B7415187j117121j408229j564626j662208j799819k043092k395833k810772
8750A2613487l219257l553162l752383l768462l571243l154567k537417j762379
8742a2705383q91549L932Q58211J618391K241095K687793K930281K964491K820921
8733B528183K562294K265279J989902J752246J523406J261108R48937O08345K76859
8724A5716559k0767k81608n13075p17068q79844r67855r30115p11553k77856L57254
8714A0774072J117481J874113K479781K809656K790709K412800J728820Q48015
8706B6835447q5085r30130j592675k041990k296546k394402k371012k251806k054374
$$ plain form
8767 15835856 18996378 21722505 23967158 25733764 27043190 27896378 28260802 28097965 27415187
8758 27415187 26298066 24889837 23325211 21663003 19863184 17820092 15424259 12613487
8750 12613487 9394230 5841068 2088685 -1679777 -5251020 -8405587 -10943004 -12705383
8742 -12705383 -13596932 -13593000 -12734789 -11116398 -8875303 -6187510 -3257229 -292738 2528183
8733 2528183 5090477 7355756 9345658 11097904 12621310 13882418 14831355 15439700 15716559
8724 15716559 15695792 15414184 14901109 14184041 13304197 12336342 11406227 10694674 10416818 10774072
8714 10774072 11891553 13765666 16245447 19055103 21845812 24258612 25987432 26835447
8706 26835447 26750362 25820232 24227557 22185567 19889021 17494619 15123607 12871801 10817427
8697A0817427j795362j499505j205275r61466q16307q05219r38603j187912j477099
8688A30679j695586j738227j552234j159753o42582j04434L62504O91424Q38417
8679d869792P77453N04239M8755n16588j087471j557474j852087j949153j877644
8670a2379762j697102j467274j223678r74193p17403m64748k46412r7751l8190
8661a9306513n4658r6523q8596L6217K99690O62446J042250J352035J531941J560673
8651a3061038J446678J207372Q50335L74063k05587q22657j354245j652564j596350
8642a4813993j130546k79973Q56150K118111L306882M217211M681676M612714
8634C568232M023315L014489J736452L46388j015383k227357l182620l796481
$$ plain form
8697 10817427 9022065 7522560 6317285 5355819 4539512 3734293 2795690 1607778 130679
8688 130679 -1564907 -3303134 -4855368 -6015121 -6657703 -6762137 -6399633 -5708209 -4869792
8679 -4869792 -4092339 -3588100 -3539345 -4055933 -5143404 -6700878 -8552965 -10502118 -12379762
8670 -12379762 -14076864 -15544138 -16767816 -17742009 -18459412 -18924160 -19170572 -19268323 -19306513
8661 -19306513 -19361171 -19457694 -19546290 -19510073 -19210383 -18547937 -17505687 -16153652 -14621711 -13061038
8651 -13061038 -11614360 -10406988 -9556653 -9182590 -9388177 -10210834 -11565079 -13217643 -14813993
8642 -14813993 -15944539 -16224512 -15368362 -13250251 -9943369 -5726158 -1044482 3568232
8634 3568232 7591547 10606036 12342488 12688876 11673493 9446136 6263516 2467035
8626B467035m027428l893804l467339k845205k122581j383911p06196j53180K44163
8617a5888446N00090O60031P69384Q52889R16647R58408R69939R35383Q38837
8608h486838O79696M79204K69204P3654j00673k60616m18960n89620p83729j002379
8598a0141057j228012j422224j535869j529041j390748j146692q50064n60336
8590a9804043l21816j52327m4877K2411P5542J38894K36630L98942O65011J072844
8580a7712789J635707K320709L050290L730284M284447M671301M879044M913178
8572A1772171M789982M535304M182325L765491L311412K829669K311513J745058
8564C9242925J141942N53484N8365k70633l94666l15362o6103K96770O97864J048434
$$ plain form
8626 2467035 -1560393 -5454197 -8921536 -11766741 -13889322 -15273233 -15979429 -16132609 -15888446
8617 -15888446 -15388356 -14728325 -13958941 -13106052 -12189405 -11230997 -10261058 -9325675 -8486838
8608 -8486838 -7807142 -7327938 -7058734 -6985080 -7085753 -7346369 -7765329 -8354949 -9138678 -10141057
8598 -10141057 -11369069 -12791293 -14327162 -15856203 -17246951 -18393643 -19243707 -19804043
8590 -19804043 -20125859 -20278186 -20323063 -20300652 -20225110 -20086216 -19849586 -19450644 -18785633 -17712789
8580 -17712789 -16077082 -13756373 -10706083 -6975799 -2691352 1979949 6858993 11772171
8572 11772171 16562153 21097457 25279782 29045273 32356685 35186354 37497867 39242925
8564 39242925 40384867 40938351 40996716 40726083 40331417 40016055 39949952 40246722 40944586 41993020
8554D1993020J261645J276804J081388P15578K53211k29362o76988j063356j388989
8545D3222951j676053j956676k251736k550515k808135k965791k980527k845097
8537B3188421k587494k253290j883263j499446j104802o92165k55447J99914O48179
8528A3760607J040097J309692J390128J232859Q25814K07253n32248j268975j884313
8519A6080914k302614k505694k518529k382916k141032j836073j518865j245340
8511c70149j061184r83924r97072j063000j147941j241799j356124j498990j646364
8502a1366547j735644j689965j457193j039927n03749L6735M50980O37534N63705
8493a6104071K78567j09186m76147p28758q28243p88651o54372m74217k88259
$$ plain form
8554 41993020 43254665 44531469 45612857 46328435 46581646 46352284 45675296 44611940 43222951
8545 43222951 41546898 39590222 37338486 34787971 31979836 29014045 26033518 23188421
8537 23188421 20600927 18347637 16464374 14964928 13860126 13167961 12912514 13112428 13760607
8528 13760607 14800704 16110396 17500524 18733383 19559197 19766450 19234202 17965227 16080914
8519 16080914 13778300 11272606 8754077 6371161 4230129 2394056 875191 -370149
8511 -370149 -1431333 -2415257 -3412329 -4475329 -5623270 -6865069 -8221193 -9720183 -11366547
8502 -11366547 -13102191 -14792156 -16249349 -17289276 -17793025 -17756290 -17305310 -16667776 -16104071
8493 -16104071 -15825504 -15934690 -16410837 -17139595 -17967838 -18756489 -19410861 -19885078 -20173337
8484b0173337j30231l5051m0498j80325m71490r01060j422317j967786k472223
8475b7794318k885779l167254l271914l155703k797217k218584j490179p19704
8467d7500652k9627M77053P54882Q34834Q05267P64951P81397Q79014J051737
8458d1181144J278009J525363J750617J906249J952264J863637J629620J254080
8450b8021305P65309K26669k72247o49493q67383r41314r14719q24340o83523
8441c2182346m88692k33809Q1217M49113Q54601J272272J666194J994107K214909
8432b4372434K295727K217132J978995J608564J165221P31019L83499J63960O3105
8423a3765212L4409K3977m120n9531j32499k07778k78619l54910m59767o13245
$$ plain form
8484 -20173337 -20303568 -20338619 -20379117 -20559442 -21030932 -21931992 -23354309 -25322095 -27794318
8475 -27794318 -30680097 -33847351 -37119265 -40274968 -43072185 -45290769 -46780948 -47500652
8467 -47500652 -47530279 -47053226 -46298344 -45463510 -44658243 -43893292 -43111895 -42232881 -41181144
8458 -41181144 -39903135 -38377772 -36627155 -34720906 -32768642 -30905005 -29275385 -28021305
8450 -28021305 -27255996 -27029327 -27301574 -27951067 -28818450 -29759764 -30674483 -31498823 -32182346
8441 -32182346 -32671038 -32904847 -32823630 -32374517 -31519916 -30247644 -28581450 -26587343 -24372434
8432 -24372434 -22076707 -19859575 -17880580 -16272016 -15106795 -14375776 -13992277 -13828317 -13765212
8423 -13765212 -13730803 -13706826 -13710946 -13770477 -13902976 -14110754 -14389373 -14744283 -15204050 -15817295
8413a5817295q10496j009360j140466j139798r86313p19738m25003j91940p3796
8404b2314205o5451j08796j19418k0763K29103O25855J120433J629837K058092
8395a6965313K326266K398105K284267K025617J675364J293779R46333O90087
8387c325495N51983N16996N33644N28475M22719J53568l02339r18188j629125
8378c467762k356226l021932l553000l885950l985480l863844l578065l197871
8370c0910130k764499k271071j677755r46984p2913R07842J919429K856275L599314
8361b9360492M041348M115909L818280L210582K409244J556627P84302J83236
8353i240964k03536l65408l04985l7038L91689Q83340J297459J493758J387312
$$ plain form
8413 -15817295 -16627791 -17637151 -18777617 -19917415 -20903728 -21623466 -22048469 -22240409 -22314205
8404 -22314205 -22379656 -22488452 -22607870 -22628633 -22399530 -21773675 -20653242 -19023405 -16965313
8395 -16965313 -14639047 -12240942 -9956675 -7931058 -6255694 -4961915 -4015582 -3325495
8387 -3325495 -2773512 -2256516 -1722872 -1194397 -771678 -618110 -920449 -1838637 -3467762
8378 -3467762 -5823988 -8845920 -12398920 -16284870 -20270350 -24134194 -27712259 -30910130
8370 -30910130 -33674629 -35945700 -37623455 -38570439 -38643352 -37735510 -35816081 -32959806 -29360492
8361 -29360492 -25319144 -21203235 -17384955 -14174373 -11765129 -10208502 -9424200 -9240964
8353 -9240964 -9444500 -9809908 -10114893 -10151931 -9760242 -8876902 -7579443 -6085685 -4698373
8344d698373R83139L71840l07484r17132j364487j624879j734662j758261j749941
8335a2800240j735179j718465j701660j692992j702797j736726j795449j878868
8327b6762376j987766k120516k268536k414721k535879k607679k610124k531120
8319d5838717k366252k115724j782796j376556r15377m24518P3147N66086J054462
8310e3126245J540266K013398K443937K789485L016992L124140L140848L107287
8302c1949892L047839K963721K846508K694667K516328K317450K086938J793441
8294a1683000J402839R10005L60038j65179n90152q83131j056772j137991j140762
8285a3984105j066138r22825p43555n80216m80621m63867n10553n72571n95547
$$ plain form
8344 -4698373 -3715234 -3343394 -3650878 -4568010 -5932497 -7557376 -9292038 -11050299 -12800240
8335 -12800240 -14535419 -16253884 -17955544 -19648536 -21351333 -23088059 -24883508 -26762376
8327 -26762376 -28750142 -30870658 -33139194 -35553915 -38089794 -40697473 -43307597 -45838717
8319 -45838717 -48204969 -50320693 -52103489 -53480045 -54395422 -54819940 -54746793 -54180707 -53126245
8310 -53126245 -51585979 -49572581 -47128644 -44339159 -41322167 -38198027 -35057179 -31949892
8302 -31949892 -28902053 -25938332 -23091824 -20397157 -17880829 -15563379 -13476441 -11683000
8294 -11683000 -10280161 -9370156 -9010118 -9175297 -9765449 -10648580 -11705352 -12843343 -13984105
8285 -13984105 -15050243 -15973068 -16716623 -17296839 -17777460 -18241327 -18751880 -19324451 -19919998
8276a9919998n44380m24520k89755k24632k99995n24405q28232j098947j245208
8267b5400072j241652j122122r33638o95803m00697m6607L32834O74679R21971
8258b7911107J056283J101829J102612J093756J087464J078360J057682J023271
8250a9309850R82435R54035R70812J072021J279735J572286J879457K108412K183140
8241f307517K072451J795732J409968R84821N73673J93748j71694n48992r43562
8232i41372j322631j620460j762525j696909j418045r70168m28170J31409O49348
8223i379523J082698J393848J548561J528990J347996J048686O90083L32750L1089
8214c74822j74593k70965k80254k51632k36835k65800l36626m23033m94202n37386
$$ plain form
8276 -19919998 -20464378 -20888898 -21178653 -21403285 -21703280 -22227685 -23055917 -24154864 -25400072
8267 -25400072 -26641724 -27763846 -28697484 -29393287 -29793984 -29840591 -29507757 -28833078 -27911107
8258 -27911107 -26854824 -25752995 -24650383 -23556627 -22469163 -21390803 -20333121 -19309850
8250 -19309850 -18327415 -17373380 -16402568 -15330547 -14050812 -12478526 -10599069 -8490657 -6307517
8241 -6307517 -4235066 -2439334 -1029366 -44545 529128 722876 551182 2190 -941372
8232 -941372 -2264003 -3884463 -5646988 -7343897 -8761942 -9732110 -10160280 -10028871 -9379523
8223 -9379523 -8296825 -6902977 -5354416 -3825426 -2477430 -1428744 -738661 -405911 -374822
8214 -374822 -549415 -820380 -1100634 -1352266 -1589101 -1854901 -2191527 -2614560 -3108762 -3646148
8204c646148n70245o32269p58625r54656j189373j409759j562839j611909j543101
8195a3878924j364573j099416p72678l97895K6870N08786J042841J599201K120344
8186a2215444K526243K729021K661574K313026J747108J083536M51175n4796l87443
8177H54000n37971n20649l65935j21079J49940L75014M93405M78261L46767J48657
8167A300410n9178k33914l52363m04361l85764l00075j67875l2977M8034L4270
8157e53793p0796k14525l22010l37267k50892r8140O6974K01100K84264L10377
8147i84708K68892J38549r7595m28197q03434j150529j405397j538081j555953
8138g556453j485892j349667j147381q56923m50290Q0110P01150J342611J927070
$$ plain form
8204 -3646148 -4216393 -4848662 -5607287 -6561943 -7751316 -9161075 -10723914 -12335823 -13878924
8195 -13878924 -15243497 -16342913 -17115591 -17513486 -17486616 -16977830 -15934989 -14335788 -12215444
8186 -12215444 -9689201 -6960180 -4298606 -1985580 -238472 845064 1296239 1241443 854000
8177 854000 316029 -204620 -570555 -691634 -541694 -166680 326725 804986 1151753 1300410
8167 1300410 1241232 1007318 654955 250594 -135170 -435245 -603120 -636097 -588063 -553793
8157 -553793 -624589 -839114 -1161124 -1498391 -1749283 -1847423 -1780449 -1579349 -1295085 -984708
8147 -984708 -715816 -577267 -674862 -1103059 -1906493 -3057022 -4462419 -6000500 -7556453
8138 -7556453 -9042345 -10392012 -11539393 -12396316 -12846606 -12766496 -12065346 -10722735 -8795665
8129h795665K404715K765775L024771L196758L287857L302546L253766L163871
8121A5604394L055670K940402K810749K643484K409333K081655J639104J068145
8113C4252936L74582l98560j164389j812650k251853k445339k414370k208169
8105B1932188j869586j425731r04088l48945J80923O27189R43500J101579J100176
8096B1337205R74497P90466O16887M91274M04035L11205J65357n5419l35981o33126
8086B4066400q95906j084264j179662j188693j140128j072631j014549r65852
8078A5524715q94370p50819m97204j35186K82817O70470R43978J053787R93131
8069A7191319P86670M74491R9500l01877p02615j076012j380406j556148j545945
$$ plain form
8129 -8795665 -6390950 -3625175 -600404 2596354 5884211 9186757 12440523 15604394
8121 15604394 18660064 21600466 24411215 27054699 29464032 31545687 33184791 34252936
8113 34252936 34627518 34228958 33064569 31251919 29000066 26554727 24140357 21932188
8105 21932188 20062602 18636871 17732783 17383838 17564761 18191950 19135450 20237029 21337205
8096 21337205 22311702 23102168 23719055 24210329 24614364 24925569 25090926 25035507 24699526 24066400
8086 24066400 23170494 22086230 20906568 19717875 18577747 17505116 16490567 15524715
8078 15524715 14630345 13879526 13382322 13247136 13529953 14200423 15144401 16198188 17191319
8069 17191319 17977989 18452480 18551980 18250103 17547488 16471476 15091070 13534922 11988977
8060A1988977j327252r32497m43224L6588M12189O20992O40788M84896J91322
8051A1672779j86364n84068r32797j170912j261789j206086j037727q04113n44246
8042C944677k78921j5753K39140M72131O59455P70042P71640O38530L60097n0689
8032G510349n51747j073564j529843j834760j923266j770772j405357r02996l63888
8023c845844J18073M75823O74171P06859N92985L72216R6367j79778m03884n28339
8013a921351n14434l41494j8149M11855Q77009J298992J617435J804862J865922
8004E080647J825845J716004J561402J373051J147743Q74178N39974J35527l43658
7995A3910713q92940j493174k106733k676800l131234l392850l395709l102932
$$ plain form
8060 11988977 10661725 9729228 9286004 9322592 9734781 10355773 10996561 11481457 11672779
8051 11672779 11486415 10902347 9969550 8798638 7536849 6330763 5293036 4488923 3944677
8042 3944677 3665756 3650003 3889143 4361274 5020729 5790771 6562411 7200941 7561038 7510349
8032 7510349 6958602 5885038 4355195 2520435 597169 -1173603 -2578960 -3481956 -3845844
8023 -3845844 -3727771 -3251948 -2577777 -1870918 -1277933 -905717 -809350 -989128 -1393012 -1921351
8013 -1921351 -2435785 -2777279 -2795428 -2383573 -1506564 -207572 1409863 3214725 5080647
8004 5080647 6906492 8622496 10183898 11556949 12704692 13578870 14118844 14254371 13910713
7995 13910713 13017773 11524599 9417866 6741066 3609832 216982 -3178727 -6281659
7987f281659k520393j702502p46615K26442J101938J799194K286445K580218K734198
7978e22734K821549K912057L047562L223671L387350L456367L357484L066557
7970B4749863K626041K125204J654204J262660R48380O76822M10444J27027j75975
7961C4404670m79691p39383q89653q74160o89894m10360j60035n1673j28919l49966
7951B9630936o16288q24091r09725q69263p48643o15639n29761n20395n76734
7942B3420397o51486o78277n96536l74021k0788M08348Q27270J149206J321536
7933B4805649J341785J243597J066064Q30850N40261J91590k04457o11700r68422
7924B8235217j200722j246539j083711p50296l41767K2720K51421L17103K55797
$$ plain form
7987 -6281659 -8802052 -10504554 -11251169 -11024727 -9922789 -8123595 -5837150 -3256932 -522734
7978 -522734 2298815 5210872 8258434 11482105 14869455 18325822 21683306 24749863
7970 24749863 27375904 29501108 31155312 32417972 33366352 34043174 34453618 34580645 34404670
7961 34404670 33924979 33185596 32295943 31421783 30731889 30321529 30161494 30109821 29980902 29630936
7951 29630936 29014648 28190557 27280832 26411569 25662926 25047287 24517526 23997131 23420397
7942 23420397 22768911 22090634 21494098 21120077 21099289 21507637 22334907 23484113 24805649
7933 24805649 26147434 27391031 28457095 29287945 29828206 30019796 29815339 29203639 28235217
7924 28235217 27034495 25787956 24704245 23953949 23612182 23634902 23886323 24203426 24459223
7915B4459223J31253q413j55953l42179o10114r80397j425731j868479k203894
7906A6995316k339597k234468j918429j480652j030703o55838l98995k61916k17888
7897F456830k20550k11773j38117K6309K65805N30032P58327R05311R53127R07306
7887A0232607P83937N97543L54027M9750l21554p53286j208252j611917j867067
7878F255788j888173j640905j166511n74998n732M25446O62182P07031N91974
7869C366102L47385q168m56280r60558j457825j865323k101111k107841j867249
7860g110868j397418p37531O5103R55150J861876K700858L393285L891716M191045
7851G813216M315321M292892M141125L869549L492079L034109K529842K014890
$$ plain form
7915 24459223 24590476 24582063 24426110 24083931 23473817 22493420 21067689 19199210 16995316
7906 16995316 14655719 12421251 10502822 9022170 7991467 7335629 6936634 6674718 6456830
7897 6456830 6236280 6024507 5886390 5912699 6178504 6708536 7466863 8372174 9325301 10232607
7887 10232607 11016544 11614087 11968114 12017864 11696310 10943024 9734772 8122855 6255788
7878 6255788 4367615 2726710 1560199 985201 979469 1404915 2067097 2774128 3366102
7869 3366102 3713487 3705319 3249039 2288481 830656 -1034667 -3135778 -5243619 -7110868
7860 -7110868 -8508286 -9245817 -9180714 -8225564 -6363688 -3662830 -269545 3622171 7813216
7851 7813216 12128537 16421429 20562554 24432103 27924182 30958291 33488133 35503023
7843C5503023J519725J066028O66465L27190M8770j77518l72083n56924p33921
7834C7290755q71924r22716q59336p05511n30695m15393m13952n39197p73090
7825C1258941j088878j463542j869056k252706k532226k622283k478347k123246
7817A4828657j633888j100236n90412j44800K08571M43150N42488N17460M09600
7808A3480590K72445J45462M1065m8592j33358k07296k40557j86940o116L11911
7798A3428614P36252J203011J632498J947172K090005K041702J825614J492117
7790B6396985J092270O60831K15324k39890p11661j209611j724323k208300k586318
7781A9685307k797317k835515k755308k637655k547300k508692k503666k478932
$$ plain form
7843 35503023 37022748 38088776 38755241 39082431 39131201 38953683 38581600 38024676 37290755
7834 37290755 36418831 35496115 34636779 33931268 33400573 32985180 32571228 32032031 31258941
7825 31258941 30170063 28706521 26837465 24584759 22052533 19430250 16951903 14828657
7817 14828657 13194769 12094533 11504121 11359321 11567892 12011042 12553530 13070990 13480590
7808 13480590 13753035 13898497 13939562 13890970 13757612 13550316 13309759 13122819 13116703 13428614
7798 13428614 14164866 15367877 17000375 18947547 21037552 23079254 24904868 26396985
7790 26396985 27489255 28150086 28365410 28125520 27413859 26204248 24479925 22271625 19685307
7781 19685307 16887990 14052475 11297167 8659512 6112212 3603520 1099854 -1379078
7773a379078k358996k071845j587403r47739k62246L34710P33720Q74025P36617
7764e928235L30429l09266j115787j994277k834670l524514l959795m062451l805833
7755b7204399l232771k448658j588844p76760r2341M39101Q39004J157669J454592
7746c1453407J779345K154358K566594K976071L336551L610995L771375L791668
7738g466450L648805L332488K853354K244837J562318Q78701K68852k16246n69103
7729F537556q22975j028577j226082j425690j600608j692695j630749j357745
7721d247565q57238j67460O24419J407120K077985K565531K830362K852475K626830
7712I712459K178622J581705R50101L94488k6735l20437n25350o64068p21701
$$ plain form
7773 -1379078 -3738074 -5809919 -7397322 -8345061 -8607307 -8272597 -7538877 -6664852 -5928235
7764 -5928235 -5597806 -5907072 -7022859 -9017136 -11851806 -15376320 -19336115 -23398566 -27204399
7755 -27204399 -30437170 -32885828 -34474672 -35251432 -35343773 -34904672 -34065668 -32907999 -31453407
7746 -31453407 -29674062 -27519704 -24953110 -21977039 -18640488 -15029493 -11258118 -7466450
7738 -7466450 -3817645 -485157 2368197 4613034 6175352 7054053 7322905 7106659 6537556
7729 6537556 5714581 4686004 3459922 2034232 433624 -1259071 -2889820 -4247565
7721 -4247565 -5104803 -5272263 -4647844 -3240724 -1162739 1402792 4233154 7085629 9712459
7712 9712459 11891081 13472786 14422887 14817375 14790640 14470203 13944853 13280785 12559084
7703A2559084o62210m59297j14179L45680Q73845J406799J863952K158556K225803
7694B0198033K056639J713008J307447R54780P25083O24808O10588O20310O03615
7685B9414311N42791M60890M13969M66625O58775R80035J365514J714234J919346
7676C7936490J898024J614268J090751M04101l39731j042487j644744k133693
7668C7782979k523758k823580l012867l047849k893652k558557k101190j605169
7660A7216357j144026p62285m76102k79598j49285n2019M1274J46489K69929M15040
7650A5225774N77206P29967Q23974Q09302O63656M00945N7433l23576o92791r90061
7640A7281829j151499j131428r23526n66116j31221K92786O17347P67935O98077
$$ plain form
7703 12559084 11896874 11437577 11323398 11669078 12542923 13949722 15813674 17972230 20198033
7694 20198033 22254672 23967680 25275127 26229907 26954990 27579798 28190386 28810696 29414311
7685 29414311 29957102 30417992 30831961 31298586 31957361 32937396 34302910 36017144 37936490
7676 37936490 39834514 41448782 42539533 42943634 42603903 41561416 39916672 37782979
7668 37782979 35259221 32435641 29422774 26374925 23481273 20922716 18821526 17216357
7660 17216357 16072331 15310046 14833944 14554346 14405061 14353042 14394316 14540805 14810734 15225774
7650 15225774 15802980 16532947 17356921 18166223 18829879 19230824 19288257 18964681 18271890 17281829
7640 17281829 16130330 14998902 14075376 13509260 13378039 13670825 14288172 15056107 15754184
7631A5754184M01341q5509o95033j355029k013197k643022l227194l734811m115336
7622a713606m318412m325762m169430l918887l642451l368782l075943k715960
7614c1249233k256186j705918j109070n11701O6408O31636J189547J716633K156561
7605c1071323K445332K547500K478991K302461K098025J927107J810573J730706
7597a3730628J647668J513483J276569Q84763K97115m94666j444895k447086l353916
7588a5851593m024110m376127m417217m229676l924883l593061l270947k935240
7580d6622854k521220j959975j218080l18438O68238J651283K546170L285508
7572d4489368L819136M116814M179462M048680L798238L505673L222819K966302
$$ plain form
7631 15754184 16155525 16070016 15374983 14019954 12006757 9363735 6136541 2401730 -1713606
7622 -1713606 -6032018 -10357780 -14527210 -18446097 -22088548 -25457330 -28533273 -31249233
7614 -31249233 -33505419 -35211337 -36320407 -36832108 -36765700 -36134064 -34944517 -33227884 -31071323
7605 -31071323 -28625991 -26078491 -23599500 -21297039 -19199014 -17271907 -15461334 -13730628
7597 -13730628 -12082960 -10569477 -9292908 -8408145 -8111030 -8605696 -10050591 -12497677 -15851593
7588 -15851593 -19875703 -24251830 -28669047 -32898723 -36823606 -40416667 -43687614 -46622854
7580 -46622854 -49144074 -51104049 -52322129 -52640567 -51972329 -50321046 -47774876 -44489368
7572 -44489368 -40670232 -36553418 -32373956 -28325276 -24527038 -21021365 -17798546 -14832244
7564a4832244K728643K492106K232477J918493J519267J020596M38107j83384
7556b665939p83545j303211j694605j924033j974794j856241j612448j315800
7548a5130616j041984q42750p35856p12368p44963p88744p84656o77492m42904
7539b1902333j04593K70806N98269Q06504Q64940P95383O64428N62194N77456
7530a6866946P74652J174299J742239K395786L025397L519352L784011L766039
7522C314829L479347L016887K520855K116384J852791J694919J564185J392145
7514B0952342J152329Q63708N76660L51352K33384K32759L14122M04058M14724
7505B5495438K75708m0069n09187j070727j647913k164833k554346k763224k760414
$$ plain form
7564 -14832244 -12103601 -9611495 -7379018 -5460525 -3941258 -2920662 -2482555 -2665939
7556 -2665939 -3449484 -4752695 -6447300 -8371333 -10346127 -12202368 -13814816 -15130616
7548 -15130616 -16172600 -17015350 -17751206 -18463574 -19208537 -19997281 -20781937 -21459429 -21902333
7539 -21902333 -22006926 -21736120 -21137851 -20331347 -19466407 -18671024 -18006596 -17444402 -16866946
7530 -16866946 -16092294 -14917995 -13175756 -10779970 -7754573 -4235221 -451210 3314829
7522 3314829 6794176 9811063 12331918 14448302 16301093 17996012 19560197 20952342
7514 20952342 22104671 22968379 23545039 23896391 24129775 24362534 24676656 25080714 25495438
7505 25495438 25771146 25731077 25221890 24151163 22503250 20338417 17784071 15020847 12260433
7496A2260433k546783k159156j662188j127801o10704j35119K95991O74544R67136
7487E956353J123122J108164R34068O56721L43549L9573k40646m94143p05430
7478H721331q39347q57119p43736n25822k64306k4537J55090K74281L58778M40223
7468F694836N42828O78376Q43985J021868J184889J306797J370013J366502J295363
7459A6305457J161692R74762P41851M61793J27625k60631o84844j110297j497195
7450A6220213j811285k029017k138997k138612k023649j779662j390741q65270
7442B042980k55038L53034Q64872J202934J316470J187647Q37499L21707k87849
7433G584256r21558j516641k013712k360614k525179k504665k324207k027933
$$ plain form
7496 12260433 9713650 7554494 5892306 4764505 4153801 4018682 4314673 4989217 5956353
7487 5956353 7079475 8187639 9121707 9778428 10121977 10161550 9920904 9426761 8721331
7478 8721331 7881984 7024865 6281129 5755307 5491001 5466464 5621554 5895835 6254613 6694836
7468 6694836 7237664 7916040 8760025 9781893 10966782 12273579 13643592 15010094 16305457
7459 16305457 17467149 18441911 19183762 19645555 19773180 19512549 18827705 17717408 16220213
7450 16220213 14408928 12379911 10240914 8102302 6078653 4298991 2908250 2042980
7442 2042980 1787942 2140976 3005848 4208782 5525252 6712899 7550398 7872105 7584256
7433 7584256 6662698 5146057 3132345 771731 -1753448 -4258113 -6582320 -8610253
7425h610253j667235j287034r14595n60086k29348O5024L08072M98574O59693
7416a1737188Q32160J053612J336334J653844J943134K125928K143863J989880
7408A341567J714012J397178J111312Q94176P51410O73258O45172O45651O42198
7399I815934N97668M85811L02871O4035k12562n19380q56907j216788j566739
7390F893943j852457k017216k027379j891674j667857j453389j359129j471881
7382f847039j820193k358342k976042l531044l893631l985989l800260l390155
7374c2602695k846178k269280j749684j348653j082937r18776p82973n90830k82277
7365d4474283J47014O34718J072125J351259J413783J270592R81053O12327K12322
$$ plain form
7425 -8610253 -10277488 -11564522 -12479117 -13039203 -13268551 -13203527 -12895455 -12396881 -11737188
7416 -11737188 -10905028 -9851416 -8515082 -6861238 -4918104 -2792176 -648313 1341567
7408 1341567 3055579 4452757 5564069 6458245 7209655 7882913 8528085 9173736 9815934
7399 9815934 10413602 10899413 11202284 11266319 11053757 10534377 9677470 8460682 6893943
7390 6893943 5041486 3024270 996891 -894783 -2562640 -4016029 -5375158 -6847039
7382 -6847039 -8667232 -11025574 -14001616 -17532660 -21426291 -25412280 -29212540 -32602695
7374 -32602695 -35448873 -37718153 -39467837 -40816490 -41899427 -42818203 -43601176 -44192006 -44474283
7365 -44474283 -44327269 -43692551 -42620426 -41269167 -39855384 -38584792 -37603739 -36991412 -36779090
$$ [...]
##END NTUPLES=NMR SPECTRUM
##END=
