##TITLE=31Pdec_DE-32_oil_TFA
 CDCl3
 64 sc
 20.2.2024
##JCAMPDX= 6.0         $$ Bruker NMR JCAMP-DX V2.0
##DATA TYPE= NMR SPECTRUM
##DATA CLASS= NTUPLES
##ORIGIN= UXNMR, Bruker Analytische Messtechnik GmbH
##OWNER= root
$$ XWIN-NMR		Version 3.5
$$ Tue Feb 20 14:35:45 2024 Russian Standard Time (UT+4h)  she@DPX200
##.OBSERVE FREQUENCY= 81.013821
##.OBSERVE NUCLEUS= ^31P
##.ACQUISITION MODE= SIMULTANEOUS
##.ACQUISITION SCHEME= undefined
##.AVERAGES= 64
##.DIGITISER RES= 16
##SPECTROMETER/DATA SYSTEM= spect
##.PULSE SEQUENCE= zgpg30
##.SOLVENT NAME= CDCl3
##.SHIFT REFERENCE= (INTERNAL, CDCl3, 0, 248.564)
##AUDIT TRAIL= $$ (NUMBER, WHEN, WHO, WHERE, WHAT)
$$ ##TITLE= Audit trail, XWIN-NMR		Version 3.5
$$ ##JCAMPDX= 5.01
$$ ##ORIGIN= Bruker BioSpin GmbH
$$ ##OWNER= she
$$ F:/spectra/data/she/nmr/P31/1/pdata/1/auditp.txt
$$ ##AUDIT TRAIL=  $$ (NUMBER, WHEN, WHO, WHERE, WHAT)
(   1,<2024-02-20 14:34:30.18 +0400>,<she>,<DPX200>,
      <created by zg, POWCHK disabled, PULCHK disabled
       configuration hash MD5:
       00 E9 B6 7A A2 85 ED C7 34 08 36 98 17 FE 4E 26
       data hash MD5: 32K
       86 DE 7C 0B 39 73 F9 91 79 0B AD D0 3D 35 88 C5>)
(   2,<2024-02-20 14:34:34.10 +0400>,<she>,<DPX200>,
      <Start of raw data processing
       efp BC_mod = 2 LB = 10 FT_mod = 6 PKNL = 1 PHC0 = -12778.91 PHC1 = -127.7166 SI = 64K 
       data hash MD5: 64K
       A3 F1 9C 55 7D B1 F0 77 DB 97 CE B7 3D 86 9C 69>)
(   3,<2024-02-20 14:34:58.96 +0400>,<she>,<DPX200>,
      <pk PHC0 = -10.21867 PHC1 = -20.8 
       data hash MD5: 64K
       FD D1 CC CD F5 8A 1F AF 65 14 41 38 AD F6 C9 BE>)
(   4,<2024-02-20 14:35:03.15 +0400>,<she>,<DPX200>,
      <abs ABSG = 5 
       data hash MD5: 64K
       9F 08 50 0C BB BC 70 FC 65 30 B6 93 BC D5 78 5A>)
$$ ##END=
$$ 
$$ hash MD5
$$ 39 DD 3C C6 7F E8 54 D7 48 72 4E D5 12 D3 12 62
##$RELAX= 
##$RELAX= 
##$RELAX= 
##$RELAX= 
##$RELAX= 
##$RELAX= 
##$RELAX= 
##$RELAX= 
##$RELAX= 
$$ Bruker specific parameters
$$ --------------------------
##$DU= <F:/spectra>
##$EXPNO= 1
##$NAME= <P31>
##$PROCNO= 1
##$TYPE= <nmr>
##$USER= <she>
##$AMP= (0..31)
100 100 100 100 100 100 100 100 100 100 100 100 100 100 100 100 100 100 
100 100 100 100 100 100 100 100 100 100 100 100 100 100 
##$AQSEQ= 0
##$AQ_mod= 1
##$AUNM= <au_zg>
##$AUTOPOS= <>
##$BF1= 81.014009
##$BF2= 200.13
##$BF3= 200.13
##$BF4= 200.13
##$BF5= 200.13
##$BF6= 200.13
##$BF7= 200.13
##$BF8= 200.13
##$BYTORDA= 1
##$CFDGTYP= 0
##$CFRGTYP= 5
##$CHEMSTR= <none>
##$CNST= (0..31)
1 1 145 1 1 1 1 1 1 1 1 1 1 1 1 1 1 1 1 1 1 1 1 1 1 1 1 1 1 1 1 1 
##$CPDPRG= <waltz16>
##$CPDPRG1= <>
##$CPDPRG2= <waltz16>
##$CPDPRG3= <>
##$CPDPRG4= <mlev>
##$CPDPRG5= <mlev>
##$CPDPRG6= <mlev>
##$CPDPRG7= <mlev>
##$CPDPRG8= <mlev>
##$CPDPRGB= <>
##$CPDPRGT= <>
##$D= (0..31)
0 1 0 0 0 0 0 0 0 0 0 0.03 2e-05 3e-06 0 0 0 0 0 0 0 0 0 0 0 0 0 0 0 0 
0 0 
##$DATE= 1708425269
##$DBL= (0..7)
120 120 120 11 120 120 24 19 
##$DBP= (0..7)
150 150 150 150 150 150 150 150 
##$DBP07= 0
##$DBPNAM0= <>
##$DBPNAM1= <>
$$ [...]
##$SUBNAM3= <"">
##$SUBNAM4= <"">
##$SUBNAM5= <"">
##$SUBNAM6= <"">
##$SUBNAM7= <"">
##$SUBNAM8= <"">
##$SUBNAM9= <"">
##$SW= 501.771253377433
##$SWIBOX= (0..15)
0 1 3 0 0 0 0 0 0 0 0 0 0 0 0 0 
##$SW_h= 40650.406504065
##$TD= 32768
##$TD0= 1
##$TE= 0
##$TE2= 300
##$TE3= 300
##$TEG= 300
##$TL= (0..7)
0 120 53 12 22 120 120 120 
##$TP= (0..7)
150 150 150 150 150 150 150 150 
##$TP07= 0
##$TPNAME0= <>
##$TPNAME1= <>
##$TPNAME2= <>
##$TPNAME3= <>
##$TPNAME4= <>
##$TPNAME5= <>
##$TPNAME6= <>
##$TPNAME7= <>
##$TPOAL= (0..7)
0.5 0.5 0.5 0.5 0.5 0.5 0.5 0.5 
##$TPOFFS= (0..7)
0 0 0 0 0 0 0 0 
##$TUNHIN= 0
##$TUNHOUT= 0
##$TUNXOUT= 0
##$USERA1= <user>
##$USERA2= <user>
##$USERA3= <user>
##$USERA4= <user>
##$USERA5= <user>
##$V9= 5
##$VALIST= <valist>
##$VCLIST= <CCCCCCCCCCCCCCC>
##$VD= 0
##$VDLIST= <DDDDDDDDDDDDDDD>
##$VPLIST= <PPPPPPPPPPPPPPP>
##$VTLIST= <TTTTTTTTTTTTTTT>
##$WBST= 1024
##$WBSW= 4
##$XGAIN= (0..3)
0 0 0 0 
##$XL= 0
##$YL= 0
##$YMAX_a= 1739
##$YMIN_a= -1749
##$ZGOPTNS= <>
##$ZL1= 120
##$ZL2= 120
##$ZL3= 120
##$ZL4= 120
##$ABSF1= 248.5645
##$ABSF2= -253.2056
##$ABSG= 5
##$ABSL= 3
##$ALPHA= 0
##$AQORDER= 0
##$ASSFAC= 0
##$ASSFACI= 0
##$ASSFACX= 0
##$ASSWID= 0
##$AUNMP= <proc_1d>
##$AZFE= 0.1
##$AZFW= 0.5
##$BCFW= 0
##$BC_mod= 2
##$BYTORDP= 0
##$COROFFS= 0
##$CY= -3
##$DATMOD= 1
##$DC= 0
##$DFILT= <>
##$DTYPP= 0
##$F1P= 0
##$F2P= 0
##$FCOR= 1
##$FTSIZE= 65536
##$FT_mod= 6
##$GAMMA= 0
##$GB= 0
##$INTBC= 1
##$INTSCL= 6.047779e-11
##$ISEN= 30
##$LB= 10
##$LEV0= 0
##$LPBIN= 0
##$MAXI= 10000
##$MC2= 0
##$MEAN= 0
##$ME_mod= 0
##$MI= 50
##$NCOEF= 0
##$NC_proc= -11
##$NLEV= 6
##$NOISF1= 182.463
##$NOISF2= 159.3651
##$NSP= 0
##$NTH_PI= 0
##$NZP= 0
##$OFFSET= 248.5645
##$PC= 4
##$PHC0= -12789.13
##$PHC1= -148.5166
##$PH_mod= 1
##$PKNL= yes
##$PPARMOD= 0
##$PSCAL= 0
##$PSIGN= 0
##$REVERSE= no
##$SF= 81.0140089999694
##$SI= 65536
##$SIGF1= 159.3651
##$SIGF2= -187.1042
##$SINO= 113.3802
##$SIOLD= 16384
##$SREGLST= <1H.CDCl3>
##$SSB= 0
##$STSI= 65536
##$STSR= 0
##$SW_p= 40650.406504065
##$SYMM= 0
##$S_DEV= 0
##$TDeff= 32768
##$TDoff= 0
##$TI= <>
##$TILT= no
##$TM1= 0
##$TM2= 0
##$TOPLEV= 0
##$USERP1= <user>
##$USERP2= <user>
##$USERP3= <user>
##$USERP4= <user>
##$USERP5= <user>
##$WDW= 1
##$XDIM= 65536
##$YMAX_p= 465566928
##$YMIN_p= -197384338
$$ End of Bruker specific parameters
$$ ---------------------------------
##NTUPLES= NMR SPECTRUM
##VAR_NAME=  FREQUENCY,     SPECTRUM/REAL,   SPECTRUM/IMAG
##SYMBOL=    X,             R,               I
##VAR_TYPE=  INDEPENDENT,   DEPENDENT,       DEPENDENT
##VAR_FORM=  AFFN,          ASDF,            ASDF
##VAR_DIM=   65536,         65536,           65536
##UNITS=     HZ,            ARBITRARY UNITS, ARBITRARY UNITS
##FACTOR=    0.620285442955139, 1,           1
##FIRST=     20137.2065510682, 0,            0
##LAST=      -20513.1999529968, 0,           0
##MIN=       -20513.1999529968, -197384338,  0
##MAX=       20137.2065510682, 465566928,    0
$$ Real data points
##PAGE= N=1
##DATA TABLE= (X++(R..R)), XYDATA
$$ [...]
14182 5269399 4709450 4047818 3350990 2702080 2204603 1968945 2094985 2666002 3754129
14173 3754129 5422982 7715682 10631856 14106929 18003692 22119742 26212487 30040500
14165 30040500 33409532 36202035 38374492 39927519 40871635 41210801 40948696 40106284 38736095
14156 38736095 36926498 34797085 32488357 30148405 27919226 25924540 24258295 22972064
14148 22972064 22064512 21481782 21135596 20934671 20814802 20753016 20760796 20862665 21072829 21381824
14138 21381824 21757891 22158328 22540967 22868545 23105372 23210199 23130175 22800401 22152913
14129 22152913 21135763 19737518 18007585 16061731 14065956 12200825 10619607 9419118
14121 9419118 8634700 8253746 8231019 8494804 8948541 9480108 9982573 10376908 10623994 10722193
14111 10722193 10696737 10588322 10442273 10294726 10154885 9990595 9730222 9289174 8614725
14102 8614725 7728836 6746882 5861559 5296514 5244547 5808901 6964320 8547859 10280064
14093 10280064 11811473 12788675 12931705 12104938 10354755 7893863 5036258 2111799
14085 2111799 -604341 -2927940 -4771711 -6137443 -7104773 -7812539 -8423464 -9075209 -9839185
14076 -9839185 -10712426 -11650300 -12622149 -13657503 -14856644 -16360982 -18302590 -20762824 -23759072
14067 -23759072 -27254944 -31172783 -35391660 -39732596 -43948277 -47735889 -50778931 -52805536
14059 -52805536 -53639174 -53223114 -51618229 -48985794 -45560235 -41604541 -37347067 -32922686
14051 -32922686 -28354981 -23596550 -18605485 -13413077 -8148733 -3018263 1745580 5936965
14043 5936965 9418669 12142715 14146986 15530951 16419791 16929495 17144095 17110804 16850794
14034 16850794 16375844 15698907 14833168 13784280 12544705 11095372 9414795 7494147
14026 7494147 5354372 3056130 693631 -1625206 -3798153 -5737508 -7373298 -8661101
14018 -8661101 -9593404 -10202275 -10546164 -10686931 -10668574 -10504903 -10178808 -9653523 -8892790 -7884020
14008 -7884020 -6660281 -5317493 -4016040 -2951537 -2294249 -2124707 -2404043 -2995619 -3720266
13999 -3720266 -4412327 -4953672 -5279666 -5362029 -5180458 -4699556 -3865023 -2622135 -948107
13990 -948107 1115226 3441762 5823903 7998741 9688256 10640600 10665690 9665740 7659513
13981 7659513 4790707 1308338 -2482540 -6284086 -9856590 -13036268 -15719249 -17831763
13973 -17831763 -19311995 -20115091 -20232885 -19710039 -18642916 -17158438 -15380686 -13400531
13965 -13400531 -11264742 -8991126 -6598684 -4130615 -1654166 760105 3061792 5227739
13957 5227739 7245512 9082853 10665163 11882422 12630175 12865223 12642924 12111233 11460744
13948 11460744 10853671 10364789 9961650 9533563 8955078 8151020 7129144 5966126 4759271
13939 4759271 3572437 2404191 1195131 -125791 -1577249 -3080026 -4459333 -5494757
13931 -5494757 -5988465 -5816887 -4948307 -3429742 -1358966 1139046 3919082 6812305 9634407
13922 9634407 12219766 14467305 16364003 17964764 19340121 20524501 21492699 22171516
13914 22171516 22473997 22334664 21728015 20665998 19182579 17316771 15101794 12564626
13906 12564626 9736350 6667190 3435667 146217 -3080953 -6120997 -8853082 -11164685
13898 -11164685 -12950185 -14110110 -14565915 -14296009 -13372452 -11964153 -10293522 -8570375
13890 -8570375 -6941192 -5474066 -4173975 -3011525 -1949178 -953174 12368 998741 2075193
13881 2075193 3313164 4765094 6457230 8398946 10590204 13009651 15588392 18192200
13873 18192200 20628345 22672801 24103899 24734931 24444842 23202570 21076741 18228509
13865 18228509 14893291 11354468 7905331 4800667 2214234 221563 -1189742 -2097950
13857 -2097950 -2627419 -2930575 -3166217 -3477668 -3979611 -4753734 -5844256 -7249679 -8919255
13848 -8919255 -10762400 -12665694 -14505975 -16159789 -17521376 -18531578 -19196528 -19570063
13840 -19570063 -19701729 -19586740 -19157665 -18324763 -17034843 -15309532 -13243780 -10971442 -8618551
13831 -8618551 -6266242 -3940109 -1631531 661189 2898054 4991209 6827934 8303755
13823 8303755 9346689 9928674 10070197 9840533 9348752 8721513 8070996 7462965 6898011
13814 6898011 6317949 5640175 4805274 3810123 2705213 1559340 417065 -723366 -1900708
13805 -1900708 -3159876 -4520143 -5960042 -7424817 -8849640 -10184907 -11410776 -12534000
13797 -12534000 -13566715 -14492686 -15232436 -15625093 -15445360 -14461058 -12511840 -9570966 -5758499
13788 -5758499 -1304378 3511004 8405592 13119123 17419642 21111138 24052507 26181326
13780 26181326 27526981 28204568 28395391 28322471 28218035 28275110 28592686 29146099 29809593
13771 29809593 30423125 30863010 31076242 31067619 30860117 30461278 29858135 29039533 28024339
13762 28024339 26872767 25675066 24529232 23521255 22712253 22131023 21771998 21599654 21557138
13753 21557138 21574723 21576409 21486313 21236052 20771116 20053543 19061747 17793498 16278180 14594986
13743 14594986 12881035 11313239 10066675 9273187 9002779 9267920 10035199 11236781 12788323
13734 12788323 14615010 16669673 18926141 21354726 23906517 26523527 29164974 31826948
13726 31826948 34541897 37358566 40309071 43372565 46450569 49370593 51924306 53928212
13718 53928212 55280201 55982636 56115874 55773456 54997388 53756006 51978649 49621286 46718241
13709 46718241 43390530 39813553 36168939 32604693 29213147 26025318 23020661 20154399
13701 20154399 17397446 14769313 12340583 10198928 8398555 6924500 5691724 4575662
13693 4575662 3453827 2238741 897051 -539385 -1971066 -3250092 -4227749 -4810637
13685 -4810637 -4991551 -4841859 -4483436 -4062729 -3729511 -3612448 -3794357 -4298322 -5087079
13676 -5087079 -6069299 -7111804 -8062936 -8783833 -9173335 -9177030 -8784962 -8026747 -6965592
13667 -6965592 -5687956 -4288058 -2849844 -1431630 -61764 1248063 2477013 3573492
13659 3573492 4451184 5001692 5114306 4696599 3693861 2104325 -14448 -2550063 -5349127
13650 -5349127 -8236399 -11033085 -13569487 -15695519 -17299999 -18342759 -18884795 -19091367
13642 -19091367 -19195048 -19430863 -19972954 -20900990 -22207860 -23838385 -25733851 -27857593 -30191590
13633 -30191590 -32711519 -35357131 -38013214 -40508307 -42630387 -44155438 -44884873 -44685059
13625 -44685059 -43516186 -41437731 -38589940 -35164989 -31381718 -27465277 -23624833 -20027875
13617 -20027875 -16778805 -13910741 -11393536 -9154634 -7104235 -5153980 -3222551 -1231937
13609 -1231937 894928 3227114 5808698 8637429 11649517 14724583 17719028 20517642
13601 20517642 23075610 25424705 27639088 29779775 31846507 33760308 35385431 36581941
13593 36581941 37266357 37454710 37271153 36919175 36625147 36573691 36859476 37474498 38332369
13584 38332369 39312449 40301765 41222736 42045594 42784924 43476838 44140432 44742100 45185433
13575 45185433 45332499 45039350 44183386 42676811 40478180 37612407 34191266 30413663
13567 30413663 26534546 22815445 19483199 16711284 14614613 13241265 12559994 12457690
13559 12457690 12755966 13239772 13686609 13894399 13710560 13055283 11924023 10362884 8429872
13550 8429872 6165402 3588506 717488 -2401208 -5674153 -8959106 -12074692 -14815511
13542 -14815511 -16975632 -18385109 -18951021 -18680976 -17671515 -16064680 -13994796 -11551062
13534 -11551062 -8771777 -5670048 -2275283 1333771 5023614 8629956 11994869 14995531
13526 14995531 17553128 19625811 21197771 22274962 22892552 23132888 23142525 23126463 23302831
13517 23302831 23828855 24738321 25930261 27215479 28392395 29313840 29919729 30229827 30307487
13508 30307487 30216507 29992200 29633266 29107148 28362200 27348046 26044540 24488283 22779523
13499 22779523 21060417 19471970 18110190 17005183 16136072 15472766 15017345 14819438 14960251
13490 14960251 15520743 16555138 18081720 20088144 22538580 25371012 28484171 31725114
13482 31725114 34890683 37749049 40077990 41707986 42552418 42610567 41944662 40648452 38825158
13473 38825158 36577853 34003777 31186995 28193763 25078364 21900544 18744459 15722194
13465 15722194 12951416 10516939 8442670 6693406 5200837 3892944 2715658 1651061
13457 1651061 734162 56695 -254115 -76366 667001 1988077 3837294 6122537 8731553
13448 8731553 11544747 14431026 17232354 19755514 21790025 23154985 23755540 23618907
13440 23618907 22889907 21789633 20559438 19412319 18499804 17892820 17579245 17487172 17532650
13431 17532650 17667257 17892050 18230028 18688705 19254162 19923516 20739988 21789977 23157675
13422 23157675 24869615 26865163 29004088 31097413 32941411 34344691 35150901 35262544
13414 35262544 34662711 33423331 31693330 29674401 27597449 25701645 24205586 23264395
13406 23264395 22924210 23097227 23575436 24084933 24365126 24244447 23683098 22768085 21669247
13397 21669247 20580015 19663718 19013987 18631526 18421688 18217325 17821913 17056464 15793792
13388 15793792 13976335 11625024 8843752 5812053 2754202 -115656 -2654282 -4828151
13380 -4828151 -6710034 -8434852 -10139044 -11913980 -13787369 -15723715 -17630444 -19372790
13372 -19372790 -20811617 -21863357 -22553960 -23031081 -23520977 -24248762 -25359318 -26874191 -28701773
13363 -28701773 -30691940 -32705450 -34665889 -36576253 -38497357 -40493547 -42562512 -44584643
13355 -44584643 -46332398 -47548909 -48052570 -47799616 -46867902 -45384368 -43451782 -41115361
13347 -41115361 -38373576 -35214656 -31658201 -27785798 -23748961 -19751956 -16019504 -12763676
13339 -12763676 -10156855 -8310690 -7264093 -6987515 -7403248 -8407713 -9880600 -11682140
13331 -11682140 -13655026 -15642267 -17512030 -19169186 -20544899 -21577583 -22206456 -22384368
13323 -22384368 -22096691 -21369938 -20267562 -18881296 -17322204 -15707834 -14145033 -12717566
13315 -12717566 -11486399 -10497757 -9786768 -9372900 -9254947 -9413349 -9818785 -10441661 -11259207
13306 -11259207 -12257208 -13419999 -14705365 -16015274 -17185713 -18012415 -18304479 -17936684 -16873722
13297 -16873722 -15161902 -12903774 -10233026 -7296795 -4244722 -1222485 1634300 4212592
13289 4212592 6443604 8325035 9927844 11377942 12817599 14361206 16061262 17896212
13281 17896212 19783775 21612000 23271928 24678549 25779148 26557053 27035590 27277032
13273 27277032 27367910 27391817 27405683 27438519 27514168 27674533 27974423 28444433 29050588 29684550
13263 29684550 30191040 30410387 30211048 29504002 28244981 26432031 24102356 21329806 18221408
13254 18221408 14908723 11532118 8220738 5071717 2131175 -615294 -3228145 -5769169
13246 -5769169 -8245322 -10576233 -12605694 -14144352 -15014766 -15083087 -14281617 -12628413 -10238161
13237 -10238161 -7313836 -4117896 -932149 1984977 4440428 6342345 7715016 8677280
13229 8677280 9387721 9986304 10567861 11196072 11931348 12838067 13962666 15304030 16801839
13220 16801839 18350506 19829944 21141313 22237787 23140401 23931351 24725823 25631959 26710942
13211 26710942 27948220 29246130 30443194 31353094 31805836 31678189 30915829 29556269 27749401
13202 27749401 25755799 23903857 22508570 21779377 21753802 22284525 23086550 23826678 24219024
13193 24219024 24090494 23402074 22239030 20790970 19326254 18147540 17520984 17596738 18354923
13184 18354923 19601093 21009247 22192687 22782046 22495702 21190545 18882207 15729320
13176 15729320 11985677 7932792 3811807 -222629 -4108576 -7842963 -11430120 -14843147
13168 -14843147 -18013302 -20839490 -23201953 -24974829 -26043301 -26327782 -25806757 -24527190
13160 -24527190 -22599911 -20186497 -17484761 -14714041 -12096127 -9827888 -8047732 -6806740
13152 -6806740 -6058962 -5678851 -5500311 -5362400 -5147663 -4805979 -4361046 -3897040 -3526584
13143 -3526584 -3351305 -3434872 -3802456 -4460436 -5414600 -6671399 -8227063 -10058193 -12115195
13134 -12115195 -14308468 -16488372 -18440964 -19919624 -20703169 -20646876 -19701573 -17903850 -15355421
13125 -15355421 -12203472 -8624306 -4810815 -962991 2725477 6092510 9040999 11562183
13117 11562183 13731029 15670951 17502007 19293649 21040508 22670523 24080625 25180246
13109 25180246 25918289 26282387 26281556 25934129 25271220 24345757 23231692 22011632 20763867
13100 20763867 19555623 18437421 17433441 16534625 15706064 14909127 14125079 13366430 12672770
13091 12672770 12097760 11697304 11526192 11642219 12107579 12977952 14282625 16009896 18106520
13082 18106520 20485124 23029600 25599193 28040467 30210492 32003254 33368751 34320880
13074 34320880 34936338 35347020 35725212 36257753 37105876 38354596 39967136 41766425 43459527
13065 43459527 44704210 45198449 44761050 43371435 41153717 38318473 35095515 31686453
13057 31686453 28243605 24863994 21586849 18393412 15215193 11956461 8530929 4904758
13049 4904758 1131347 -2636988 -6167629 -9191524 -11457359 -12777963 -13055656 -12283873
13041 -12283873 -10532801 -7930154 -4644384 -872713 3165113 7227467 11051004 14361031
13033 14361031 16901034 18478426 19009692 18544011 17254628 15403679 13294991 11225272
13025 11225272 9436877 8078777 7194376 6754730 6729993 7157425 8156490 9874322 12392217
13016 12392217 15645853 19397059 23264705 26800987 29590222 31342151 31952144 31513024
13008 31513024 30282521 28621810 26919579 25513845 24628123 24340998 24598070 25258094 26154964
12999 26154964 27157005 28207208 29329864 30597967 32073730 33750766 35527170 37221540
12991 37221540 38620156 39528932 39808097 39385696 38259921 36497527 34224072 31599507
12983 31599507 28783715 25906717 23056320 20286399 17640536 15178508 12987272 11161756
12975 11161756 9758686 8747068 7984118 7231948 6209699 4659160 2395862 -672732
12967 -672732 -4556186 -9191492 -14435248 -20047313 -25696579 -31007879 -35636234 -39334426
12959 -39334426 -41987962 -43614000 -44335848 -44347086 -43875928 -43155617 -42399847 -41777603 -41386775
12950 -41386775 -41237821 -41261871 -41343359 -41358664 -41200420 -40783006 -40039403 -38920001 -37397828
12941 -37397828 -35481002 -33228454 -30756139 -28220372 -25782542 -23578945 -21714472 -20271212
12933 -20271212 -19305619 -18821625 -18735543 -18862134 -18941496 -18705417 -17960126 -16647820 -14854587
12924 -14854587 -12763421 -10587201 -8524457 -6752498 -5438171 -4738708 -4783007 -5642772 -7307895
12915 -7307895 -9676339 -12563635 -15729790 -18912751 -21855841 -24326396 -26133888 -27153855
12907 -27153855 -27350718 -26784128 -25589860 -23940755 -22003591 -19908833 -17744132 -15570932
12899 -15570932 -13451276 -11466582 -9716862 -8301740 -7293376 -6712583 -6516748 -6604787 -6839779
12890 -6839779 -7084652 -7241824 -7283932 -7260329 -7268902 -7399507 -7675645 -8026641 -8305732 -8342784
12880 -8342784 -8003631 -7229144 -6040583 -4514378 -2742716 -800795 1265028 3426690
12872 3426690 5650440 7872689 9988952 11865681 13374588 14432563 15019135 15153472
12864 15153472 14844211 14053501 12711298 10775336 8291711 5409461 2340476 -704363
12856 -704363 -3564105 -6143266 -8397325 -10300185 -11807292 -12830172 -13235858 -12872667 -11609813
12847 -11609813 -9374847 -6180309 -2138041 2541307 7568722 12617548 17374050 21581656
12839 21581656 25067452 27748842 29623831 30749769 31216999 31125320 30568850 29629512 28377183
12830 28377183 26876466 25199350 23435999 21690230 20053101 18565839 17196476 15849036
12822 15849036 14403534 12766368 10907981 8875542 6780674 4767518 2968187 1456148
12814 1456148 212419 -881086 -2013862 -3388794 -5150876 -7330643 -9830040 -12459935
12806 -12459935 -15010281 -17318032 -19306416 -20991002 -22461943 -23851639 -25292877 -26874716
12798 -26874716 -28609183 -30423038 -32181732 -33739629 -34996605 -35932913 -36600595 -37074054
12790 -37074054 -37391572 -37529084 -37423822 -37026387 -36340898 -35430193 -34394160 -33342031 -32368624
12781 -32368624 -31532910 -30840217 -30237011 -29624431 -28885820 -27916763 -26647454 -25051235 -23137882
12772 -23137882 -20937496 -18487025 -15829298 -13024537 -10165083 -7381927 -4835077 -2686399
12764 -2686399 -1062750 -26095 432334 369830 -142274 -1040118 -2262823 -3733861 -5352526
12755 -5352526 -7005460 -8584148 -9990876 -11136726 -11950269 -12401489 -12519964 -12384712 -12089026
12746 -12089026 -11705603 -11272343 -10798297 -10276373 -9691646 -9023248 -8245352 -7334095 -6280188
12737 -6280188 -5097146 -3815018 -2462886 -1056424 395907 1870356 3304741 4591530
12729 4591530 5594439 6181591 6257078 5774450 4732119 3166563 1156449 -1168252 -3629372
12720 -3629372 -6021880 -8139934 -9791848 -10806516 -11049304 -10455467 -9062422 -7010281
12712 -7010281 -4501701 -1747901 1060757 3748113 6134805 8043415 9332155 9932064
12704 9932064 9858371 9188893 8025892 6464043 4577602 2425917 66845 -2435461 -5016528
12695 -5016528 -7627470 -10246394 -12872506 -15504457 -18118130 -20657994 -23042601 -25175074
12687 -25175074 -26953804 -28288943 -29130470 -29500449 -29508443 -29331504 -29160300 -29136392 -29313367
12678 -29313367 -29659675 -30095183 -30535732 -30921085 -31216838 -31398768 -31438828 -31309508 -31008045
12669 -31008045 -30584169 -30149569 -29858532 -29865975 -30278742 -31117729 -32306504 -33695075 -35112028
12660 -35112028 -36422767 -37568550 -38571929 -39508440 -40455879 -41442426 -42418838 -43268562 -43846407
12651 -43846407 -44021656 -43707988 -42878731 -41572653 -39890590 -37979432 -36003613 -34110815
12643 -34110815 -32402889 -30923008 -29663213 -28584475 -27635088 -26761187 -25916113 -25075824 -24254308
12634 -24254308 -23503973 -22893224 -22468694 -22219348 -22060328 -21848785 -21430786 -20700608 -19642899
12625 -19642899 -18335098 -16907740 -15480604 -14103903 -12732878 -11249420 -9519666 -7457704
12617 -7457704 -5067145 -2451115 201848 2645739 4614357 5865993 6229336 5638747
12609 5638747 4147172 1913814 -824404 -3783315 -6656518 -9138693 -10953975 -11889658
12601 -11889658 -11828802 -10774982 -8863834 -6354512 -3593787 -953125 1246647 2797943
12593 2797943 3633896 3814046 3480129 2802617 1934941 984474 6342 -976029 -1929790
12584 -1929790 -2772240 -3357468 -3502914 -3045856 -1903045 -103478 2224824 4910666 7809878
12575 7809878 10851949 14039701 17406060 20951399 24588495 28117070 31241809 33633387
12567 33633387 35012129 35219939 34250805 32231019 29362192 25851186 21851314 17434661
12559 17434661 12607697 7367699 1778016 -3972671 -9557093 -14552242 -18526263 -21141482
12551 -21141482 -22238535 -21871034 -20279910 -17824598 -14905607 -11907287 -9167864 -6964264
12543 -6964264 -5494153 -4848964 -4990781 -5755836 -6894790 -8133612 -9225331 -9974675 -10238115
12534 -10238115 -9910954 -8913774 -7192676 -4743812 -1652112 1886797 5585781 9120105
12526 9120105 12189547 14569077 16141718 16907139 16958809 16437483 15486789 14232022 12778542
12517 12778542 11209603 9572635 7865553 6045122 4064966 1922301 -322828 -2573629
12509 -2573629 -4746577 -6802267 -8731845 -10511416 -12058528 -13219384 -13796115 -13602989
12501 -13602989 -12524115 -10543130 -7734826 -4236721 -228408 4069493 8388397 12417903
12493 12417903 15838274 18375485 19858611 20254024 19662972 18289593 16396715 14261527
12485 14261527 12135134 10209998 8602695 7357548 6469161 5913661 5672831 5737309 6088407
12476 6088407 6675192 7406986 8166980 8836624 9318542 9553497 9530062 9282776 8875236 8373189
12466 8373189 7822070 7244235 6659999 6118552 5713561 5566938 5787712 6429814 7468310
12457 7468310 8798146 10250169 11618021 12688301 13265563 13190442 12358402 10744460 8425178
12448 8425178 5580559 2466946 -632157 -3462616 -5850065 -7732197 -9160396 -10264441
12440 -10264441 -11190887 -12042391 -12845490 -13555472 -14085700 -14343613 -14265902 -13852477 -13192220
12431 -13192220 -12463685 -11898608 -11715852 -12052067 -12918159 -14196930 -15676861 -17102780 -18224453
12422 -18224453 -18834919 -18798565 -18067781 -16684337 -14765911 -12483853 -10036918 -7621727 -5404020
12413 -5404020 -3500487 -1977034 -858207 -139518 199412 182221 -167332 -810756 -1670802
12404 -1670802 -2619498 -3490969 -4111456 -4330177 -4041195 -3193623 -1789349 129922 2498647
12395 2498647 5236628 8247205 11408868 14571010 17564799 20232307 22463285 24220994
12387 24220994 25544346 26526794 27280105 27892472 28392785 28735793 28817415 28514763 27732299
12378 27732299 26433151 24642571 22425214 19853305 16987201 13876275 10568507 7112699
12370 7112699 3550483 -92478 -3807865 -7596463 -11450186 -15328197 -19141118 -22760274
12362 -22760274 -26052215 -28915901 -31297093 -33175667 -34543996 -35397909 -35747438 -35636318
12354 -35636318 -35148471 -34384885 -33416472 -32243160 -30792190 -28961804 -26684093 -23972904
12346 -23972904 -20941592 -17794809 -14799482 -12233510 -10317733 -9155906 -8714783 -8856663
12338 -8856663 -9404701 -10204525 -11154836 -12203030 -13321627 -14487282 -15674814 -16861464 -18027062
12329 -18027062 -19143824 -20165183 -21026102 -21654414 -21982878 -21958324 -21555317 -20798805 -19785763
12320 -19785763 -18689019 -17734681 -17157229 -17143556 -17780588 -19023129 -20694349 -22518310 -24170182
12311 -24170182 -25326123 -25702469 -25085011 -23354622 -20511288 -16687580 -12136058 -7184289
12303 -7184289 -2173156 2591560 6854989 10405433 13070328 14733440 15365235 15043717
12295 15043717 13950524 12343430 10514755 8744845 7259470 6200589 5614998 5457563
12287 5457563 5605544 5887803 6131996 6216586 6100294 5811797 5411128 4952481 4469261 3980605
12277 3980605 3506267 3077667 2736973 2520009 2428043 2406677 2352962 2154027 1733785 1074193
12267 1074193 196356 -882175 -2182052 -3767701 -5724659 -8123237 -10983900 -14254607
12259 -14254607 -17805044 -21438978 -24924835 -28042982 -30639867 -32666206 -34174789 -35275034
12251 -35275034 -36072163 -36630085 -36977354 -37142966 -37189512 -37216948 -37334263 -37620781 -38104527 -38766973
12241 -38766973 -39560643 -40423469 -41289755 -42105802 -42846176 -43514339 -44120945 -44654033 -45061411
12232 -45061411 -45252253 -45112280 -44526279 -43404659 -41709020 -39469738 -36790965 -33840385
12224 -33840385 -30820660 -27924022 -25283885 -22945482 -20869127 -18960790 -17112545 -15236683
12216 -15236683 -13284251 -11244351 -9126822 -6939811 -4678758 -2336578 70981 2482947
12208 2482947 4790300 6855916 8546257 9758489 10432415 10547677 10115174 9171656 7778645
12199 7778645 6019008 3985523 1765837 -564305 -2933830 -5264928 -7474486 -9493017
12191 -9493017 -11285089 -12849753 -14198145 -15329458 -16229515 -16894310 -17358010 -17703631 -18051601
12182 -18051601 -18535479 -19274539 -20348209 -21777546 -23520866 -25486616 -27557743 -29616043
12174 -29616043 -31556124 -33284953 -34712767 -35749641 -36319176 -36383514 -35957162 -35092355 -33844983
12165 -33844983 -32250343 -30329862 -28122511 -25716209 -23258471 -20939967 -18954046 -17440600
12157 -17440600 -16432061 -15828954 -15425923 -14981445 -14295423 -13254989 -11834287 -10064056 -7996104
12148 -7996104 -5676627 -3130301 -356180 2660608 5922766 9392780 12979580 16547456
12140 16547456 19940679 23009878 25628792 27696835 29128425 29835329 29715006 28660831
12132 28660831 26601020 23553053 19664449 15214011 10568970 6115437 2187933 -981082
12124 -981082 -3279899 -4702753 -5312461 -5203349 -4488126 -3314898 -1893906 -498865 579077
12115 579077 1111835 1005484 317347 -793340 -2152740 -3650438 -5274828 -7101911 -9253811
12106 -9253811 -11845196 -14929712 -18456595 -22250382 -26025731 -29440170 -32173089 -34005355
12098 -34005355 -34868225 -34839941 -34093771 -32828257 -31217179 -29396515 -27475677 -25546304 -23672623
12089 -23672623 -21869418 -20088326 -18230982 -16190904 -13904932 -11384500 -8707505 -5977697
12081 -5977697 -3279536 -654939 1891370 4369510 6780563 9100589 11275971 13230271
12073 13230271 14878618 16142589 16961618 17303988 17180753 16655634 15835079 14830662 13708490
12064 13708490 12456536 10993212 9213955 7048437 4497366 1634545 -1417518 -4517998
12056 -4517998 -7528086 -10319635 -12781540 -14832272 -16436433 -17613741 -18429497 -18965157
12048 -18965157 -19278266 -19366349 -19150309 -18490282 -17235666 -15290095 -12656900 -9441705 -5821562
12039 -5821562 -2010727 1760931 5267914 8319813 10789586 12613551 13759900 14194063
12031 14194063 13871765 12764069 10894174 8361607 5339124 2041257 -1321611 -4580001
12023 -4580001 -7614297 -10335633 -12654398 -14455882 -15597230 -15930219 -15342186 -13798189
12015 -13798189 -11368710 -8235182 -4669488 -984650 2534764 5694589 8413436 10697784
12007 10697784 12592686 14138653 15349637 16210816 16689849 16754796 16391836 15619817 14503131
11998 14503131 13159495 11749270 10437497 9343789 8513235 7928615 7550084 7348626 7312013
11989 7312013 7429741 7677495 8014675 8394858 8782545 9169154 9579777 10061977 10657087
11980 10657087 11370671 12165663 12987641 13806348 14644056 15570569 16667969 17987430 19523461
11971 19523461 21216457 22972634 24680186 26212156 27428089 28192993 28414855 28079674
11963 28079674 27258901 26081245 24683329 23166156 21580077 19941713 18264336 16576298
11955 16576298 14917050 13321887 11814189 10414368 9160560 8126864 7422799 7165625
11947 7165625 7435840 8242094 9516532 11138137 12964360 14855400 16689552 18374095
11939 18374095 19852927 21108602 22156048 23027385 23753298 24352431 24835396 25214937 25507875
11930 25507875 25728843 25891623 26026808 26202933 26531091 27146852 28176629 29697224 31699486
11921 31699486 34074773 36639092 39185845 41536254 43561670 45176763 46321018 46946692
11913 46946692 47022281 46548083 45568855 44167647 42439874 40463431 38279962 35888677 33248308
11904 33248308 30290176 26948998 23206528 19128902 14877470 10685631 6809789 3473331
11896 3473331 823826 -1086785 -2304154 -2965134 -3281906 -3505158 -3862402 -4489242 -5385429
11887 -5385429 -6419437 -7380853 -8057218 -8303942 -8083326 -7463826 -6584901 -5601870 -4628706
11878 -4628706 -3696779 -2744774 -1648016 -280962 1412619 3376937 5451010 7416951
11870 7416951 9060092 10215187 10791359 10779599 10246181 9314567 8141442 6893446 5728597
11861 5728597 4785887 4185307 4030971 4399319 5302201 6642259 8198041 9664367 10738124
11852 10738124 11210531 11022842 10263145 9114423 7788882 6481875 5352972 4518199 4038945
11843 4038945 3910520 4062815 4379077 4729403 5010942 5183159 5283162 5410398 5684500
11834 5684500 6194937 6966763 7959879 9101208 10326647 11600098 12895395 14161885 15311778
11825 15311778 16247257 16908021 17302636 17504112 17620355 17765119 18045620 18563257 19413117
11816 19413117 20672568 22380726 24517660 26992642 29647648 32276887 34655297 36564863
11808 36564863 37814347 38258543 37822412 36521982 34466736 31840577 28875272 25827396
11800 25827396 22950549 20449822 18430149 16877710 15703589 14830174 14259163 14070243
11792 14070243 14355586 15145433 16379611 17935338 19677844 21493497 23291037 24984044
11784 24984044 26475136 27653719 28409839 28661116 28382907 27624497 26497902 25144352 23700737
11775 23700737 22284557 20994870 19912373 19088842 18533165 18208124 18044529 17967490 17921720
11766 17921720 17881296 17836218 17763539 17604185 17264480 16643698 15671353 14334646 12686178
11757 12686178 10833844 8919879 7093398 5476400 4126266 3009478 2009018 975376
11749 975376 -198285 -1517558 -2877546 -4104566 -5022456 -5510532 -5532818 -5136272 -4429672
11740 -4429672 -3559738 -2695575 -2019231 -1708836 -1902787 -2650599 -3874381 -5366952 -6834337
11731 -6834337 -7966647 -8509491 -8312755 -7346975 -5690738 -3500753 -976688 1672553 4257837
11722 4257837 6627455 8665334 10273051 11356142 11835789 11683913 10955404 9791718 8392374
11713 8392374 6970303 5708681 4729293 4077418 3725635 3592943 3568756 3531051 3355263
11704 3355263 2918106 2102181 803701 -1057506 -3526598 -6601544 -10223656 -14278244
11696 -14278244 -18611240 -23058196 -27472273 -31737505 -35763119 -39464806 -42742839 -45466877
11688 -45466877 -47477300 -48610714 -48747318 -47862439 -46056391 -43546373 -40626003 -37613714
11680 -37613714 -34807713 -32449917 -30693689 -29578095 -29022111 -28848871 -28833424 -28754033 -28429272
11671 -28429272 -27736464 -26617691 -25079890 -23187927 -21043848 -18749902 -16366647 -13887506
11663 -13887506 -11245303 -8347070 -5118193 -1537285 2347173 6420155 10521223 14474866
11655 14474866 18116283 21304970 23933603 25945547 27360785 28291425 28927040 29489694
11647 29489694 30178883 31129398 32391988 33933219 35648282 37385786 38984929 40316700
11639 40316700 41311035 41956448 42278606 42319191 42129040 41768793 41302093 40778724 40220210
11630 40220210 39620250 38960859 38235778 37469660 36722391 36073878 35596079 35326761 35255485
11621 35255485 35323929 35440127 35504824 35438422 35189116 34716477 33972524 32909123 31511382
11612 31511382 29824512 27945491 25984796 24026446 22106801 20212994 18294153 16281213
11604 16281213 14111331 11750198 9206444 6536338 3838001 1234311 -1151724 -3217910
11596 -3217910 -4889386 -6111637 -6842603 -7055229 -6748330 -5954104 -4736614 -3189891 -1446992
11587 -1446992 303902 1816477 2812873 3035514 2303691 555288 -2135565 -5565898 -9431064
11578 -9431064 -13361812 -16964112 -19865218 -21772263 -22533843 -22175180 -20880991 -18929813
11570 -18929813 -16613269 -14178370 -11811076 -9651891 -7816567 -6397275 -5441366 -4928695
11562 -4928695 -4772011 -4845865 -5029274 -5242743 -5465245 -5721263 -6037150 -6386324 -6658576 -6678395
11552 -6678395 -6265742 -5308704 -3816947 -1936966 77997 1936157 3388166 4287838 4614130
11543 4614130 4460087 4003741 3466503 3057017 2909153 3040931 3361046 3721436 3979481
11534 3979481 4027184 3778146 3146373 2058524 502060 -1434950 -3580169 -5750381 -7830346
11525 -7830346 -9798385 -11685264 -13508463 -15239522 -16827248 -18249281 -19544305 -20798375
11517 -20798375 -22095712 -23464950 -24847827 -26100186 -27019681 -27388027 -27018368 -25803278
11509 -25803278 -23756751 -21035023 -17919409 -14759229 -11894778 -9590210 -7997173 -7152990
11501 -7152990 -7004418 -7443521 -8343744 -9588767 -11090137 -12790637 -14652146 -16633898 -18675065
11492 -18675065 -20695019 -22613182 -24376661 -25977403 -27444228 -28807680 -30053229 -31090795
11484 -31090795 -31763571 -31896545 -31361597 -30128759 -28283959 -26010586 -23545780 -21129196
11476 -21129196 -18961624 -17183300 -15870596 -15042536 -14668843 -14676496 -14957539 -15383589 -15830894
11467 -15830894 -16212560 -16505480 -16755895 -17055539 -17496079 -18122049 -18903652 -19740966 -20496127
11458 -20496127 -21036595 -21267528 -21139482 -20634969 -19750158 -18487028 -16860995 -14920392 -12768388
11449 -12768388 -10571898 -8540960 -6875939 -5703044 -5030171 -4744285 -4650707 -4538706 -4247668
11440 -4247668 -3703193 -2904439 -1875752 -622545 876495 2644221 4674982 6920517
11432 6920517 9291207 11663398 13889376 15812300 17287490 18207978 18528375 18276680 17543214
11423 17543214 16445492 15083515 13508629 11721263 9692958 7393094 4805408 1939028
11415 1939028 -1150691 -4331443 -7379102 -10007566 -11943127 -13009407 -13180683 -12580470
11407 -12580470 -11429484 -9969085 -8397459 -6848103 -5411586 -4170620 -3213190 -2613561
11399 -2613561 -2401158 -2544185 -2957181 -3521579 -4105328 -4579949 -4843042 -4847147 -4619825 -4255451
11389 -4255451 -3876020 -3581454 -3417759 -3378226 -3431363 -3553704 -3743019 -3998883 -4279658 -4465296
11379 -4465296 -4358687 -3737873 -2438781 -424993 2193917 5202158 8347779 11406665
11371 11406665 14223472 16733063 18965007 21022428 23030080 25066971 27112088 29024028
11363 29024028 30559704 31428082 31368026 30226582 28006533 24865586 21078203 16987536
11355 16987536 12964146 9365608 6484849 4493042 3404375 3088070 3324350 3872281
11347 3872281 4516612 5086442 5461073 5576278 5427662 5061515 4553785 3988716 3446357
11338 3446357 2997529 2698749 2583448 2654206 2885331 3239976 3694094 4252115 4945951 5823238
11328 5823238 6935835 8330023 10030024 12011144 14172498 16325867 18211408 19540298
11320 19540298 20054419 19583920 18080497 15615882 12355223 8524077 4377100 164404
11312 164404 -3903472 -7676499 -11056236 -13961278 -16290692 -17909558 -18664976 -18424467 -17119964
11303 -17119964 -14779912 -11538431 -7621136 -3314932 1071103 5249088 8992081 12156079
11295 12156079 14672959 16519633 17685588 18160594 17945649 17071606 15608943 13665474
11287 13665474 11377274 8892419 6339425 3780406 1171605 -1632161 -4808759 -8457163
11279 -8457163 -12501868 -16672845 -20578830 -23836155 -26186470 -27551628 -28014509 -27750085
11271 -27750085 -26945890 -25747121 -24243748 -22492174 -20546039 -18473008 -16352115 -14260625
11263 -14260625 -12260624 -10391370 -8671584 -7112551 -5734149 -4570021 -3654858 -3001786
11255 -3001786 -2586899 -2353281 -2233042 -2173318 -2149230 -2156508 -2191449 -2232967 -2235167 -2127284 -1814065
11244 -1814065 -1176330 -80461 1593839 3910569 6840173 10255094 13967193 17786233
11236 17786233 21564764 25209753 28666865 31895123 34845556 37451020 39631132 41310444
11228 41310444 42439317 43005307 43032012 42573584 41715389 40582569 39345847 38208448 37366988
11219 37366988 36958946 37024115 37503642 38279371 39231910 40282717 41393345 42524428 43590877
11210 43590877 44456276 44975460 45048309 44636671 43732432 42311270 40319147 37709006 34503707
11201 34503707 30842141 26978983 23237850 19937879 17317625 15479751 14382059 13889303
11193 13889303 13864175 14240205 15027458 16255874 17907940 19886466 22022245 24102404 25909891
11184 25909891 27275838 28133369 28541911 28658738 28670246 28724923 28904202 29234607 29716216
11175 29716216 30340544 31089620 31926172 32789291 33603023 34295654 34819355 35155530 35295078
11166 35295078 35197996 34755010 33780163 32048307 29364353 25631340 20885399 15284885 9065203
11157 9065203 2486555 -4198238 -10745293 -16903750 -22408766 -27000029 -30458266 -32638279
11149 -32638279 -33485812 -33042404 -31445229 -28918146 -25744876 -22225013 -18626530 -15150802
11141 -15150802 -11919401 -8983300 -6346482 -3988012 -1868242 78662 1946239 3834095
11133 3834095 5809116 7874835 9969076 11987896 13818938 15370511 16592288 17486569
11125 17486569 18107389 18547894 18923286 19356380 19963468 20832953 21999312 23430481 25045719
11116 25045719 26757437 28505874 30257593 31969199 33549129 34853167 35722115 36038230
11108 36038230 35766745 34963564 33753438 32296417 30757420 29281000 27965563 26838917
11100 26838917 25852372 24910931 23931829 22894546 21845894 20857436 19967299 19144350 18292570
11091 18292570 17289077 16034553 14492636 12704172 10777230 8862356 7120737 5691232
11083 5691232 4667202 4094711 3990034 4359248 5204680 6518839 8276261 10430974 12921477
11074 12921477 15680505 18640787 21727281 24839936 27847357 30606662 32999574 34959869
11066 34959869 36479756 37603064 38415686 39032423 39575197 40145846 40805221 41568435 42415990
11057 42415990 43310083 44204192 45044047 45767990 46311442 46609668 46594404 46193893 45349184
11048 45349184 44041402 42308218 40236309 37937970 35526541 33095394 30700377 28352463
11040 28352463 26029310 23702711 21367027 19055896 16845699 14850432 13208750 12058142
11032 12058142 11493731 11522435 12036109 12824055 13623992 14188990 14343700 14014220 13229034
11023 13229034 12097909 10782507 9471984 8365903 7655711 7498953 7992410 9154012
11015 9154012 10916036 13128007 15573009 18002459 20183717 21943106 23188501 23908149
11007 23908149 24153388 24016547 23612748 23068005 22509412 22052145 21783851 21752664 21965050
10998 21965050 22395728 23006916 23767711 24659989 25663820 26733013 27782692 28700200 29368195
10989 29368195 29681341 29554335 28936108 27837337 26352544 24647833 22909336 21283025
10981 21283025 19844168 18606041 17545036 16616588 15758382 14893248 13939213 12823039 11492611
10972 11492611 9928588 8154298 6236425 4269930 2351709 556886 -1071454 -2520060
10964 -2520060 -3799603 -4940177 -5983788 -6966172 -7889490 -8701445 -9299744 -9566534 -9415084
10955 -9415084 -8821074 -7822961 -6499224 -4942179 -3239355 -1458683 366642 2244434
10947 2244434 4206488 6269092 8393354 10471709 12349994 13873424 14934429 15502056
10939 15502056 15622324 15393254 14930010 14336045 13686412 13021053 12346260 11645369 10896329
10930 10896329 10085948 9208801 8248139 7150944 5816871 4112951 1907306 -896958
10922 -896958 -4340355 -8395135 -12955048 -17829602 -22754904 -27426672 -31546652 -34868640
10914 -34868640 -37235910 -38605556 -39052118 -38742779 -37887202 -36679914 -35258377 -33690949
10906 -33690949 -31992712 -30155125 -28174114 -26068810 -23890867 -21726107 -19688183 -17905083
10898 -17905083 -16503076 -15592122 -15250366 -15503055 -16300671 -17513266 -18955211 -20434764 -21804153
10889 -21804153 -22986786 -23975352 -24809267 -25542097 -26206980 -26791154 -27235810 -27470377 -27468190
10880 -27468190 -27290457 -27088831 -27063889 -27403473 -28229717 -29570262 -31356959 -33450876 -35685616
10871 -35685616 -37908721 -39999318 -41859387 -43398937 -44536328 -45214673 -45418159 -45173189
10863 -45173189 -44530160 -43532208 -42186908 -40461564 -38310627 -35718365 -32726525 -29431957
10855 -29431957 -25965097 -22467886 -19077993 -15917021 -13083603 -10655036 -8693585 -7244492
10847 -7244492 -6316052 -5847706 -5687337 -5600380 -5316916 -4598870 -3296848 -1374636 1101248
10838 1101248 3995920 7148565 10406079 13634714 16709787 19498508 21853056 23619592
10830 23619592 24658458 24869067 24213301 22729320 20529373 17782233 14685175 11429209
10822 11429209 8163036 4969221 1867967 -1149192 -4071917 -6834040 -9306337 -11326948
10814 -11326948 -12761295 -13565982 -13824739 -13738866 -13580359 -13631280 -14129103 -15225186 -16956364
10805 -16956364 -19231850 -21843038 -24503292 -26913084 -28828725 -30105660 -30700170 -30638253
10797 -30638253 -29978195 -28791799 -27171248 -25247221 -23193460 -21201166 -19427412 -17938956
10789 -17938956 -16677002 -15463280 -14057456 -12255038 -9986159 -7362143 -4641861 -2139502
10781 -2139502 -126525 1230292 1885301 1896126 1384881 490632 -671713 -2031907 -3560110
10772 -3560110 -5245857 -7073970 -9009199 -10993278 -12948206 -14775559 -16350453 -17523108
10764 -17523108 -18142697 -18100022 -17364321 -15988160 -14076868 -11745323 -9092540 -6207616 -3193624
10755 -3193624 -181437 2683367 5270533 7485845 9266991 10563370 11319671 11473041
10747 11473041 10960861 9736167 7792281 5191778 2082271 -1317564 -4758256 -8003125
10739 -8003125 -10854752 -13164202 -14837395 -15845889 -16231430 -16088624 -15526410 -14628840 -13436722
10730 -13436722 -11953925 -10166711 -8064921 -5660954 -3002010 -166591 2758245 5706078
10722 5706078 8643502 11550931 14379441 17010155 19244751 20839622 21572538 21314485
10714 21314485 20078032 18023764 15420930 12575248 9752075 7125888 4770691 2681991
10706 2681991 809704 -912719 -2547500 -4139983 -5711752 -7253385 -8713768 -9993581
10698 -9993581 -10956365 -11459596 -11390184 -10685354 -9335332 -7380931 -4917978 -2105000 841019
10689 841019 3671110 6148230 8093491 9420224 10147519 10389688 10323358 10143076 10024060
10680 10024060 10107096 10504402 11308977 12588180 14357750 16553010 19020983 21542334 23868758
10671 23868758 25754245 26975334 27354377 26795504 25319954 23075166 20307050 17310413
10663 17310413 14381678 11785125 9727426 8333410 7627105 7529663 7877980 8453878 9011869
10654 9011869 9306481 9129697 8361384 7020029 5294104 3536171 2206340 1765555 2548134
10645 2548134 4666593 7989665 12191712 16838884 21478088 25711027 29243336 31902476
10637 31902476 33629297 34458646 34500369 33920696 32920912 31713575 30495775 29418374 28559698
10628 28559698 27922593 27465861 27156124 27008598 27090713 27484252 28226048 29263484 30458449
10619 30458449 31645427 32710711 33641925 34517519 35448713 36516879 37745427 39112865
10611 39112865 40581548 42112298 43659357 45163629 46558550 47780633 48768152 49448241
10603 49448241 49732074 49532677 48795541 47517817 45744116 43550131 41032145 38304587
10595 38304587 35492125 32709188 30039635 27534285 25225622 23141300 21303442 19719347
10587 19719347 18376279 17244303 16283329 15452423 14722670 14092519 13600437 13328397 13390036
10578 13390036 13900358 14932681 16478611 18427707 20573514 22642278 24336910 25388131
10570 25388131 25603158 24901461 23329031 21045789 18286665 15307489 12335737 9542070
10562 9542070 7033482 4859970 3032162 1552474 451204 -197993 -303976 186176 1242585
10553 1242585 2752946 4562958 6521340 8501403 10401848 12146928 13696296 15057423
10545 15057423 16288739 17487605 18763049 20199158 21823409 23596309 25426746 27202077
10537 27202077 28819712 30215798 31390883 32427263 33489074 34800487 36605394 39118441
10529 39118441 42481404 46737670 51828090 57601681 63834740 70258833 76598508 82612030
10521 82612030 88124447 93047026 97381894 101210473 104665571 107894374 111025348 114147393
10513 114147393 117298567 120457186 123536955 126400800 128906891 130977123 132652504 134100495
10505 134100495 135569158 137312192 139515704 142251078 145470138 149039687 152782854 156487845
10497 156487845 159879470 162585110 164116602 163853871 161013923 154623762 143542431 126584610
10489 126584610 102801349 71928379 34859095 -6169008 -47937652 -87086969 -121001063
10482 -121001063 -148287381 -168721975 -182872335 -191686726 -196202109 -197384338 -196068407
10475 -196068407 -192961968 -188669603 -183704473 -178481380 -173300996 -168332162 -163601993 -159013141
10467 -159013141 -154397556 -149586249 -144462014 -138982962 -133189597 -127207517 -121241957 -115554361
10459 -115554361 -110419178 -106069095 -102643716 -100158640 -98505366 -97478861 -96821153 -96271888
10451 -96271888 -95620166 -94746610 -93639426 -92377002 -91088001 -89909217 -88953752 -88289823 -87928278
10442 -87928278 -87823105 -87889632 -88034228 -88178638 -88266995 -88261365 -88142063 -87918761 -87640227 -87387511
10432 -87387511 -87250159 -87298166 -87560162 -88009975 -88563718 -89094586 -89468609 -89589899 -89432821
10423 -89432821 -89043233 -88507642 -87905324 -87265709 -86550010 -85664539 -84498437 -82968017 -81049269
10414 -81049269 -78788624 -76293797 -73714285 -71220965 -68987896 -67172723 -65891675 -65192234
10406 -65192234 -65035216 -65299540 -65813458 -66400981 -66923319 -67299249 -67500922 -67531625 -67395206
10397 -67395206 -67068506 -66491450 -65586439 -64301756 -62652203 -60725779 -58647081 -56519465
10389 -56519465 -54382900 -52212559 -49955464 -47578839 -45098411 -42570327 -40055356 -37580952
10381 -37580952 -35124889 -32628753 -30033189 -27317551 -24525572 -21766624 -19195601 -16983780
10373 -16983780 -15289572 -14228690 -13842757 -14076535 -14781118 -15750564 -16779343 -17715816 -18491749
10364 -18491749 -19122471 -19684800 -20283779 -21016455 -21937555 -23032390 -24204186 -25280404 -26035539
10355 -26035539 -26223569 -25615323 -24038821 -21418097 -17800755 -13363339 -8387851 -3209699
10347 -3209699 1852033 6558292 10779115 14474013 17638621 20253725 22268404 23623239
10339 23623239 24292125 24310486 23769728 22784289 21458726 19879485 18131364 16315868 14549498
10330 14549498 12940438 11559721 10423645 9493120 8685230 7888501 6977475 5831232 4364978
10321 4364978 2572986 560509 -1465485 -3256511 -4608791 -5430861 -5756551 -5696165 -5351815
10312 -5351815 -4746213 -3810843 -2442370 -587834 1698787 4258037 6870036 9310592
10304 9310592 11398139 13026831 14181747 14928080 15373848 15623042 15745401 15777556 15744593
10295 15744593 15674253 15586523 15470643 15278416 14948290 14447095 13806085 13138528 12635459 12534950
10285 12534950 13063069 14362017 16436545 19144159 22231442 25397905 28361515 30904931
10277 30904931 32893611 34270380 35037013 35229775 34892370 34053924 32723246 30902121 28605607
10268 28605607 25873452 22767549 19361948 15732509 11946812 8051856 4061270 -48414
10260 -48414 -4319440 -8769842 -13346044 -17906777 -22258683 -26223565 -29689560 -32613227
10252 -32613227 -34982630 -36780149 -37975308 -38547735 -38517165 -37954568 -36963618 -35645716 -34078815
10243 -34078815 -32331013 -30495549 -28707393 -27115746 -25830253 -24883969 -24237554 -23813166
10235 -23813166 -23532672 -23345469 -23241158 -23242568 -23380037 -23662706 -24067965 -24554665 -25086044 -25645663
10225 -25645663 -26240435 -26891135 -27609743 -28366810 -29063579 -29529364 -29553387 -28939946 -27563923
10216 -27563923 -25407512 -22570690 -19255394 -15726203 -12256370 -9078296 -6359138 -4205988
10208 -4205988 -2683992 -1827101 -1637537 -2084269 -3107812 -4628133 -6550503 -8769091 -11168973
10199 -11168973 -13625754 -16006140 -18178862 -20039828 -21539670 -22694205 -23569499 -24251550
10191 -24251550 -24817827 -25321154 -25786517 -26216713 -26602100 -26929289 -27184181 -27348547 -27395059
10182 -27395059 -27287329 -26986234 -26457156 -25673154 -24616423 -23285045 -21707196 -19954844 -18144159
10173 -18144159 -16414700 -14891131 -13643129 -12663807 -11878896 -11181316 -10470771 -9677129 -8758619
10164 -8758619 -7681651 -6399172 -4844912 -2951295 -684287 1921765 4745787 7586439
10156 7586439 10193049 12314261 13751995 14403591 14275897 13464944 12111763 10359145 8332916
10147 8332916 6150931 3939228 1830405 -60483 -1663505 -2961719 -3972250 -4712884
10139 -4712884 -5175744 -5325484 -5124387 -4568179 -3708809 -2652446 -1540882 -531915 215377
10130 215377 555320 373484 -398275 -1778703 -3747374 -6258451 -9244337 -12605362 -16198726
10121 -16198726 -19846632 -23367774 -26610580 -29460214 -31816136 -33568183 -34601512 -34831082
10113 -34831082 -34237855 -32880802 -30884036 -28416241 -25674777 -22872756 -20223178 -17920501
10105 -17920501 -16125129 -14954249 -14478063 -14717995 -15642797 -17161004 -19114351 -21282252
10097 -21282252 -23404736 -25221424 -26514639 -27140213 -27031072 -26170580 -24554310 -22172570
10089 -22172570 -19030211 -15183405 -10753840 -5902737 -786451 4470408 9769076 15010760
10081 15010760 20072453 24796975 28998760 32482932 35075115 36656130 37189327 36726302
10073 36726302 35387571 33332176 30737091 27794610 24716359 21725098 19025310 16760598
10065 16760598 14977640 13615724 12526387 11510279 10354007 8861606 6886008 4360476
10057 4360476 1317503 -2118204 -5762701 -9418471 -12915854 -16137970 -19026788 -21578763
10049 -21578763 -23840117 -25900730 -27876160 -29875484 -31969703 -34176537 -36459610 -38728417
10041 -38728417 -40837559 -42601899 -43840595 -44437066 -44382266 -43777703 -42802474 -41667602 -40575886
10032 -40575886 -39690018 -39107046 -38844985 -38850531 -39026974 -39270396 -39501975 -39689394 -39852493 -40051102
10022 -40051102 -40361685 -40854804 -41578712 -42545118 -43716133 -45000623 -46266579 -47364521 -48152599
10013 -48152599 -48520925 -48416330 -47862047 -46961360 -45879741 -44810542 -43934767 -43384191 -43212845
10004 -43212845 -43378807 -43740439 -44075828 -44129172 -43669660 -42535944 -40652505 -38029955 -34766810
9995 -34766810 -31050154 -27137037 -23309154 -19814225 -16813884 -14350591 -12341500 -10607018
9987 -10607018 -8934063 -7156302 -5219297 -3200977 -1277771 347437 1522578 2196785
9979 2196785 2427902 2352136 2137001 1941201 1891658 2069503 2493766 3107989 3788961 4386178
9969 4386178 4775529 4898954 4772486 4463367 4050431 3589290 3101001 2585951 2046097 1497549
9959 1497549 969309 493088 88174 -252272 -560336 -869477 -1179047 -1431844 -1521527 -1328420
9949 -1328420 -769278 159472 1366167 2686627 3935473 4961452 5683851 6100185 6268935
9940 6268935 6279727 6223515 6168660 6145618 6148451 6160886 6195342 6314872 6619382 7210197 8161033
9929 8161033 9506400 11239887 13316402 15660874 18184323 20802383 23449855 26084699
9921 26084699 28677066 31190338 33572567 35769288 37748924 39525497 41172788 42828025
9913 42828025 44679930 46944096 49843125 53604631 58471910 64719429 72675454 82749271
9905 82749271 95449050 111387832 131286567 155948841 186136158 222293849 264152344
9898 264152344 310278179 357703400 401902462 437470515 459568742 465566928 455925976
9891 455925976 433762753 403451707 369179529 334129647 300344002 268941474 240413368
9884 240413368 214876044 192238088 172279466 154691321 139130768 125291384 112955549
9877 112955549 102015049 92467613 84387101 77863489 72935282 69550539 67568103 66781951
9869 66781951 66949700 67817122 69135343 70672320 72227385 73652476 74868518 75862988 76669079
9860 76669079 77337175 77906834 78385053 78737793 78895432 78763448 78233075 77197503 75575455
9851 75575455 73328841 70461099 67002428 63000679 58527008 53689272 48640786 43575181
9843 43575181 38704281 34224422 30282211 26947709 24199474 21929896 19978057 18178090
9835 18178090 16393941 14525720 12504660 10300137 7937407 5507620 3162477 1098410
9827 1098410 -470966 -1360373 -1466519 -802867 502425 2237712 4147981 5971651 7473080
9818 7473080 8473248 8877817 8695296 8032732 7061391 5961053 4864827 3824357 2803507
9809 2803507 1699319 383959 -1244056 -3215448 -5466718 -7844387 -10134815 -12109196
9801 -12109196 -13568748 -14378024 -14482297 -13909781 -12760052 -11182997 -9358132 -7482664 -5765089
9792 -5765089 -4411848 -3598743 -3432468 -3918868 -4956393 -6363793 -7933157 -9483695 -10892333
9783 -10892333 -12093466 -13056647 -13756103 -14143959 -14136531 -13618744 -12465455 -10576083 -7920267
9774 -7920267 -4586219 -808785 3050409 6576378 9398000 11262380 12056868 11785560 10533389
9765 10533389 8449272 5754138 2751271 -191889 -2703735 -4494879 -5436566 -5597514
9757 -5597514 -5223141 -4664660 -4282556 -4353532 -5006479 -6207461 -7801244 -9591339 -11414914
9748 -11414914 -13170791 -14794695 -16215566 -17334225 -18039256 -18243181 -17910323 -17057772 -15730684
9739 -15730684 -13969454 -11789414 -9181818 -6128721 -2618285 1344886 5729030 10458357
9731 10458357 15394999 20334505 25025964 29212331 32673884 35259519 36901019 37611222
9723 37611222 37467384 36585746 35102096 33171283 30980711 28756398 26744657 25171815
9715 25171815 24198306 23883589 24173390 24916159 25907002 26944593 27879391 28636616 29209324
9706 29209324 29628286 29924520 30105188 30156357 30066024 29843805 29518863 29121472 28671135 28186342
9696 28186342 27707306 27308055 27080629 27093630 27345441 27740604 28111758 28286984 28172385 27803503
9686 27803503 27333313 26961430 26842205 27017859 27404369 27826232 28070303 27925252 27194338
9677 27194338 25697060 23285231 19883474 15538999 10451702 4961155 -512968 -5557586
9669 -5557586 -9848126 -13200056 -15582647 -17101631 -17960259 -18408121 -18690377 -19010771 -19512818
9660 -19512818 -20272517 -21295351 -22518962 -23828100 -25084228 -26164348 -26998399 -27592683 -28028886
9651 -28028886 -28436963 -28951875 -29670006 -30617916 -31741229 -32919852 -34011022 -34907416 -35582064
9642 -35582064 -36093555 -36549165 -37051421 -37661139 -38391456 -39221165 -40104437 -40965160 -41685068
9633 -41685068 -42105690 -42054465 -41384748 -40008459 -37909853 -35146093 -31843625 -28186668 -24386220
9624 -24386220 -20630001 -17033152 -13614086 -10305847 -6996624 -3584195 -25244 3639685
9616 3639685 7295507 10787663 13960950 16683445 18851214 20380890 21199897 21242411 20456102
9607 20456102 18818830 16356654 13150523 9324809 5024365 397635 -4401080 -9195569
9599 -9195569 -13778344 -17923678 -21419691 -24104235 -25893144 -26796408 -26916904 -26425760 -25518924
9590 -25518924 -24373314 -23120884 -21843995 -20581211 -19330691 -18046184 -16630902 -14942088
9582 -14942088 -12818060 -10127165 -6821643 -2972504 1230681 5516188 9590197 13200007
9574 13200007 16179485 18464652 20079857 21102876 21620332 21688279 21315130 20475363 19143689
9565 19143689 17327138 15078315 12488024 9664423 6707438 3688467 644281 -2415005
9557 -2415005 -5494135 -8605404 -11762934 -14972403 -18220002 -21470671 -24676121 -27780445
9549 -27780445 -30714561 -33387650 -35692797 -37534297 -38865729 -39717857 -40199504 -40468502 -40685203
9540 -40685203 -40969350 -41378245 -41912513 -42541346 -43228241 -43937792 -44620036 -45192740 -45549906
9531 -45549906 -45602020 -45319669 -44743438 -43949493 -42994125 -41871773 -40507792 -38785427 -36588822
9522 -36588822 -33838505 -30508620 -26636964 -22343564 -17850500 -13472409 -9558516 -6406286
9514 -6406286 -4191534 -2945700 -2578363 -2923103 -3784294 -4969818 -6304329 -7629660 -8807161
9505 -8807161 -9731775 -10352216 -10679582 -10769876 -10682886 -10438665 -9998638 -9285000 -8228309 -6816834
9495 -6816834 -5122702 -3294221 -1519747 21067 1199025 1953851 2282681 2205804 1730258
9486 1730258 836716 -497123 -2249672 -4318753 -6523895 -8649899 -10508992 -11992818
9478 -11992818 -13094410 -13893652 -14513762 -15068946 -15626954 -16201085 -16770287 -17312785 -17832388
9469 -17832388 -18361136 -18939235 -19592957 -20332144 -21166011 -22114154 -23194728 -24396828 -25659047
9460 -25659047 -26868798 -27882364 -28558933 -28799189 -28573326 -27923080 -26936693 -25715419 -24354248
9451 -24354248 -22942464 -21570007 -20323340 -19267963 -18426914 -17765791 -17191334 -16569133 -15761412
9442 -15761412 -14671913 -13272526 -11593715 -9687843 -7596603 -5348893 -2988791 -608802
9434 -608802 1640082 3573041 5018496 5861678 6064747 5662062 4742752 3431476 1869356
9425 1869356 192249 -1494087 -3137020 -4748650 -6396464 -8171951 -10148821 -12347446
9417 -12347446 -14715479 -17126725 -19398819 -21328018 -22730315 -23472797 -23488490 -22780978 -21423504
9408 -21423504 -19546093 -17305016 -14845223 -12276506 -9673757 -7093190 -4587882 -2209846
9400 -2209846 4429 2055495 3989727 5879972 7784351 9710172 11608090 13399134
9392 13399134 15015570 16431581 17669430 18781313 19819325 20811508 21757365 22643457 23466484
9383 23466484 24246783 25021768 25822074 26643835 27432888 28090321 28497288 28545344 28153835 27265326
9373 27265326 25830216 23805023 21178855 18015645 14481957 10838572 7399100 4476969
9365 4476969 2341192 1188064 1124459 2156890 4186378 7014081 10361763 13907885 17338242
9356 17338242 20405633 22981966 25078012 26815428 28361275 29854831 31354159 32814682
9348 32814682 34101681 35035148 35457601 35301617 34626181 33600741 32439661 31315551 30293463
9339 30293463 29319456 28266990 27010640 25482766 23685792 21666498 19482402 17187290
9331 17187290 14839393 12514280 10303272 8295356 6557007 5124207 4007594 3200559
9323 3200559 2681467 2410106 2324485 2342503 2368357 2301965 2051378 1547875 759398 -304171
9313 -304171 -1595913 -3042899 -4559862 -6066434 -7505905 -8853426 -10100937 -11224401
9305 -11224401 -12159406 -12808639 -13078070 -12915395 -12327605 -11378362 -10182330 -8905309 -7756335
9296 -7756335 -6949304 -6633064 -6823891 -7386759 -8084044 -8664103 -8937623 -8805490 -8240196 -7250559
9286 -7250559 -5858797 -4097570 -2016001 316209 2805228 5325970 7719646 9812492
9278 9812492 11457485 12576645 13177802 13341065 13189214 12854106 12442329 12007444 11544836
9269 11544836 11016806 10392975 9679665 8924090 8199100 7582884 7144200 6935926 6992580 7324499
9259 7324499 7907398 8677806 9546705 10428416 11265227 12031887 12724821 13353261 13940283 14525501
9249 14525501 15159025 15887664 16742058 17728831 18824413 19968458 21063030 21987146 22628336
9240 22628336 22918912 22857498 22502991 21944303 21262842 20506880 19688390 18800799 17846671 16860302
9230 16860302 15913237 15100253 14514797 14228849 14288570 14726009 15575426 16878242 18668362
9221 18668362 20945996 23659019 26703925 29939387 33195878 36276814 38965848 41056017
9213 41056017 42395091 42920843 42663321 41715950 40199487 38243899 35994982 33632027 31374751
9204 31374751 29465086 28124804 27503181 27634658 28424106 29667500 31101066 32459437 33522502
9195 33522502 34141490 34245846 33833608 32945096 31625950 29899160 27767726 25249379 22418611
9186 22418611 19425836 16482884 13826671 11679298 10216674 9552301 9739475 10786468
9178 10786468 12668338 15320173 18613399 22333095 26173876 29759698 32686013 34583500
9170 34583500 35197273 34458289 32512134 29683974 26391070 23038945 19937669 17259428
9162 17259428 15043513 13241697 11781426 10613598 9721443 9096291 8710143 8511036 8440751
9153 8440751 8453609 8518559 8606412 8677997 8686333 8593060 8388568 8103364 7804209 7577897 7510902
9142 7510902 7670368 8085152 8725384 9488327 10205635 10678750 10729982 10246390 9201909 7658402
9132 7658402 5752611 3673962 1637665 -140592 -1465212 -2179469 -2184841 -1456232 -47067
9123 -47067 1914059 4230146 6649617 8897531 10723342 11944619 12463323 12252273 11332556
9114 11332556 9763664 7648554 5137834 2418311 -313295 -2878985 -5140671 -7013148
9106 -7013148 -8469177 -9531562 -10249165 -10666241 -10801356 -10643044 -10157085 -9301252 -8050333
9097 -8050333 -6429417 -4540032 -2562219 -730145 709364 1546753 1660121 1050235 -157158
9088 -157158 -1742259 -3435650 -4955788 -6035565 -6446383 -6026612 -4713338 -2569438 206869
9079 206869 3302141 6339266 8948444 10839180 11856158 12003469 11426176 10353793 9030029
9070 9030029 7657247 6367785 5217046 4191062 3226199 2236637 1139810 -126185 -1589006
9061 -1589006 -3225872 -4948572 -6602721 -7991564 -8922452 -9262507 -8983228 -8173220 -7006855
9052 -7006855 -5676890 -4322101 -2988929 -1647047 -243718 1240870 2767157 4241716
9044 4241716 5541032 6544238 7174310 7441525 7468384 7472987 7706189 8363295 9505700 11025136
9034 11025136 12666642 14102328 15026609 15235966 14666665 13384461 11539205 9307098 6843451
9025 6843451 4259881 1625909 -1015754 -3630963 -6176507 -8584334 -10755576 -12576409
9017 -12576409 -13955796 -14863354 -15338331 -15461482 -15312422 -14944553 -14388982 -13672280 -12826980
9008 -12826980 -11889087 -10892031 -9866215 -8842767 -7854168 -6928969 -6086353 -5337818 -4695489
8999 -4695489 -4178389 -3809894 -3610276 -3595047 -3783842 -4211459 -4924737 -5953789 -7262780
8990 -7262780 -8707315 -10036457 -10959411 -11252110 -10842849 -9826190 -8404808 -6802563 -5193528
8981 -5193528 -3664801 -2211522 -760925 779650 2468490 4296546 6195079 8080099
8973 8080099 9908546 11713996 13599559 15688721 18059008 20692631 23465990 26177354
8965 26177354 28596754 30521108 31823149 32485423 32609749 32394713 32083767 31900136 31990878
8956 31990878 32395522 33041441 33761560 34332314 34529579 34189395 33248697 31746376 29788485
8947 29788485 27503489 25013716 22429849 19856370 17393599 15132939 13151944 11514961
8939 11514961 10276338 9475026 9110824 9106918 9283566 9374704 9097799 8248181 6766861 4748548
8929 4748548 2397210 -38483 -2324055 -4284889 -5837375 -6999983 -7878574 -8628592 -9405049
8920 -9405049 -10314903 -11387252 -12573003 -13773751 -14884093 -15825153 -16555297 -17059305 -17329144
8911 -17329144 -17352315 -17117159 -16631321 -15938741 -15122088 -14290675 -13565145 -13068131 -12918185 -13215960
8901 -13215960 -14016118 -15292538 -16916270 -18664204 -20260267 -21432087 -21960132 -21706299 -20623837
8892 -20623837 -18757438 -16239358 -13280517 -10149831 -7134666 -4484346 -2354343 -778093
8884 -778093 317370 1061596 1585423 1984119 2302646 2533879 2625910 2504400 2112191 1452265
8874 1452265 610824 -252585 -940347 -1257185 -1038658 -163868 1439341 3785374 6815406
8865 6815406 10386244 14278218 18225292 21955480 25227492 27858572 29743156 30856835
8857 30856835 31238531 30955320 30069096 28625326 26669801 24281241 21597525 18816412 16167859
8848 16167859 13875408 12130714 11089617 10875807 11573930 13211538 15745803 19066979
8840 19066979 23013430 27385249 31953638 36476677 40730764 44550002 47851483 50628974
8832 50628974 52917487 54747652 56108900 56930176 57080094 56387898 54684072 51851086 47868189
8823 47868189 42836801 36981238 30623917 24134644 17860004 12054708 6848096 2267044
8815 2267044 -1697863 -5026106 -7642867 -9447117 -10368670 -10417778 -9700543 -8393089 -6686891
8806 -6686891 -4730811 -2596017 -276586 2279172 5121368 8250190 11580130 14931113
8798 14931113 18057506 20712715 22728517 24076734 24885594 25401758 25910542 26641134 27689006
8789 27689006 28985157 30327790 31464058 32181669 32366379 32007935 31169938 29950728 28452703
8780 28452703 26765858 24966591 23127347 21324541 19632574 18104883 16755997 15557769
8772 15557769 14451637 13369715 12256555 11087177 9880146 8704108 7672059 6916071
8764 6916071 6543795 6593772 7014747 7683619 8454330 9212297 9907830 10556669 11216365 11957876
8754 11957876 12844012 13911166 15149505 16492473 17834365 19075320 20163901 21104971
8746 21104971 21931273 22667315 23312576 23845861 24236394 24453428 24478877 24327071 24064197 23812557
8736 23812557 23729655 23964349 24604010 25634122 26931538 28299963 29533527 30476294 31047131
8727 31047131 31220807 30983097 30294490 29095096 27359668 25174920 22786425 20573985 18958533
8718 18958533 18284384 18727020 20253925 22641964 25542827 28578248 31433294 33911179
8710 33911179 35930220 37474748 38535025 39071916 39023746 38347436 37065728 35287322 33182623
8701 33182623 30927276 28647776 26399473 24181355 21968596 19741911 17505739 15295385
8693 15295385 13171373 11199507 9424669 7853973 6458840 5191744 4006034 2869313
8685 2869313 1764940 680691 -407433 -1539528 -2751851 -4039755 -5327562 -6466713
8677 -6466713 -7264011 -7524303 -7089155 -5861799 -3817772 -1003010 2480631 6502047 10932959
8668 10932959 15671771 20646641 25795933 31037813 36247959 41261054 45898887 50011436
8660 50011436 53507991 56361640 58588477 60217229 61264627 61722446 61555857 60713314 59147676
8651 59147676 56841699 53824769 50171631 45988068 41400249 36560028 31659228 26929926
8643 26929926 22614061 18910907 15930777 13678201 12065511 10943049 10135230 9478949
8635 9478949 8857272 8212767 7528843 6786663 5922475 4810053 3278741 1163494 -1625363
8626 -1625363 -5033075 -8820677 -12581587 -15821559 -18078149 -19034573 -18586552 -16845218 -14087093
8617 -14087093 -10678141 -6999775 -3396199 -150337 2516258 4432068 5467211 5538080
8609 5538080 4627080 2808451 261442 -2746239 -5903318 -8904990 -11483819 -13419575
8601 -13419575 -14546056 -14766445 -14067430 -12516545 -10243679 -7422855 -4266142 -1026530
8593 -1026530 2002638 4505170 6185813 6836335 6399503 4997299 2906022 489462 -1882861
8584 -1882861 -3907828 -5393388 -6264040 -6529826 -6242213 -5467471 -4290926 -2838740 -1290947
8575 -1290947 133132 1217262 1799474 1803639 1232635 130385 -1458023 -3500926 -5965529
8566 -5965529 -8792351 -11880444 -15093029 -18279409 -21302285 -24059507 -26490885 -28563894
8558 -28563894 -30240566 -31441579 -32031254 -31837834 -30701843 -28530223 -25336059 -21254445
8550 -21254445 -16532111 -11492853 -6488231 -1849194 2150245 5317429 7557360 8877491
8542 8877491 9373002 9193922 8509907 7490527 6304836 5127832 4138556 3504872 3361164
8533 3361164 3788830 4807998 6386953 8469182 11002974 13947444 17241933 20760657
8525 20760657 24296553 27598363 30438869 32666766 34213600 35066646 35239735 34764700 33703029
8516 33703029 32161380 30294094 28287306 26332022 24597041 23206972 22226765 21658019
8508 21658019 21455298 21561779 21948223 22633568 23675368 25134546 27030864 29309518 31835418
8499 31835418 34419607 36866418 39019508 40785564 42125767 43023792 43456909 43397858 42849712
8490 42849712 41882146 40631750 39262779 37922785 36726729 35765890 35110421 34788337 34760249
8481 34760249 34924337 35162841 35403088 35649690 35964297 36407954 36985498 37623103 38181847
8472 38181847 38491209 38389517 37767766 36608971 35001868 33108979 31095127 29054229 26979051
8463 26979051 24790785 22404904 19791309 17002867 14176011 11518244 9284807 7735067
8455 7735067 7068956 7363733 8536829 10347086 12431708 14369993 15760213 16289179 15775255
8446 15775255 14180415 11601066 8245736 4397903 363334 -3585560 -7249517 -10518112
8438 -10518112 -13367389 -15847094 -18057601 -20115395 -22115074 -24102648 -26069146 -27961052
8430 -27961052 -29697723 -31189596 -32357073 -33151219 -33574474 -33695833 -33652528 -33630400 -33821781
8421 -33821781 -34372664 -35341133 -36685433 -38283787 -39972463 -41584944 -42981114 -44061391
8413 -44061391 -44763569 -45044570 -44858143 -44146112 -42854435 -40966374 -38528828 -35651488 -32480916
8404 -32480916 -29171315 -25871267 -22725257 -19873619 -17438972 -15503002 -14086498 -13141568
8396 -13141568 -12556291 -12168786 -11790265 -11237998 -10374474 -9141738 -7578346 -5812700 -4033961
8387 -4033961 -2444425 -1199297 -347909 199706 658790 1304744 2378058 3996587 6112450
8378 6112450 8532964 10994329 13248713 15120568 16511512 17366651 17634780 17252324 16163119
8369 16163119 14364039 11950224 9133617 6224336 3581450 1545202 361584 114997
8361 114997 693120 1804695 3051341 4032047 4447200 4169793 3261719 1932062 456512
8352 456512 -909873 -1998037 -2753842 -3229093 -3541775 -3819811 -4149037 -4547017 -4974418
8343 -4974418 -5375783 -5722954 -6034185 -6364260 -6784804 -7372755 -8200681 -9308923 -10659892
8334 -10659892 -12107813 -13420335 -14351340 -14723855 -14478483 -13675176 -12467012 -11066690 -9708721
8325 -9708721 -8601189 -7871048 -7521863 -7424948 -7353411 -7052600 -6325545 -5100958 -3452634
8316 -3452634 -1559026 378920 2223698 3952812 5653082 7459606 9470361 11685368
8308 11685368 14006080 16288462 18406282 20281572 21872054 23136429 24005233 24373952
8300 24373952 24122890 23159257 21466166 19132537 16340618 13312432 10249033 7305493
8292 7305493 4613652 2319113 585188 -450878 -740362 -362701 478877 1502929 2420887
8283 2420887 3009037 3151265 2835378 2116843 1084263 -151741 -1455229 -2670680 -3648673
8274 -3648673 -4281505 -4529539 -4424447 -4048751 -3504787 -2891170 -2294879 -1790398 -1431956 -1237637
8264 -1237637 -1179512 -1192990 -1201637 -1139663 -957992 -616489 -76849 693555 1710525 2964989
8254 2964989 4420514 6008151 7614277 9073494 10185166 10755985 10648167 9809923 8282831
8245 8282831 6195416 3748967 1193059 -1208562 -3211298 -4612595 -5265870 -5092187 -4089419
8236 -4089419 -2332267 39691 2841216 5862658 8891750 11734582 14232047 16269023
8228 16269023 17777370 18735475 19166160 19134113 18741637 18117016 17390252 16662813 15990036
8219 15990036 15388659 14859267 14399791 13998549 13619153 13197732 12659769 11947801 11046729
8210 11046729 9997327 8892222 7853334 6998782 6415046 6146493 6200212 6552698 7147389
8201 7147389 7884892 8617787 9160387 9313799 8897451 7776986 5883407 3223345 -119969
8192 -119969 -3998541 -8226690 -12617537 -17013862 -21298520 -25382052 -29181106 -32607560
8184 -32607560 -35578887 -38041639 -39987120 -41443312 -42447164 -43018792 -43156851 -42854778 -42120166
8175 -42120166 -40980311 -39472282 -37629407 -35477044 -33042139 -30372200 -27555454 -24733405
8167 -24733405 -22096677 -19855642 -18185399 -17161703 -16719291 -16658781 -16701296 -16562413 -16012590
8158 -16012590 -14908945 -13201216 -10918206 -8137581 -4945412 -1401819 2468937 6659217
8150 6659217 11143778 15851395 20653137 25365400 29764545 33616364 36721285 38961400
8142 38961400 40325700 40901148 40839978 40323676 39533893 38626534 37704334 36793000 35833312
8133 35833312 34699166 33241687 31347046 28987082 26243565 23299016 20400343 17807170
8125 17807170 15735896 14310061 13529559 13271140 13325472 13461846 13496340 13333775 12966582
8116 12966582 12439390 11807019 11109966 10371858 9607848 8831826 8057053 7290182 6523314
8107 6523314 5733564 4897714 4015418 3120385 2264651 1486749 792860 168042 -396167 -885815
8097 -885815 -1271101 -1520206 -1600428 -1464593 -1037753 -219236 1095147 2975769 5419333
8088 5419333 8325397 11505595 14724794 17752334 20396638 22514013 24005018 24815615
8080 24815615 24942844 24428929 23335711 21716200 19610209 17069509 14186997 11100364
8072 11100364 7968217 4942581 2158104 -265344 -2224367 -3648634 -4525842 -4917237
8064 -4917237 -4946644 -4758849 -4462355 -4084486 -3562159 -2772382 -1587433 68031 2177229
8055 2177229 4619097 7184368 9613604 11647776 13080239 13797860 13802343 13210480 12236446
8046 12236446 11155188 10244339 9715652 9665879 10074786 10847382 11866282 13019833 14199122
8037 14199122 15282709 16130994 16598320 16556969 15921826 14666951 12830528 10508172 7835071
8028 7835071 4959022 2012946 -899466 -3697541 -6305983 -8645239 -10640710 -12242299
8020 -12242299 -13436594 -14243643 -14706041 -14882727 -14850910 -14709278 -14574460 -14569459 -14808673 -15383789
8010 -15383789 -16350577 -17715151 -19423198 -21362100 -23383343 -25339257 -27116553 -28652754
8002 -28652754 -29936437 -30998911 -31897354 -32683693 -33365667 -33884294 -34129647 -33990691 -33410337
7993 -33410337 -32416318 -31117198 -29671456 -28246594 -26985314 -25988086 -25308241 -24948048 -24851311
7984 -24851311 -24902513 -24946817 -24832910 -24463977 -23834579 -23035714 -22223303 -21562800 -21176036 -21114227
7974 -21114227 -21362732 -21865159 -22552116 -23368371 -24294774 -25355222 -26598898 -28063397 -29742471
7965 -29742471 -31582489 -33510985 -35476487 -37471320 -39522383 -41657102 -43865806 -46080433
7957 -46080433 -48177524 -50002088 -51403760 -52274591 -52575848 -52342387 -51662738 -50647440 -49405557
7948 -49405557 -48041123 -46662768 -45387260 -44323037 -43539095 -43040030 -42765333 -42614282 -42483357
7939 -42483357 -42300026 -42039941 -41718961 -41361936 -40967629 -40497318 -39897557 -39137493 -38229355
7930 -38229355 -37218843 -36156861 -35071209 -33950241 -32746593 -31406671 -29918384 -28350860
7922 -28350860 -26857461 -25635320 -24861559 -24636601 -24956401 -25719817 -26762791 -27902315 -28973608
7913 -28973608 -29852325 -30460960 -30759987 -30726462 -30331833 -29537292 -28315365 -26683771 -24723915
7904 -24723915 -22567209 -20358327 -18221521 -16250331 -14519456 -13099761 -12057138 -11432355
7896 -11432355 -11217753 -11352164 -11742794 -12301348 -12968946 -13712469 -14499245 -15277708 -15989290
7887 -15989290 -16612065 -17209579 -17950119 -19076537 -20833280 -23380600 -26734927 -30762788 -35226394
7878 -35226394 -39849978 -44369146 -48546161 -52163086 -55017811 -56939051 -57818630 -57646531
7870 -57646531 -56529420 -54676321 -52347538 -49783445 -47144962 -44493539 -41816335 -39079400
7862 -39079400 -36282797 -33495908 -30860284 -28557717 -26754868 -25548642 -24937790 -24830296
7854 -24830296 -25073733 -25486542 -25879875 -26077398 -25941888 -25400632 -24450408 -23136234 -21522770
7845 -21522770 -19680934 -17689559 -15632298 -13579314 -11566931 -9594000 -7636093 -5662856
7837 -5662856 -3647718 -1571840 571563 2771701 4997714 7202898 9334704 11343404
7829 11343404 13181774 14798695 16142896 17189050 17973075 18603729 19230718 19985568 20932820
7820 20932820 22056592 23280471 24505004 25648874 26682127 27638051 28595421 29639058
7812 29639058 30820238 32135189 33524494 34886166 36097496 37044595 37653777 37911057 37858005
7803 37858005 37565041 37095665 36479049 35704765 34744348 33589768 32285647 30933844 29669084
7794 29669084 28625715 27917540 27634224 27838606 28548133 29701685 31134808 32591802 33783246
7785 33783246 34464922 34496638 33853697 32597048 30831262 28676228 26259159 23717113 21196726
7776 21196726 18844047 16785978 15110304 13852030 12991198 12463841 12182933 12060517 12020196
7767 12020196 11995724 11923106 11739084 11391071 10849738 10110180 9177085 8043743 6679156
7758 6679156 5029077 3026555 606058 -2280678 -5648137 -9463168 -13635674 -18011690
7750 -18011690 -22370190 -26435268 -29916150 -32569535 -34257808 -34975066 -34832001 -34011999 -32720598
7741 -32720598 -31149340 -29465436 -27821178 -26361273 -25209105 -24436239 -24040789 -23955353 -24078088
7732 -24078088 -24300342 -24513121 -24602203 -24457071 -24003870 -23243566 -22265354 -21223481 -20292298
7723 -20292298 -19623222 -19316679 -19409501 -19875214 -20637056 -21593273 -22649555 -23746569 -24868398
7714 -24868398 -26027617 -27240698 -28514620 -29849784 -31243236 -32677307 -34101653 -35431668
7706 -35431668 -36575519 -37480258 -38175310 -38791047 -39535650 -40629358 -42220373 -44321841 -46797059
7697 -46797059 -49391892 -51795513 -53710609 -54918174 -55322064 -54960778 -53983591 -52599709 -51017827
7688 -51017827 -49397708 -47831422 -46355517 -44976475 -43687886 -42472752 -41300660 -40130503
7680 -40130503 -38917691 -37615633 -36164716 -34475045 -32421158 -29865852 -26713012 -22968067
7672 -22968067 -18776570 -14422248 -10284156 -6766065 -4217385 -2865579 -2775449 -3842212
7664 -3842212 -5818597 -8372309 -11163241 -13918172 -16475915 -18788623 -20887817 -22837134
7656 -22837134 -24690452 -26464772 -28133686 -29644890 -30954759 -32058852 -32996772 -33829865
7648 -33829865 -34613574 -35388782 -36194995 -37085219 -38120879 -39344597 -40748622 -42260316 -43753770
7639 -43753770 -45081015 -46108633 -46747449 -46968422 -46800609 -46308262 -45550603 -44541011 -43231301
7630 -43231301 -41538260 -39403885 -36856079 -34033342 -31159518 -28485857 -26232375 -24549007
7622 -24549007 -23494605 -23023484 -22980701 -23119653 -23150116 -22805805 -21906990 -20395613 -18333109
7613 -18333109 -15867053 -13185424 -10478929 -7918760 -5641387 -3730519 -2199436 -986816
7605 -986816 25785 978754 1993272 3138053 4416468 5778043 7142931 8418719 9498200
7596 9498200 10247967 10509898 10129477 9003273 7120498 4573539 1531039 -1808784 -5256900
7587 -5256900 -8648371 -11838918 -14700369 -17127170 -19052478 -20462391 -21397692 -21942296 -22206479
7578 -22206479 -22310903 -22368508 -22460947 -22619220 -22826734 -23049373 -23272321 -23516536 -23828364 -24259632
7568 -24259632 -24856659 -25657985 -26687519 -27937533 -29353299 -30836559 -32270575 -33550819
7560 -33550819 -34602991 -35385018 -35882094 -36099654 -36049826 -35731278 -35117383 -34170113 -32877863
7551 -32877863 -31292774 -29539461 -27783353 -26168429 -24750812 -23461656 -22124360 -20524990
7543 -20524990 -18504013 -16024406 -13185739 -10184642 -7247187 -4565202 -2257879 -363906
7535 -363906 1141876 2317077 3216525 3865580 4253173 4347856 4127990 3608722 2850041 1941739
7525 1941739 975456 21155 -879753 -1704914 -2434515 -3037632 -3467116 -3664561 -3573317 -3154623
7515 -3154623 -2402487 -1355760 -104774 1215372 2451706 3473615 4206818 4646517 4853780
7506 4853780 4946923 5086589 5440494 6125413 7152509 8413110 9718024 10865642 11699406
7497 11699406 12134225 12159377 11834592 11284808 10687693 10249182 10169462 10604865 11631540 13220507
7487 13220507 15237781 17476754 19712163 21750025 23451447 24729550 25538880 25876313
7479 25876313 25792035 25390854 24808509 24169543 23548660 22953104 22331201 21605527 20724038 19709994
7469 19709994 18682016 17827468 17342229 17370336 17970263 19111637 20688742 22534702 24429930
7460 24429930 26112606 27306269 27769035 27347022 26004443 23818257 20950278 17618008
7452 17618008 14072971 10579919 7387112 4685364 2564810 987617 -204095 -1238560
7444 -1238560 -2337715 -3643841 -5178971 -6851087 -8499938 -9957667 -11095416 -11840704
7436 -11840704 -12172005 -12108672 -11707485 -11062097 -10293870 -9527713 -8858913 -8327169 -7914406 -7569728
7426 -7569728 -7245498 -6918861 -6584511 -6229438 -5816778 -5297557 -4642930 -3869977 -3040000 -2232838
7416 -2232838 -1518032 -938459 -504927 -193705 52792 314551 669583 1166244 1806413 2547700
7406 2547700 3322593 4063717 4721011 5260954 5649107 5827569 5702017 5148507 4041578
7397 4041578 2294147 -108979 -3100633 -6546289 -10271959 -14089555 -17812741 -21264605
7389 -21264605 -24281607 -26720630 -28476706 -29509840 -29862826 -29647485 -28997969 -28019445 -26766105
7380 -26766105 -25255810 -23498263 -21510166 -19312093 -16919817 -14341807 -11585176 -8668811
7372 -8668811 -5641854 -2599041 322697 2974620 5241471 7076141 8505657 9609121
7364 9609121 10480057 11186852 11744605 12111972 12219640 12018795 11520185 10794009 9923942 8941119
7354 8941119 7782137 6302888 4343517 1804965 -1309491 -4908111 -8861015 -13044966
7346 -13044966 -17350947 -21656729 -25794584 -29543410 -32650311 -34866555 -35983766 -35867040
7338 -35867040 -34482507 -31907810 -28313732 -23922203 -18964740 -13665890 -8256642 -2999508
7330 -2999508 1802299 5829526 8802538 10546805 11041282 10429960 8990444 7067482 4991637
7321 4991637 3010178 1253423 -255791 -1561340 -2725327 -3793269 -4780659 -5673769 -6432724
7312 -6432724 -6992708 -7269833 -7178631 -6657877 -5692524 -4321355 -2629552 -733720 1230856
7303 1230856 3115650 4762073 6014688 6750212 6910015 6514442 5651025 4451119 3073152
7294 3073152 1692011 479637 -428114 -962330 -1128268 -982975 -595733 -11120 767516
7285 767516 1764426 2993529 4420158 5949379 7447743 8780076 9838082 10553680 10902939
7276 10902939 10902665 10594927 10022359 9209597 8162746 6880296 5359319 3592800 1569810
7267 1569810 -712065 -3228720 -5920742 -8699672 -11462081 -14101249 -16513049 -18599773
7259 -18599773 -20276575 -21480001 -22171791 -22330462 -21930841 -20921534 -19213365 -16687442 -13226128
7250 -13226128 -8764969 -3353322 2801993 9338258 15793477 21698519 26665955 30441335
7242 30441335 32906473 34051688 33947026 32732357 30621936 27903162 24914500 22002623
7234 22002623 19466193 17494494 16117366 15196256 14480726 13718506 12765330 11632619 10448560
7225 10448560 9362639 8455379 7704419 7016048 6287968 5454147 4485079 3357256 2030203
7216 2030203 458336 -1370449 -3405217 -5542519 -7675217 -9746149 -11770700 -13819340
7208 -13819340 -15981185 -18336276 -20946875 -23858086 -27093991 -30645773 -34458415 -38422869
7200 -38422869 -42375419 -46104941 -49373190 -51952237 -53670304 -54443185 -54272356 -53213853
7192 -53213853 -51340955 -48719713 -45397901 -41399408 -36724703 -31367542 -25352902 -18784348
7184 -18784348 -11875505 -4941554 1654626 7580251 12597578 16590632 19557609 21591195
7176 21591195 22860444 23588258 24014300 24348681 24736282 25247367 25891921 26641369 27444012
7167 27444012 28234304 28944020 29516650 29914242 30106974 30051773 29679151 28901629 27639830
7158 27639830 25851343 23548416 20796998 17697925 14361172 10889334 7378815 3932029
7150 3932029 667337 -2280773 -4772317 -6684798 -7948127 -8579617 -8697392 -8497636 -8201842
7141 -8201842 -7996419 -7988419 -8192270 -8550953 -8982530 -9431441 -9900703 -10450771 -11168360 -12122325
7131 -12122325 -13326077 -14718724 -16168002 -17493298 -18506001 -19060552 -19101044 -18681928 -17948463
7122 -17948463 -17083433 -16247175 -15540677 -15003916 -14638614 -14434334 -14382868 -14477842 -14704550 -15028256
7112 -15028256 -15389044 -15705958 -15884024 -15815149 -15375295 -14434339 -12890649 -10718099 -7994463
7103 -7994463 -4889901 -1623832 1582749 4539507 7102242 9178678 10726505 11740789
7095 11740789 12233022 12213628 11690865 10687366 9260452 7507715 5550541 3505326 1459648
7086 1459648 -536982 -2470298 -4351727 -6201157 -8019646 -9760929 -11322269 -12568575
7078 -12568575 -13379283 -13688732 -13497343 -12855350 -11839147 -10538706 -9059782 -7530318 -6095380
7069 -6095380 -4891703 -4009047 -3459202 -3171038 -3011899 -2820028 -2433749 -1714887 -569452
7060 -569452 1036110 3069049 5436829 8001654 10598108 13052991 15207567 16939547
7052 16939547 18180553 18927918 19252671 19302543 19291565 19465770 20044249 21152412 22776547
7043 22776547 24764643 26877245 28865707 30540530 31800898 32623347 33032915 33084085 32859437
7034 32859437 32470192 32037980 31656262 31354292 31091016 30784347 30353401 29744904 28934255
7025 28934255 27914663 26691936 25290177 23761533 22189866 20680198 19331343 18200517
7017 18200517 17278737 16491635 15723091 14846895 13754680 12375412 10681543 8678010 6382970
7008 6382970 3821408 1042771 -1852808 -4707747 -7330505 -9533690 -11164494 -12119728
7000 -12119728 -12352489 -11877983 -10777298 -9191620 -7301266 -5293214 -3331606 -1547528
6992 -1547528 -50994 1052140 1662623 1716817 1222056 267168 -1005905 -2454847 -3986027
6983 -3986027 -5581261 -7299714 -9257531 -11584753 -14364051 -17572709 -21060713 -24583590
6975 -24583590 -27873755 -30708252 -32938950 -34486080 -35323369 -35478736 -35047955 -34200137 -33159383
6966 -33159383 -32165563 -31429564 -31097754 -31233262 -31814410 -32745229 -33871030 -34994862 -35896087
6957 -35896087 -36355078 -36184476 -35259931 -33539291 -31064916 -27955940 -24402117 -20659763 -17035179
6948 -17035179 -13843205 -11350039 -9726233 -9028024 -9204232 -10115869 -11562273 -13314767 -15156118
6939 -15156118 -16917610 -18504374 -19902954 -21169434 -22401154 -23699318 -25130719 -26695410
6931 -26695410 -28308104 -29803647 -30973304 -31625396 -31647979 -31043776 -29915920 -28407835 -26630354
6922 -26630354 -24620851 -22357176 -19808090 -16977921 -13915618 -10690282 -7357234 -3939576
6914 -3939576 -437682 3137333 6724138 10187805 13325334 15898588 17684900 18533308
6906 18533308 18410929 17421743 15788404 13806236 11791648 10042075 8807665 8263994 8480005
6897 8480005 9389885 10787594 12359024 13750650 14654802 14881448 14390872 13279050 11727597
6888 11727597 9941401 8094830 6298388 4590941 2958092 1370140 -176151 -1630603
6880 -1630603 -2888606 -3815026 -4282460 -4208078 -3573523 -2420887 -832740 1085580 3207265
6871 3207265 5370494 7366348 8947704 9867361 9933968 9059703 7276423 4714923 1560493
6862 1560493 -1994225 -5779650 -9651508 -13470621 -17086189 -20351894 -23177117 -25577592
6854 -25577592 -27678527 -29653946 -31634118 -33638139 -35571052 -37279281 -38621262 -39509976
6846 -39509976 -39915393 -39844624 -39322002 -38378277 -37049504 -35385568 -33465021 -31405678 -29360902
6837 -29360902 -27500872 -25985155 -24932641 -24394796 -24341070 -24663246 -25197661 -25759849 -26186438
6828 -26186438 -26373986 -26295495 -25981380 -25477164 -24808755 -23974293 -22954792 -21726700 -20272240
6819 -20272240 -18592994 -16725286 -14746697 -12765906 -10897645 -9230673 -7800695 -6584113
6811 -6584113 -5524047 -4580386 -3773442 -3190069 -2948367 -3149687 -3853222 -5081563 -6832023
6802 -6832023 -9063750 -11660823 -14405443 -16997609 -19126071 -20559576 -21215524 -21178009 -20663946
6793 -20663946 -19958176 -19345714 -19060129 -19250980 -19965026 -21140264 -22618736 -24181081 -25594296
6784 -25594296 -26655915 -27221282 -27211916 -26611863 -25458617 -23830013 -21827786 -19564200 -17159510
6775 -17159510 -14746665 -12465481 -10432240 -8695679 -7212682 -5870233 -4546794 -3175965
6767 -3175965 -1774275 -421798 785126 1777997 2536498 3083380 3464390 3725158 3892440
6758 3892440 3962299 3894962 3616340 3028841 2034483 568077 -1368628 -3683232 -6189095
6749 -6189095 -8630609 -10741456 -12324180 -13318250 -13819789 -14039730 -14220800 -14550824 -15103720
6740 -15103720 -15823078 -16547303 -17062636 -17164702 -16713363 -15672549 -14126443 -12260666 -10306584
6731 -10306584 -8468504 -6866649 -5518881 -4361583 -3294428 -2230282 -1133212 -32077
6723 -32077 993317 1844959 2443333 2753345 2788859 2594627 2219744 1706813 1110204 527656
6713 527656 109511 22836 384841 1207682 2390344 3761517 5147958 6435246 7598938
6704 7598938 8700464 9854345 11180279 12755059 14575873 16542007 18460963 20084785
6696 20084785 21174688 21575539 21268845 20377302 19116182 17713356 16335356 15052644 13854423
6687 13854423 12694506 11534666 10362180 9183483 8013102 6872892 5799169 4843220
6679 4843220 4055634 3462343 3053534 2800101 2688400 2744863 3028451 3595594 4463145 5592271
6669 5592271 6898284 8276241 9626554 10866082 11918538 12693542 13076197 12943934 12205031
6660 12205031 10833570 8876904 6431715 3605707 488619 -2853076 -6360051 -9957166
6652 -9957166 -13539164 -16972028 -20108651 -22815435 -25006310 -26675069 -27909016 -28869343
6644 -28869343 -29741713 -30680889 -31776664 -33051699 -34481049 -36014617 -37589149 -39126734
6636 -39126734 -40525354 -41652314 -42352377 -42477106 -41931424 -40722316 -38987573 -36984606 -35033346
6627 -35033346 -33429880 -32365740 -31887472 -31910901 -32276713 -32815448 -33390295 -33904542 -34284937
6618 -34284937 -34464544 -34379827 -33978713 -33229158 -32125744 -30698487 -29021937 -27213255 -25412063
6609 -25412063 -23750149 -22327193 -21199849 -20377548 -19816831 -19417996 -19037387 -18522003 -17755513
6600 -17755513 -16694933 -15385382 -13955121 -12597023 -11535503 -10975822 -11043839 -11736723 -12904949
6591 -12904949 -14275057 -15511158 -16302441 -16450880 -15925075 -14855227 -13470969 -12011533 -10649358
6582 -10649358 -9458304 -8432388 -7534040 -6739459 -6059523 -5536140 -5226241 -5183129 -5438543
6573 -5438543 -5987644 -6780768 -7724871 -8694578 -9549845 -10154964 -10394416 -10186146 -9495970 -8349809
6563 -8349809 -6829505 -5040992 -3064693 -917674 1445952 4093692 7055419 10281070
6555 10281070 13642006 16976801 20152469 23102723 25825546 28353259 30719983 32939880
6547 32939880 34995775 36836692 38387103 39568779 40329066 40665234 40635690 40353549 39965408
6538 39965408 39624968 39470988 39611477 40109897 40972646 42145040 43523454 44981563 46398141
6529 46398141 47673255 48729263 49504276 49949733 50038126 49776547 49214089 48432085 47516069
6520 47516069 46521115 45448369 44245021 42828113 41124341 39115218 36872766 34565316
6512 34565316 32419124 30646678 29378704 28636431 28350569 28401965 28653333 28959894 29167948
6503 29167948 29117978 28661738 27688158 26142725 24029844 21404670 18370808 15088872 11779941
6494 11779941 8704215 6115490 4214193 3121126 2874156 3434924 4696651 6496598
6486 6496598 8638982 10924064 13172020 15237301 17020830 18485774 19667843 20663335
6478 20663335 21592322 22556698 23617362 24795781 26084091 27446668 28812146 30068585
6470 30068585 31073372 31678133 31760082 31249893 30149037 28531091 26523404 24272503 21906902
6461 21906902 19513486 17132156 14760309 12361686 9889490 7335438 4791400 2482368
6453 2482368 734516 -118477 150869 1578503 3980454 6986162 10120465 12906733 14956236
6444 14956236 16018696 15991845 14905048 12891521 10155673 6940456 3502551 98843
6436 98843 -3024655 -5655766 -7653968 -8986909 -9740870 -10091265 -10241056 -10352222 -10498939
6427 -10498939 -10661471 -10762004 -10723800 -10521376 -10192691 -9808106 -9420505 -9031829 -8593257 -8027554
6417 -8027554 -7250694 -6183528 -4763418 -2968156 -848086 1454772 3721955 5710710
6409 5710710 7222306 8156048 8529101 8462121 8143167 7781514 7557998 7579049 7845934 8250615
6399 8250615 8601251 8669394 8244006 7177369 5412725 2989915 31349 -3284246 -6750537
6390 -6750537 -10157713 -13311868 -16053292 -18273354 -19923445 -21011196 -21587978 -21736075 -21558549
6381 -21558549 -21169821 -20687866 -20232861 -19931850 -19919898 -20328219 -21259520 -22758244 -24783882
6372 -24783882 -27195651 -29758743 -32178786 -34159119 -35463685 -35964740 -35658312 -34640788
6364 -34640788 -33058741 -31061374 -28780183 -26330993 -23810987 -21277557 -18731736 -16139044
6356 -16139044 -13486935 -10837557 -8333503 -6153167 -4449918 -3312843 -2762766 -2772823 -3295143
6347 -3295143 -4280159 -5682522 -7452882 -9520111 -11774893 -14068560 -16235808 -18136175
6339 -18136175 -19694860 -20918604 -21872861 -22629117 -23212475 -23583018 -23663875 -23397185 -22790030
6330 -22790030 -21920829 -20905378 -19848474 -18812752 -17818986 -16867407 -15957555 -15092452 -14270667
6321 -14270667 -13479630 -12698575 -11907656 -11093318 -10243560 -9336734 -8335544 -7195348 -5882810
6312 -5882810 -4389946 -2734403 -954819 882665 2667171 4236728 5401080 5984066
6304 5984066 5857140 4949085 3245655 800312 -2244586 -5649527 -9102449 -12272282 -14869796
6295 -14869796 -16695246 -17662113 -17793189 -17191476 -15998310 -14357813 -12400339 -10243357 -8001067
6286 -8001067 -5796861 -3772771 -2082911 -859045 -158627 68703 -36823 -310393 -633314
6277 -633314 -963948 -1314239 -1692734 -2050912 -2263485 -2154299 -1556853 -381736 1338262
6268 1338262 3441464 5668388 7719909 9327605 10317398 10645420 10392359 9720026 8811377
6259 8811377 7820354 6847546 5939931 5100989 4300129 3483655 2596905 1616975 577482
6250 577482 -435812 -1319558 -1995815 -2439403 -2680890 -2789378 -2841885 -2888836 -2932587 -2935627
6240 -2935627 -2858131 -2703649 -2546517 -2527208 -2818910 -3580058 -4911502 -6832107 -9274115
6231 -9274115 -12089931 -15066129 -17950917 -20499802 -22528660 -23952746 -24797981 -25185524 -25296159
6222 -25296159 -25320326 -25404913 -25616815 -25939765 -26302574 -26619302 -26819516 -26857565 -26703671 -26330285
6212 -26330285 -25710067 -24832578 -23728795 -22481047 -21203581 -20000678 -18926748 -17971983 -17079467
6203 -17079467 -16178784 -15213189 -14148625 -12972547 -11698093 -10376190 -9100568 -7990794
6195 -7990794 -7157100 -6666066 -6522089 -6665359 -6981392 -7321382 -7532923 -7491094 -7113595 -6352950
6185 -6352950 -5176679 -3554458 -1462832 1096512 4076617 7374478 10836597 14280915
6177 14280915 17525304 20406779 22782527 24521652 25508452 25669719 25015504 23665900 21841307
6168 21841307 19815634 17853562 16160043 14860168 14008330 13608996 13628280 13988291 14555156
6159 14555156 15140639 15529159 15525308 15005324 13954015 12471724 10743153 8975025 7329162
6150 7329162 5884006 4638822 3544035 2527443 1501690 364330 -989612 -2636804
6142 -2636804 -4590525 -6782714 -9076314 -11305324 -13326574 -15062981 -16524602 -17804412
6134 -17804412 -19052712 -20436906 -22097014 -24110998 -26479766 -29128579 -31912706 -34622336
6126 -34622336 -36997352 -38766122 -39705909 -39701136 -38770932 -37053755 -34759855 -32114469 -29310941
6117 -29310941 -26481233 -23683424 -20905482 -18086860 -15156553 -12078520 -8888662 -5707531
6109 -5707531 -2719911 -124936 1924643 3366290 4233753 4626956 4668711 4473181 4134366
6100 4134366 3726565 3306969 2917860 2588879 2337558 2167671 2071421 2041423 2086909 2238647
6090 2238647 2534513 2996501 3618567 4373770 5233241 6184937 7244897 8456372 9872903
6081 9872903 11528296 13407713 15436637 17492999 19433618 21121193 22442655 23317051
6073 23317051 23697468 23574546 22985452 22023057 20834225 19599942 18499517 17669730 17174930
6064 17174930 17003037 17089923 17355259 17726005 18140680 18550336 18931797 19304890 19728845 20265946
6054 20265946 20928625 21641549 22243748 22536639 22361314 21668849 20543909 19165084 17723748
6045 17723748 16347014 15062269 13811307 12495643 11024457 9343202 7437282 5321740
6037 5321740 3032100 620740 -1848704 -4313221 -6718704 -9011478 -11117257 -12930579
6029 -12930579 -14332526 -15227586 -15571554 -15371434 -14663809 -13493196 -11906504 -9964289 -7757131
6020 -7757131 -5411183 -3072626 -876070 1082702 2749158 4085505 5038458 5523413 5436256
6011 5436256 4686309 3232989 1106990 -1596374 -4749347 -8230028 -11940608 -15791979
6003 -15791979 -19667660 -23400248 -26789065 -29658834 -31927263 -33639643 -34948012 -36046114
5995 -36046114 -37095848 -38181539 -39307561 -40428559 -41487968 -42446564 -43296805 -44065124 -44802270
5986 -44802270 -45563304 -46387096 -47287672 -48258531 -49278458 -50309489 -51290460 -52135251 -52739171
5977 -52739171 -52991260 -52791429 -52072081 -50819880 -49091183 -47018118 -44804155 -42704019 -40982352
5968 -40982352 -39857082 -39446991 -39743189 -40612584 -41831207 -43139771 -44305126 -45162385 -45619463
5959 -45619463 -45631401 -45172129 -44224185 -42783314 -40864386 -38505689 -35777754 -32793572 -29704063
5950 -29704063 -26670374 -23829037 -21277638 -19090894 -17348811 -16148964 -15589989 -15734888
5942 -15734888 -16574210 -18009458 -19869438 -21956296 -24098969 -26185641 -28163837 -30022250
5934 -30022250 -31774981 -33450570 -35070794 -36613453 -37980177 -39000849 -39484257 -39291165
5926 -39291165 -38392000 -36883686 -34961470 -32858062 -30773181 -28821751 -27021745 -25321769
5918 -25321769 -23647968 -21944363 -20190788 -18396815 -16581585 -14756479 -12925777 -11106269
5910 -11106269 -9348943 -7742130 -6390875 -5385460 -4774559 -4547621 -4624237 -4853806 -5035819
5901 -5035819 -4965133 -4489386 -3553517 -2211872 -606869 1070952 2623828 3877517 4698559
5892 4698559 4999626 4737878 3911729 2557028 738332 -1467136 -3986280 -6756227 -9715961
5883 -9715961 -12792957 -15899022 -18940637 -21835773 -24522640 -26951431 -29064058 -30779202
5875 -30779202 -31998532 -32633045 -32631628 -31995739 -30782047 -29105530 -27144568 -25131973 -23318111
5866 -23318111 -21916073 -21058194 -20786042 -21069764 -21833871 -22970990 -24344236 -25793234 -27156429
5857 -27156429 -28306814 -29182993 -29793946 -30187209 -30391036 -30360329 -29960197 -29001972 -27313047
5848 -27313047 -24799447 -21468496 -17410662 -12765026 -7693598 -2374726 2986857 8143415
5840 8143415 12798793 16634314 19369751 20834556 21010294 20023951 18107139 15553706 12692865
5831 12692865 9866302 7388168 5486892 4255214 3638710 3467730 3509108 3510192 3226948
5822 3226948 2445537 1007469 -1161081 -4022846 -7416851 -11070513 -14639052 -17759773
5814 -17759773 -20101337 -21397707 -21472330 -20261603 -17836381 -14410519 -10326134 -6012510
5806 -6012510 -1924255 1527528 4033324 5420270 5664008 4883679 3321903 1304750 -820385
5797 -820385 -2757383 -4319387 -5446662 -6175388 -6573357 -6675480 -6450074 -5809024 -4652621
5788 -4652621 -2922906 -633799 2141296 5315047 8828997 12657068 16762006 21032188
5780 21032188 25240128 29049920 32072594 33944995 34400871 33312403 30697717 26704024
5772 26704024 21581401 15658421 9320511 2981817 -2957552 -8163050 -12406842 -15582619
5764 -15582619 -17693627 -18824267 -19105743 -18685218 -17709069 -16324421 -14687852 -12962390 -11295672
5755 -11295672 -9791009 -8490320 -7380570 -6423325 -5594664 -4912968 -4434547 -4216451 -4267222
5746 -4267222 -4510163 -4772147 -4802416 -4324903 -3120051 -1111606 1582161 4664385 7741665
5737 7741665 10437556 12489830 13797873 14413934 14493168 14223627 13756690 13159522 12408131
5728 12408131 11422605 10123031 8475312 6507914 4300114 1955324 -422735 -2736132
5720 -2736132 -4877803 -6709257 -8054328 -8726199 -8585870 -7608202 -5918051 -3766803 -1453328
5711 -1453328 767541 2736769 4383029 5678258 6596776 7102044 7160961 6772363 5994252
5702 5994252 4957907 3864348 2965772 2535679 2827730 4024333 6185147 9215400 12872542
5693 12872542 16813872 20665996 24085619 26791922 28576027 29308176 28953358 27585105
5685 27585105 25381428 22600655 19548431 16544564 13888324 11818713 10474290 9865012
5677 9865012 9869359 10263182 10775046 11152076 11217736 10909835 10294020 9548509 8915957 8629377
5667 8629377 8837346 9561108 10700442 12077296 13489058 14748945 15708879 16271798 16399358
5658 16399358 16115644 15506503 14714705 13928433 13358265 13203542 13618318 14688243 16420631
5649 16420631 18744386 21521944 24580636 27761849 30968680 34186047 37459297 40838110
5641 40838110 44309118 47748213 50919191 53526125 55298615 56070204 55815752 54638724
5633 54638724 52725508 50295195 47566679 44747986 42036964 39617559 37642060 36200368
5625 36200368 35286314 34777739 34448593 34020588 33239171 31940321 30079326 27717948 24989307
5616 24989307 22062584 19117269 16326205 13845272 11809241 10330602 9493251 9334064
5608 9334064 9815908 10808261 12093501 13404099 14478709 15117926 15225330 14826338 14060185
5599 14060185 13143989 12317784 11788913 11693342 12081035 12923572 14140093 15636733 17348542
5590 17348542 19265644 21427599 23885483 26651915 29669060 32813712 35932456 38878923
5582 38878923 41527366 43760212 45449923 46457714 46655297 45958923 44360642 41945740
5574 41945740 38888375 35420330 31777707 28145524 24625973 21243102 17974268 14786142
5566 14786142 11658080 8589757 5600796 2732566 56191 -2320086 -4258055 -5618084
5558 -5618084 -6298613 -6265630 -5560413 -4292638 -2633103 -808982 910388 2249339 2978439
5549 2978439 2960584 2165819 650702 -1475690 -4070567 -6953928 -9903583 -12673998 -15042450
5540 -15042450 -16862716 -18103366 -18858902 -19330881 -19779469 -20452863 -21514063 -22990629 -24765648
5531 -24765648 -26611953 -28256432 -29451908 -30032444 -29936188 -29195171 -27904482 -26186570 -24162442
5522 -24162442 -21937555 -19605616 -17263958 -15023633 -12999322 -11281885 -9913633 -8884517
5514 -8884517 -8149960 -7657938 -7373186 -7290230 -7426519 -7791569 -8346302 -8983900 -9554910 -9925275
5504 -9925275 -10027298 -9869526 -9505715 -8992454 -8364669 -7634937 -6804162 -5874550 -4869211
5495 -4869211 -3861590 -2998916 -2492358 -2564115 -3374501 -4966255 -7248039 -10016282 -13004951
$$ [...]
##END NTUPLES=NMR SPECTRUM
##END=
