##TITLE=31Pdec_DE-32_oil
 CDCl3
 64 sc
 20.2.2024
##JCAMPDX= 6.0         $$ Bruker NMR JCAMP-DX V2.0
##DATA TYPE= NMR SPECTRUM
##DATA CLASS= NTUPLES
##ORIGIN= UXNMR, Bruker Analytische Messtechnik GmbH
##OWNER= root
$$ XWIN-NMR		Version 3.5
$$ Tue Feb 20 14:03:56 2024 Russian Standard Time (UT+4h)  she@DPX200
##.OBSERVE FREQUENCY= 81.013821
##.OBSERVE NUCLEUS= ^31P
##.ACQUISITION MODE= SIMULTANEOUS
##.ACQUISITION SCHEME= undefined
##.AVERAGES= 64
##.DIGITISER RES= 16
##SPECTROMETER/DATA SYSTEM= spect
##.PULSE SEQUENCE= zgpg30
##.SOLVENT NAME= CDCl3
##.SHIFT REFERENCE= (INTERNAL, CDCl3, 0, 248.564)
##AUDIT TRAIL= $$ (NUMBER, WHEN, WHO, WHERE, WHAT)
$$ ##TITLE= Audit trail, XWIN-NMR		Version 3.5
$$ ##JCAMPDX= 5.01
$$ ##ORIGIN= Bruker BioSpin GmbH
$$ ##OWNER= she
$$ F:/spectra/data/she/nmr/P31/1/pdata/1/auditp.txt
$$ ##AUDIT TRAIL=  $$ (NUMBER, WHEN, WHO, WHERE, WHAT)
(   1,<2024-02-20 13:59:31.70 +0400>,<she>,<DPX200>,
      <created by zg, POWCHK disabled, PULCHK disabled
       configuration hash MD5:
       00 E9 B6 7A A2 85 ED C7 34 08 36 98 17 FE 4E 26
       data hash MD5: 32K
       C4 02 20 45 9F F2 A2 B9 71 61 7F DC 5B 1B 96 7F>)
(   2,<2024-02-20 13:59:37.79 +0400>,<she>,<DPX200>,
      <Start of raw data processing
       efp BC_mod = 2 LB = 10 FT_mod = 6 PKNL = 1 PHC0 = -12796.57 PHC1 = -127.7166 SI = 64K 
       data hash MD5: 64K
       D9 48 5D AC B5 2F 39 97 01 7E 4F 3C F2 CB CE 0D>)
(   3,<2024-02-20 14:00:09.68 +0400>,<she>,<DPX200>,
      <pk PHC0 = 17.65826 PHC1 = 0 
       data hash MD5: 64K
       9E F8 1E 08 69 FC A3 E6 41 B0 08 F2 28 39 2C 11>)
$$ ##END=
$$ 
$$ hash MD5
$$ 9B 0D F1 75 F7 B8 D0 F7 AD EA 1F DE 81 49 B9 A3
##$RELAX= 
##$RELAX= 
##$RELAX= 
##$RELAX= 
##$RELAX= 
##$RELAX= 
##$RELAX= 
##$RELAX= 
##$RELAX= 
$$ Bruker specific parameters
$$ --------------------------
##$DU= <F:/spectra>
##$EXPNO= 1
##$NAME= <P31>
##$PROCNO= 1
##$TYPE= <nmr>
##$USER= <she>
##$AMP= (0..31)
100 100 100 100 100 100 100 100 100 100 100 100 100 100 100 100 100 100 
100 100 100 100 100 100 100 100 100 100 100 100 100 100 
##$AQSEQ= 0
##$AQ_mod= 1
##$AUNM= <au_zg>
##$AUTOPOS= <>
##$BF1= 81.014009
##$BF2= 200.13
##$BF3= 200.13
##$BF4= 200.13
##$BF5= 200.13
##$BF6= 200.13
##$BF7= 200.13
##$BF8= 200.13
##$BYTORDA= 1
##$CFDGTYP= 0
##$CFRGTYP= 5
##$CHEMSTR= <none>
##$CNST= (0..31)
1 1 145 1 1 1 1 1 1 1 1 1 1 1 1 1 1 1 1 1 1 1 1 1 1 1 1 1 1 1 1 1 
##$CPDPRG= <waltz16>
##$CPDPRG1= <>
##$CPDPRG2= <waltz16>
##$CPDPRG3= <>
##$CPDPRG4= <mlev>
##$CPDPRG5= <mlev>
##$CPDPRG6= <mlev>
##$CPDPRG7= <mlev>
##$CPDPRG8= <mlev>
##$CPDPRGB= <>
##$CPDPRGT= <>
##$D= (0..31)
0 1 0 0 0 0 0 0 0 0 0 0.03 2e-05 3e-06 0 0 0 0 0 0 0 0 0 0 0 0 0 0 0 0 
0 0 
##$DATE= 1708423171
##$DBL= (0..7)
120 120 120 11 120 120 24 19 
##$DBP= (0..7)
150 150 150 150 150 150 150 150 
##$DBP07= 0
##$DBPNAM0= <>
##$DBPNAM1= <>
##$DBPNAM2= <>
##$DBPNAM3= <>
##$DBPNAM4= <>
##$DBPNAM5= <>
##$DBPNAM6= <>
##$DBPNAM7= <>
##$DBPOAL= (0..7)
0.5 0.5 0.5 0.5 0.5 0.5 0.5 0.5 
##$DBPOFFS= (0..7)
$$ [...]
##$SUBNAM2= <"">
##$SUBNAM3= <"">
##$SUBNAM4= <"">
##$SUBNAM5= <"">
##$SUBNAM6= <"">
##$SUBNAM7= <"">
##$SUBNAM8= <"">
##$SUBNAM9= <"">
##$SW= 501.771253377433
##$SWIBOX= (0..15)
0 1 3 0 0 0 0 0 0 0 0 0 0 0 0 0 
##$SW_h= 40650.406504065
##$TD= 32768
##$TD0= 1
##$TE= 0
##$TE2= 300
##$TE3= 300
##$TEG= 300
##$TL= (0..7)
0 120 53 12 22 120 120 120 
##$TP= (0..7)
150 150 150 150 150 150 150 150 
##$TP07= 0
##$TPNAME0= <>
##$TPNAME1= <>
##$TPNAME2= <>
##$TPNAME3= <>
##$TPNAME4= <>
##$TPNAME5= <>
##$TPNAME6= <>
##$TPNAME7= <>
##$TPOAL= (0..7)
0.5 0.5 0.5 0.5 0.5 0.5 0.5 0.5 
##$TPOFFS= (0..7)
0 0 0 0 0 0 0 0 
##$TUNHIN= 0
##$TUNHOUT= 0
##$TUNXOUT= 0
##$USERA1= <user>
##$USERA2= <user>
##$USERA3= <user>
##$USERA4= <user>
##$USERA5= <user>
##$V9= 5
##$VALIST= <valist>
##$VCLIST= <CCCCCCCCCCCCCCC>
##$VD= 0
##$VDLIST= <DDDDDDDDDDDDDDD>
##$VPLIST= <PPPPPPPPPPPPPPP>
##$VTLIST= <TTTTTTTTTTTTTTT>
##$WBST= 1024
##$WBSW= 4
##$XGAIN= (0..3)
0 0 0 0 
##$XL= 0
##$YL= 0
##$YMAX_a= 2873
##$YMIN_a= -1718
##$ZGOPTNS= <>
##$ZL1= 120
##$ZL2= 120
##$ZL3= 120
##$ZL4= 120
##$ABSF1= 0
##$ABSF2= 0
##$ABSG= 0
##$ABSL= 0
##$ALPHA= 0
##$AQORDER= 0
##$ASSFAC= 0
##$ASSFACI= 0
##$ASSFACX= 0
##$ASSWID= 0
##$AUNMP= <proc_1d>
##$AZFE= 0.1
##$AZFW= 0.5
##$BCFW= 0
##$BC_mod= 2
##$BYTORDP= 0
##$COROFFS= 0
##$CY= -3
##$DATMOD= 1
##$DC= 0
##$DFILT= <>
##$DTYPP= 0
##$F1P= 0
##$F2P= 0
##$FCOR= 1
##$FTSIZE= 65536
##$FT_mod= 6
##$GAMMA= 0
##$GB= 0
##$INTBC= 1
##$INTSCL= 6.047779e-11
##$ISEN= 30
##$LB= 10
##$LEV0= 0
##$LPBIN= 0
##$MAXI= 10000
##$MC2= 0
##$MEAN= 0
##$ME_mod= 0
##$MI= 50
##$NCOEF= 0
##$NC_proc= -11
##$NLEV= 6
##$NOISF1= 182.463
##$NOISF2= 159.3651
##$NSP= 0
##$NTH_PI= 0
##$NZP= 0
##$OFFSET= 248.5645
##$PC= 4
##$PHC0= -12778.91
##$PHC1= -127.7166
##$PH_mod= 1
##$PKNL= yes
##$PPARMOD= 0
##$PSCAL= 0
##$PSIGN= 0
##$REVERSE= no
##$SF= 81.0140089999694
##$SI= 65536
##$SIGF1= 159.3651
##$SIGF2= -187.1042
##$SINO= 113.3802
##$SIOLD= 16384
##$SREGLST= <1H.CDCl3>
##$SSB= 0
##$STSI= 65536
##$STSR= 0
##$SW_p= 40650.406504065
##$SYMM= 0
##$S_DEV= 0
##$TDeff= 32768
##$TDoff= 0
##$TI= <>
##$TILT= no
##$TM1= 0
##$TM2= 0
##$TOPLEV= 0
##$USERP1= <user>
##$USERP2= <user>
##$USERP3= <user>
##$USERP4= <user>
##$USERP5= <user>
##$WDW= 1
##$XDIM= 65536
##$YMAX_p= 339249396
##$YMIN_p= -269804996
$$ End of Bruker specific parameters
$$ ---------------------------------
##NTUPLES= NMR SPECTRUM
##VAR_NAME=  FREQUENCY,     SPECTRUM/REAL,   SPECTRUM/IMAG
##SYMBOL=    X,             R,               I
##VAR_TYPE=  INDEPENDENT,   DEPENDENT,       DEPENDENT
##VAR_FORM=  AFFN,          ASDF,            ASDF
##VAR_DIM=   65536,         65536,           65536
##UNITS=     HZ,            ARBITRARY UNITS, ARBITRARY UNITS
##FACTOR=    0.620285442955139, 1,           1
##FIRST=     20137.2065510682, 0,            0
##LAST=      -20513.1999529968, 0,           0
##MIN=       -20513.1999529968, -269804996,  0
##MAX=       20137.2065510682, 339249396,    0
$$ Real data points
##PAGE= N=1
##DATA TABLE= (X++(R..R)), XYDATA
$$ [...]
12331a2633246K424296K247314J886801J448383J020619O46760L23969L0175k40792
12322b845721m61679n79636n34868k77232K15360R13954J728045K526626L180897
12313C865746L595885L714617L511118K992977K210252J252876K31116p48945
12305B0625642j602634k274828k742949l016973l135078l151965l119496l067270
12297a485551k996604k894234k755032k593941k436637k297231k162247j996109
12289b1617586j767690j480187j180532r37361p99603p61173p51874o59164l72359
12280c0327529J67904R37511J832022K705300L422759L901942M125333M128196
12272i106562L972781L719184L401682L020857K558756K010274J408939Q27158
$$ plain form
12331 -12633246 -10208950 -7961636 -6074835 -4626452 -3605833 -2959073 -2635104 -2604929 -2845721
12322 -2845721 -3307400 -3887036 -4421904 -4699136 -4483776 -3569822 -1841777 684849 3865746
12313 3865746 7461631 11176248 14687366 17680343 19890595 21143471 21374587 20625642
12305 20625642 19023008 16748180 14005231 10988258 7853180 4701215 1581719 -1485551
12297 -1485551 -4482155 -7376389 -10131421 -12725362 -15161999 -17459230 -19621477 -21617586
12289 -21617586 -23385276 -24865463 -26045995 -26983356 -27782959 -28544132 -29296006 -29955170 -30327529
12280 -30327529 -30159625 -29222114 -27390092 -24684792 -21262033 -17360091 -13234758 -9106562
12272 -9106562 -5133781 -1414597 1987085 5007942 7566698 9576972 10985911 11813069
12264A1813069L51625N2984l3260Q6962L66543P22923J053244J259058J273392
12255A6946540J080708P22200K83446j32015m33753n70747n46906m20847k86460
12246A6642166k39840l48798o37269j081088j606466k097091k425325k503862
12238E702427k324788j952838j477189r62800m39519P1373N28653Q73935J064331
12229A083585J101459J026765Q87122P03140M66813J65239j94660n81842r59565
12220C698056j311069j651293k012338k409592k811128l132128l260461l102431
12212a5992384k627835j891174j014531j39141O25166J222734J641502J889745
12204a6285918J984501J957893J867833J793677J808436J940198K150815K353337
$$ plain form
12264 11813069 12164694 12217678 12184418 12271380 12637923 13360846 14414090 15673148 16946540
12255 16946540 18027248 18749448 19032894 18900879 18467126 17896379 17349473 16928626 16642166
12246 16642166 16402326 16053528 15416259 14335171 12728705 10631614 8206289 5702427
12238 5702427 3377639 1424801 -52388 -1015188 -1454707 -1383334 -854681 19254 1083585
12229 1083585 2185044 3211809 4098931 4802071 5268884 5434123 5239463 4657621 3698056
12220 3698056 2386987 735694 -1276644 -3686236 -6497364 -9629492 -12889953 -15992384
12212 -15992384 -18620219 -20511393 -21525924 -21665065 -21039899 -19817165 -18175663 -16285918
12204 -16285918 -14301417 -12343524 -10475691 -8682014 -6873578 -4933380 -2782565 -429228
12196d29228K461294K436616K304100K126848J964086J840033J739921J629493
12188A6073163J479501J276401J015498O90073K92522j71556o70689j150278j551211
12179A7283424j832715j986334k034725k017434j971165j912970j832826j700210
12171A995045j486189j193343q74309o20214n20987o23769r17263j345142j828372
12162g414543k278850k606763k732850k605543k210936j569985p33190K14938
12154b1937722J147503J905179K337986K362729J999711J364432O22425o3786
12146a0261543n73517q48803r00262p96024o32079m93686m25492m21785m35331
12137a5788522l97326k43537N7297M81238R45672J332535J532311J487919J213628
$$ plain form
12196 -429228 2032066 4468682 6772782 8899630 10863716 12703749 14443670 16073163
12188 16073163 17552664 18829065 19844563 20534636 20827158 20655602 19984913 18834635 17283424
12179 17283424 15450709 13464375 11429650 9412216 7441051 5528081 3695255 1995045
12171 1995045 508856 -684487 -1558796 -2179010 -2699997 -3323766 -4241029 -5586171 -7414543
12162 -7414543 -9693393 -12300156 -15033006 -17638549 -19849485 -21419470 -22152660 -21937722
12154 -21937722 -20790219 -18885040 -16547054 -14184325 -12184614 -10820182 -10197757 -10261543
12146 -10261543 -10835060 -11683863 -12584125 -13380149 -14012228 -14505914 -14931406 -15353191 -15788522
12137 -15788522 -16185848 -16429385 -16372088 -15890850 -14945178 -13612643 -12080332 -10592413 -9378785
12128i378785P78338K66338k57023p55353j209326j600956j909549k120422k235838
12119a8422576k277384k277813k268228k266621k269846k250753k166207j979423
12111c6178851j687466j333871r93653p39748o14677o23365p43120r36199j157087
12102d5008037j358323j500925j567627j569828j541565j523110j544113j614844
12094e7228372j725610j847411j928905j895071j659641j155852l72091O30443
12086f7182510J730035K777880L634131M195091M410225M289573L899397L345186
12078c8900992K744981K198430J759563J425540J151428Q85888O05408L25029
12070b7804725Q4131p5430j23399m7561J40481M01936O79630R20333J095481J202851
$$ plain form
12128 -9378785 -8600447 -8334109 -8591132 -9346485 -10555811 -12156767 -14066316 -16186738 -18422576
12119 -18422576 -20699960 -22977773 -25246001 -27512622 -29782468 -32033221 -34199428 -36178851
12111 -36178851 -37866317 -39200188 -40193841 -40933589 -41548266 -42171631 -42914751 -43850950 -45008037
12102 -45008037 -46366360 -47867285 -49434912 -51004740 -52546305 -54069415 -55613528 -57228372
12094 -57228372 -58953982 -60801393 -62730298 -64625369 -66285010 -67440862 -67812953 -67182510
12086 -67182510 -65452475 -62674595 -59040464 -54845373 -50435148 -46145575 -42246178 -38900992
12078 -38900992 -36156011 -33957581 -32198018 -30772478 -29621050 -28735162 -28129754 -27804725
12070 -27804725 -27720594 -27796024 -27919423 -27966984 -27826503 -27424567 -26744937 -25824604 -24729123 -23526272
12060b3526272J249390J234049J147812R89958P85056N85236M52598M28896N10278
12051a6142999O45296P58882P84919O87593M68402J67212j42287l71758m50736
12042a3595476l53992j06945K28697N76417Q66056J050759J111950J048874Q65508
12033h308152N73125K07167j63971m54900n94967n53827l49382m1379K83727N34817
12023h867742O40646N66519L15136q4446n86663j129951j634222k009103k177339
12014a4967165k100980j792382j303645p03513n5912N90776J201801J745095K179714
12005a5206211K453522K514411K329634J901776J271955N08488l12078j120579
11997e659082j859979k481316k940556l204110l261160l132181k863476k508093
$$ plain form
12060 -23526272 -22276882 -21042833 -19895021 -18905063 -18120007 -17534771 -17082173 -16653277 -16142999
12051 -16142999 -15497703 -14738821 -13953902 -13266309 -12797907 -12630695 -12772982 -13144740 -13595476
12042 -13595476 -13949468 -14056413 -13827716 -13251299 -12385243 -11334484 -10222534 -9173660 -8308152
12033 -8308152 -7735027 -7527860 -7691831 -8146731 -8741698 -9295525 -9644907 -9686286 -9402559 -8867742
12023 -8867742 -8227096 -7660577 -7345441 -7429887 -8016550 -9146501 -10780723 -12789826 -14967165
12014 -14967165 -17068145 -18860527 -20164172 -20867685 -20923597 -20332821 -19131020 -17385925 -15206211
12005 -15206211 -12752689 -10238278 -7908644 -6006868 -4734913 -4226425 -4538503 -5659082
11997 -5659082 -7519061 -10000377 -12940933 -16145043 -19406203 -22538384 -25401860 -27909953
11989b7909953k105761j676183j227551p68306l10967J29284N31079Q57273J050636
11980c1430449J045645P94762K96867l86972j141329j828459k330270k577831
11972c7558036k555510k286120j813588j193519m91125K19142Q58133J354754
11964d3465869J665207J789160J771903J689987J627696J653844J803954K069295
11956b9394823K394584K687882K845150K785096K479619J962708J314081O33020
11948a2292683K1035m24817o21328n18917j22512N00964J233152J929055K451615
11939g844436K709394K682578K422354K024802J597654J236429J009728R45532
11931F784035J020178J162530J279921J295644J178434R49968O68434L96542J69278
$$ plain form
11989 -27909953 -30015714 -31691897 -32919448 -33687754 -33998721 -33869437 -33338358 -32481085 -31430449
11980 -31430449 -30384804 -29590042 -29293175 -29680147 -30821476 -32649935 -34980205 -37558036
11972 -37558036 -40113546 -42399666 -44213254 -45406773 -45897898 -45678756 -44820623 -43465869
11964 -43465869 -41800662 -40011502 -38239599 -36549612 -34921916 -33268072 -31464118 -29394823
11956 -29394823 -27000239 -24312357 -21467207 -18682111 -16202492 -14239784 -12925703 -12292683
11948 -12292683 -12271648 -12696465 -13317793 -13836710 -13959222 -13458258 -12225106 -10296051 -7844436
11939 -7844436 -5135042 -2452464 -30110 1994692 3592346 4828775 5838503 6784035
11931 6784035 7804213 8966743 10246664 11542308 12720742 13670710 14339144 14735686 14904964
11922A4904964k2043k21271m80783q31671j263346j718961k110379k352050k401174
11913C503286k281028k071197j871032j760364j778682j927214k184036k517950
11905a2888217k890883l248744l513792l596245l429813l011619k414408j753414
11897c6747135j123571n48297K3227O66810J416882K229975L000062L607405L962718
11888b3511924M022982L784186L270315K531004J646362P28656r1996p04469j063584
11879i388468j214717j268601j335017j460273j611389j712255j701831j577997
11871b1270548j405528j285175j299827j469422j743512k031619k242189k302490
11863c5050310k160518j788871j198324m45997L79477J193114J947327K642734
$$ plain form
11922 14904964 14882921 14661650 14180867 13349196 12085850 10366889 8256510 5904460 3503286
11913 3503286 1222258 -848939 -2719971 -4480335 -6259017 -8186231 -10370267 -12888217
11905 -12888217 -15779100 -19027844 -22541636 -26137881 -29567694 -32579313 -34993721 -36747135
11897 -36747135 -37870706 -38419003 -38395776 -37728966 -36312084 -34082109 -31082047 -27474642 -23511924
11888 -23511924 -19488942 -15704756 -12434441 -9903437 -8257075 -7528419 -7620415 -8324884 -9388468
11879 -9388468 -10603185 -11871786 -13206803 -14667076 -16278465 -17990720 -19692551 -21270548
11871 -21270548 -22676076 -23961251 -25261078 -26730500 -28474012 -30505631 -32747820 -35050310
11863 -35050310 -37210828 -38999699 -40198023 -40644020 -40264543 -39071429 -37124102 -34481368
11855c4481368L310456L977676M636275N230796N671074N863542N748487N328297
11847E285235M673437L900574L130776K447714J877322J398329R74983N89588
11839B4277958K52678j4803k09947l59005m98510o43243p72888q53433q76816
11830B0301991q84465r52751j148194j482924j900876k304147k601462k746411
11822F280761k743606k627484k435990k195655j917619j598149j223842p84497
11814i246081k88083K34205P36958J175255J515491J741757J861248J905771J920988
11805A557509J941197J961572J927926J757310J383167Q00078Q0971o43161j228866
11796I537703j569112j628032j452428j156465q82537p51814q25488j093745j493926
$$ plain form
11855 -34481368 -31170912 -27193236 -22556961 -17326165 -11655091 -5791549 -43062 5285235
11847 5285235 9958672 13859246 16990022 19437736 21315058 22713387 23688370 24277958
11839 24277958 24530636 24515833 24305886 23946881 23448371 22805128 22032240 21178807 20301991
11830 20301991 19417526 18464775 17316581 15833657 13932781 11628634 9027172 6280761
11822 6280761 3537155 909671 -1526319 -3721974 -5639593 -7237742 -8461584 -9246081
11814 -9246081 -9534164 -9299959 -8563001 -7387746 -5872255 -4130498 -2269250 -363479 1557509
11805 1557509 3498706 5460278 7388204 9145514 10528681 11328759 11409730 10766569 9537703
11796 9537703 7968591 6340559 4888131 3731666 2849129 2097315 1271827 178082 -1315844
11787a315844j942627k360893k682173k850845k827468k605614k225671j766633
11779b0577768j315051r33559o52805m86368m43656n20850o81971q62781j008103
11770b7482912j109664j202219j317741j442115j512236j447065j181463o86470
11762c7381885K1034Q79627J801952K703357L518458M195661M685572M943720
11754a4632504M947009M707252M270177L700836L062102K395520J715933J024113
11746A1190438L25968l59770j010670j614361k172605k693174l176552l605369
11738c116095l941937m137895m155594l991987l689247l320842k958516k642216
11730c1954329k374807k143231j945373j799859j733846j760851j861894j976640
$$ plain form
11787 -1315844 -3258471 -5619364 -8301537 -11152382 -13979850 -16585464 -18811135 -20577768
11779 -20577768 -21892819 -22826378 -23479183 -23965551 -24409207 -24930057 -25612028 -26474809 -27482912
11770 -27482912 -28592576 -29794795 -31112536 -32554651 -34066887 -35513952 -36695415 -37381885
11762 -37381885 -37360851 -36481224 -34679272 -31975915 -28457457 -24261796 -19576224 -14632504
11754 -14632504 -9685495 -4978243 -708066 2992770 6054872 8450392 10166325 11190438
11746 11190438 11516406 11156636 10145966 8531605 6359000 3665826 489274 -3116095
11738 -3116095 -7058032 -11195927 -15351521 -19343508 -23032755 -26353597 -29312113 -31954329
11730 -31954329 -34329136 -36472367 -38417740 -40217599 -41951445 -43712296 -45574190 -47550830
11722d7550830k009847j858374j454420q04409K232Q24458J524932K017437K281035
11713d7027786K339640K229095J978909J618198J190852P56218L67086M1738k43797
11704c6749847n32776q49857j176012j452229j606070j583085j368356r92193
11696d6310425n20595l5898L83353O76342Q08989P83914O49854M97484M30415
11687d2636567N19821P70280J121177J482005J775146J959356K028158J996552
11679c0984072J889470J734190J553348J359912J159299R59974P87326O92465
11671b0848088P47963J025650J560751K319578L192076M017653M632144M913994
11663A561721M813194M357420L636074K767050J857677R76937J52405o09093j293997
$$ plain form
11722 -47550830 -49560677 -51419051 -52873471 -53677880 -53675648 -52851190 -51326258 -49308821 -47027786
11713 -47027786 -44688146 -42459051 -40480142 -38861944 -37671092 -36914874 -36547788 -36506050 -36749847
11704 -36749847 -37282623 -38132480 -39308492 -40760721 -42366791 -43949876 -45318232 -46310425
11696 -46310425 -46831020 -46866918 -46483565 -45807223 -44998234 -44214320 -43564466 -43066982 -42636567
11687 -42636567 -42116746 -41346466 -40225289 -38743284 -36968138 -35008782 -32980624 -30984072
11679 -30984072 -29094602 -27360412 -25807064 -24447152 -23287853 -22327879 -21540553 -20848088
11671 -20848088 -20100125 -19074475 -17513724 -15194146 -12002070 -7984417 -3352273 1561721
11663 1561721 6374915 10732335 14368409 17135459 18993136 19970073 20122478 19513385 18219388
11654A8219388j868889k291395k536330k617469k589304k526921k495612k527298
11646a233830k615692k729070k827601k872672k828141k664053k369859j970739
11638b2111657j533193j150806r11948q60256r64490j115526j160036r61909m64363
11629c1234184K78534J118077J867494K371378K555813K440545K116674J708695
11621a6776974J338959J100975J039977J141979J338491J530734J624350J557704
11613f103805J313679R17813M28605q0225n44947r31966j235683j454296j567328
11604i258153j539406j348926j016283o08668k19860N9214J62859O0297k42191
11595a3951117o98914j222261j690503j975868j987308j705831j191093n56136
$$ plain form
11654 18219388 16350499 14059104 11522774 8905305 6316001 3789080 1293468 -1233830
11646 -1233830 -3849522 -6578592 -9406193 -12278865 -15107006 -17771059 -20140918 -22111657
11638 -22111657 -23644850 -24795656 -25707604 -26567860 -27532350 -28647876 -29807912 -30769821 -31234184
11629 -31234184 -30955650 -29837573 -27970079 -25598701 -23042888 -20602343 -18485669 -16776974
11621 -16776974 -15438015 -14337040 -13297063 -12155084 -10816593 -9285859 -7661509 -6103805
11613 -6103805 -4790126 -3872313 -3443708 -3523933 -4068880 -5000846 -6236529 -7690825 -9258153
11604 -9258153 -10797559 -12146485 -13162768 -13771436 -13991296 -13932082 -13769223 -13708926 -13951117
11595 -13951117 -14650031 -15872292 -17562795 -19538663 -21525971 -23231802 -24422895 -24979031
11587b4979031P4268O01088R70900J174220J226589J143608R25551N62943O0089
11578a8239775n42161j165462j719833k139822k407149k547903k609992k634974
11570c4007071k637011k597386k477177k240695j873664j383838p87637r8693
11562d8103172O69929J492568K318623L070609L656495L995410M048507L837825
11554b5013206L437888K944127K441522J992899J642473J416824J318625J325925
11546h492923J405137J526905J671219J824893J983440K156367K362309K610574
11538G047921K884923L144724L339139L418930L341042L074964K617361K006829
11530C0875833J323388O66085J18429k78890n33218o83622p76857q50304r26326
$$ plain form
11587 -24979031 -24904763 -24303675 -23332775 -22158555 -20931966 -19788358 -18862807 -18299864 -18239775
11578 -18239775 -18781936 -19947398 -21667231 -23807053 -26214202 -28762105 -31372097 -34007071
11570 -34007071 -36644082 -39241468 -41718645 -43959340 -45833004 -47216842 -48004479 -48103172
11562 -48103172 -47433243 -45940675 -43622052 -40551443 -36894948 -32899538 -28851031 -25013206
11554 -25013206 -21575318 -18631191 -16189669 -14196770 -12554297 -11137473 -9818848 -8492923
11546 -8492923 -7087786 -5560881 -3889662 -2064769 -81329 2075038 4437347 7047921
11538 7047921 9932844 13077568 16416707 19835637 23176679 26251643 28869004 30875833
11530 30875833 32199221 32865306 32983735 32704845 32171627 31488005 30711148 29860844 28934518
11521B8934518j012416j100369j164723j167530j074456q75723n95675k80735
11513B1662891K4971K94854N14287O64258P13972O32298M10438P7644l05599o76431
11503B4013583r99857j275129j515020j722266j888070k009058k096624k162939
11495A0344620k196057k150029j963947j600751j080414m82372Q8178N48257Q66431
11486B373916J058359J162151J217464J258810J315593J407073J529454J644204
11478A2967024J682230J570976J273318Q13079K67899k67101p21271j070946j332701
11469A5182507j537833j710376j865569k025188k228492k521150k927328l428323
11461c061752l966292m469244m875924n142265n231044n103366m727465m099515
$$ plain form
11521 28934518 27922102 26821733 25657010 24489480 23415024 22539301 21943626 21662891
11513 21662891 21687862 21982716 22497003 23161261 23875233 24507531 24917969 24995613 24690014 24013583
11503 24013583 23013726 21738597 20223577 18501311 16613241 14604183 12507559 10344620
11495 10344620 8148563 5998534 4034587 2433836 1353422 871050 959228 1507485 2373916
11486 2373916 3432275 4594426 5811890 7070700 8386293 9793366 11322820 12967024
11478 12967024 14649254 16220230 17493548 18306627 18574526 18307425 17586154 16515208 15182507
11469 15182507 13644674 11934298 10068729 8043541 5815049 3293899 366571 -3061752
11461 -3061752 -7028044 -11497288 -16373212 -21515477 -26746521 -31849887 -36577352 -40676867
11453d0676867l256383k268612j221963k02227P15178J479637K083581K568575
11445d0779081L005603L457480L947697M452127M908518N229366N314305N069854
11437e394131M438721L425359K102882O02090r05542k227359l179676l629900
11429d767556l533645k946197k003624q85143K29357J195733J925817K386605
11421h398653K586368K562174K373155K090555J778848J477035J194124R21187
11413F584793O49915L87151J60117Q626l7394J4715J10599J73453J50654M5292
11403H247921r5239k22603l23812m22818n54315p36452r61314j204655j445670
11394B281043j682506j928601k187048k421879k554017k491826k178919j631446
$$ plain form
11453 -40676867 -43933250 -46201862 -47423825 -47626052 -46910874 -45431237 -43347656 -40779081
11445 -40779081 -37773478 -34315998 -30368301 -25916174 -21007656 -15778290 -10463985 -5394131
11437 -5394131 -955410 2469949 4572831 5174921 4269379 2042020 -1137656 -4767556
11429 -4767556 -8301201 -11247398 -13251022 -14136165 -13906808 -12711075 -10785258 -8398653
11421 -8398653 -5812285 -3250111 -876956 1213599 2992447 4469482 5663606 6584793
11413 6584793 7234708 7621859 7781976 7790602 7753208 7767923 7878522 8051975 8202629 8247921
11403 8247921 8152682 7930079 7606267 7183449 6629134 5892682 4931368 3726713 2281043
11394 2281043 598537 -1330064 -3517112 -5938991 -8493008 -10984834 -13163753 -14795199
11386a4795199r46329k75566K26488M62044M24474J88644j33809m42888o76936
11377a5969077q16210q76743r01765r45435j044774j191055j322243j347576j191699
11368b5606577q31840l09188K85095Q36705J236413J405801J319615J019071O04230
11359b0040675J99035r8043k49072k76987k37421j85219j51872j35604j03071
11350b1278929m820J98319N10549Q90904J260997J526822J607321J458606J082742
11341a2747489N20700j59264q69670j513331k001752k277666k328230k181663
11333b3558365j891388j516809j110194p16043l79314j47387n4006r3135k05334
11324b9671975k91763k51163k1788L91548R20040J464041J938014K298115K536536
$$ plain form
11386 -14795199 -15741528 -16017094 -15790606 -15328562 -14904088 -14715444 -14849253 -15292141 -15969077
11377 -15969077 -16785287 -17662030 -18563795 -19509230 -20554004 -21745059 -23067302 -24414878 -25606577
11368 -25606577 -26438417 -26747605 -26462510 -25625805 -24389392 -22983591 -21663976 -20644905 -20040675
11359 -20040675 -19841640 -19939683 -20188755 -20465742 -20703163 -20888382 -21040254 -21175858 -21278929
11350 -21278929 -21283749 -21085430 -20574881 -19683977 -18422980 -16896158 -15288837 -13830231 -12747489
11341 -12747489 -12226789 -12386053 -13255723 -14769054 -16770806 -19048472 -21376702 -23558365
11333 -23558365 -25449753 -26966562 -28076756 -28792799 -29172113 -29319500 -29373506 -29466641 -29671975
11324 -29671975 -29963738 -30214901 -30236689 -29845141 -28925101 -27461060 -25523046 -23224931 -20688395
11315b0688395K653381K632868K444108K066198J518331Q70638K25739l15502
11307h592634o80147q30829p64921n17933j68252J71853L87953M08975K42821
11298a0343114k2920k63646l84255l69938k89798k53620l51028o07471r75543
11289a3861333j359262j654241j782423j707444j431465r85419m23138J81124
11281b3023601P40323J173145J428331J501150J430795J279009J102037R30917
11273a3437894P68814O03971M28902K54252J10041L4673N7380J80946L71809N65221
11263a0061885O88148O90375N64863L44712Q2628j68667l62779m57633m19588
11254i099826k40609M1782L41927N52821N93094M47488J74549j26014l68949n28752
$$ plain form
11315 -20688395 -18035014 -15402146 -12958038 -10891840 -9373509 -8502871 -8277132 -8592634
11307 -8592634 -9272781 -10103610 -10868531 -11386464 -11554716 -11382863 -10994910 -10585935 -10343114
11298 -10343114 -10366034 -10629680 -11013935 -11383873 -11673671 -11927291 -12278319 -12885790 -13861333
11289 -13861333 -15220595 -16874836 -18657259 -20364703 -21796168 -22781587 -23204725 -23023601
11281 -23023601 -22283278 -21110133 -19681802 -18180652 -16749857 -15470848 -14368811 -13437894
11273 -13437894 -12669080 -12065109 -11636207 -11381955 -11271914 -11237241 -11179861 -10998915 -10627106 -10061885
11263 -10061885 -9373737 -8683362 -8118499 -7773787 -7691159 -7859826 -8222605 -8680238 -9099826
11254 -9099826 -9340435 -9298653 -8956726 -8403905 -7810811 -7363323 -7188774 -7314788 -7683737 -8212489
11244h212489o46247p92688j016212j305635j590732j771639j755656j484796
11236a8576094r51151k03947O52831J481382K153976K602831K841668K937434
11228g061070K950455K889315K713284K374808J866526J239844N84247j7852n28110
11219G011447r53067j311974j606168j820268j948058k009892k041893k069050
11211f748923k086591k061962j953378j733022j402324r92703n56788j60312J24195
11202a7571808K31222J27002j68315n79181r97875j320102j476806j451084j275325
11193b4482272j011077p22359m56339k39025q3552k062j1971j31988l70336p12617
11183b8223598j116284j515071j833386k007288k003779j828909j521557j137991
$$ plain form
11244 -8212489 -8858736 -9651424 -10667636 -11973271 -13564003 -15335642 -17091298 -18576094
11236 -18576094 -19527245 -19731192 -19078361 -17596979 -15443003 -12840172 -9998504 -7061070
11228 -7061070 -4110615 -1221300 1491984 3866792 5733318 6973162 7557409 7539557 7011447
11219 7011447 6058380 4746406 3140238 1319970 -628088 -2637980 -4679873 -6748923
11211 -6748923 -8835514 -10897476 -12850854 -14583876 -15986200 -16978903 -17535691 -17696003 -17571808
11202 -17571808 -17340586 -17213584 -17381899 -17961080 -18958955 -20279057 -21755863 -23206947 -24482272
11193 -24482272 -25493349 -26215708 -26672047 -26911072 -26994624 -26996686 -27008657 -27140645 -27510981 -28223598
11183 -28223598 -29339882 -30854953 -32688339 -34695627 -36699406 -38528315 -40049872 -41187863
11175d1187863p34621l54745k5105K35025M00938M42552L42486J15566j89665
11166d0955432n06175p63753q97296q55782o15363j86674L90823J058460J740155
11157d1591037K340666K756113K902162K745832K319656J707506J009667L08561
11149b5500874l44664r20258j393501j739904j943568k006887j951959j812389
11141c7614004j617677j376098j070003o76779k07450K69828O49786Q45651Q39290
11132c9957456O89444M97704L62528L50506M90224P75586J167751J598108J979529
11123c2046076K225783K271521K087496J690501J145671N53830K1538l74263o06638
11114b3030637o93524o75354n93879m84112l77502l06155k99039l68097m91375
$$ plain form
11175 -41187863 -41922484 -42277229 -42302334 -42067309 -41666371 -41223819 -40881333 -40765767 -40955432
11166 -40955432 -41461607 -42225360 -43122656 -43978438 -44593801 -44780475 -44389652 -43331192 -41591037
11157 -41591037 -39250371 -36494258 -33592096 -30846264 -28526608 -26819102 -25809435 -25500874
11149 -25500874 -25845538 -26765796 -28159297 -29899201 -31842769 -33849656 -35801615 -37614004
11141 -37614004 -39231681 -40607779 -41677782 -42354561 -42562011 -42292183 -41642397 -40796746 -39957456
11132 -39957456 -39268012 -38770308 -38407780 -38057274 -37567050 -36791464 -35623713 -34025605 -32046076
11123 -32046076 -29820293 -27548772 -25461276 -23770775 -22625104 -22071274 -22049736 -22423999 -23030637
11114 -23030637 -23724161 -24399515 -24993394 -25477506 -25855008 -26161163 -26460202 -26828299 -27319674
11105b7319674o07831o36382n14614k31512J72269O35365J107523J555573J949276
11096b3890007K253357K437148K487888K412668K233434J986905J727429J519403
11088f831775J415416J433302J549331J713124J874415K002906K086766K114236
11080G357721K061285J904051J646999J336849J044442Q28275P09447O74460O97243
11071A8260772P58351Q44925R34100R79614R20128P06713L27957j84295p66033
11062B2782232j337504j821417k164614k356616k431149k445406k448385k457130
11054E320011k453280k399545k263461k031288j704234j286661p82144k01104
11046g801706M30246J067923J653426K120284K408823K489706K381394K142647
$$ plain form
11105 -27319674 -27927505 -28563887 -29078501 -29310013 -29137744 -28502379 -27394856 -25839283 -23890007
11096 -23890007 -21636650 -19199502 -16711614 -14298946 -12065512 -10078607 -8351178 -6831775
11088 -6831775 -5416359 -3983057 -2433726 -720602 1153813 3156719 5243485 7357721
11080 7357721 9419006 11323057 12970056 14306905 15351347 16179622 16889069 17563529 18260772
11071 18260772 19019123 19864048 20798148 21777762 22697890 23404603 23732560 23548265 22782232
11062 22782232 21444728 19623311 17458697 15102081 12670932 10225526 7777141 5320011
11054 5320011 2866731 467186 -1796275 -3827563 -5531797 -6818458 -7600602 -7801706
11046 -7801706 -7371460 -6303537 -4650111 -2529827 -121004 2368702 4750096 6892743
11038F892743J839588J509679J148536P28045K32602l10670q27439j220073j404217
11029H588794j337069j027841n34991M3307N86871R82834J160340J113274Q95641
11020A0471160N90159K68311l4775l18359n93160q55729j077289j213174j226027
11011F011117j108281q91061o36380m19731l11880l62787n86586r50838j379168
11002f35595j772762k043835k144522k077594j887586j641775j411486j257941
10994a4873096j221130j310824j502538j742194j960320k093028k104026j997843
10986b8804999j814636j607275j416621j262936j153870j092094j070459j062619
10978c9285509j025440r15600p07026l97607p260M24594Q40835J173676J361416
$$ plain form
11038 6892743 8732331 10242010 11390546 12118591 12351193 12040523 11213084 9993011 8588794
11029 8588794 7251725 6223884 5688893 5732200 6319071 7301905 8462245 9575519 10471160
11020 10471160 11061319 11329630 11294855 10976496 10383336 9527607 8450318 7237144 6011117
11011 6011117 4902836 4011775 3375395 2955664 2643784 2280997 1694411 743573 -635595
11002 -635595 -2408357 -4452192 -6596714 -8674308 -10561894 -12203669 -13615155 -14873096
10994 -14873096 -16094226 -17405050 -18907588 -20649782 -22610102 -24703130 -26807156 -28804999
10986 -28804999 -30619635 -32226910 -33643531 -34906467 -36060337 -37152431 -38222890 -39285509
10978 -39285509 -40310949 -41226549 -41933575 -42331182 -42338442 -41913848 -41073013 -39899337 -38537921
10969c8537921J370523J210704R31042N97615K69340q894j95556k45448j24138
10960c4732733J66094N77845J042024J503897J938756K335193K666032K877124
10952b1625768K905713K714624K318007J782951J207089O84594K77266L601j52024
10943i883947k20568k35181k29703k39618k91750l82724m64764m58019k87406
10934a2693680Q0130O20928J264381J912964K462335K822014K935794K791800
10926B196666K414566J847533J142146L57087m44112j204407j883503k452996
10918A972980k879251l112804l098384k800239k224791j425867m90792M83490
10910a3575658J411784K231999K906320L416067L754061L917859L907174L725997
$$ plain form
10969 -38537921 -37167398 -35956694 -35025652 -34428037 -34158697 -34167591 -34363147 -34608595 -34732733
10960 -34732733 -34566639 -33988794 -32946770 -31442873 -29504117 -27168924 -24502892 -21625768
10952 -21625768 -18720055 -16005431 -13687424 -11904473 -10697384 -10012790 -9735524 -9731923 -9883947
10943 -9883947 -10104515 -10339696 -10569399 -10809017 -11100767 -11483491 -11948255 -12406274 -12693680
10934 -12693680 -12613550 -11992622 -10728241 -8815277 -6352942 -3530928 -595134 2196666
10926 2196666 4611232 6458765 7600911 7957998 7513886 6309479 4425976 1972980
10918 1972980 -906271 -4019075 -7117459 -9917698 -12142489 -13568356 -14059148 -13575658
10910 -13575658 -12163874 -9931875 -7025555 -3609488 144573 4062432 7969606 11695603
10902A1695603L385940K908070K325141J685703J054169M98770O9858k16827l79609
10893B3026818m54267m71767m39885l36866j24864K16940O57344J104235J437194
10884B4614882J567302J487296J278626J069846R73619J041669J258941J567447
10876C4859628J895500K177801K367143K441108K401195K262291K037542J726802
10868E2169010J313434P71012Q0133p49391j663170k565668l343681l899034m176238
10859C7936407m175410l947693l576638l152052k742234k370721k008441j593075
10851A4370143j072814m48821K13946Q13514J251934J463898J426420J158390
10843A9176610P15092J74629l83658q99045j336102j676039j902079j992401j927476
$$ plain form
10902 11695603 15081543 17989613 20314754 22000457 23054626 23553396 23623254 23406427 23026818
10893 23026818 22572551 22100784 21660899 21324033 21199169 21416109 22073453 23177688 24614882
10884 24614882 26182184 27669480 28948106 30017952 30991571 32033240 33292181 34859628
10876 34859628 36755128 38932929 41300072 43741180 46142375 48404666 50442208 52169010
10868 52169010 53482444 54253456 54333589 53584198 51921028 49355360 46011679 42112645 37936407
10859 37936407 33760997 29813304 26236666 23084614 20342380 17971659 15963218 14370143
10851 14370143 13297329 12848508 13062454 13875968 15127902 16591800 18018220 19176610
10843 19176610 19891702 20066331 19682673 18783628 17447526 15771487 13869408 11877007 9949531
10834I949531j705660j353060r19696m66527n2479K75951M94763O09974O55823
10825G488620O80700P25316Q00982Q77654Q92759P83476N25095J46730k87313
10816A2634019p11525j080098j366164j552284j626184j584894j443894j245089
10808B023887j053597r37421r40277j068371j299024j596384j916864k206377
10800h994428k404372k459984k349967k087554j720252j317429r47264o49081
10792b2930331m18511k20183k1868J76185L40659M34516M53712M42464M73052
10783b1270305O01612Q29406J095020J300372J351958J195806Q35649L32839k11553
10774a3939196o88798j016194j156438j116607r35050o68369l82951j47186j8931
$$ plain form
10834 9949531 8243871 6890811 5971115 5504588 5452109 5728060 6222823 6832797 7488620
10825 7488620 8169320 8894636 9695618 10573272 11466031 12249507 12774602 12921332 12634019
10816 12634019 11922494 10842396 9476232 7923948 6297764 4712870 3268976 2023887
10808 2023887 970290 32869 -907408 -1975779 -3274803 -4871187 -6788051 -8994428
10800 -8994428 -11398800 -13858784 -16208751 -18296305 -20016557 -21333986 -22281250 -22930331
10792 -22930331 -23348842 -23569025 -23590893 -23414708 -23074049 -22639533 -22185821 -21743357 -21270305
10783 -21270305 -20668693 -19839287 -18744267 -17443895 -16091937 -14896131 -14060482 -13727643 -13939196
10774 -13939196 -14627994 -15644188 -16800626 -17917233 -18852283 -19520652 -19903603 -20050789 -20069720
10765b0069720k7966j61922l69744n88096p74463r19354j028549j097963j109784
10756b6147561j051017r30171p74102o10692m52697k91155j00830J41598M34145
10747b9782482P39041R97763J162651J221977J202445J150275J103898J075342
10739b1129090J053194J024528R94649R83835J003651J036801J039764R66137
10731a3026531P95383N52477L07856J52346J56025L34883O45035J001140J301063
10722g780323J448298J377755J083556O28686J19038l45165p03914r36376j040426
10713f148871j024527r20298p93176p28002p93436j010085j341783j710899k027124
10704a6498201k217729k247180k116556j844356j444739r21568k82099M42652
$$ plain form
10765 -20069720 -20097686 -20259608 -20629352 -21217448 -21991911 -22911265 -23939814 -25037777 -26147561
10756 -26147561 -27198578 -28128749 -28902851 -29513543 -29966240 -30257395 -30358225 -30216627 -29782482
10747 -29782482 -29043441 -28045678 -26883027 -25661050 -24458605 -23308330 -22204432 -21129090
10739 -21129090 -20075896 -19051368 -18056719 -17072884 -16069233 -15032432 -13992668 -13026531
10731 -13026531 -12231148 -11678671 -11370815 -11218469 -11062444 -10727561 -10082526 -9081386 -7780323
10722 -7780323 -6332025 -4954270 -3870714 -3242028 -3122990 -3468155 -4172069 -5108445 -6148871
10713 -6148871 -7173398 -8093696 -8886872 -9614874 -10408310 -11418395 -12760178 -14471077 -16498201
10704 -16498201 -18715930 -20963110 -23079666 -24924022 -26368761 -27290329 -27572428 -27129776
10696b7129776J187200J857868K354410K601063K576289K324847J940247J525006
10688a0762846J154390Q64938O65148N48754M98622M86565M77805M38536L39901
10679e288187J58644j19102m88718r18507j348748j701821j902788j905076j709652
10670a5223955j365108r46043n22639j41570J70674L90592M88626M41836K56641
10661a6450946k5700l53078o97322j070125j509941k053739k710896l446267m174759
10652c2492773m771157n095913n031250m519547l593620k382127j075112J41300
10644e8820199J143816J889050K389058K677147K791282K774899K678995K556574
10636c9919378K453433K400768K409163K462425K516723K515031K418353K237041
$$ plain form
10696 -27129776 -25942576 -24084708 -21730298 -19129235 -16552946 -14228099 -12287852 -10762846
10688 -10762846 -9608456 -8743518 -8078370 -7529616 -7030994 -6544429 -6066624 -5628088 -5288187
10679 -5288187 -5129543 -5248645 -5737363 -6655870 -8004618 -9706439 -11609227 -13514303 -15223955
10670 -15223955 -16589063 -17535106 -18057745 -18199315 -18028641 -17638049 -17149423 -16707587 -16450946
10661 -16450946 -16476646 -16829724 -17527046 -18597171 -20107112 -22160851 -24871747 -28318014 -32492773
10652 -32492773 -37263930 -42359843 -47391093 -51910640 -55504260 -57886387 -58961499 -58820199
10644 -58820199 -57676383 -55787333 -53398275 -50721128 -47929846 -45154947 -42475952 -39919378
10636 -39919378 -37465945 -35065177 -32656014 -30193589 -27676866 -25161835 -22743482 -20506441
10628b0506441K036256J903945J899717K021381K213445K407328K557988K649977
10620b816404K679632K643326K548623K430806K344445K326240K360683K381978
10612A6899329K312905K109921J782175J375420R38195M99437P4656l10810o11124
10603B5070104p77255p85603o50935m18585j52164P3942J86309J35154q4759m33439
10593B2162769q46723j263463j644152j976270k267309k528095k753948k914964
10585E967845k962448k847911k543704k054280j413528o72529J12029Q81081J570428
10576c963017K112009K446083K540286K404156K089742J677463J253632Q87884
10568A1448238O16115M31404K85264J02969j86854o18238j168629j769423k342438
$$ plain form
10628 -20506441 -18470185 -16566240 -14666523 -12645142 -10431697 -8024369 -5466381 -2816404
10620 -2816404 -136772 2506554 5055177 7485983 9830428 12156668 14517351 16899329
10612 16899329 19212234 21322155 23104330 24479750 25417945 25917382 25992038 25681228 25070104
10603 25070104 24292849 23507246 22856311 22437726 22285562 22359504 22545813 22680967 22596208 22162769
10593 22162769 21316046 20052583 18408431 16432161 14164852 11636757 8882809 5967845
10585 5967845 3005397 157486 -2386218 -4440498 -5854026 -6526555 -6414526 -5533445 -3963017
10576 -3963017 -1851008 595075 3135361 5539517 7629259 9306722 10560354 11448238
10568 11448238 12064353 12495757 12781021 12883990 12697136 12078898 10910269 9140846 6798408
10559F798408k838693l252954l605338l905504m126938m209955m090388l733420
10551b2964782l151699k401745j568433p49914m5570M59098P13837P22448N42893
10542b8443867K61054m9405l54830o59929r84438j341120j728129k129259k511720
10533c7941643k824215l005961l008856k822183k485817k083419j716001j467712
10525e7355807j382977j466238j696422k039799k454974k895176l311112l653181
10517g6255686l876619l955871l903399l777136l668323l677395l888559m347112
10509a07350100n043956n916136o865194p782850q573187r169210r543137r707357
10501a69951127r708976r625878r560519r614977r842873j0197587j0499445j0429833
$$ plain form
10559 6798408 3959715 706761 -2898577 -6804081 -10931019 -15140974 -19231362 -22964782
10551 -22964782 -26116481 -28518226 -30086659 -30836573 -30882143 -30423045 -29709208 -28986760 -28443867
10542 -28443867 -28182813 -28232218 -28587048 -29246977 -30231415 -31572535 -33300664 -35429923 -37941643
10533 -37941643 -40765858 -43771819 -46780675 -49602858 -52088675 -54172094 -55888095 -57355807
10525 -57355807 -58738784 -60205022 -61901444 -63941243 -66396217 -69291393 -72602505 -76255686
10517 -76255686 -80132305 -84088176 -87991575 -91768711 -95437034 -99114429 -103002988 -107350100
10509 -107350100 -112394056 -118310192 -125175386 -132958236 -141531423 -150700633 -160243770 -169951127
10501 -169951127 -179660103 -189285981 -198846500 -208461477 -218304350 -228501937 -239001382 -249431215
10493b49431215r554589p380203l438989K595859J0739169K0467023L0565608
10486b05437337L9289465M4919871M6463259M4030679L8657210L1753731K4590156
10479F4267034J8044093J2579522Q325148N181901K937431J359206K44112n64124
10471A12374323j168758j624118j954927k179833k323718k418840k502408k611317
10463I5590404k772754k996057l270883l569871l854494m086136m237928m296145
10455F6506136m250822m091074l814953l442241l013288k573286k154167j763481
10447D1402824j384681r91952n73786j45616K63794O40961J001440J372877J762269
10438D3348130K136302K429427K570529K508370K224491J736607J098603L94310
$$ plain form
10493 -249431215 -258985804 -266366007 -269804996 -267209137 -256469968 -236002945 -205437337
10486 -205437337 -166147872 -121228001 -74764742 -30734063 7923147 39676878 64267034
10479 64267034 82311127 94890649 103215797 108397698 111335129 112694335 112938447 112374323
10471 112374323 111205565 109581447 107626520 105446687 103122969 100704129 98201721 95590404
10463 95590404 92817650 89821593 86550710 82980839 79126345 75040209 70802281 66506136
10455 66506136 62255314 58164240 54349287 50907046 47893758 45320472 43166305 41402824
10447 41402824 40018143 39026191 38452405 38306789 38570583 39211544 40212984 41585861 43348130
10438 43348130 45484432 47913859 50484388 52992758 55217249 56953856 58052459 58446769
10430E8446769k81184q47617j257484j498309j588017j571502j511395j462945
10422D8428316j442196j413834j315555j105971q01673m74496k10357o2319l4590
10413D1567325j02674k39111m15096n85282o89018o82663n78101m50518m06007
10404C7418855n31867q58649j347219j899807k390270k706053k786775k640925
10396B2257290k332655j949139j567575j233835r54107o99074m22287q8798L01042
10387A3310862P09563J085133J395811J650134J889585K156386K458283K754795
10379B7410552K973408L042933K924018K625639K206685J762129J391436J155106
10371D5491906J040915R65735Q18721N19829N4604n31711j162676j753704k223562
$$ plain form
10430 58446769 58165585 57317968 56060484 54562175 52974158 51402656 49891261 48428316
10422 48428316 46986120 45572286 44256731 43150760 42349087 41874591 41664234 41601915 41567325
10413 41567325 41464651 41225540 40810444 40225162 39536144 38853481 38275380 37824862 37418855
10404 37418855 36886988 36028339 34681120 32781313 30391043 27684990 24898215 22257290
10396 22257290 19924635 17975496 16407921 15174086 14219979 13520905 13098618 13009820 13310862
10387 13310862 14020425 15105558 16501369 18151503 20041088 22197474 24655757 27410552
10379 27410552 30383960 33426893 36350911 38976550 41183235 42945364 44336800 45491906
10371 45491906 46532821 47498556 48317277 48837106 48891710 48359999 47197323 45443619 43220057
10362D3220057k508135k580764k462406k207226j874288j509158j144359q07561
10354B8126160n24996l19147k05071j87079k55647l85094n31490o31086o06073
10345B4480477l87572M6759O43434J279156J806578K114589K169402K019958J773391
10336C5946172J554053J457081J509680J658986J797974J816142J643274J264272
10328D8647634P09773M0426o67071j336615j913835k383571k772802l134350l514863
10319C3674726l919566m294294m542385m573115m352966l925892l391514k860648
10311A814346k418758k113027j956643j935918k014942k142941k268065k352852
10303a5388800k383009k365319k316146k245228k142119j974042j699525j292869
$$ plain form
10362 43220057 40711922 38131158 35668752 33461526 31587238 30078080 28933721 28126160
10354 28126160 27601164 27282017 27076946 26889867 26634220 26249126 25717636 25086550 24480477
10345 24480477 24092905 24139664 24783098 26062254 27868832 29983421 32152823 34172781 35946172
10336 35946172 37500225 38957306 40466986 42125972 43923946 45740088 47383362 48647634
10328 48647634 49357407 49397833 48730762 47394147 45480312 43096741 40323939 37189589 33674726
10319 33674726 29755160 25460866 20918481 16345366 11992400 8066508 4674994 1814346
10311 1814346 -604412 -2717439 -4674082 -6610000 -8624942 -10767883 -13035948 -15388800
10303 -15388800 -17771809 -20137128 -22453274 -24698502 -26840621 -28814663 -30514188 -31807057
10295c1807057p66519j77077L92317Q66548J210121J436535J593637J739479J920678
10286b3591338K153144K406110K603745K657627K517498K204599J801622J408228
10278e838765J095990Q91115P87488P71199Q35468R79434J199668J485267J818547
10269D025411K176763K531996K849654L086798L193919L126738K868394K448642
10261B6308315J942947J449225J056359Q18446P39320P69685Q23042Q10685O81002
10252C5399026M41672J53948r5432k30133k13685o3249J55143L47094M20290L16696
10242C6631370L5333l65190p86999j126976j309849j308897j149855q99339o42697
10233B9076901m58238l95489m64719o41977q86021j156379j423388j670126j890496
$$ plain form
10295 -31807057 -32573576 -32750653 -32358336 -31491788 -30281667 -28845132 -27251495 -25512016 -23591338
10286 -23591338 -21438194 -19032084 -16428339 -13770712 -11253214 -9048615 -7246993 -5838765
10278 -5838765 -4742775 -3851660 -3064172 -2292973 -1457505 -478071 721597 2206864 4025411
10269 4025411 6202174 8734170 11583824 14670622 17864541 20991279 23859673 26308315
10261 26308315 28251262 29700487 30756846 31575292 32314612 33084297 33907339 34718024 35399026
10252 35399026 35840698 35994646 35899214 35669081 35455396 35392147 35547290 35894384 36314674 36631370
10242 36631370 36666703 36301513 35514514 34387538 33077689 31768792 30618937 29719598 29076901
10233 29076901 28618663 28223174 27758455 27116478 26230457 25074078 23650690 21980564 20090068
10224B0090068k083247k240056k334295k323660k170988j870976j464377j030037
10216D572432o58273m19028l42053m18436o15076q84279j163460j379294j467928
10207b775395j399642j185393q60597m64870l6621L78874P23992R37839R77432
10198c704381Q37631N55994J98018j68113m91574p43938r12635r92937r83709
10189f405644q83648o85643l76631M6458N49596J048832J434740J625684J611308
10180b034948J451722J233621J017915Q17343O17334M18621K61277K05286K82859
10171D271030M65823O77340Q36816R02396Q85303Q34124Q02441Q19106Q80242
10162A1374621R68789J083783J250701J502461J850053K269599K712848L125919
$$ plain form
10224 20090068 18006821 15766765 13432470 11108810 8937822 7066846 5602469 4572432
10216 4572432 3914159 3495131 3153078 2734642 2119566 1235287 71827 -1307467 -2775395
10207 -2775395 -4175037 -5360430 -6221027 -6685897 -6722518 -6343644 -5619652 -4681813 -3704381
10198 -3704381 -2866750 -2310756 -2112738 -2280851 -2772425 -3516363 -4428998 -5421935 -6405644
10189 -6405644 -7289292 -7974935 -8351566 -8305108 -7755512 -6706680 -5271940 -3646256 -2034948
10180 -2034948 -583226 650395 1668310 2485653 3102987 3521608 3782885 3988171 4271030
10171 4271030 4736853 5414193 6251009 7153405 8038708 8872832 9675273 10494379 11374621
10162 11374621 12343410 13427193 14677894 16180355 18030408 20300007 23012855 26138774
10154B6138774L459753L671477L727281L611757L335925K934240K452317J934976
10146E1266500J417448R15271M16202j11108o87424j294920j880544k391545k810570
10137D4839310l157920l460086l712334l866761l858127l651973l280067k833874
10129A7018168k418431k100042j882721j720921j549051j303795r30854l85426
10121D726927L59052J290403K339381L383604M279681M907477N200886N150301
10113C1637712M782888M141809L283584K293186J294234M29432j88109n21279
10105D7153457o17276n71022m73044l81728l34909l77758n69227r52860j516266
10096D1359367k175650k797801l241928l398610l215924k709869j954962j056686
$$ plain form
10154 26138774 29598527 33270004 36997285 40609042 43944967 46879207 49331524 51266500
10146 51266500 52683948 53599219 54015421 53904313 53216889 51921969 50041425 47649880 44839310
10137 44839310 41681390 38221304 34508970 30642209 26784082 23132109 19852042 17018168
10129 17018168 14599737 12499695 10616974 8896053 7347002 6043207 5112353 4726927
10121 4726927 5085979 6376382 8715763 12099367 16379048 21286525 26487411 31637712
10113 31637712 36420600 40562409 43845993 46139179 47433413 47862845 47674736 47153457
10105 47153457 46536181 45965159 45492115 45110387 44775478 44397720 43828493 42875633 41359367
10096 41359367 39183717 36385916 33143988 29745378 26529454 23819585 21864623 20807937
10088B0807937j20592P65120J531229K124794K511625K682837K659055K487938
10080C5449943K234566J967260J742749J593704J519598J483284J419019J255557
10072D8665680R48000N02505k1088n31774r43339j204611j310499j294579j213454
10063D3596841j129645j092408j118418j184418j243143j256012j219147j164030
10055C4189620j135739j166975j262362j394932j511071j542990j428566j133098
10047B3613887o63564o9522N68778J162076J639444J971222K173006K285174K342243
10038C5022744K355291K317517K222450K077500J904093J726186J554526J376363
10030E0556670J158676Q64989M76961R537m88354r51355j329198j615161j849894
$$ plain form
10088 20807937 20687345 21452465 22983694 25108488 27620113 30302950 32962005 35449943
10080 35449943 37684509 39651769 41394518 42988222 44507820 45991104 47410123 48665680
10072 48665680 49613680 50116185 50095097 49563323 48619984 47415373 46104874 44810295 43596841
10063 43596841 42467196 41374788 40256370 39071952 37828809 36572797 35353650 34189620
10055 34189620 33053881 31886906 30624544 29229612 27718541 26175551 24746985 23613887
10047 23613887 22950323 22880801 23449579 24611655 26251099 28222321 30395327 32680501 35022744
10038 35022744 37378035 39695552 41918002 43995502 45899595 47625781 49180307 50556670
10030 50556670 51715346 52580335 53057296 53066833 52578479 51627124 50297926 48682765 46832871
10021D6832871k094835k393897k749493l123822l458150l696425l801385l756096
10013B1758768l555185l202285k724936k193222j712921j383209j246201j268581
10005D472228j368843j466120j514466j505379j448838j355481j234055j099215
9997f520169r73369q73518p93944p06710n87534m45815l26268k74187k93629l36739
9987a2131882l31679k21122J8991L82667Q39529J330237J761768K023093K027240
9978d301158J758896J292134P59425K90369l7100k04092k25381j22423Q4128L66356
9968c38846O83247R90362J263739J522002J825673K245388K814468L495110M178317
9959A8679460M715867M967434M843861M332531L498047K461105J366860L55453
$$ plain form
10021 46832871 44738036 42344139 39594646 36470824 33012674 29316249 25514864 21758768
10013 21758768 18203583 15001298 12276362 10083140 8370219 6987010 5740809 4472228
10005 4472228 3103385 1637265 122799 -1382580 -2831418 -4186899 -5420954 -6520169
9997 -6520169 -7493538 -8367056 -9161000 -9867710 -10455244 -10901059 -11227327 -11501514 -11795143 -12131882
9987 -12131882 -12463561 -12684683 -12665692 -12283025 -11443496 -10113259 -8351491 -6328398 -4301158
9978 -4301158 -2542262 -1250128 -490703 -200334 -237434 -441526 -666907 -789330 -705202 -338846
9968 -338846 344401 1334763 2598502 4120504 5946177 8191565 11006033 14501143 18679460
9959 18679460 23395327 28362761 33206622 37539153 41037200 43498305 44865165 45220618
9951D5220618m58894j000932j242492j205250r53919n76761j57936K45664O11054
9942D0481152R38636J236720J514671J786034K069760K379325K706236L016280
9934E6128814L266881L431981L513719L535391L526544L510759L498647L487614
9926H3900350L471249L453515L454833L503071L617196L796625M023079M274136
9918A13494054M540941M836271N183715N599347O089593O670351P383666Q289124
9910A62087062R435634J0835546J2452658J4202724J5962611J7578683J8858332
9903B61413250J9539433J9255607J7527195J3816078P697833q31146j1040466
9896C27377784k1424027l0124319l5664302l7523532l6185979l2707385k8176365
$$ plain form
9951 45220618 44761724 43760792 42518300 41313050 40359131 39782370 39624434 39870098 40481152
9942 40481152 41419788 42656508 44171179 45957213 48026973 50406298 53112534 56128814
9934 56128814 59395695 62827676 66341395 69876786 73403330 76914089 80412736 83900350
9926 83900350 87371599 90825114 94279947 97783018 101400214 105196839 109219918 113494054
9918 113494054 118034995 122871266 128054981 133654328 139743921 146414272 153797938 162087062
9910 162087062 171522696 182358242 194810900 209013624 224976235 242554918 261413250
9903 261413250 280952683 300208290 317735485 331551563 339249396 338418250 327377784
9896 327377784 305953757 275829438 240165136 202641604 166455625 133748240 105571875
9889A05571875k3396470j8842371j4755486j1248683q369802o122018m457972
9882A8379073l276504k443923j834297j364208j002146p48804o00200n20283m48672
9873F140036l40229j98816p0203j82K623l1104n8628n2944r511O4921J62761K73836
9861E882560L79248M54597M82508M61260M01761L18120K18979J01555m8245k44032
9851H408311m80125p23425r27943j062353j129458j164815j215557j308831j426392
9842a030588j504056j460710j238004q24258k53699M08114J080322J681495K144061
9833i97323K426319K518380K440067K231440J940014J611191J284141R88835P42199
9824A5185263N49214M12135L36366L19092L27344K91317J28375k15253p31658
$$ plain form
9889 105571875 82175405 63333034 48577548 37328865 28959063 22837045 18379073
9882 18379073 15102569 12658646 10824349 9460141 8457995 7709191 7108991 6588708 6140036
9873 6140036 5799807 5600991 5530788 5530606 5533229 5502125 5443497 5390553 5381042 5445963 5608724 5882560
9861 5882560 6261808 6716405 7198913 7660173 8061934 8380054 8599033 8700588 8652343 8408311
9851 8408311 7928186 7204761 6276818 5214465 4085007 2920192 1704635 395804 -1030588
9842 -1030588 -2534644 -3995354 -5233358 -6057616 -6311315 -5903201 -4822879 -3141384 -997323
9833 -997323 1428996 3947376 6387443 8618883 10558897 12170088 13454229 14443064 15185263
9824 15185263 15734477 16146612 16482978 16802070 17129414 17420731 17549106 17333853 16602195
9815A6602195j344434j930853k366766k575448k550703k336234j979268j500807
9807A7682r07802k29820M59349J057017J471567J657764J626642J429072J127613
9798G709084P75336M12462P6845j86719l30843l23003j64457J01701L98774O39359
9788I108539P54924P18623N48590K90305q921l16429o15144q94973j144736j350446
9778G090332j499968j589309j624155j614626j569259j496033j409254j332352
9770e044624j290350j297402j348762j419052j463075j420087j227808q46566
9762a5357726k81386M13321J149938J832709K376330K712826K793947K597844
9754a762197K139190J472684O82900j34509q88763j502037j914300k089625k021267
$$ plain form
9815 16602195 15257761 13326908 10960142 8384694 5833991 3497757 1518489 17682
9807 17682 -890120 -1119940 -660591 396426 1867993 3525757 5152399 6581471 7709084
9798 7709084 8484420 8896882 8973727 8787008 8456165 8133162 7968705 8070406 8469180 9108539
9788 9108539 9863463 10582086 11130676 11420981 11412060 11095631 10480487 9585514 8440778 7090332
9778 7090332 5590364 4001055 2376900 762274 -806985 -2303018 -3712272 -5044624
9770 -5044624 -6334974 -7632376 -8981138 -10400190 -11863265 -13283352 -14511160 -15357726
9762 -15357726 -15639112 -15225791 -14075853 -12243144 -9866814 -7153988 -4360041 -1762197
9754 -1762197 376993 1849677 2532577 2398068 1509305 7268 -1907032 -3996657 -6017924
9745f017924j731223j266155o93977r8111M38443Q57427J142377J314631J412437
9736d642075J468998J498072J484577J381527J124965O71928M1875o71441j331429
9727A026997j812275k038910j995167j709732j240381o66595q5065M02471P11524
9718g407133P97307O62797L46698r9797o32125j218850j837819k468322l083762
9709a4941006l648013m118497m454900m626958m616311m416147m035658l507221
9701d8364711k884448k224287j563365r07538k43272M38294J121451J761419K297362
9692e0569095K677975K888377K962055K966156K964988K983335K992394K925271
9684b7208544K711010K309817J736296J063182M02945j27350m42850n12086l54766
$$ plain form
9745 -6017924 -7749147 -9015302 -9709279 -9807390 -9368947 -8511520 -7369143 -6054512 -4642075
9736 -4642075 -3173077 -1675005 -190428 1191099 2316064 2987992 3029867 2358426 1026997
9727 1026997 -785278 -2824188 -4819355 -6529087 -7769468 -8436063 -8521128 -8118657 -7407133
9718 -7407133 -6609826 -5947029 -5600331 -5700128 -6332253 -7551103 -9388922 -11857244 -14941006
9709 -14941006 -18589019 -22707516 -27162416 -31789374 -36405685 -40821832 -44857490 -48364711
9701 -48364711 -51249159 -53473446 -55036811 -55944349 -56187621 -55749327 -54627876 -52866457 -50569095
9692 -50569095 -47891120 -45002743 -42040688 -39074532 -36109544 -33126209 -30133815 -27208544
9684 -27208544 -24497534 -22187717 -20451421 -19388239 -18985294 -19112644 -19555494 -20067580 -20422346
9675b0422346k1639M31198R61606J546029K167781K797522L381012L844631M116733
9666a197473M154902L968157L622824L221696K858480K571396K328262K054203
9658B3582447J679947J177210N66296r5470p30489j257808j611341j758015j709794
9649A9842983j522356j277659j056721r17009q85554r64907j139253j374875j622624
9640I082025j831045j966189k024665k030905k020426k018243k023644k010333
9632f843425j941725j789487j542332j204404p93216l41738J03017M92384P93631
9623a3067295R98668J117465J164122J148775J081004R78246Q66633P68780O87737
9614d255865O03494M86800L17027Q8620j92784n10896q30847j095142j237997
$$ plain form
9675 -20422346 -20443985 -20012787 -19051181 -17505152 -15337371 -12539849 -9158837 -5314206 -1197473
9666 -1197473 2957429 6925586 10548410 13770106 16628586 19199982 21528244 23582447
9658 23582447 25262394 26439604 27005900 26910430 26179941 24922133 23310792 21552777 19842983
9649 19842983 18320627 17042968 15986247 15069238 14183684 13218777 12079524 10704649 9082025
9640 9082025 7250980 5284791 3260126 1229221 -791205 -2809448 -4833092 -6843425
9632 -6843425 -8785150 -10574637 -12116969 -13321373 -14114589 -14456327 -14353310 -13860926 -13067295
9623 -13067295 -12068627 -10951162 -9787040 -8638265 -7557261 -6579015 -5712382 -4943602 -4255865
9614 -4255865 -3652371 -3165571 -2848544 -2759924 -2952708 -3463604 -4294451 -5389593 -6627590
9605f627590j215475j032097p45333m45931k28498j69501l17878o89712j258662
9596a2730677j947379k633981l179316l464645l423475l057831k435882j670554
9588c4543740q84643j77603L89337P87000J004958J047685R43473P54297N71191
9579c0108045M89094N70536Q18929J181166J582935J976125K363264K775598L217785
9570a5132613L625095L874487L847170L496452K873019K098014J310743O23486
9562F615853R8711k51375m49083n29075n21425m46181l15620j36852Q6291L46897
9552D498141O23352Q72593J041193J092980J032398R00354P42709N78855L97839
9543A1780414J80815p6558l62117o59564r55185j230727j453712j581137j579460
$$ plain form
9605 -6627590 -7843065 -8875162 -9620495 -10066426 -10294924 -10464425 -10782303 -11472015 -12730677
9596 -12730677 -14678056 -17312037 -20491353 -23955998 -27379473 -30437304 -32873186 -34543740
9588 -34543740 -35428383 -35605986 -35216649 -34429649 -33424691 -32377006 -31433533 -30679236 -30108045
9579 -30108045 -29618951 -29048415 -28229486 -27048320 -25465385 -23489260 -21125996 -18350398 -15132613
9570 -15132613 -11507518 -7633031 -3785861 -289409 2583610 4681624 5992367 6615853
9562 6615853 6714564 6463189 6014106 5485031 4963606 4517425 4201805 4064953 4151244 4498141
9552 4498141 5121493 5994086 7035279 8128259 9160657 10061011 10803720 11382575 11780414
9543 11780414 11961229 11884671 11522554 10862990 9907805 8677078 7223366 5642229 4062769
9534D062769j447085j220478r56064o99519m65764k45178k9773J64294K98452
9525e38346L37985K82490J77099R6857J15951K78993N83206R73839J357150J634310
9515E299534J745538J699207J566034J441929J401190J461289J570853J625167
9507A7810741J505586J126841M69534m15341j425471k437200l337263m049600
9499I247827m547932m846959m977981m966794m828324m576318m234621l838870
9491b7569972l428415l036048k682737k379014k128910j930556j771240j621068
9483d6547960j432823j152365p36917j73863N07684J238220J923951K472786K818480
9474d1082807K931964K819599K518189K093640J637736J252539J022911R91368
$$ plain form
9534 4062769 2615684 1395206 439142 -260377 -726141 -971319 -1001092 -836798 -538346
9525 -538346 -200361 82129 259228 356085 472036 751029 1334235 2308074 3665224 5299534
9515 5299534 7045072 8744279 10310313 11752242 13153432 14614721 16185574 17810741
9507 17810741 19316327 20443168 20912702 20497361 19071890 16634690 13297427 9247827
9499 9247827 4699895 -147064 -5125045 -10091839 -14920163 -19496481 -23731102 -27569972
9491 -27569972 -30998387 -34034435 -36717172 -39096186 -41225096 -43155652 -44926892 -46547960
9483 -46547960 -47980783 -49133148 -49870065 -50043928 -49536244 -48298024 -46374073 -43901287 -41082807
9474 -41082807 -38150843 -35331244 -32813055 -30719415 -29081679 -27829140 -26806229 -25814861
9466b5814861J148623J439943J779772K071475K233119K223288K053496J780308
9458a1084837J485459J256094J166802J258899J521972J892457K276177K582245
9450B355268K746966K736325K532035K116419J472155O02451m42147j556396k606467
9441I956609l474146m088256m426811m499082m326839l935823l357490k634618
9433b0786456j821694r75392j42926O37048J319237J841450K139480K182325J999383
9424a3607545J675456J315382J002421P76432O41272N88355O11770P01598Q28500
9415e466359R46014J019050J054938J104193J224011J431479J681015J878820
9407D873161J921395J735999J306295O74758p7909q64490j614565k276976k808849
$$ plain form
9466 -25814861 -24666238 -23226295 -21446523 -19375048 -17141929 -14918641 -12865145 -11084837
9458 -11084837 -9599378 -8343284 -7176482 -5917583 -4395611 -2503154 -226977 2355268
9450 2355268 5102234 7838559 10370594 12487013 13959168 14561619 14119472 12563076 9956609
9441 9956609 6482463 2394207 -2032604 -6531686 -10858525 -14794348 -18151838 -20786456
9433 -20786456 -22608150 -23583542 -23726468 -23089420 -21770183 -19928733 -17789253 -15606928 -13607545
9424 -13607545 -11932089 -10616707 -9614286 -8837854 -8196582 -7608227 -6996457 -6294859 -5466359
9415 -5466359 -4520345 -3501295 -2446357 -1342164 -118153 1313326 2994341 4873161
9407 4873161 6794556 8530555 9836850 10511608 10433699 9569209 7954644 5677668 2868819
9398B868819l170897l339093l321402l159756k911330k623930k325050k028329
9390b0010968j743106j472471j202995r03729n44905j24653L19686P26579J039148
9381b3917414J224711J273071J182714R55721O12846K15911j31591l21678k98053
9372a9203762r0346J99397M46803N57071M90664K57719j03974n46017j008963
9363a9001408j411792j652717j634845j305870o85527J36529J028172J850496
9355b2676962K487342K864136K957807K798773K461997K044905J638112J302043
9347d121847J059156R00883Q01366P30421O60375N65293M18853K01529q2479l94862
9337G38688o75851q74490r71779r78223r10674p69440n34661j86871K61298P47073
$$ plain form
9398 2868819 -302078 -3641171 -6962573 -10122329 -13033659 -15657589 -17982639 -20010968
9390 -20010968 -21754074 -23226545 -24429540 -25333269 -25878174 -26002827 -25683141 -24956562 -23917414
9381 -23917414 -22692703 -21419632 -20236918 -19281197 -18668351 -18452440 -18584031 -18905709 -19203762
9372 -19203762 -19294108 -19094711 -18647908 -18090837 -17600173 -17342454 -17446428 -17992445 -19001408
9363 -19001408 -20413200 -22065917 -23700762 -25006632 -25692159 -25555630 -24527458 -22676962
9355 -22676962 -20189620 -17325484 -14367677 -11568904 -9106907 -7062002 -5423890 -4121847
9347 -4121847 -3062691 -2161808 -1360442 -630021 30354 595647 1014500 1216029 1133550 738688
9337 738688 62837 -811653 -1783432 -2761655 -3672329 -4441769 -4976430 -5163301 -4902003 -4154930
9327d154930J171405J438835J497343J356030J078008P58412M96306L66476L98799
9318D406684N72560Q27242J085254J278926J371644J363770J282041J161381J029086
9309A4378588Q94229P41681N34286K27079k10914p78751j437813k119359k743981
9300I485045l249164l613054l857005m020581m125175m153048m054573l773532
9292b1361087l272740k552476j662778p05854J81116Q63199J248225J310577J093272
9283b4858546O96730K59613p1075j79252j5125L89798R34791J484813J916927
9274a9441326K160466K210599K107329J896210J600475J221473P57964K22048
9266g264762l60231r57352j537140k063879k495040k786494k906162k847450k633270
$$ plain form
9327 -4154930 -2983525 -1544690 -47347 1308683 2386691 3145103 3641409 4007885 4406684
9318 4406684 4979244 5806486 6891740 8170666 9542310 10906080 12188121 13349502 14378588
9309 14378588 15272817 16014498 16548784 16775863 16564949 15786198 14348385 12229026 9485045
9300 9485045 6235881 2622827 -1234178 -5254759 -9379934 -13532982 -17587555 -21361087
9292 -21361087 -24633827 -27186303 -28849081 -29554935 -29373819 -28510620 -27262395 -25951818 -24858546
9283 -24858546 -24161816 -23902203 -23973278 -24152530 -24167655 -23777857 -22843066 -21358253 -19441326
9274 -19441326 -17280860 -15070261 -12962932 -11066722 -9466247 -8244774 -7486810 -7264762
9266 -7264762 -7624993 -8582345 -10119485 -12183364 -14678404 -17464898 -20371060 -23218510 -25851780
9257b5851780k307970j921088j510914j096222o80115k61341J56739N65449R55365
9248c1951877J319195J649813J936453K164389K320448K399957K406272K340004
9240a5415346K188747J933224J571276J140057P13474L71451J60480P1749N0937
9231g213951L1895l0425j50122l23372n43510q02247j083452j364211j622916
9222a3102311j840569j990595k029117j898710j546441r48966j36368P96898J707475
9213b0988704K446974K915540L096769L055798K901839K733188K592290K456186
9205A209880K268582J992585J649007J315465J087104J023071J112122J279755
9197A2937571J431227J499005J463216J340725J163454R65351P78840O31880N42774
$$ plain form
9257 -25851780 -28159750 -30080838 -31591752 -32687974 -33368089 -33629430 -33472691 -32907242 -31951877
9248 -31951877 -30632682 -28982869 -27046416 -24882027 -22561579 -20161622 -17755350 -15415346
9240 -15415346 -13226599 -11293375 -9722099 -8582042 -7868568 -7497117 -7336637 -7264888 -7213951
9231 -7213951 -7182056 -7212481 -7362603 -7685975 -8229485 -9031732 -10115184 -11479395 -13102311
9222 -13102311 -14942880 -16933475 -18962592 -20861302 -22407743 -23356709 -23493077 -22696179 -20988704
9213 -20988704 -18541730 -15626190 -12529421 -9473623 -6571784 -3838596 -1246306 1209880
9205 1209880 3478462 5471047 7120054 8435519 9522623 10545694 11657816 12937571
9197 12937571 14368798 15867803 17331019 18671744 19835198 20800549 21579389 22211269 22754043
9188B2754043N16185N40408N83936N96187N22008L27477J6717l77643q20261j285032
9178B3374025j738906k118857k335009k305608j996326j434890o98245J10933
9170A0857117Q85354J531470J987588K238057K316442K293632K253188K262365
9162B6625213K349619K496020K641004K699839K591010K269061J749773J111024
9154D4532563M63944r1941n06159p90442j005186j228850j525342j922125k403603
9145C5522859k916007l378880l701896l806075l643679l210208k548531j748670
9137A0568913r38578k53561K16004M71525O09518P69071J054728J485128J995197
9128A5977945K478994K837744L006367K956491K690265K236318J646172R83785
$$ plain form
9188 22754043 23270228 23810636 24394572 24990759 25512767 25840244 25856961 25479318 24659057 23374025
9178 23374025 21635119 19516262 17181253 14875645 12879319 11444429 10746184 10857117
9170 10857117 11742471 13273941 15261529 17499586 19816028 22109660 24362848 26625213
9162 26625213 28974832 31470852 34111856 36811695 39402705 41671766 43421539 44532563
9154 44532563 44996507 44904566 44398407 43607965 42602779 41373929 39848587 37926462 35522859
9145 35522859 32606852 29227972 25526076 21720001 18076322 14866114 12317583 10568913
9137 10568913 9630335 9376774 9592778 10064303 10673821 11442892 12497620 13982748 15977945
9128 15977945 18456939 21294683 24301050 27257541 29947806 32184124 33830296 34814081
9120C4814081L09423l30773r02055j372441j711028j895355j918379j789665j535722
9111B3668086j202403q50149n33108k72461m9044J72717M07259O28234P81467
9102B2750598Q17814P21432N17837K60998P748k08832l94616n89421q42787j182838
9092B1857933j595567k026669k405019k672626k801372k788738k644862k390647
9084B532433k069925j756167j533180j453701j503846j601248j633337j517069
9076a0536040j247136r03399o12091m85497n75952q62376j263212j663565j952269
9067b0101537k063065k001229j835687j656799j523860j432059j315802j085695
9059c3015733o78462r1597O14776J343023J990036K471768K738037K778498K619192
$$ plain form
9120 34814081 35123504 34792731 33890676 32518235 30807207 28911852 26993473 25203808 23668086
9111 23668086 22465683 21615534 21082426 20809965 20760921 20933638 21340897 21969131 22750598
9102 22750598 23568412 24289844 24807681 25068679 25076427 24867595 24472979 23883558 23040771 21857933
9092 21857933 20262366 18235697 15830678 13158052 10356680 7567942 4923080 2532433
9084 2532433 462508 -1293659 -2826839 -4280540 -5784386 -7385634 -9018971 -10536040
9076 -10536040 -11783176 -12686575 -13298666 -13784163 -14360115 -15222491 -16485703 -18149268 -20101537
9067 -20101537 -22164602 -24165831 -26001518 -27658317 -29182177 -30614236 -31930038 -33015733
9059 -33015733 -33694195 -33785792 -33171016 -31827993 -29837957 -27366189 -24628152 -21849654 -19230462
9050a9230462K312913J930089J550398J248088J070886J025495J079960J176497
9042g836136J242859J204106J004593O34686J39877l99478r01549j303982j566370
9033g781394j666946j601712j381092j022456n49586n723N35164R82109J264616
9024a1227020J362907J304017J131787Q82433N83880K67980k4096k48498l69442
9015f336052l68011k48181l7633K20659M83059P16218Q99742J027303J113414
9006b529482J200305J351135J625027K046755K590166L184150L735273M154403
8998A7357732M376525M368094M121992L646366K957609K084213J077856J9864
8990D0010251r86183j833544k432627k724504k687542k340086j738165r65976
$$ plain form
9050 -19230462 -16917549 -14987460 -13437062 -12188974 -11118088 -10092593 -9012633 -7836136
9042 -7836136 -6593277 -5389171 -4384578 -3749892 -3610015 -4009493 -4911042 -6215024 -7781394
9033 -7781394 -9448340 -11050052 -12431144 -13453600 -14003186 -14008909 -13473745 -12491636 -11227020
9024 -11227020 -9864113 -8560096 -7428309 -6545876 -5961996 -5694016 -5718112 -5966610 -6336052
9015 -6336052 -6704063 -6952244 -6989877 -6769218 -6286159 -5569941 -4670199 -3642896 -2529482
9006 -2529482 -1329177 21958 1646985 3693740 6283906 9468056 13203329 17357732
8998 17357732 21734257 26102351 30224343 33870709 36828318 38912531 39990387 40010251
8990 40010251 39024068 37190524 34757897 32033393 29345851 27005765 25267600 24301624
8982B4301624j22594O87173J356310J783154J891864J659202J129035M02893l87436
8973C2701225j111147j665843j999367k120239k086349j970294j817568j622590
8965A8307828j337380r07052l11083M11949J168813J843942K344346K632939K730151
8956B6884453K683452K527559K263242J864126J298646N50369l69139j414601
8948C6288107k512057l577423m540128n355717n999495o448211o664381o597005
8940e406310o205911n501415m571088l564084k634324j880963j327408r45230
8932c2036733o94896n51899n07120n49610o48268p47060p77155o75657l98092
8923c7586490P5735P33943J523209K352708L122136L761443M253717M623189M898310
$$ plain form
8982 24301624 24179030 24866203 26222513 28005667 29897531 31556733 32685768 33088661 32701225
8973 32701225 31590078 29924235 27924868 25804629 23718280 21747986 19930418 18307828
8965 18307828 16970448 16063396 15752313 16164262 17333075 19177017 21521363 24154302 26884453
8956 26884453 29567905 32095464 34358706 36222832 37521478 38071847 37702708 36288107
8948 36288107 33776050 30198627 25658499 20302782 14303287 7855076 1190695 -5406310
8940 -5406310 -11612221 -17113636 -21684724 -25248808 -27883132 -29764095 -31091503 -32036733
8932 -32036733 -32731629 -33283528 -33790648 -34340258 -34988526 -35735586 -36512741 -37188398 -37586490
8923 -37586490 -37510755 -36776812 -35253603 -32900895 -29778759 -26017316 -21763599 -17140410 -12242100
8914a2242100N078931N131327N011451M696608M203969L588468K926578K296354
8906B0691586J760663J356954J093151R45306Q53849P24513M46612o7711q39771
8897B6965152j803872k826213l753874m466864m908726n088240n060334m898605
8889e841576m668851m410595m132142l819636l453436l023882k542331k044203
8881c3936652j578606j185071q73042o24707m22687k78464k34788l38713o05321
8872d0078051r94928j413885j736934j843237j655391j169130m61755L27855J043345
8863d7982111J560431J817622J816103J598061J223412P57344K66831j82369n34010
8854c9658686p53745q38156q11651p09666n58090l63116j17719J82075N24390
$$ plain form
8914 -12242100 -7163169 -2031842 2979609 7676217 11880186 15468654 18395232 20691586
8906 20691586 22452249 23809203 24902354 25847660 26701509 27426022 27872634 27804923 26965152
8897 26965152 25161280 22335067 18581193 14114329 9205603 4117363 -942971 -5841576
8889 -5841576 -10510427 -14921022 -19053164 -22872800 -26326236 -29350118 -31892449 -33936652
8881 -33936652 -35515258 -36700329 -37573371 -38198078 -38620765 -38899229 -39134017 -39472730 -40078051
8872 -40078051 -41072979 -42486864 -44223798 -46067035 -47722426 -48891556 -49353311 -49025456 -47982111
8863 -47982111 -46421680 -44604058 -42787955 -41189894 -39966482 -39209138 -38942307 -39124676 -39658686
8854 -39658686 -40412431 -41250587 -42062238 -42771904 -43329994 -43693110 -43810829 -43628754 -43104364
8845d3104364Q81320J219549J511224J736576J881194J937290J909023J810170
8837c0218018J649090J416865J099108P07292K99793l0687j95079j43470J19886
8828b5295220N40114J025859J472355J792880J948003J954527J865927J737729
8820a2957826J602901J469985J334503J187155J015252Q05781N54141K71825j4576
8811d730859k72979m79175o28872p42504q57893j013766j234323j521335j851590
8802a3333296k178396k442756k594881k610874k486946k215972j774096j138408
8794c0775625l25190N84262J455451K146986K564849K694196K593514K358392
8786a6703165K078644J813195J592433J437820J377448J442421J647235J970659
$$ plain form
8845 -43104364 -42223044 -41003495 -39492271 -37755695 -35874501 -33937211 -32028188 -30218018
8837 -30218018 -28568928 -27152063 -26052955 -25345663 -25045870 -25076557 -25271636 -25415106 -25295220
8828 -25295220 -24755106 -23729247 -22256892 -20464012 -18516009 -16561482 -14695555 -12957826
8820 -12957826 -11354925 -9884940 -8550437 -7363282 -6348030 -5542249 -4988108 -4716283 -4730859
8811 -4730859 -5003838 -5483013 -6111885 -6854389 -7712282 -8726048 -9960371 -11481706 -13333296
8802 -13333296 -15511692 -17954448 -20549329 -23160203 -25647149 -27863121 -29637217 -30775625
8794 -30775625 -31100815 -30516553 -29061102 -26914116 -24349267 -21655071 -19061557 -16703165
8786 -16703165 -14624521 -12811326 -11218893 -9781073 -8403625 -6961204 -5313969 -3343310
8778c343310K351632K702795K936753K997939K887960K667141K424720K234758
8770A7860388K128640K097716K110261K121106K074711J919049J634231J255020
8762C3201122Q64105N56661L99077M04719N34659P17820Q78798R60147R29934
8753C9447042P75536M94761R4917l99128r36262j439209j817877j993981j928496
8744C2297303j638976j195978o98306k39520J16763L41618M27689L71612J67839
8735B9950044j79273o32906j109274j488195j651737j534359j155254o10273k6626
8726B1562147M90470Q88229J165629J355905J506621J659487J830421K000789
8718C2459698K130941K187432K159031K048556J856796J583340J244072Q78697
$$ plain form
8778 -3343310 -991678 1711117 4647870 7645809 10533769 13200910 15625630 17860388
8770 17860388 19989028 22086744 24197005 26318111 28392822 30311871 31946102 33201122
8762 33201122 34065227 34621888 35020965 35425684 35960343 36678163 37556961 38517108 39447042
8753 39447042 40222578 40717339 40812256 40413128 39476866 38037657 36219780 34225799 32297303
8744 32297303 30658327 29462349 28764043 28524523 28641286 28982904 29410593 29782205 29950044
8735 29950044 29770771 29137865 28028591 26540396 24888659 23354300 22199046 21588773 21562147
8726 21562147 22052617 22940846 24106475 25462380 26969001 28628488 30458909 32459698
8718 32459698 34590639 36778071 38937102 40985658 42842454 44425794 45669866 46548563
8710D6548563N30826K19074o7132l41272n94736q03306r56610j075020j195459
8701D2264928j343683j521570j715734j910555k089615k227345k284042k212826
8693B6959558j975935j561909r97677l52436K71479P65565J053631J120258J008710
8684B6291244P91260N36365K92279Q4829q2543k27832l80798n64404p79461j004227
8674B4956712j209039j375601j508028j627372j752171j879082j978760k009352
8666A1617307j935915j742664j434968j036483n86467j36472K57793N50239P16791
8657F269161P56607O81300N03920K39883q1990m12007o86126q44636q53269p16927
8647D855916m79379k07259L6218K17655L49462M86017O94751J010401J399446
$$ plain form
8710 46548563 47079389 47298463 47231331 46890059 46295323 45492017 44535407 43460387 42264928
8701 42264928 40921245 39399675 37683941 35773386 33683771 31456426 29172384 26959558
8693 26959558 24983623 23421714 22424037 22071601 22343080 23108645 24162276 25282534 26291244
8684 26291244 27082504 27618869 27911148 27995977 27913434 27685602 27304804 26740400 25960939 24956712
8674 24956712 23747673 22372072 20864044 19236672 17484501 15605419 13626659 11617307
8666 11617307 9681392 7938728 6503760 5467277 4880810 4744338 5002131 5552370 6269161
8657 6269161 7025768 7707068 8210988 8450871 8368881 7956874 7270748 6426112 5572843 4855916
8647 4855916 4376537 4169278 4205496 4423151 4772613 5258630 5953381 6963782 8363228
8638H363228J764092J989280K003053J811962J493678J155743Q83879P05577N87593
8629B0758085M68079L02766R6778r4708j94247j42188P2226M05857P84430J135339
8619B3592417J408178J576993J636363J601862J509743J404761J318443J254840
8611C5303600J197399J130668J055425R81786R06666P98819O09589L05321j01724
8602D2187549n47252r40344j207947j335169j379681j450893j662964k084720
8594C1578579k709849l457909m201356m805436n166900n238939n033490m601214
8586c636514m002532l288874k503371j692674r13558k26736L16512O85630Q76271
8577a4385846R09959Q27484O77159N04438L49686K51858K47062L54956N60525
$$ plain form
8638 8363228 10127320 12116600 14119653 15931615 17425293 18581036 19464915 20170492 20758085
8629 20758085 21226164 21528930 21625708 21531000 21336753 21194565 21266791 21672648 22457078 23592417
8619 23592417 25000595 26577588 28213951 29815813 31325556 32730317 34048760 35303600
8611 35303600 36500999 37631667 38687092 39668878 40575544 41374363 41983952 42289273 42187549
8602 42187549 41640297 40699953 39492006 38156837 36777156 35326263 33663299 31578579
8594 31578579 28868730 25410821 21209465 16404029 11237129 5998190 964700 -3636514
8586 -3636514 -7639046 -10927920 -13431291 -15123965 -16037523 -16264259 -15947747 -15262117 -14385846
8577 -14385846 -13475887 -12648403 -11971244 -11466806 -11117120 -10865262 -10618200 -10263244 -9702719
8568i702719Q07951J016894J115458J072505R11910P00282N12192L89122L14560
8559b861845K21423K9830l05225p62255j253498j655816j856903j795245j476556
8550a1716090r62654l43162K93490Q77539J360364J708038J898882J934575J857331
8541c091687J750656J710577J803062K037996K371578K722456K985891L049398
8533A5339927K819586K254484J383696L06684q26669j846749k601630k990941
8525A3838388k980561k592969j887575r50818J01154J124480J971609K533029
8517A1156737K770934K720293K458055K066345J614777J162535P60895M42568
8509B5153139K05343P991k12942n12442r07720j364824j809782k161526k369433
$$ plain form
8568 -9702719 -8894768 -7877874 -6762416 -5689911 -4778001 -4077719 -3565527 -3176405 -2861845
8559 -2861845 -2640422 -2610592 -2915817 -3678072 -4931570 -6587386 -8444289 -10239534 -11716090
8550 -11716090 -12678744 -13021906 -12728416 -11850877 -10490513 -8782475 -6883593 -4949018 -3091687
8541 -3091687 -1341031 369546 2172608 4210604 6582182 9304638 12290529 15339927
8533 15339927 18159513 20413997 21797693 22104377 21277708 19430959 16829329 13838388
8525 13838388 10857827 8264858 6377283 5426465 5527619 6652099 8623708 11156737
8517 11156737 13927671 16647964 19106019 21172364 22787141 23949676 24710571 25153139
8509 25153139 25358482 25366473 25153531 24641089 23733369 22368545 20558763 18397237 16027804
8500A6027804k432179k386609k277935k135233j967165j773182j555811j325636
8492A74054j100215r00084p43100o39323n89948n90029o29950o93380p56272p92106
8482g260353p81790p22597o32861n50617n23158n87643p52188r90077j250217
8473a4051501j475362j618235j650652j563485j357653j034243n96047o1647N25127
8464b2883698J107862J646464K134760K586213K998216L328164L506154L476653
8456b099212L235463K832303K338934J810206J266377P03245J15762m82372j051164
8447H669542j529331j850759j969658j886107j658410j391204j200197j169851
8439c985975j326901j642429k054150k488080k867691l117702l175698l011593
$$ plain form
8500 16027804 13595625 11209016 8931081 6795848 4828683 3055501 1499690 174054
8492 174054 -926161 -1826245 -2569345 -3208668 -3798616 -4388645 -5018595 -5711975 -6468247 -7260353
8482 -7260353 -8042143 -8764740 -9397601 -9948218 -10471376 -11059019 -11811207 -12801284 -14051501
8473 -14051501 -15526863 -17145098 -18795750 -20359235 -21716888 -22751131 -23347178 -23408825 -22883698
8464 -22883698 -21775836 -20129372 -17994612 -15408399 -12410183 -9082019 -5575865 -2099212
8456 -2099212 1136251 3968554 6307488 8117694 9384071 10087316 10203078 9720706 8669542
8447 8669542 7140211 5289452 3319794 1433687 -224723 -1615927 -2816124 -3985975
8439 -3985975 -5312876 -6955305 -9009455 -11497535 -14365226 -17482928 -20658626 -23670219
8431b3670219k641434k125553j553805j024616o20139l81422k96649l13520l68193
8422c2995550m08667m00085l20608j62624N9133L02466N02671N86784M94114J99890
8412c2142476k65797q15065j320802j649821j695969j402193p70895J32130J180184
8403c8750704K204064L032809L544288L698555L537671L161294K698373K283197
8395a4590453K031057K012627K235961K644979L135302L582778L876231L942253
8387H870735L752945L320053K687399J926253J126694L79390k46590p19446j047913
8378B0049520j271465j440036j592057j743133j890615k026186k144795k245207
8370E696026k324761k373394k373229k307797k175829j997692j808909j647842
$$ plain form
8431 -23670219 -26311653 -28437206 -29991011 -31015627 -31635766 -32017188 -32313837 -32627357 -32995550
8422 -32995550 -33404217 -33804302 -34124910 -34287534 -34228401 -33925935 -33423264 -32836480 -32342366 -32142476
8412 -32142476 -32408273 -33223338 -34544140 -36193961 -37889930 -39292123 -40063018 -39930888 -38750704
8403 -38750704 -36546640 -33513831 -29969543 -26270988 -22733317 -19572023 -16873650 -14590453
8395 -14590453 -12559396 -10546769 -8310808 -5665829 -2530527 1052251 4928482 8870735
8387 8870735 12623680 15943733 18631132 20557385 21684079 22063469 21816879 21097433 20049520
8378 20049520 18778055 17338019 15745962 14002829 12112214 10086028 7941233 5696026
8370 5696026 3371265 997871 -1375358 -3683155 -5858984 -7856676 -9665585 -11313427
8362a1313427j545393j515989j548612j605004j630922j572886j388530j051840
8354b3172603n62981L9004O76029J252589J690607J961064K099515K196064K357018
8345a1463694K653133L085450L591423M083963M493212M784526M947216M968367
8337B1143596M814469M437546L803736K924568J869970P56445k83287j140003
8329C8327040j766690k199834k546069k931867l437932m053787m679453n173771
8321A1537637n419278n363603n017380m423372l629404k684222j648842o04578
8313a7253042L51661J121862J625741J821093J720624J394740R52130N03093J24551
8304g637547j54273l41162m56686n11400m93089l67663r5639L40283R11828J542762
$$ plain form
8362 -11313427 -12858820 -14374809 -15923421 -17528425 -19159347 -20732233 -22120763 -23172603
8354 -23172603 -23735584 -23696580 -23020551 -21767962 -20077355 -18116291 -16016776 -13820712 -11463694
8345 -11463694 -8810561 -5725111 -2133688 1950275 6443487 11228013 16175229 21143596
8337 21143596 25958065 30395611 34199347 37123915 38993885 39750330 39467043 38327040
8329 38327040 36560350 34360516 31814447 28882580 25444648 21390861 16711408 11537637
8321 11537637 6118359 754756 -4262624 -8685996 -12315400 -14999622 -16648464 -17253042
8313 -17253042 -16901381 -15779519 -14153778 -12332685 -10612061 -9217321 -8265191 -7762098 -7637547
8304 -7637547 -7791820 -8132982 -8589668 -9101068 -9594157 -9961820 -10057459 -9717176 -8805348 -7262586
8294g262586K129497K569790K783956K725710K388091J806749J057803K48093
8286H447103n02273j084317j426612j512177j375749j084347p15373l43031l2008
8277C71216J67837K28538J51748k6504k41164m20258n17943n37619n26140n41929
8267a892218o19118p49559q89430r82754r86896q86443o92407m36631j70389L8814
8257h267031J25804N9520j35034l85370o06551p39217p69441p23226o41539n50882
8247a2632967m48039l08891j13433J32599L95404O32366Q20494R72105J120916
8238i429446J286375J448499J559364J580784J511848J384228J237073J095942
8230A674667R65656Q32788O73935M68840K12507q2141l91457o89198r48739j142304
$$ plain form
8294 -7262586 -5133089 -2563299 220657 2946367 5334458 7141207 8199010 8447103
8286 8447103 7944830 6860513 5433901 3921724 2545975 1461628 746255 403224 371216
8277 371216 539053 767591 919339 892835 651671 231413 -286530 -824149 -1350289 -1892218
8267 -1892218 -2511336 -3260895 -4150325 -5133079 -6119975 -7006418 -7698825 -8135456 -8305845 -8267031
8257 -8267031 -8141227 -8081707 -8216741 -8602111 -9208662 -9947879 -10717320 -11440546 -12082085 -12632967
8247 -12632967 -13081006 -13389897 -13503330 -13370731 -12975327 -12342961 -11522467 -10550362 -9429446
8238 -9429446 -8143071 -6694572 -5135208 -3554424 -2042576 -658348 578725 1674667
8230 1674667 2640323 3473111 4147046 4615886 4828393 4746252 4354795 3665597 2716858 1574554
8220A574554j244292j240228j135602r58140p52308n69017m51956m20118m51477
8211e648584m82228m33366k55461L7957L74080O59712Q28197Q65140Q02233O91213
8201b561107N80862N11941N24048O54558R18488J280781J644477J869596J818257
8192G241901J406598O38314l97075j555983k678401l613774m241060m495177m388399
8183a2083056l999616l428029k746833j993766j195424l91288L64262J012968
8175b4460782J500130J778958J822757J644306J306106R07617N54094L25605K60727
8166a4360482L54843N66542Q31709J088278J302934J478301J629453J748223J788885
8157c571314J687720J395907Q97901K10461o21597j522537k385586l091906l548705
$$ plain form
8220 1574554 330262 -909966 -2045568 -3003708 -3756016 -4325033 -4776989 -5197107 -5648584
8211 -5648584 -6130812 -6564178 -6819639 -6781682 -6407602 -5747890 -4919693 -4054553 -3252320 -2561107
8201 -2561107 -1980245 -1468304 -944256 -289698 628790 1909571 3554048 5423644 7241901
8192 7241901 8648499 9286813 8889738 7333755 4655354 1041580 -3199480 -7694657 -12083056
8183 -12083056 -16082672 -19510701 -22257534 -24251300 -25446724 -25838012 -25473750 -24460782
8175 -24460782 -22960652 -21181694 -19358937 -17714631 -16408525 -15500908 -14946814 -14621209 -14360482
8166 -14360482 -14005639 -13439097 -12607388 -11519110 -10216176 -8737875 -7108422 -5360199 -3571314
8157 -3571314 -1883594 -487687 410214 620675 -922 -1523459 -3909045 -7000951 -10549656
8148a0549656l725032l659789l435289l133986k804056k447118k025191j480042
8140c3260159p62491J33705J149350K166442L044850L668317L973285L948719
8132a5937982L615869L008553K170529J169467J08562q85935j702841k284848
8124a0738626k638162k806888k834411k739027k513529k141469j619089r73525
8116b9004726k66460M24238J037296J552898J992201K395588K798802L220662
8108a5849501L661102M101265M500899M795870M904318M750073M300240L594675
8100A8758941K740158J864640J060193L53091k83302q88024j472091j998790k392021
8091A7742795k567536k471074k102949j517451q02704n8253O17563J134914J428717
$$ plain form
8148 -10549656 -14274688 -17934477 -21369766 -24503752 -27307808 -29754926 -31780117 -33260159
8140 -33260159 -34022650 -33888945 -32739595 -30573153 -27528303 -23859986 -19886701 -15937982
8132 -15937982 -12322113 -9313560 -7143031 -5973564 -5865002 -6750937 -8453778 -10738626
8124 -10738626 -13376788 -16183676 -19018087 -21757114 -24270643 -26412112 -28031201 -29004726
8116 -29004726 -29271186 -28846948 -27809652 -26256754 -24264553 -21868965 -19070163 -15849501
8108 -15849501 -12188399 -8087134 -3586235 1209635 6113953 10864026 15164266 18758941
8100 18758941 21499099 23363739 24423932 24777023 24493721 23605697 22133606 20134816 17742795
8091 17742795 15175259 12704185 10601236 9083785 8281081 8222828 8840391 9975305 11404022
8082A1404022J486682J368544J189685J068544J071535J192230J370050J526037
8074B1677329J595909J555594J434219J302177J232726J259648J359235J462994
8066C2879831J485393J349945J007644M46900l04431j179921k073222k841137
8058C0771002l326838l408420l053395k347696j479312o79921j46608K5262j30708
8049A6223366m76141q28393j024620r63087o17974l8855O58734J316444J773061
8040A6022535J909818J681210J120869L26874n64866j414353k112149k602321
8032A4367617k883495k990951k971338k858760k657751k342098j875565j243593
8024e455934m71378L84928J261404K101965K859566L492998L969160M270536M401180
$$ plain form
8082 11404022 12890704 14259248 15448933 16517477 17589012 18781242 20151292 21677329
8074 21677329 23273238 24828832 26263051 27565228 28797954 30057602 31416837 32879831
8066 32879831 34365224 35715169 36722813 37169713 36865282 35685361 33612139 30771002
8058 30771002 27444164 24035744 20982349 18634653 17155341 16475420 16328812 16354074 16223366
8049 16223366 15747225 14918832 13894212 12931125 12313151 12274296 12933030 14249474 16022535
8040 16022535 17932353 19613563 20734432 21061306 20496440 19082087 16969938 14367617
8032 14367617 11484122 8493171 5521833 2663073 5322 -2336776 -4212341 -5455934
8024 -5455934 -5927312 -5542384 -4280980 -2179015 680551 4173549 8142709 12413245 16814425
8015A6814425M385057M254769M037263L749908L413082L065923K762857K546144
8007D5029428K416339K327733K214005K024560J746405J399787J014599O07050
7999E8779906J74396k90514p80902j271711j730891k132826k462805k715652k898121
7990D4670880l035727l172480l353066l593430l861636m088442m204470m177932
7982A5183697m025531l791065l510119l185597k787858k278091j641864r13473
7974f949901j74585M73626R47181J203329J244308J108661Q59404N71102L15401
7965d01474J48518J04398J91979L93292O65024R49847J196669J377793J490319
7956F116365J541139J527731J429406J215392Q64973L87311j71490p38320j233026
$$ plain form
8015 16814425 21199482 25454251 29491514 33241422 36654504 39720427 42483284 45029428
8007 45029428 47445767 49773500 51987505 54012065 55758470 57158257 58172856 58779906
7999 58779906 58954302 58663788 57882886 56611175 54880284 52747458 50284653 47569001 44670880
7990 44670880 41635153 38462673 35109607 31516177 27654541 23566099 19361629 15183697
7982 15183697 11158166 7367101 3856982 671385 -2116473 -4394564 -6036428 -6949901
7974 -6949901 -7124486 -6650860 -5703679 -4500350 -3256042 -2147381 -1287977 -716875 -401474
7965 -401474 -252956 -148558 43421 436713 1101737 2051584 3248253 4626046 6116365
7956 6116365 7657504 9185235 10614641 11830033 12695006 13082317 12910827 12172507 10939481
7947A0939481j586719j753506j720212j517834j226988r62906q35901r03349j139331
7938g07265j438942j655341j652907j354907p67668K5984Q96786J706055K335932
7929b612273K709447K802140K643361K301545J853983J354795Q21345K49472l52649
7920A1771166r37026j416003j691760j697721j429212r49934l74173J66119N56996
7911C998452P29367O69274M10937J9352m27452q51197j184067j382181j438484
7902E44001j383597j268543j138909j017381r01993p73783o05718l71657n6620
7893f974200L34186P71205J202278J561536J788966J858305J798465J689900J632063
7884E662704J697833J899030K179138K435022K556006K461410K120990J555407
$$ plain form
7947 10939481 9352762 7599256 5879044 4361210 3134222 2171316 1335415 432066 -707265
7938 -707265 -2146207 -3801548 -5454455 -6809362 -7577030 -7551046 -6654260 -4948205 -2612273
7929 -2612273 97174 2899314 5542675 7844220 9698203 11052998 11874343 12123815 11771166
7920 11771166 10834140 9418137 7726377 6028656 4599444 3649510 3275337 3441456 3998452
7911 3998452 4727819 5397093 5808030 5827382 5399930 4548733 3364666 1982485 544001
7902 544001 -839596 -2108139 -3247048 -4264429 -5166422 -5940205 -6545923 -6917580 -6974200
7893 -6974200 -6640014 -5868809 -4666531 -3104995 -1316029 542276 2340741 4030641 5662704
7884 5662704 7360537 9259567 11438705 13873727 16429733 18891143 21012133 22567540
7876B2567540Q25417J8809p63656j426937j904256k174947k267240k243965k180284
7867A0450481k145006k187630k325463k531970k739496k865688k851127k681859
7859i877758k383630j999700j573202j142878p46033m18477j86436n3385P507
7850a8373992M3981R8180J78719K51228K55288J38761j08235m35886p42292r03525
7840a9597773q12971m13165K90002J229250K286809L311318M145830M669149M835839
7831e5712M686991M317302L818937L243589K605523J911198J184415M71672j66404
7822B2017511o67053r77212j065206r30245o05706j52699L56258Q56944J304749
7813B0137341J671544J935069K073785K071347J924044J644349J260523Q14242
$$ plain form
7876 22567540 23392957 23411766 22648110 21221173 19316917 17141970 14874730 12630765 10450481
7867 10450481 8305475 6117845 3792382 1260412 -1479084 -4344772 -7195899 -9877758
7859 -9877758 -12261388 -14261088 -15834290 -16977168 -17723201 -18141678 -18328114 -18381499 -18373992
7850 -18373992 -18330011 -18231831 -18053112 -17801884 -17546596 -17407835 -17516070 -17951956 -18694248 -19597773
7840 -19597773 -20410744 -20823909 -20533907 -19304657 -17017848 -13706530 -9560700 -4891551 -55712
7831 -55712 4631279 8948581 12767518 16011107 18616630 20527828 21712243 22183915 22017511
7822 22017511 21350458 20373246 19308040 18377795 17772089 17619390 17975648 18832592 20137341
7813 20137341 21808885 23743954 25817739 27889086 29813130 31457479 32718002 33532244
7805C3532244L55599o6129m14925o79954q80804j059330j257807j495318j758528
7796B6275048k011128k210555k319566k310724k167208j880236j444127q56996
7788A1074508j32570O86425J530451K322639K997729L506658L815222L912139
7780B9713201L822555L605906L329543L036890K735969K413328K056556J667206
7772E2381154J258848Q45307M28260o182m77270r91445j528351k039469k460517
7763D7410335k735325k844274k820770k737850k666966k637226k625586k581497
7755B5760841k462572k255972j977513j656078j316545r72767o34637l21691o8844
7746A4094222Q4346J15680L8363r9174k34477l20394l42443l13958k57658j90176
$$ plain form
7805 33532244 33887843 33821714 33406789 32726835 31846031 30786701 29528894 28033576 26275048
7796 26275048 24263920 22053365 19733799 17423075 15255867 13375631 11931504 11074508
7788 11074508 10941938 11628363 13158814 15481453 18479182 21985840 25801062 29713201
7780 29713201 33535756 37141662 40471205 43508095 46244064 48657392 50713948 52381154
7772 52381154 53640002 54485309 54913569 54907387 54430117 53438672 51910321 49870852 47410335
7763 47410335 44675010 41830736 39009966 36272116 33605150 30967924 28342338 25760841
7755 25760841 23298269 21042297 19064784 17408706 16092161 15119394 14484757 14163066 14094222
7746 14094222 14178568 14294248 14332611 14233437 13998960 13678566 13336123 13022165 12764507 12574331
7736A2574331j16771l2919O9710J92370L19282M20380M68551M56059L94788L04428
7726A5050209K05583J23805R1341J32658K39533L57690M01526K91857m887m57283
7716A6432032r78747j463233j832495k071294k227867k376679k568465k801484
7708A11768l027202l176477l186212l019258k678569k212377j704178j248999
7700b0141504r26602p82627q22273j015152j305862j623831j890625k030281j987712
7691c2526469j748853j347040q46676l14088K03027O74573J073674J369554J538694
7682c1923604J583132J534873J439219J330981J222590J109405R83565Q45936
7674b1873903P10655O00810N37663N30918N77611O69605Q01559R71236J171143
$$ plain form
7736 12574331 12457560 12424641 12494351 12686721 13006003 13426383 13894934 14350993 14745781 15050209
7726 15050209 15255792 15379597 15470938 15603596 15843129 16200819 16602345 16894202 16889315 16432032
7716 16432032 15453285 13990052 12157557 10086263 7858396 5481717 2913252 111768
7708 111768 -2915434 -6091911 -9278123 -12297381 -14975950 -17188327 -18892505 -20141504
7700 -20141504 -21068106 -21850733 -22673006 -23688158 -24994020 -26617851 -28508476 -30538757 -32526469
7691 -32526469 -34275322 -35622362 -36469038 -36783126 -36580099 -35905526 -34831852 -33462298 -31923604
7682 -31923604 -30340472 -28805599 -27366380 -26035399 -24812809 -23703404 -22719839 -21873903
7674 -21873903 -21163248 -20562438 -20024775 -19493857 -18916246 -18246641 -17445082 -16473846 -15302703
7665a5302703J378136J551123J643056J622077J486655J263599R94554P26549
7657d636954N13112M15512M90489P64969J214226J761591K303582K745027L021238
7648H592792L096725K952225K579380J988545J218885L41174n46206j328058j897749
7639A6997713k198036k256032k181549k120063k185578k412094k747068l084203
7631b186910l314054l365970l223501k912765k477981j960264j388464p83431
7623b1613340j71942M00426Q71867J187138J326939J321979J242541J172277J179161
7614a3082954J289049J466782J618232J625972J409230R73496M15325j22601n17665
7605d925134p16448p44313o77870o00491n65613n84009o34275o81815o91955o35635
$$ plain form
7665 -15302703 -13924567 -12373444 -10730388 -9108311 -7621656 -6358057 -5363503 -4636954
7657 -4636954 -4123842 -3708330 -3217841 -2452872 -1238646 522945 2826527 5571554 8592792
7648 8592792 11689517 14641742 17221122 19209667 20428552 20769726 20223520 18895462 16997713
7639 16997713 14799677 12543645 10362096 8242033 6056455 3644361 897293 -2186910
7631 -2186910 -5500964 -8866934 -12090435 -15003200 -17481181 -19441445 -20829909 -21613340
7623 -21613340 -21785282 -21384856 -20512989 -19325851 -17998912 -16676933 -15434392 -14262115 -13082954
7614 -13082954 -11793905 -10327123 -8708891 -7082919 -5673689 -4700193 -4284868 -4407469 -4925134
7605 -4925134 -5641582 -6385895 -7063765 -7664256 -8229869 -8813878 -9448153 -10129968 -10821923 -11457558
7595a1457558m96096k80503k8633J92875L12721K83517J02228j88002n16167q12026
7585a2887644j027181j135756j120484r64209o59470k26663K79796P85419J218687
7576a5737505J527405J683066J677485J517789J224035Q31839L96961p102l04665
7567g190692m40017l91040j66700K03358O73185J176251J624476J923703K004221
7558e83255J848993J500539J041848N64361J42086j77556l68834m19332l27997
7549C220853j12518J80846M77827O94647P67356O73880M35074R6783k93305p00683
7539E440760j105937j496690j857154k162986k384077k491345k462540k287352
7531a0807321j975256j563721j116997p09341m00451k19006j62444k06262l11547
$$ plain form
7595 -11457558 -11953654 -12234157 -12262790 -12069915 -11757194 -11473677 -11371449 -11559451 -12075618 -12887644
7585 -12887644 -13914825 -15050581 -16171065 -17135274 -17794744 -18021407 -17741611 -16956192 -15737505
7576 -15737505 -14210100 -12527034 -10849549 -9331760 -8107725 -7275886 -6878925 -6886027 -7190692
7567 -7190692 -7630709 -8021749 -8188449 -7985091 -7311906 -6135655 -4511179 -2587476 -583255
7558 -583255 1265738 2766277 3808125 4372486 4514572 4337016 3968182 3548850 3220853
7549 3220853 3108335 3289181 3767008 4461655 5229011 5902891 6337965 6434748 6141443 5440760
7539 5440760 4334823 2838133 980979 -1182007 -3566084 -6057429 -8519969 -10807321
7531 -10807321 -12782577 -14346298 -15463295 -16172636 -16573087 -16792093 -16954537 -17160799 -17472346
7522a7472346m28199n00221m77358l27968m3821L66063Q85226J492709K156017
7513a4349898K821638L414799L853816M073884M048971L800847L389412K887006
7505A3940475K349541J802201J248477O92332J52639l41119p63073j098654j340686
7496A6642133j483507j525878j481344j384058j278886j197103j133021j040925
7488F117411q59047n46083j04650M23014R78423J507004J960711K288656K433922
7479A4199361K348504K019178J482647Q13572R1194o31155j333056k011282k658600
7470A4320363l252010l752317m110160m275576m209534l893777l335935k571906
7462a5080852j668061p18356J72096R14363J456788J785659J911576J860009J672844
$$ plain form
7522 -17472346 -17900545 -18400766 -18878124 -19206092 -19249913 -18883850 -17998624 -16505915 -14349898
7513 -14349898 -11528260 -8113461 -4259645 -185761 3863210 7664057 11053469 13940475
7505 13940475 16290016 18092217 19340694 20033026 20185665 19844546 19081473 17982819 16642133
7496 16642133 15158626 13632748 12151404 10767346 9488460 8291357 7158336 6117411
7488 6117411 5258364 4712281 4607631 5030645 6009068 7516072 9476783 11765439 14199361
7479 14199361 16547865 18567043 20049690 20863262 20954456 20323301 18990245 16978963 14320363
7470 14320363 11068353 7316036 3205876 -1069700 -5279234 -9173011 -12508946 -15080852
7462 -15080852 -16748913 -17467269 -17295173 -16380810 -14924022 -13138363 -11226787 -9366778 -7693934
7453g693934J408577J129906Q86935P13275O36137O80553Q52093J109810J360016
7444A083368J487949J410874J116366O61788J42501l44105p18210r22398r25899
7435B992234p35471m04539k6584K91153M62464M47838K59192n6450m44636q67374
7425A917827j308681j757067k177927k501815k646310k561418k265669j844961
7417a5146021j413965j064426q28278o71246n16700k85667O8607N47993J117654
7408a8192049J719663K280157K713840K937968K898926K598677K102311J518318
7400E77811R61875N22782K54000J78140K96174N86584R97290J441884J810076
7391G626616J995437J934364J638672J197882P39117L61589Q5778j48068m30662
$$ plain form
7453 -7693934 -6285357 -5155451 -4268516 -3555241 -2919104 -2238551 -1386458 -276648 1083368
7444 1083368 2571317 3982191 5098557 5760345 5902846 5558741 4840531 3918133 2992234
7435 2992234 2256763 1852224 1825640 2116793 2579257 3027095 3286287 3229837 2785201 1917827
7425 1917827 609146 -1147921 -3325848 -5827663 -8473973 -11035391 -13301060 -15146021
7417 -15146021 -16559986 -17624412 -18452690 -19123936 -19640636 -19926303 -19857696 -19309703 -18192049
7408 -18192049 -16472386 -14192229 -11478389 -8540421 -5641495 -3042818 -940507 577811
7400 577811 1539686 2062468 2316468 2494608 2790782 3377366 4374656 5816540 7626616
7391 7626616 9622053 11556417 13195089 14392971 15132088 15493677 15579455 15431387 15000725
$$ [...]
##END NTUPLES=NMR SPECTRUM
##END=
