##TITLE=31Pdec_DE-31k
 D2O
 24 sc
 12.2.2024
##JCAMPDX= 6.0         $$ Bruker NMR JCAMP-DX V2.0
##DATA TYPE= NMR SPECTRUM
##DATA CLASS= NTUPLES
##ORIGIN= UXNMR, Bruker Analytische Messtechnik GmbH
##OWNER= root
$$ XWIN-NMR		Version 3.5
$$ Mon Feb 12 16:05:28 2024 Russian Standard Time (UT+4h)  she@DPX200
##.OBSERVE FREQUENCY= 81.013821
##.OBSERVE NUCLEUS= ^31P
##.ACQUISITION MODE= SIMULTANEOUS
##.ACQUISITION SCHEME= undefined
##.AVERAGES= 24
##.DIGITISER RES= 16
##SPECTROMETER/DATA SYSTEM= spect
##.PULSE SEQUENCE= zgpg30
##.SOLVENT NAME= CDCl3
##.SHIFT REFERENCE= (INTERNAL, CDCl3, 0, 248.564)
##AUDIT TRAIL= $$ (NUMBER, WHEN, WHO, WHERE, WHAT)
$$ ##TITLE= Audit trail, XWIN-NMR		Version 3.5
$$ ##JCAMPDX= 5.01
$$ ##ORIGIN= Bruker BioSpin GmbH
$$ ##OWNER= she
$$ F:/spectra/data/she/nmr/P31/1/pdata/1/auditp.txt
$$ ##AUDIT TRAIL=  $$ (NUMBER, WHEN, WHO, WHERE, WHAT)
(   1,<2024-02-12 16:04:25.43 +0400>,<she>,<DPX200>,
      <created by zg, POWCHK disabled, PULCHK disabled
       configuration hash MD5:
       00 E9 B6 7A A2 85 ED C7 34 08 36 98 17 FE 4E 26
       data hash MD5: 32K
       A8 84 29 4F 4F 41 64 CC 67 1B B1 A8 88 50 54 73>)
(   2,<2024-02-12 16:04:27.70 +0400>,<she>,<DPX200>,
      <Start of raw data processing
       efp BC_mod = 2 LB = 10 FT_mod = 6 PKNL = 1 PHC0 = -13316.56 PHC1 = 991.0837 SI = 64K 
       data hash MD5: 64K
       3E 9E F2 A2 47 4A 01 01 C0 23 71 52 FE A4 79 2E>)
(   3,<2024-02-12 16:04:53.09 +0400>,<she>,<DPX200>,
      <pk PHC0 = 440.1518 PHC1 = -954.2002 
       data hash MD5: 64K
       CD 0D 19 50 8E 67 C9 21 F7 D9 AC 26 C4 63 79 E6>)
$$ ##END=
$$ 
$$ hash MD5
$$ 58 CB 44 DC F9 59 33 53 F9 04 12 CF 6B E3 8B 01
##$RELAX= 
##$RELAX= 
##$RELAX= 
##$RELAX= 
##$RELAX= 
##$RELAX= 
##$RELAX= 
##$RELAX= 
##$RELAX= 
$$ Bruker specific parameters
$$ --------------------------
##$DU= <F:/spectra>
##$EXPNO= 1
##$NAME= <P31>
##$PROCNO= 1
##$TYPE= <nmr>
##$USER= <she>
##$AMP= (0..31)
100 100 100 100 100 100 100 100 100 100 100 100 100 100 100 100 100 100 
100 100 100 100 100 100 100 100 100 100 100 100 100 100 
##$AQSEQ= 0
##$AQ_mod= 1
##$AUNM= <au_zg>
##$AUTOPOS= <>
##$BF1= 81.014009
##$BF2= 200.13
##$BF3= 200.13
##$BF4= 200.13
##$BF5= 200.13
##$BF6= 200.13
##$BF7= 200.13
##$BF8= 200.13
##$BYTORDA= 1
##$CFDGTYP= 0
##$CFRGTYP= 5
##$CHEMSTR= <none>
##$CNST= (0..31)
1 1 145 1 1 1 1 1 1 1 1 1 1 1 1 1 1 1 1 1 1 1 1 1 1 1 1 1 1 1 1 1 
##$CPDPRG= <waltz16>
##$CPDPRG1= <>
##$CPDPRG2= <waltz16>
##$CPDPRG3= <>
##$CPDPRG4= <mlev>
##$CPDPRG5= <mlev>
##$CPDPRG6= <mlev>
##$CPDPRG7= <mlev>
##$CPDPRG8= <mlev>
##$CPDPRGB= <>
##$CPDPRGT= <>
##$D= (0..31)
0 1 0 0 0 0 0 0 0 0 0 0.03 2e-05 3e-06 0 0 0 0 0 0 0 0 0 0 0 0 0 0 0 0 
0 0 
##$DATE= 1707739464
##$DBL= (0..7)
120 120 120 11 120 120 24 19 
##$DBP= (0..7)
150 150 150 150 150 150 150 150 
##$DBP07= 0
##$DBPNAM0= <>
##$DBPNAM1= <>
##$DBPNAM2= <>
##$DBPNAM3= <>
##$DBPNAM4= <>
##$DBPNAM5= <>
##$DBPNAM6= <>
##$DBPNAM7= <>
##$DBPOAL= (0..7)
0.5 0.5 0.5 0.5 0.5 0.5 0.5 0.5 
##$DBPOFFS= (0..7)
$$ [...]
##$SUBNAM2= <"">
##$SUBNAM3= <"">
##$SUBNAM4= <"">
##$SUBNAM5= <"">
##$SUBNAM6= <"">
##$SUBNAM7= <"">
##$SUBNAM8= <"">
##$SUBNAM9= <"">
##$SW= 501.771253377433
##$SWIBOX= (0..15)
0 1 3 0 0 0 0 0 0 0 0 0 0 0 0 0 
##$SW_h= 40650.406504065
##$TD= 32768
##$TD0= 1
##$TE= 0
##$TE2= 300
##$TE3= 300
##$TEG= 300
##$TL= (0..7)
0 120 53 12 22 120 120 120 
##$TP= (0..7)
150 150 150 150 150 150 150 150 
##$TP07= 0
##$TPNAME0= <>
##$TPNAME1= <>
##$TPNAME2= <>
##$TPNAME3= <>
##$TPNAME4= <>
##$TPNAME5= <>
##$TPNAME6= <>
##$TPNAME7= <>
##$TPOAL= (0..7)
0.5 0.5 0.5 0.5 0.5 0.5 0.5 0.5 
##$TPOFFS= (0..7)
0 0 0 0 0 0 0 0 
##$TUNHIN= 0
##$TUNHOUT= 0
##$TUNXOUT= 0
##$USERA1= <user>
##$USERA2= <user>
##$USERA3= <user>
##$USERA4= <user>
##$USERA5= <user>
##$V9= 5
##$VALIST= <valist>
##$VCLIST= <CCCCCCCCCCCCCCC>
##$VD= 0
##$VDLIST= <DDDDDDDDDDDDDDD>
##$VPLIST= <PPPPPPPPPPPPPPP>
##$VTLIST= <TTTTTTTTTTTTTTT>
##$WBST= 1024
##$WBSW= 4
##$XGAIN= (0..3)
0 0 0 0 
##$XL= 0
##$YL= 0
##$YMAX_a= 2892
##$YMIN_a= -2814
##$ZGOPTNS= <>
##$ZL1= 120
##$ZL2= 120
##$ZL3= 120
##$ZL4= 120
##$ABSF1= 0
##$ABSF2= 0
##$ABSG= 0
##$ABSL= 0
##$ALPHA= 0
##$AQORDER= 0
##$ASSFAC= 0
##$ASSFACI= 0
##$ASSFACX= 0
##$ASSWID= 0
##$AUNMP= <proc_1d>
##$AZFE= 0.1
##$AZFW= 0.5
##$BCFW= 0
##$BC_mod= 2
##$BYTORDP= 0
##$COROFFS= 0
##$CY= -3
##$DATMOD= 1
##$DC= 0
##$DFILT= <>
##$DTYPP= 0
##$F1P= 0
##$F2P= 0
##$FCOR= 1
##$FTSIZE= 65536
##$FT_mod= 6
##$GAMMA= 0
##$GB= 0
##$INTBC= 1
##$INTSCL= 6.047779e-11
##$ISEN= 30
##$LB= 10
##$LEV0= 0
##$LPBIN= 0
##$MAXI= 10000
##$MC2= 0
##$MEAN= 0
##$ME_mod= 0
##$MI= 50
##$NCOEF= 0
##$NC_proc= -8
##$NLEV= 6
##$NOISF1= 182.463
##$NOISF2= 159.3651
##$NSP= 0
##$NTH_PI= 0
##$NZP= 0
##$OFFSET= 248.5645
##$PC= 4
##$PHC0= -12876.41
##$PHC1= 36.88348
##$PH_mod= 1
##$PKNL= yes
##$PPARMOD= 0
##$PSCAL= 0
##$PSIGN= 0
##$REVERSE= no
##$SF= 81.0140089999694
##$SI= 65536
##$SIGF1= 159.3651
##$SIGF2= -187.1042
##$SINO= 113.3802
##$SIOLD= 16384
##$SREGLST= <1H.CDCl3>
##$SSB= 0
##$STSI= 65536
##$STSR= 0
##$SW_p= 40650.406504065
##$SYMM= 0
##$S_DEV= 0
##$TDeff= 32768
##$TDoff= 0
##$TI= <>
##$TILT= no
##$TM1= 0
##$TM2= 0
##$TOPLEV= 0
##$USERP1= <user>
##$USERP2= <user>
##$USERP3= <user>
##$USERP4= <user>
##$USERP5= <user>
##$WDW= 1
##$XDIM= 65536
##$YMAX_p= 475036771
##$YMIN_p= -45139030
$$ End of Bruker specific parameters
$$ ---------------------------------
##NTUPLES= NMR SPECTRUM
##VAR_NAME=  FREQUENCY,     SPECTRUM/REAL,   SPECTRUM/IMAG
##SYMBOL=    X,             R,               I
##VAR_TYPE=  INDEPENDENT,   DEPENDENT,       DEPENDENT
##VAR_FORM=  AFFN,          ASDF,            ASDF
##VAR_DIM=   65536,         65536,           65536
##UNITS=     HZ,            ARBITRARY UNITS, ARBITRARY UNITS
##FACTOR=    0.620285442955139, 1,           1
##FIRST=     20137.2065510682, 0,            0
##LAST=      -20513.1999529968, 0,           0
##MIN=       -20513.1999529968, -45139030,   0
##MAX=       20137.2065510682, 475036771,    0
$$ Real data points
##PAGE= N=1
##DATA TABLE= (X++(R..R)), XYDATA
$$ [...]
40154e070416j03066m8825N902N5649R5681J24189J43414J58061J71622J83428
40144d284361J88552J80597J55439J14021O3139J3903k1609l4212k0227J8114
40134c626644P4042J38291K00952K52995K87629L01481K95104K72327K38592J99129
40124a366102J57768J16509P5617L4324p808m9804q9400j24194j52179j71081
40114a576350j77829j69629j46098j10473o8737k7393Q777L8017O1603Q2575J03909
40103a981628J27072J51237J72995J86671J85615J64304J20376N5982k1771j01501
40093i40648j69794k14689k28985k12076j70089j14502n9241j6553O983J2227
40083b107367O109k125m959J117J5709L5874N7019P3189P8210O8489M5903J7892
$$ plain form
40154 -5070416 -5173482 -5222307 -5216405 -5160756 -5065075 -4940886 -4797472 -4639411 -4467789 -4284361
40144 -4284361 -4095809 -3915212 -3759773 -3645752 -3582613 -3568710 -3590319 -3624531 -3644758 -3626644
40134 -3626644 -3552602 -3414311 -3213359 -2960364 -2672735 -2371254 -2076150 -1803823 -1565231 -1366102
40124 -1366102 -1208334 -1091825 -1016208 -981884 -989692 -1039496 -1128896 -1253090 -1405269 -1576350
40114 -1576350 -1754179 -1923808 -2069906 -2180379 -2249116 -2276509 -2267732 -2229715 -2168112 -2085537 -1981628
40103 -1981628 -1854556 -1703319 -1530324 -1343653 -1158038 -993734 -873358 -817376 -839147 -940648
40093 -940648 -1110442 -1325131 -1554116 -1766192 -1936281 -2050783 -2110024 -2126577 -2119594 -2107367
40083 -2107367 -2101258 -2103383 -2108342 -2107225 -2091516 -2055642 -1998623 -1925434 -1847224 -1778735 -1732832 -1714940
40071a714940n907j8270j7206n725J0468K5733L6489M2066M4246M5828M9088N5215
40059a452915O4807P8325R5203J12282J23537J22092J03126O5483J1644n2898
40049g29314j20292j81502k28244k54946k59936k45768k18538j85905j54091j25380
40039b703916r7512o5199k2800L2789R9975J72159K39882K94347L30216L46168
40029a373891L43660L25280K93784K51836K02093J47282R0290L4332j7126o1042
40019B36498r6173j24173j49113j75035k02962k29608k48988k55787k48053k27289
40009a720683j96390j57606j12387o2821j2761L2648O8444R0862R7501Q7592O2939
39998a822662K8704p385l7724n8000o8934p5449q3466r5719j08963j14463j01867
$$ plain form
40071 -1714940 -1720847 -1739117 -1756323 -1762048 -1751580 -1725847 -1689358 -1647292 -1603046 -1557218 -1508130 -1452915
40059 -1452915 -1388108 -1309783 -1214580 -1102298 -978761 -856669 -753543 -688060 -676416 -729314
40049 -729314 -849606 -1031108 -1259352 -1514298 -1774234 -2020002 -2238540 -2424445 -2578536 -2703916
40039 -2703916 -2801428 -2866627 -2889427 -2856638 -2756663 -2584504 -2344622 -2050275 -1720059 -1373891
40029 -1373891 -1030231 -704951 -411167 -159331 42762 190044 280334 314666 297540 236498
40019 236498 140325 16152 -132961 -307996 -510958 -740566 -989554 -1245341 -1493394 -1720683
40009 -1720683 -1917073 -2074679 -2187066 -2249887 -2262648 -2230000 -2161556 -2070694 -1973193 -1885601 -1822662
39998 -1822662 -1793958 -1801343 -1839067 -1897067 -1966001 -2041450 -2124916 -2220635 -2329598 -2444061 -2545928
39987b545928o4350k009P8092J64665K45629L10516L51490L63794L46402L02649
39977d49050K39934J68156R7412L5639j3281n0258p9838j07224j35056j61825
39967d55391j82495j90643j81260j53385j11385o3876k0768R800K3378K0167N399
39956a300459j1575k0143j2353J4150N5566J03648J48666J82519K00694K02432
39946d36855J89575J65601J35506J05882Q3906P5132Q1269R9419J23475J46758
39936G69668J64292J73312J72413J60780J38571J07885P3122M0058J4050j849
39926A812302p964p611n386n143q958j7266k9233m2871n5247o3459o5926o2994
39914A440244n6463m8726m2362m0152m4720n7337p6483r7319j12881j16354j03181
$$ plain form
39987 -2545928 -2610278 -2612287 -2534195 -2369530 -2123901 -1813385 -1461895 -1098101 -751699 -449050
39977 -449050 -209116 -40960 56452 92091 78810 28552 -51286 -158510 -293566 -455391
39967 -455391 -637886 -828529 -1009789 -1163174 -1274559 -1338435 -1359203 -1349403 -1326025 -1305858 -1300459
39956 -1300459 -1312034 -1332177 -1344530 -1330380 -1274814 -1171166 -1022500 -839981 -639287 -436855
39946 -436855 -247280 -81679 53827 159709 243615 318747 400016 499435 622910 769668
39936 769668 933960 1107272 1279685 1440465 1579036 1686921 1760043 1800101 1814151 1812302
39926 1812302 1804338 1796727 1791341 1786198 1777240 1759974 1730741 1687870 1632623 1569164 1503238 1440244
39914 1440244 1383781 1335055 1292693 1252541 1207821 1150484 1074001 976682 863801 747447 644266
39903F44266p2256k6529K6667P6294J10251J19489J01248N9355J796o2403j25199
39892H52979j80203k22594k48922k57292k48040k24217j90980j53733j16375q0800
39882a070177m7446j5691J6126N0211Q7927J28552J69295K06481K36971K59068
39872B1317K72904K80122K82832K82406K78980K71701K58923K38038K05824J60166
39862B553213J02414L8495k2365p0843j00987j12167j08477r5972p9615o2013
39852B041683m4379k8197j6020j1165j6928l5772o8271j12162j62288k11816k54062
39841A080623k83679k96696k90105k62170k13933j50827q2650k0917K5217N2087
39831d43050O1867O0342N3779M6791M1950M0728M4577N5223P4051J01122J34585
$$ plain form
39903 644266 572010 545481 572148 648442 758693 878182 979430 1038785 1040581 978178 852979
39892 852979 672776 450182 201260 -56032 -304072 -528289 -719269 -873002 -989377 -1070177
39882 -1070177 -1117623 -1133314 -1117188 -1066977 -979050 -850498 -681203 -474722 -237751 21317
39872 21317 294221 574343 857175 1139581 1418561 1690262 1949185 2187223 2393047 2553213
39862 2553213 2655627 2694122 2671757 2600914 2499927 2387760 2279283 2183311 2103696 2041683
39852 2041683 1997304 1969107 1953087 1941922 1924994 1889222 1820951 1708789 1546501 1334685 1080623
39841 1080623 796944 500248 210143 -52027 -265960 -416787 -499437 -520354 -495137 -443050
39831 -443050 -381183 -320841 -267062 -220271 -178321 -137593 -93016 -37793 36258 137380 271965
39820B71965J70950K06297K38074K66464K94231L24759L59563L97172M34110M66891
39810C430476M93336N12633N25092N32440N38424N48570N68699O02842O51689
39801H404201P12277P79082Q46339R10923R74457J043358J126550J231878J363016
39792A7392081J518163J690727J870905K046864K204796K327842K394655K379173
39784C3825206K254504K002825J628507J166096O74759K18991j54302m29257o19188
39775D0568141p53919q65594r79068j107308j249810j393757j518999j606353
39767C1093333j645432j637790j594358j529947j458304j389149j327057j271932
39759A9239364j220912j170687j118839j063845j004742r41355q74898q08021
$$ plain form
39820 271965 442915 649212 887286 1153750 1447981 1772740 2132303 2529475 2963585 3430476
39810 3430476 3923812 4436445 4961537 5493977 6032401 6580971 7149670 7752512 8404201
39801 8404201 9116478 9895560 10741899 11652822 12627279 13670637 14797187 16029065 17392081
39792 17392081 18910244 20600971 22471876 24518740 26723536 29051378 31446033 33825206
39784 33825206 36079710 38082535 39711042 40877138 41551897 41770888 41616586 41187329 40568141
39775 40568141 39814222 38948628 37969560 36862252 35612442 34218685 32699686 31093333
39767 31093333 29447901 27810111 26215753 24685806 23227502 21838353 20511296 19239364
39759 19239364 18018452 16847765 15728926 14665081 13660339 12718984 11844086 11036065
39751A1036065p44107o86353o37182n98008n68971n48603n33733n20170n04069
39742E694869m83205m57218m26683l91844l52199l07492k59601k13962j79079
39733B623586j63759j73353k06974k57147l11946l58611l87382l94158l80829
39724a0573l53215l17687k78435k36661j91698j42854r0682l7141J4918O2345
39714a581683J02285J32926J54193J67644J75450J79278J79947J77707J72261
39705a39992J62384J45880J20532Q5548M2488m742n0381q7623j09960j13145r6771
39694d5782o4399k2155K3057O4711R7264J16820J21846J13242R3513O5899L4482
39683E98498M820j6633k5412k2697j6452j8075l6252p2178j19254j66819k05020
$$ plain form
39751 11036065 10291958 9605605 8968423 8370415 7801444 7252841 6719108 6198938 5694869
39742 5694869 5211664 4754446 4327763 3935919 3583720 3276228 3016627 2802665 2623586
39733 2623586 2459827 2286474 2079500 1822353 1510407 1151796 764414 370256 -10573
39724 -10573 -363788 -681475 -959910 -1196571 -1388269 -1531123 -1621805 -1658946 -1644028 -1581683
39714 -1581683 -1479398 -1346472 -1192279 -1024635 -849185 -669907 -489960 -312253 -139992
39705 -139992 22392 168272 288804 374352 416840 412098 361717 274094 164134 50989 -45782
39694 -45782 -110181 -132336 -109279 -44568 52696 169516 291362 404604 498117 564016 598498
39683 598498 603318 586685 561273 538576 522124 504049 467797 395619 276365 109546 -95474
39672i5474k28158k35614k30950k19756k07051j95273j83797j70146j51942j28469
39662b046630j01051p2363m5185k1379j358J5901L2581N1402P4554J02404J32638
39651a878486J60488J80090J86514J77692J55353J24319R0368N7924K9035L940
39641g12763j7727l6243n1681o3777p1575p3297o7068n2297l0826o920J4139K8036
39629a141999L2800K8882J8496N025p466j5134j5613q589M915K3669M6343P0616
39617i58055R2781J09041J17623J19519J16834J10075R6980P4166M0073l310n1289
39606a35562r8691j41396j76433k01400k14169k13126j97745j69442j32289r2808
39596a773061n8414l4953k4662k5499l2104l8010l8479l2740k4441j9688k3606
$$ plain form
39672 -95474 -323632 -559246 -790196 -1009952 -1217003 -1412276 -1596073 -1766219 -1918161 -2046630
39662 -2046630 -2147681 -2220044 -2265229 -2286608 -2287966 -2272065 -2239484 -2188082 -2113528 -2011124 -1878486
39651 -1878486 -1717998 -1537908 -1351394 -1173702 -1018349 -894030 -803662 -745738 -716703 -712763
39641 -712763 -730490 -766733 -818414 -882191 -953766 -1027063 -1094131 -1146428 -1177254 -1184174 -1170035 -1141999
39629 -1141999 -1109199 -1080317 -1061821 -1056796 -1064262 -1079396 -1095009 -1103598 -1098683 -1075014 -1028671 -958055
39617 -958055 -865274 -756233 -638610 -519091 -402257 -292182 -195202 -121036 -80963 -84273 -135562
39606 -135562 -234253 -375649 -552082 -753482 -967651 -1180777 -1378522 -1547964 -1680253 -1773061
39596 -1773061 -1831475 -1866428 -1891090 -1916589 -1948693 -1986703 -2025182 -2057922 -2082363 -2102051 -2125657
39585b125657l7287n6926p5442q5529q2347o4751l5093J691L9280P1471R3917
39574b356673J05448J08156J06029J02833J00375R7905R2930Q3074O8037N0392
39564a441494L4477K3978J9857J9963K0489J8314J2812O122J501P17K415K912
39552a277937q54q450j5300j4732j290K6869O7749J17010J69499K19581K60767
39541d57088K86257K91073K74460K40474J96193J48855J03916O4825L3773J2144
39531A194882J30l864k961n01J367K063J746J84l716j1307k2937l6864m9302n6088
39517A012832n5224m8560m1106l8143m2166n2015o4738p8360r2880j08879j25343
39506B65418j38921j44977j39262j19147q4396l7497J6718P2322J23565J65465
$$ plain form
39585 -2125657 -2162944 -2219870 -2295312 -2380841 -2463188 -2527939 -2563032 -2561341 -2522061 -2450590 -2356673
39574 -2356673 -2251225 -2143069 -2037040 -1934207 -1833832 -1735927 -1642997 -1559923 -1491886 -1441494
39564 -1441494 -1407017 -1383039 -1363182 -1343219 -1322730 -1304416 -1291604 -1285482 -1283981 -1283264 -1280849 -1277937
39552 -1277937 -1278791 -1287241 -1302541 -1317273 -1318563 -1291694 -1223945 -1106935 -937436 -717855 -457088
39541 -457088 -170831 120242 394702 635176 831369 980224 1084140 1148965 1182738 1194882
39531 1194882 1195012 1191148 1188187 1187686 1189053 1191116 1192862 1193046 1189330 1178023 1155086 1118222 1068920 1012832
39517 1012832 957608 909048 867942 829799 787633 735618 670880 592520 499640 390761 265418
39506 265418 126497 -18480 -157742 -276889 -361285 -398782 -382064 -309742 -186177 -20712
39496b0712J94032K07030K05147J92287J73975J54752J36405J17992R7084P1163
39486A529155L8976J832l5514o5670q1531q0226o5518m6772l4769l6648n2816
39475A070499p7398j01834j19569j29114j33785j38582j46654j57720j68858j76234
39465b79249j76436j67333j48839j23293r4886o8559m9260m1511m8151o8294r6373
39454a362184j24037j43957j52510j49459j35780j12116p9156l9093L590M3161
39444b251541P5070R8072J14249J26630J36173J40435J34918J15901Q2564L7134
39434a190395j6232p2255j24442j65302j88277j90812j76012j50962j22652r4468
39424b491809o5606l3441L145M1869P7700J05382J21852J27338J25203J21164
$$ plain form
39496 -20712 173320 380350 585497 777784 951759 1106511 1242916 1360908 1457992 1529155
39486 1529155 1568131 1569963 1534449 1468779 1387248 1307022 1241504 1194732 1159963 1123315 1070499
39475 1070499 993101 891267 771698 642584 508799 370217 223563 65843 -103015 -279249
39465 -279249 -455685 -623018 -771857 -895150 -990036 -1058595 -1107855 -1149366 -1197517 -1265811 -1362184
39454 -1362184 -1486221 -1630178 -1782688 -1932147 -2067927 -2180043 -2259199 -2298292 -2294702 -2251541
39444 -2251541 -2176471 -2078399 -1964150 -1837520 -1701347 -1560912 -1425994 -1310093 -1227529 -1190395
39434 -1190395 -1206627 -1278882 -1403324 -1568626 -1756903 -1947715 -2123727 -2274689 -2397341 -2491809
39424 -2491809 -2557415 -2590856 -2587711 -2545842 -2468142 -2362760 -2240908 -2113570 -1988367 -1867203
39414a867203J21660J31059J48738J68188J79292J72779J44607R8470M5299l90
39404f57501k6169k6723n692K6215N5370O9670O1862L1102j7465p4595j29474
39393f93400j72139j95308j95304j71902j27655o7404J945P1933J33773J79742
39383a235719K04063K03347J77144J28751O5542k199o4147j13336j48163j71672
39373i56389j88643k02419k13298k18844k15446k00125j71959j32570q5677l6279
39363b621649R933M7008O9744P5458O5608M5679K2967L647q823j3085q516M974
39351b307055K5658M9076O9240Q1453Q4299P9204O8331N3148L4784J5238k419
39340a749043j5327k2263k3801k1301j5978q704j75Q842J6943K1380J8546O246
$$ plain form
39414 -1867203 -1745543 -1614484 -1465746 -1297558 -1118266 -945487 -800880 -702410 -657111 -657501
39404 -657501 -683670 -710393 -716085 -689870 -634500 -564830 -502968 -471866 -489331 -563926 -693400
39393 -693400 -865539 -1060847 -1256151 -1428053 -1555708 -1623112 -1621167 -1549234 -1415461 -1235719
39383 -1235719 -1031656 -828309 -651165 -522414 -456872 -459071 -523218 -636554 -784717 -956389
39373 -956389 -1145032 -1347451 -1560749 -1779593 -1995039 -2195164 -2367123 -2499693 -2585370 -2621649
39363 -2621649 -2611716 -2564708 -2494964 -2419506 -2353898 -2308219 -2285252 -2281605 -2290428 -2303513 -2312029 -2307055
39351 -2307055 -2281397 -2232321 -2163081 -2081628 -1997329 -1918125 -1849794 -1796646 -1761862 -1746624 -1749043
39340 -1749043 -1764370 -1786633 -1810434 -1831735 -1847713 -1856417 -1856592 -1847750 -1830807 -1809427 -1790881 -1784635
39328a784635j3827l5933n2938n9567n4011l7606j3771J3152L8984O0619P6219
39317a863314Q4796Q5914Q0016O9017N6350M5875M0123L9016M0128M0259L7077
39306a244743K9706J8405M133j1542k6448l8040m3953m2769l4706k1724o780P325
39294a411136J8837K7332L3614L9295M5823N3130N8820N8871M9817L1182O638
39283i87777j6955l2282l4733k4405o043J2866K4706K4090R542j5673m4123o6833
39271a157620p7150p3563n9212l8550j4290J2974M2898P4015J04164J31618J55141
39260h99575J72970J82201J79496J62421J30179Q3527K4632m2623j12391j77410
39250b96573k30355k65201k78186k68727k40420k01389j62771j35289j25356j32741
$$ plain form
39328 -1784635 -1798462 -1834395 -1887333 -1946900 -2000911 -2038517 -2052288 -2039136 -2000152 -1939533 -1863314
39317 -1863314 -1778518 -1692604 -1612588 -1543571 -1487221 -1441346 -1401223 -1362207 -1322079 -1281820 -1244743
39306 -1244743 -1215037 -1196632 -1192499 -1204041 -1230489 -1268529 -1312482 -1355251 -1389957 -1411681 -1418461 -1411136
39294 -1411136 -1392299 -1364967 -1331353 -1292058 -1246235 -1193105 -1134285 -1075414 -1025597 -994415 -987777
39283 -987777 -1004732 -1037014 -1071747 -1096152 -1102195 -1089329 -1064623 -1040533 -1030991 -1046664 -1090787 -1157620
39271 -1157620 -1234770 -1308333 -1367545 -1406095 -1420385 -1407411 -1364513 -1290498 -1186334 -1054716 -899575
39260 -899575 -726605 -544404 -364908 -202487 -72308 11219 35851 -6772 -119163 -296573
39250 -296573 -526928 -792129 -1070315 -1339042 -1579462 -1780851 -1943622 -2078911 -2204267 -2337008
39240b337008j50977j70161j80773j76780j57201j26081r1220o1670m4390m1353
39230c537614m8790n9085o4091n8128l9581j0941K2598N5460Q3736J05694J20526
39219c430216J26608J21026J01246O7915K6584j3309m1875n2468m3559j8101J8571
39208c137578O0966J04601J45885J81386K07783K23102K28267K27037K23793K20738
39198a314020K16924K09746J97514J80964J62952J46890J35078J27647J22398
39189A86093J15498J02950Q2335N4095K1762r165l3116m6171m6892l6306j7546
39178C73537M696K5187L9427M4462L8638K0824r918n3880j10001j75300k44599
39167d6927l10852l66476m05535m25374m26540m11181l81487l39470k87938k31282
$$ plain form
39240 -2337008 -2487985 -2658146 -2838919 -3015699 -3172900 -3298981 -3390201 -3451871 -3496261 -3537614
39230 -3537614 -3586404 -3645489 -3709580 -3767708 -3807289 -3818230 -3795632 -3740172 -3656436 -3550742 -3430216
39219 -3430216 -3303608 -3182582 -3081336 -3013421 -2986837 -3000146 -3042021 -3094489 -3138048 -3156149 -3137578
39208 -3137578 -3076612 -2972011 -2826126 -2644740 -2436957 -2213855 -1985588 -1758551 -1534758 -1314020
39198 -1314020 -1097096 -887350 -689836 -508872 -345920 -199030 -63952 63695 186093
39189 186093 301591 404541 486876 540971 562733 553568 520452 474281 427389 391083 373537
39178 373537 378233 403420 442847 487309 525947 546771 536853 482973 372972 197672 -46927
39167 -46927 -357779 -724255 -1129790 -1555164 -1981704 -2392885 -2774372 -3113842 -3401780 -3633062
39157c633062j74802j22713p6189l3109J0186N6058J03352J47086J80603J99244
39147c343346K03280J97990J90856J88155J93060K05508K22752K40090K51952
39138a449703K53268K40547K12528J70670J19259O4330J1576l5347p4757j05604
39128e93233j26468j35794j32820j18284r4631o5854l7004j3325Q00K755p908
39117a321766k9553n8896r1541j22478j46356j57719j51685j25428q0045k1465
39107b306932M0644R5573J34602J53149J51716J35474J12243Q9374P1057N7731
39097a265369M7700L9563L3958L4006M4385O9372J10493J64950K25560K82016
39087b13366L22873L38073L22012K76353K10818J40696Q1587M3836K9322L2121
$$ plain form
39157 -3633062 -3807864 -3930577 -4006766 -4039875 -4029689 -3973631 -3870279 -3723193 -3542590 -3343346
39147 -3343346 -3140066 -2942076 -2751220 -2563065 -2370005 -2164497 -1941745 -1701655 -1449703
39138 -1449703 -1196435 -955888 -743360 -572690 -453431 -389101 -377525 -412872 -487629 -593233
39128 -593233 -719701 -855495 -988315 -1106599 -1201230 -1267084 -1304088 -1317413 -1316613 -1313858 -1321766
39117 -1321766 -1351319 -1410215 -1501756 -1624234 -1770590 -1928309 -2079994 -2205422 -2285467 -2306932
39107 -2306932 -2266288 -2170715 -2036113 -1882964 -1731248 -1595774 -1483531 -1394157 -1323100 -1265369
39097 -1265369 -1217669 -1178106 -1144148 -1110142 -1065757 -996385 -885892 -720942 -495382 -213366
39087 -213366 109507 447580 769592 1045945 1256763 1397459 1479046 1522882 1552204 1584325
39077A584325M2328N0824N2469M6667L5991K4301J5323J1777J4953K4753M0054
39066A943765N9139P9999J00554J18831J32934J40914J40844J31308J11847Q2927
39056C043062M5548J166m7992r8857j48233j93787k34325k69059k96509l14001
39046A487013l17918l04414k70513k15780j44315o5702O447N8333Q0308O9493
39036C82952K9924k8852r3730j50621j87872j99751j88047j60670j28041r9559
39026h24267q1805p8271q9535j13162j43935j75048k00080k14688k17187k08091
39016b346069j89272j63158j31978r7197n9394j8967K2720O2590R6342J20137
39006b704246J32476J35014J31849J27842J27251J33276J48151J72965K06973
$$ plain form
39077 1584325 1626653 1677477 1729946 1776613 1812604 1836905 1852228 1864005 1878958 1903711 1943765
39066 1943765 2002904 2082903 2183457 2302288 2435222 2576136 2716980 2848288 2960135 3043062
39056 3043062 3088610 3089776 3041784 2942927 2794694 2600907 2366582 2097523 1801014 1487013
39046 1487013 1169095 864681 594168 378388 234073 168371 174818 233151 313459 382952
39036 382952 412876 384024 290294 139673 -48199 -247950 -435997 -596667 -724708 -824267
39026 -824267 -906072 -984343 -1073878 -1187040 -1330975 -1506023 -1706103 -1920791 -2137978 -2346069
39016 -2346069 -2535341 -2698499 -2830477 -2927674 -2987068 -3006035 -2983315 -2920725 -2824383 -2704246
39006 -2704246 -2571770 -2436756 -2304907 -2177065 -2049814 -1916538 -1768387 -1595422 -1388449
38997a388449K47020K87776L22938L46823L55665L48131L24870K87533K38053
38988A370360J78818J13472M7099j4916o8680j12926j48663j78047k03398k26612
38978G56507k48348k66896k77586k74097k51577k09753j53619r1135k9659K6441
38968a019722P5690J17580J50422J70600J73992J58804J27835Q8188M8300J4146
38958A05835j2950l5779n8655q4524j13311j42191j67082j84221j91237j87995
38948a072110j77355j65073j57896j60172j71011j84240j91623j87499j71806
38939b638785j49533j27136j08614r3789p9412o1712l8604j0754J8502M4173O1292
38928c184372O6703O0203M4681K5466R135J972Q346K9510O3225J04313J45898
$$ plain form
38997 -1388449 -1141429 -853653 -530715 -183892 171773 519904 844774 1132307 1370360
38988 1370360 1549178 1662650 1709749 1694833 1626153 1513227 1364564 1186517 983119 756507
38978 756507 508159 241263 -36323 -310420 -561997 -771750 -925369 -1016504 -1046163 -1019722
38968 -1019722 -944032 -826452 -676030 -505430 -331438 -172634 -44799 43389 91689 105835
38958 105835 92885 57106 -1549 -86073 -199384 -341575 -508657 -692878 -884115 -1072110
38948 -1072110 -1249465 -1414538 -1572434 -1732606 -1903617 -2087857 -2279480 -2466979 -2638785
38939 -2638785 -2788318 -2915454 -3024068 -3117857 -3197269 -3258981 -3297585 -3308339 -3289837 -3245664 -3184372
38928 -3184372 -3117669 -3057466 -3012785 -2987319 -2978184 -2976212 -2967866 -2938356 -2875131 -2770818 -2624920
38917b624920J81238K05700K18138K20915K18562K15915K16552K21875K30774
38908f95251K39958K45052K42046K28265K02367J63873J13383N3809q466o4291
38898G20745j04787j25201j27049j17194j04320r4643q8877q2128o7043l8687
38888b29184J812M7184Q7486J14851J26832J26786J21407J16920J16083J17560
38878G47737J17747J13639J04908R4118Q5065Q0577Q1331Q6514R5394J08086J24569
38867A839685J42868J58281J64828J58398J39531J13720Q8695P0263N9146N0460
38857B985875L5700O216m3244j12520j96559k87922l79184m63514n33773n82177
38847D28898o01899n89891n48692m85862m11363l34688k63143k01503j52253j15978
$$ plain form
38917 -2624920 -2443682 -2237982 -2019844 -1798929 -1580367 -1364452 -1147900 -926025 -695251
38908 -695251 -455293 -210241 31805 260070 462437 626310 739693 793502 785036 720745
38898 720745 615958 490757 363708 246514 142194 47551 -41326 -123454 -190497 -229184
38888 -229184 -227372 -180188 -92702 22149 148981 275767 397174 514094 630177 747737
38878 747737 865484 979123 1084031 1178149 1263214 1343791 1425122 1511636 1607030 1715116 1839685
38867 1839685 1982553 2140834 2305662 2464060 2603591 2717311 2806006 2876269 2935415 2985875
38857 2985875 3021575 3027791 2984547 2872027 2675468 2387546 2008362 1544848 1011075 428898
38847 428898 -173001 -762892 -1311584 -1797446 -2208809 -2543497 -2806640 -3008143 -3160396 -3276374
38837c276374r1959p9082p6442q2791r4919j06483j09044r5581o4480k0884K5881
38826d072158O7245R9294J23477J44354J66220J90305K13791K30978K36129K26287
38816b374078K02579J69484J32924R8312O9461M8627L7024L4768L9893M7661N1681
38805a441664M6622L0557N183k5677n7628q6266j07204j16474j11486r1774n8939
38794b014750j5952L3307Q4026J30503J67047J89676J97669J93848J83214J70538
38784f80874J58081J44572J25894R7077N4865J17o0841j16887j55151j65425j43903
38773g42475r4631k8074M2560J05675J54210J85862K01247K02042J90498J69903
38763C86817J44854J20687J02248R2399R0859R4102R6768R3951Q3196O5201M3072
$$ plain form
38837 -3276374 -3368333 -3447415 -3523857 -3606648 -3701567 -3808050 -3917094 -4012675 -4077155 -4098039 -4072158
38826 -4072158 -4004913 -3905619 -3782142 -3637788 -3471568 -3281263 -3067472 -2836494 -2600365 -2374078
38816 -2374078 -2171499 -2002015 -1869091 -1770779 -1701318 -1652691 -1615667 -1580899 -1541006 -1493345 -1441664
38805 -1441664 -1395042 -1364485 -1359302 -1384979 -1442607 -1528873 -1636077 -1752551 -1864037 -1955811 -2014750
38794 -2014750 -2030702 -1997395 -1913369 -1782866 -1615819 -1426143 -1228474 -1034626 -851412 -680874
38784 -680874 -522793 -378221 -252327 -155250 -100385 -100268 -161109 -277996 -433147 -598572 -742475
38773 -742475 -837106 -865180 -822620 -716945 -562735 -376873 -175626 26416 216914 386817
38763 386817 531671 652358 754606 847005 937864 1031966 1128734 1222685 1305881 1371082 1414154
38752A414154K0612P52j4973k5944l2062l4182l4742l7442m5985o2898q9042j23272
38740I34976j61854j98387k25116k35340k25547j96342j52033r9244m4865N900
38730e97852N0284Q6916J13761J26875J21321R3865M5530j7729q6460j49908j97821
38719d11218k21852k17204j84332j29539o3340K982O1160J08402J47509J84446
38709g22986K24214K67089L07465L36138L44457L27872K87079K26987J54746P8086
38699A831147M506n8865j05416j29797j29302j05425o4681j7978K1752M3102L9637
38688A328680J1905l2834q2979j26357j53900j61535j49544j20381p7119k3618
38678D12318L4588R0436J36953J69065J84176J81404J60586J22141O7843J582
$$ plain form
38752 1414154 1434766 1435518 1420545 1394601 1362539 1328357 1293615 1256173 1210188 1147290 1058248 934976
38740 934976 773122 574735 349619 114279 -111268 -307610 -459643 -558887 -603752 -597852
38730 -597852 -547568 -460652 -346891 -220016 -98695 -4830 40700 22971 -63489 -213397 -411218
38719 -411218 -633070 -850274 -1034606 -1164145 -1227485 -1224503 -1163343 -1054941 -907432 -722986
38709 -722986 -498772 -231683 75782 411920 756377 1084249 1371328 1598315 1753061 1831147
38699 1831147 1835653 1776788 1671372 1541575 1412273 1306848 1242167 1224189 1245941 1289043 1328680
38688 1328680 1340585 1307751 1224772 1098415 944515 782980 633436 513055 435936 412318
38678 412318 446906 537342 674295 843360 1027536 1208940 1369526 1491667 1559510 1561092
38668A561092p0667j41732k04327k52035k80215k86781k72319k39374j91609j33575
38658e11542p0897r770M4782R0917J30650J68257K07073K46817K83305L10824
38648H90416L25186L25376L13195K92013K65669K37725K10880J86690J65678J47374
38638C360202J30065J10658Q5449N1694R152l9427q9036j34198j71166j99569
38628C113824k22486k44588k69396k97312l25424l48596l60783l56199l30870
38619C58170k84718k22938j55128r2251m3211j2748p38k357r405j3389r579N83
38607d87709J1001J5619J3005P545O708J6581L8526O8391R8220J19450J26523
38596C3860J19455J03840Q8021P8787P8045Q2060Q3497P5169N3765K1618j4621
$$ plain form
38668 1561092 1490425 1348693 1144366 892331 612116 325335 53016 -186358 -377967 -511542
38658 -511542 -582439 -592209 -547427 -456510 -325860 -157603 49470 296287 579592 890416
38648 890416 1215602 1540978 1854173 2146186 2411855 2649580 2860460 3047150 3212828 3360202
38638 3360202 3490267 3600925 3686374 3738068 3747220 3707793 3618757 3484559 3313393 3113824
38628 3113824 2891338 2646750 2377354 2080042 1754618 1406022 1045239 689040 358170
38619 358170 73452 -149486 -304614 -396865 -440076 -452824 -453562 -455919 -465324 -478713 -488292 -487709
38607 -487709 -476708 -461089 -448084 -440539 -433831 -417250 -378724 -310333 -212113 -92663 33860
38596 33860 153315 257155 345176 423963 502008 584068 667565 742734 796499 818117 803496
38585H03496m7356p1187q4175q7567q5179q2734q6546j01410j28693j65807k07398
38574c44556k47644k82441l10220l30796l43215l44490l30544k98686k49627j87686
38564c269905j19357n1229J1779O7433J16019J59005J97250K30116K56172K74705
38554b128012K86287K91400K88290K72428K38815J85770J17316M2442k8126q5614
38544e19004j25538j48068j56623j55580j48174j35593j17540r3641o4614l2376
38534a696751P99L3162O3566R1030J14752J34836J52689J70036J87222K02495
38524e46164K13084K16911K13334K02648J85312J61736J32560R8795O1739K2795
38514I62750j6451n3962q7028j12595j28242j33353j29724j21067j11610j04425
$$ plain form
38585 803496 756140 684953 600778 513211 428032 345298 258752 157342 28649 -137158 -344556
38574 -344556 -592200 -874641 -1184861 -1515657 -1858872 -2203362 -2533906 -2832592 -3082219 -3269905
38564 -3269905 -3389262 -3440491 -3428712 -3361279 -3245260 -3086255 -2889005 -2658889 -2402717 -2128012
38554 -2128012 -1841725 -1550325 -1262035 -989607 -750792 -565022 -447706 -405264 -433390 -519004
38544 -519004 -644542 -792610 -949233 -1104813 -1252987 -1388580 -1506120 -1599761 -1664375 -1696751
38534 -1696751 -1695952 -1662790 -1599224 -1508194 -1393442 -1258606 -1105917 -935881 -748659 -546164
38524 -546164 -333080 -116169 97165 299813 485125 646861 779421 878216 939955 962750
38514 962750 946299 892337 805309 692714 564472 431119 301395 180328 68718 -35707
38504c5707j00342r7886r4139q5902p0682m7249j5832K2191O4846J09889J54420
38493a96393J94146K23584K37766K34559K15728J85672J48805J07535O2319J3428
38483A427149l7080q4729j23843j50062j62830j66480j68841j77523j95682k19877
38473e9798k41638k51766k44476k18996j78660j29263p7826l1314N369L1185M8876
38462a348307O2663P5662Q8878J01562J11417J14266J04667P8464L6080j6160
38452e90808o8055j09543j33957j38635j23465q9404l8596K4242R1079J51942
38442a025200J98138K25411K35178K33234K26847K21835K20872K23425K26896
38433I86636K28368K26172K20410K12177K02288J90861J78114J65166J53635J44490
$$ plain form
38504 -35707 -136049 -233935 -328074 -413976 -484658 -531907 -547739 -525548 -460702 -350813 -196393
38493 -196393 -2247 221337 459103 693662 909390 1095062 1243867 1351402 1413721 1427149
38483 1427149 1390069 1305340 1181497 1031435 868605 702125 533284 355761 160079 -59798
38473 -59798 -301436 -553202 -797678 -1016674 -1195334 -1324597 -1402423 -1433737 -1428368 -1397183 -1348307
38462 -1348307 -1285644 -1209982 -1121104 -1019542 -908125 -793859 -689192 -610728 -574648 -590808
38452 -590808 -658863 -768406 -902363 -1040998 -1164463 -1253867 -1292463 -1268221 -1177142 -1025200
38442 -1025200 -827062 -601651 -366473 -133239 93608 315443 536315 759740 986636
38433 986636 1215004 1441176 1661586 1873763 2076051 2266912 2445026 2610192 2763827 2908317
38423B908317J37657J32664J28974J24898J16258R6871O1545R612n3614j18491
38413C544691j74673k14420k34008k33089k13234j77069j28407p2474j5371L7094
38403B119040Q0103J09652J22222J15360Q8907M5620r676p1666j35468j96441
38393B267653k49707k90297l13852l17278k99141k60255k04462j38694p1444j0057
38383A12466M1353Q1816J11608J30446J37364J31997J15666R1149O1529K9311
38373A044705l455l4442o0677p9201q8490q9720q6873q5397r0065j03207j24132
38362A99046j49778j75642j96222k05043j95313j62032j04824k9713N1733J25682
38352h42106J80277K09187K13465K01083J83896J72808J73205J83086J94899J99773
$$ plain form
38423 2908317 3045974 3178638 3307612 3432510 3548768 3645639 3707184 3716796 3663182 3544691
38413 3544691 3370018 3155598 2921590 2688501 2475267 2298198 2169791 2097317 2081946 2119040
38403 2119040 2199143 2308795 2431017 2546377 2635284 2680904 2671228 2599562 2464094 2267653
38393 2267653 2017946 1727649 1413797 1096519 797378 537123 332661 193967 122523 112466
38383 112466 153819 235635 347243 477689 615053 747050 862716 953865 1015394 1044705
38373 1044705 1041250 1006808 946131 866930 778440 688720 601847 516450 426385 323178 199046
38362 199046 49268 -126374 -322596 -527639 -722952 -884984 -989808 -1019521 -967788 -842106
38352 -842106 -661829 -452642 -239177 -38094 145802 318610 491815 674901 869800 1069573
38342A069573J91508J68301J32128Q7027L7473j2809o1481j07334j49134j84374
38332A170878k09334k20834k18360k04777j84778j62139j37705j09443p4403l1080
38322c81975J9315P3099J25396J71614K08612K34923K49921K52582K41202K14650
38312A409339J74198J24303P1723K3666j3997l7681m6116l9867k1234N025L1071
38301A680430M6914M3345J5474l5061j00160j67427k23497k57384k62740k38742
38291E01152j89953j25412n6853L857M7155O7528O4715M4407J7349m161j1131
38280C58653j012K2786N4022Q6842J17648J45298J69979J91353K07371K14985
38270A567925K12301K00086J81047J57654J30679R9786O5219K8664p599m1962
$$ plain form
38342 1069573 1261081 1429382 1561510 1648537 1686010 1673201 1611720 1504386 1355252 1170878
38332 1170878 961544 740710 522350 317573 132795 -29344 -167049 -276492 -350895 -381975
38322 -381975 -362660 -289561 -164165 7449 216061 450984 700905 953487 1194689 1409339
38312 1409339 1583537 1707840 1779563 1803229 1789232 1751551 1705435 1665568 1644334 1649359 1680430
38301 1680430 1727344 1770689 1786163 1751102 1650942 1483515 1260018 1002634 739894 501152
38291 501152 311199 185787 128934 132791 179946 247474 312189 356596 373945 369784 358653
38280 358653 357641 380427 434449 521291 638939 784237 954216 1145569 1352940 1567925
38270 1567925 1780226 1980312 2161359 2319013 2449692 2549478 2614697 2643361 2635762 2593800
38260B593800p3510j00584j19739j26618j18394r5675o2499k4774J1364M0406
38250A923777N7824O0713M8849K5503k907k8391m3637m4284l0631q017J4733K8349
38238B001881K6113N562l0874p5860j18342j46903j54191j39634j08551o8821
38228A190380k7763R409M0018O3862Q2573R8240J11994J23482J31585J35568J35671
38217B095019J32644J26687J16847J01402P9020M9868J6087j8645n0320p5854
38207B572755r3688j03507j05733j01411r2287q0566o8421n7808n0733m9457n6251
38196A712893p2814r9634j35186j75331k13659k43386k59956k62652k54133k38380
38186b42238k18751j97427j76069j56380j39479j24451j07559q3320m7135K206
$$ plain form
38260 2593800 2520290 2419706 2299967 2173349 2054955 1959280 1896781 1872007 1883371 1923777
38250 1923777 1981601 2042314 2091163 2116666 2113759 2085368 2041731 1997447 1966816 1958799 1973532 2001881
38238 2001881 2027994 2033556 2002682 1926822 1808480 1661577 1507386 1367752 1259201 1190380
38228 1190380 1162617 1172026 1212044 1275906 1358479 1456719 1568713 1692195 1823780 1959348 2095019
38217 2095019 2227663 2354350 2471197 2572599 2651619 2701487 2717574 2698929 2648609 2572755
38207 2572755 2479067 2375560 2269827 2168416 2076129 1995563 1927142 1869334 1818601 1769144 1712893
38196 1712893 1640079 1540445 1405259 1229928 1016269 772883 512927 250275 -3858 -242238
38186 -242238 -460989 -658416 -834485 -990865 -1130344 -1254795 -1362354 -1445674 -1492809 -1490603
38176a490603O1704J25563J87636K43055K88046L18954L32257L26032L01309K61921
38166I55874K13145J60664J10275O7627L7297K1676K0404L0571M7608O6781Q4850
38155A816772J00920J15731J30011J43314J54299J61975J66746J70291J74245
38146C134304J78376J79536J72305J51179J12907N7587j1635q9160j67069k35490
38136C482840k84351l06493l00377k70670k26639j79572j40242j16647j12274
38127A545575j25462j50293j78640k02796k18023k23943k23619k20655k16495
38118b14351k10323k01109j89061j74743j57332j34675j05644p2320l9735j3461
38108a512754K787Q029L736o813j9297k9508l4559l3386k6358j4707l27J4514
$$ plain form
38176 -1490603 -1428899 -1303336 -1115700 -872645 -584599 -265645 66612 392644 693953 955874
38166 955874 1169019 1329683 1439958 1507585 1544882 1566558 1586962 1617533 1665141 1731922 1816772
38155 1816772 1917692 2033423 2163434 2306748 2461047 2623022 2789768 2960059 3134304
38146 3134304 3312680 3492216 3664521 3815700 3928607 3986194 3974559 3885399 3718330 3482840
38136 3482840 3198489 2891996 2591619 2320949 2094310 1914738 1774496 1657849 1545575
38127 1545575 1420113 1269820 1091180 888384 670361 446418 222799 2144 -214351
38118 -214351 -424674 -625783 -814844 -989587 -1146919 -1281594 -1387238 -1459558 -1499293 -1512754
38108 -1512754 -1509967 -1501938 -1498202 -1505015 -1524312 -1553820 -1588379 -1621765 -1648123 -1662830 -1663157 -1648643
38096a648643K8202M1079N5556P4277R7679J22966J45246J59563J62375J52109
38086f09591J29342R6622N7594J5677k6595o6979j02550j29795j46009j50731
38076i33015j45971j35227j22113j09293r7724q6439p3090n5333l2327n267K3455
38065a772344N1689P8044J00879J16863J21033J09080Q0333L9219n762m4806o9813
38054a195585p6594o5527m0423o167L3306P5384J17708J57183J90393K15206K32178
38043c62938K44417K55796K68448K80883K87812K81999K57635K13735J55449R2017
38033A975253L2520j7767n7897q8894j10887j22005j19362j00858o6770k0780
38023A302553K9706P4627J04174J12665J01151P6818M9444K7051J3263P350O277
$$ plain form
38096 -1648643 -1620441 -1579362 -1523806 -1449529 -1351850 -1228884 -1083638 -924075 -761700 -609591
38086 -609591 -480249 -383627 -326033 -310356 -336951 -403930 -506480 -636275 -782284 -933015
38076 -933015 -1078986 -1214213 -1336326 -1445619 -1543343 -1629782 -1702872 -1758205 -1790532 -1795799 -1772344
38065 -1772344 -1720655 -1642611 -1541732 -1424869 -1303836 -1194756 -1114423 -1075204 -1080966 -1125772 -1195585
38054 -1195585 -1272179 -1337706 -1378129 -1384296 -1350990 -1275606 -1157898 -1000715 -810322 -595116 -362938
38043 -362938 -118521 137275 405723 686606 974418 1256417 1514052 1727787 1883236 1975253
38033 1975253 2007773 1990006 1932109 1843215 1732328 1610323 1490961 1390103 1323333 1302553
38023 1302553 1332259 1406886 1511060 1623725 1724876 1801694 1851138 1878189 1891452 1898802 1905079
38012A905079P119Q416J0089J2571J6212K1344K8427L7739M8942O1263P4283Q8392
38000B319876J04234J21489J38185J51376J58939J61331J61907J65351J74986
37991C657674J90484K07284K18165K16559K00088J72045J39516J09170Q3754O1688
37981E256427L9418J4445j2950l9782o2007p7057q5930r3346j05616j27495j60115
37970D545992k01079k46301k91974l35398l74411m06366m27613m33788m20736
37961A408326l85938l30263k58905j80228j02457l0299L6123R9349J61139K19739
37951F36586K69504L02978L14000K99859K61468K02487J28879M9223k5362q2955
37941B356667j14095j15311r0993n2276j3007J5260K6885K3015J0199k485p061
$$ plain form
38012 1905079 1912198 1920614 1930703 1943274 1959486 1980830 2009257 2046996 2095938 2157201 2231484 2319876
38000 2319876 2424110 2545599 2683784 2835160 2994099 3155430 3317337 3482688 3657674
37991 3657674 3848158 4055442 4273607 4490166 4690254 4862299 5001815 5110985 5194739 5256427
37981 5256427 5295845 5310290 5297340 5257558 5195551 5118494 5032564 4939218 4833602 4706107 4545992
37970 4545992 4344913 4098612 3806638 3471240 3096829 2690463 2262850 1829062 1408326
37961 1408326 1022388 692125 433220 252992 150535 120236 156359 255708 416847 636586
37951 636586 906090 1209068 1523068 1822927 2084395 2286882 2415761 2464984 2439622 2356667
37941 2356667 2242572 2127261 2036268 1983992 1970985 1986245 2013130 2036145 2046344 2043859 2036798
37930B036798l5J6117L4280M5960M4483K6778o236n0186r8414j43598j79446k02086
37918A524415k10776k07751j97172j83723j71585j64011j63171j69808j82740
37909a26322j98577k12046k17270k09712j87976j54287j13378p0666l0822K970
37899a518086K9524M9973O7314Q4681J03101J20256J31193J30499J14554Q3040
37889f03951L9804o815m4965o2385n0984j0489N1037J19906J80814K20293K29018
37878F1283K03256J45462O3705l0126j22741k01808k57948k86201k86546k63120
37868i74784k22337j70713j13359n3677N788O2050J11167J49200J73873J85248
37858h47544J84822J74272J55437J31254J06051Q4267O8549N8633N1625M3514
$$ plain form
37930 2036798 2036763 2052880 2087160 2133120 2177603 2204381 2198145 2147959 2049545 1905947 1726501 1524415
37918 1524415 1313639 1105888 908716 724993 553408 389397 226226 56418 -126322
37909 -126322 -324899 -536945 -754215 -963927 -1151903 -1306190 -1419568 -1490234 -1521056 -1518086
37899 -1518086 -1488562 -1438589 -1371275 -1286594 -1183493 -1063237 -932044 -801545 -686991 -603951
37889 -603951 -564147 -570962 -615927 -678312 -729296 -739785 -688748 -568842 -388028 -167735 61283
37878 61283 264539 410001 473706 443580 320839 119031 -138917 -425118 -711664 -974784
37868 -974784 -1197121 -1367834 -1481193 -1534870 -1529082 -1467032 -1355865 -1206665 -1032792 -847544
37858 -847544 -662722 -488450 -333013 -201759 -95708 -11441 57108 115741 167366 210880
37848B10880L1342J5006k508j6808k4375k3755j5236Q9K0898M5591P1981R7240
37836D10345J18466J33631J41726J41639J30873J06119O6006J3801m2518r3155
37826A126933j30424j51406j58311j56852j53641j53830j59788j70811j83634
37817b91764j93509j96033j89263j75294j60029j50706j51996j62775j75759j80529
37807b027657j68003j33598p7673m180Q0673J68983K51614L19274L64178L81487
37797h44902L69982L32070K73495K02742J29919O5054J6228j1873j8493o353J9595
37786E27464N3462Q9211J20863J42730J50153J40504J14083P4636K9168j3496
37776A428778m5393o2042o3302n2141l2755r585J2691K9334L6782L4529K6254
$$ plain form
37848 210880 242222 257228 254720 237912 213537 189782 174546 174635 195533 241124 313105 410345
37836 410345 528811 662442 804168 945807 1076680 1182799 1248805 1262606 1220088 1126933
37826 1126933 996509 845103 686792 529940 376299 222469 62681 -108130 -291764
37817 -291764 -485273 -681306 -870569 -1045863 -1205892 -1356598 -1508594 -1671369 -1847128 -2027657
37807 -2027657 -2195660 -2329258 -2406931 -2411111 -2330438 -2161455 -1909841 -1590567 -1226389 -844902
37797 -844902 -474920 -142850 130645 333387 463306 528360 544588 532715 514222 507869 527464
37786 527464 580926 670137 791000 933730 1083883 1224387 1338470 1413106 1442274 1428778
37776 1428778 1383385 1321343 1258041 1205900 1173145 1163560 1176251 1205585 1242367 1276896 1303150
37765A303150J8628J7708K5035L6515M5249M6041L7974K3534N815j3675l5494
37754A510480o1458r3335j31662j75107k20622k64272l02307l32024l52015l61660
37744g83982l60327l47065l21462k85071k42199j98940j60842j30662j07663q8657
37734c026870o9800m7795k0372J3327N2073R2221J28517J55908J71179J73527
37724b378085J64122J45459J20915R4368O9529M9116L4459K5968K3970K9141M2030
37713a579008O2162Q7419J14063J37337J52522J56239J47445J27529R9616O7675
37703d27001L5949Q412j2067k4528l0013l0607k8003k2283j1438Q155M0171Q5996
37691d07257J42705K02865K56992K97655L22838L36298L44383L51094L54485L46759
$$ plain form
37765 1303150 1321778 1339486 1364521 1401036 1446285 1492326 1530300 1553834 1559649 1545974 1510480
37754 1510480 1449022 1355687 1224025 1048918 828296 564024 261717 -70307 -422322 -783982
37744 -783982 -1144309 -1491374 -1812836 -2097907 -2340106 -2539046 -2699888 -2830550 -2938213 -3026870
37734 -3026870 -3096670 -3144465 -3164837 -3151510 -3099437 -3007216 -2878699 -2722791 -2551612 -2378085
37724 -2378085 -2213963 -2068504 -1947589 -1853221 -1783692 -1734576 -1700117 -1674149 -1650179 -1621038 -1579008
37713 -1579008 -1516846 -1429427 -1315364 -1178027 -1025505 -869266 -721821 -594292 -494676 -427001
37703 -427001 -391052 -382640 -394707 -419235 -449248 -479855 -507858 -530141 -541579 -533424 -493253 -407257
37691 -407257 -264552 -61687 195305 492960 815798 1152096 1496479 1847573 2202058 2548817
37681B548817L18179K62330J79710P7996l0425j31940k14950k72209l01915l07277
37671B128316k94698k71331k42864k12413j80883j48341j15239q2644n1852k4409
37661E03642k690R899R791n229l4754p5233j20281j61904j92375k06030k00290
37650d75454j75954j36942q9385l9970N646M3437P0813Q6685R2142R0761Q7628
37639d40593Q7320R1982J00350J08110J09510R9493P5199L6378j4832p3820j33281
37628D5816j83765k15567k21456j99077j51734q7020j4012N9313J26961J84380
37618f56161K27934K55456K67392K67251K60486K52221K45098K38364K28373K09845
37608A796259J77344J27122N9297k0773j03595j79166k40937k87418l20759l43837
$$ plain form
37681 2548817 2866996 3129326 3309036 3387032 3356607 3224667 3009717 2737508 2435593 2128316
37671 2128316 1833618 1562287 1319423 1107010 926127 777786 662547 579903 528051 503642
37661 503642 500952 510851 520642 515413 480659 405426 285145 123241 -69134 -275164 -475454
37650 -475454 -651408 -788350 -877735 -917705 -912059 -868622 -797809 -711124 -618982 -528221 -440593
37639 -440593 -353273 -261291 -160941 -52831 56679 156172 231371 267749 252917 179097 45816
37628 45816 -137949 -353516 -574972 -774049 -925783 -1012803 -1026815 -967502 -840541 -656161
37618 -656161 -428227 -172771 94621 361872 622358 874579 1119677 1358041 1586414 1796259
37608 1796259 1973603 2100725 2160022 2139249 2035654 1856488 1615551 1328133 1007374 663537
37598F63537l58056l62913l57098l39908l11912k74460k29055j77545j23189p1307
37588a941906k8369K31J2565J1315L241k996J72J6469M4456P8144J09114J29247
37576a568317J33188J20120R4517O5445M4070L9858N7043R3155J40213J87699
37566e93009K25722K47338K49871K35228K09102J79030J51784J31064J16684J05674
37556A258488R4589Q1287O5004M5270K1384o632l6610o4173q4657r5933j00078
37545A177939j02600j09581j24402j46094j69975j89775j99787j96461j79460
37536b40196j52051j20363r1425p0723o0269n7942n8587n6783m9991l9898l0765
37525a028993k5969k5437k5783k2499j2235O352L3077O6988J06600J49656J92883
$$ plain form
37598 663537 305481 -57432 -414530 -754438 -1066350 -1340810 -1569865 -1747410 -1870599 -1941906
37588 -1941906 -1970275 -1970044 -1957479 -1946164 -1942923 -1945919 -1945747 -1929278 -1884822 -1806678 -1697564 -1568317
37576 -1568317 -1435129 -1315009 -1220492 -1155047 -1110977 -1071119 -1014076 -920921 -780708 -593009
37566 -593009 -367287 -119949 129922 365150 574252 753282 905066 1036130 1152814 1258488
37556 1258488 1353077 1434364 1499368 1544638 1566022 1559390 1522780 1458607 1373950 1278017 1177939
37545 1177939 1075339 965758 841356 695262 525287 335512 135725 -60736 -240196
37536 -240196 -392247 -512610 -604035 -674758 -735027 -792969 -851556 -908339 -958330 -998228 -1028993
37525 -1028993 -1054962 -1080399 -1106182 -1128681 -1140916 -1134564 -1101487 -1034499 -927899 -778243 -585360
37514e85360K31981K62089K79110K82050K74800K65177K60701K63943K71161K75116
37504B080768K69500K51908K24213J91042J57267J25557R5195O2942K5341j8976
37494C464757o8012j16495j57404j84637j95572j91934j78493j60590j42035j23988
37484A945597j05046q2399n3774j9022J9539N8007R2094J18138J34113J40566
37474B247813J40621J38468J37061J36783J35870J31789J22272J05828Q2263N3137
37464C431905K1483r305l6451n7713p0770p3295o4029m3975j6870J1537L5227
37453C127744N0396N7466O1311O9156Q7262J18021J58649K01880K38554K61222
37443D431661K66910K57575K38325K14831J91234J69086J47490J24438R8670P0736
$$ plain form
37514 -585360 -353379 -91290 187820 469870 744670 1009847 1270548 1534491 1805652 2080768
37504 2080768 2350268 2602176 2826389 3017431 3174698 3300255 3395450 3458392 3483733 3464757
37494 3464757 3396745 3280250 3122846 2938209 2742637 2550703 2372210 2211620 2069585 1945597
37484 1945597 1840551 1758152 1704378 1685356 1704895 1762902 1854996 1973134 2107247 2247813
37474 2247813 2388434 2526902 2663963 2800746 2936616 3068405 3190677 3296505 3378768 3431905
37464 3431905 3453388 3444083 3407632 3349919 3279149 3205854 3141825 3097850 3080980 3092517 3127744
37453 3127744 3178140 3235606 3296917 3366073 3453335 3571356 3730005 3931885 4170439 4431661
37443 4431661 4698571 4956146 5194471 5409302 5600536 5769622 5917112 6041550 6140220 6210956
37433F210956M2339J4700j2419m0033o8223r5152j18037j35557j49817j65959
37423E482798j89376k22209k61348k98895l24711l29575l07419k55895j75933
37414C117437p1779M8066J70407K79323L60736M07173M19860M07100L80503L51512
37404E870338L29467L20623L27330L47751L77171M10885M46669M84879N26408
37395I441521N70527O14409O54028O85219P04008P06401O88302O46170N78592
37386A5289177M88173L82418K72387J69312Q1068J0737m2185p9440j02774j14425
37376A6354448j17907j17362j15484j11797j03169q6591o2316l4758j0136P585
37366A5602513J9299L0044M5999P1680J08782J56091K09699K63695L11741L49097
$$ plain form
37433 6210956 6253295 6267995 6255576 6215543 6147320 6052168 5934131 5798574 5648757 5482798
37423 5482798 5293422 5071213 4809865 4510970 4186259 3856684 3549265 3293370 3117437
37414 3117437 3045658 3093724 3264131 3543454 3904190 4311363 4731223 5138323 5518826 5870338
37404 5870338 6199805 6520428 6847758 7195509 7572680 7983565 8430234 8915113 9441521
37395 9441521 10012048 10626457 11280485 11965704 12669712 13376113 14064415 14710585 15289177
37386 15289177 15777350 16159768 16432155 16601467 16682535 16693272 16651087 16571647 16468873 16354448
37376 16354448 16236541 16119179 16003695 15891898 15788729 15702138 15639822 15605064 15594928 15602513
37366 15602513 15621812 15651856 15697855 15769535 15878317 16034408 16244107 16507802 16819543 17168640
37356A7168640L73980L87580L93008L93927L93624L94873M00206M11702M29958
37347B0747498M53022M76846M97727N15466N34899N64253O11199O79281P67186
37338B5847377Q70638R84833J105621J229717J355080J481753J612438J751911
37330C6239368J905279K075999K264827K470683K692892K933152L195864L487093
37322E7265157L813281M180494M594068N058736N579527O163065O818162P554730
37314A01027220Q381453R304045J0325713J1449654J2681358J4027910J5493831
37307A82691184J7075310J8755154K0498907K2251010K3929511K5418217K6556399
37300C37175692K7129482K6869036K5473964K2663840J8265913J2317601N141243
$$ plain form
37356 17168640 17542620 17930200 18323208 18717135 19110759 19505632 19905838 20317540 20747498
37347 20747498 21200520 21677366 22175093 22690559 23225458 23789711 24400910 25080191 25847377
37338 25847377 26718015 27702848 28808469 30038186 31393266 32875019 34487457 36239368
37330 36239368 38144647 40220646 42485473 44956156 47649048 50582200 53778064 57265157
37322 57265157 61078438 65258932 69853000 74911736 80491263 86654328 93472490 101027220
37314 101027220 109408673 118712718 129038431 140488085 153169443 167197353 182691184
37307 182691184 199766494 218521648 239020555 261271565 285201076 310619293 337175692
37300 337175692 364305174 391174210 416648174 439312014 457577927 469895528 475036771
37293D75036771k661449j0321010j7086044k2403850k6019057k7964724k8477291
37286C40103346k7889599k6542774k4732504k2687622k0571463j8494668j6530005
37279A82654711j4724080j3104450j1682462j0453436r397446q483560p677709
37272A07131568o951120o285623n674176n117707m621065m190088l829532l540041
37264F6922216l314114l133922k974266k810222k625262k415451k188520j959548
37256D5500911j745577j560953j414596j309682j245231j217951j222909j253051
37248C4530961j298743j348553j391136j417137j420170j397008j347478j274281
37240B3636455j182492j078630r69664q62304p62602o75604o04967n52633n18633
$$ plain form
37293 475036771 472375322 462054312 444968268 422564418 396545361 368580637 340103346
37286 340103346 312213747 285670973 260938469 238250847 217679384 199184716 182654711
37279 182654711 167930631 154826181 143143719 132690283 123292837 114809277 107131568
37272 107131568 100180448 93894825 88220649 83102942 78481877 74291789 70462257 66922216
37264 66922216 63608102 60474180 57499914 54689692 52064430 49648979 47460459 45500911
37256 45500911 43755334 42194381 40779785 39470103 38224872 37006921 35784012 34530961
37248 34530961 33232218 31883665 30492529 29075392 27655222 26258214 24910736 23636455
37240 23636455 22453963 21375333 20405669 19543365 18780763 18105159 17500192 16947559 16428926
37231A6428926n00834m94628m92973m87433m70353m37486l90120l35803k86918
37222A2532378k56883k55183k83787l36943m03928m72486n31368n72038n89982
37213H829780n85261n61664n24909m80920m34761l90272l50412l18214k97402
37204D885965k91606l02219l26416l56829l83169l94836l83364l43939k75903
37195A827684j82655p1615M5646J53808K35716K76230K67265K11848J24599K7250
37185B915776n9178j21198j54857j62722j49390j19299p7445l0489J4139N0881
37175B106218P8052R7509J12471J25395J37188J47803J57356J66854J77899J91555
37165C498300K07286K23145K37311K49758K62550K78478K99174L24192L51457
$$ plain form
37231 16428926 15928092 15433464 14940491 14453058 13982705 13545219 13155099 12819296 12532378
37222 12532378 12275495 12020312 11736525 11399582 10995654 10523168 9991800 9419762 8829780
37213 8829780 8244519 7682855 7157946 6677026 6242265 5851993 5501581 5183367 4885965
37204 4885965 4594359 4292140 3965724 3608895 3225726 2830890 2447526 2103587 1827684
37195 1827684 1645029 1573414 1619060 1772868 2008584 2284814 2552079 2763927 2888526 2915776
37185 2915776 2856598 2735400 2580543 2417821 2268431 2149132 2071687 2041198 2055337 2106218
37175 2106218 2184270 2281779 2394250 2519645 2656833 2804636 2961992 3128846 3306745 3498300
37165 3498300 3705586 3928731 4166042 4415800 4678350 4956828 5256002 5580194 5931651
37156E931651L78216M01545M18272M24757M17104L92032L48278K88084K17583
37147I217522J45183P8674K2939k0297n1373p1767q3595q8669q6924p5716n1287
37136H934690j1663M1353J02563J65525K24665K76251L18217L49535L69636L77937
37126A1148709L73550L55343L22582K75966K18427J54981R1488L2963j7618n9680
37116A2896711r4811j26298j58246j94252k36177k83896l35902l89718m41689
37107A0635722m87185n22269n45899n60343n69122n74359n76067n73746n68229
37098E658503n61794n56517n52529n47759n39263n24874n03847m76266m42093
37089I53561m00697l51031k92084k23284j44725n7417L6280J31920K22490K99049
$$ plain form
37156 5931651 6309867 6711412 7129684 7554441 7971545 8363577 8711855 8999939 9217522
37147 9217522 9362705 9441379 9464318 9444021 9392648 9320881 9237286 9148617 9061693 8985977 8934690
37136 8934690 8923027 8964380 9066943 9232468 9457133 9733384 10051601 10401136 10770772 11148709
37126 11148709 11522259 11877602 12200184 12476150 12694577 12849558 12941046 12974009 12956391 12896711
37116 12896711 12801900 12675602 12517356 12323104 12086927 11803031 11467129 11077411 10635722
37107 10635722 10148537 9626268 9080369 8520026 7950904 7376545 6800478 6226732 5658503
37098 5658503 5096709 4540192 3987663 3439904 2900641 2375767 1871920 1395654 953561
37089 953561 552864 201833 -90251 -313535 -458260 -515677 -479397 -347477 -124987 174062
37079A74062L52623L76507L67956L28835K65473J87677J06716L2503k9177p8274
37069B084901j19928j61328k07028k55235k97748l23915l26077l03130k60398
37060a69886k06626j50265r7130n0211j0885J9872M1416N4360O1486O7518P7431
37049c62920R3944J15636J36807J49359J45754J21580P6904J6172n2896j20933
37039C19407j78607k18086k34010k23949j88762j32985o4930M381O3677J04341
37029g49523J22408J19029R9575P1855M3936K2501J2492J7530L9759P8420J28369
37018F351J80268K23058K47656K50154K33035K03595J70203J38455J09463Q1040
37008A843278N0501J7180j6699m6990o9602q2115q4070p6292o0438l9300j7189
$$ plain form
37079 174062 526685 903192 1271148 1599983 1865456 2053133 2159849 2192352 2163175 2084901
37069 2084901 1964973 1803645 1596617 1341382 1043634 719719 393642 90512 -169886
37060 -169886 -376512 -526777 -623907 -674118 -685003 -665131 -623715 -569355 -507869 -440351 -362920
37049 -362920 -268976 -153340 -16533 132826 278580 400160 477064 493236 440340 319407
37039 319407 140800 -77286 -311296 -535245 -724007 -856992 -921922 -917541 -853864 -749523
37029 -749523 -627115 -508086 -408511 -336656 -292720 -270219 -257727 -240197 -200438 -122018 6351
37018 6351 186619 409677 657333 907487 1140522 1344117 1514320 1652775 1762238 1843278
37008 1843278 1893779 1910959 1894260 1847270 1777668 1695553 1611483 1535191 1474753 1435453 1418264
36997A418264O77R771P971l565k0817l8621n3051o3025p0024p6146q2305q8129
36985I41000r3240r8279j04614j13375j25153j40572j60748j86749k18348k53008
36975e53086k85631l09094l15796l00254k61798k05589j40909p7789k4101J5608
36965b458439L9883M9721M7952L8535K5818J4006O938P805J8590L9531O9234J05456
36953a994970J45744J87091K24992K53386K66570K62110K42330K12844J79409
36944b0494J45799J14280Q7316O8177N9623O2200P3791R0463J07510J20041J23647
36933A032353J15407R4760O3323K3825k0794o7135j10490j44704j63625j63339
36923F59581j43575j07684o1877j4464K5262M9281N3573L9443J2455k0093n1290
$$ plain form
36997 1418264 1418941 1428712 1436683 1433118 1412301 1373680 1320629 1257604 1187580 1111434 1029129 941000
36985 941000 847760 749481 644867 531492 406339 265767 105019 -81730 -300078 -553086
36975 -553086 -838717 -1147811 -1463607 -1763861 -2025659 -2231248 -2372157 -2449946 -2474047 -2458439
36965 -2458439 -2418556 -2368835 -2320883 -2282348 -2256530 -2242524 -2235586 -2227781 -2209191 -2169660 -2100426 -1994970
36953 -1994970 -1849226 -1662135 -1437143 -1183757 -917187 -655077 -412747 -199903 -20494
36944 -20494 125305 239585 326901 395078 454701 516901 590692 681155 788665 908706 1032353
36933 1032353 1147760 1242520 1305843 1329668 1308874 1241739 1131249 986545 822920 659581
36923 659581 516006 408322 346445 331981 357243 406524 460097 499540 511995 491902 440612
36912D40612p5710q9978r3261q7390p6144o3763n3414m6389m2415m0741m1086
36901b69679m3598m8088n3446n8153o1503o4367o8510p4867q2178q7201q6437
36890i98027p8125o3113m4001k2964K21K8196O3392J04571J45701J78570J97123
36879d88456J99985J89797J71010J48393J26643J10159J02097J03099J10515J18776
36869H92018J20882J10551Q4188M2123j1218o8282j20333j59746j81729j84935
36859E23519j71225j45024j12410p9996n3765l8207l5711m6150o6822r3155j20116
36848d39062j43627j61254j71973j75628j72912j65969j58589j54877j56616j61320
36838b061827j62869j54519j32204r6209n0866k787M1645P8507J07008J28093
$$ plain form
36912 440612 364902 274924 181663 94273 18129 -45634 -99048 -145437 -187852 -228593 -269679
36901 -269679 -313277 -361365 -414811 -472964 -534467 -598834 -667344 -742211 -824389 -911590 -998027
36890 -998027 -1076152 -1139265 -1183266 -1206230 -1206009 -1177813 -1114421 -1009850 -864149 -685579 -488456
36879 -488456 -288471 -98674 72336 220729 347372 457531 559628 662727 773242 892018
36869 892018 1012900 1123451 1207639 1249762 1238544 1170262 1049929 890183 708454 523519
36859 523519 352294 207270 94860 14864 -38901 -77108 -112819 -158969 -225791 -318946 -439062
36848 -439062 -582689 -743943 -915916 -1091544 -1264456 -1430425 -1589014 -1743891 -1900507 -2061827
36838 -2061827 -2224696 -2379215 -2511419 -2607628 -2658494 -2661281 -2619636 -2541129 -2434121 -2306028
36828b306028J42432J49804J50425J46459J41847J40267J42968J48179J52523
36819i91124J53340J50399J46045J43944J47144J56250J68173J76171J71475J46391
36809E68208R7610K8236n2456j31606j96827k39918k58498k55104k34948k03895
36799h79198j66975j27183q4772l7983J4772P2485J30315J80063K12208K18957
36789d67311J97289J50452Q7130J8850m3079r0114j18019j26833j19320r9068
36779f10023o9601l4613J692L4834O0536P5168P6446O4504M2434J5505j0817l2831
36767c86766m9532o2138p2582q1711q8317q9676q3293o8607m7332k2129N215L4316
36755a012552O4926R5313J22180J42363J54556J59504J58806J53673J44514J31516
$$ plain form
36828 -2306028 -2163596 -2013792 -1863367 -1716908 -1575061 -1434794 -1291826 -1143647 -991124
36819 -991124 -837784 -687385 -541340 -397396 -250252 -94002 74171 250342 421817 568208
36809 568208 665818 694054 641598 509992 313165 73247 -185251 -440355 -675303 -879198
36799 -879198 -1046173 -1173356 -1258128 -1296111 -1281339 -1208854 -1078539 -898476 -686268 -467311
36789 -467311 -270022 -119570 -32440 -13590 -56669 -146783 -264802 -391635 -510955 -610023
36779 -610023 -679624 -714237 -712545 -677711 -617175 -542007 -465561 -401057 -358623 -343118 -353935 -386766
36767 -386766 -436298 -498436 -571018 -652729 -741046 -830722 -914015 -982622 -1029954 -1052083 -1046868 -1012552
36755 -1012552 -947626 -852313 -730133 -587770 -433214 -273710 -114904 38769 183283 314799
36745C14799J15728R9653Q6245P6532O8013N5862L6394R809j9983m7814o9637
36734G25601q3576q9934r0873q9657q9271r1121r4843r9428j04507j10562j18291
36723c36462j28165j40467j54944j69530j79456j78565j62658j32269r2432m9777
36713a724725r697K4362M9826O4050O4514M9818K0601j9719o4485j04514j30626
36702a780595j37073j23438r3644n3133o612M2407R0678J33995J66682J82603
36692a578130J77666J52460J12908O7935K5339j1685m5368q0903j22096j67796
36682a469670k11707k45734k64360k66924k56709k38041k13674j83985j48294
36673c499098j07388o5496l0045q952o990k3608n3574q9674j25300j55302j75333
$$ plain form
36745 314799 430527 530180 616425 692957 760970 816832 853226 863035 843052 795238 725601
36734 725601 642025 552091 461218 371561 282290 191169 96326 -3102 -107609 -218171 -336462
36723 -336462 -464627 -605094 -760038 -929568 -1109024 -1287589 -1450247 -1582516 -1674948 -1724725
36713 -1724725 -1734422 -1710060 -1660234 -1596184 -1531670 -1481852 -1461251 -1480970 -1545455 -1649969 -1780595
36702 -1780595 -1917668 -2041106 -2134750 -2187883 -2194495 -2152088 -2061410 -1927415 -1760733 -1578130
36692 -1578130 -1400464 -1248004 -1135096 -1067161 -1041822 -1053507 -1098875 -1179778 -1301874 -1469670
36682 -1469670 -1681377 -1927111 -2191471 -2458395 -2715104 -2953145 -3166819 -3350804 -3499098
36673 -3499098 -3606486 -3671982 -3702027 -3710979 -3717969 -3741577 -3795151 -3884825 -4010125 -4165427 -4340760
36662d340760j81280j69950j40544r5566m0223J9248P7084J28585J70173J99708
36652d373525K17043K24068K23705K18704K11341K04133K00313K03201K14845
36643b456172K35122K61901K91644L19615L39847L46165L34991L08396K74430
36634B55939K43461K23085K15602K19160K30139K44171K56080K60546K53866K35275
36624B637324K06726J71777J34774J00484P3477N6925N1460N5029O4022P4982
36614C626980Q5871R6348J07329J20230J36011J54231J72624J87529J94875J91104
36604E073132J73904J42885R9969M8888o157o1604j14342j60540j95029k12511
36594D788595k10092j89167j55199j15772p8768n1538m0364m9119p7714j22119
$$ plain form
36662 -4340760 -4522040 -4691990 -4832534 -4928100 -4968323 -4949075 -4871991 -4743406 -4573233 -4373525
36652 -4373525 -4156482 -3932414 -3708709 -3490005 -3278664 -3074531 -2874218 -2671017 -2456172
36643 -2456172 -2221050 -1959149 -1667505 -1347890 -1008043 -661878 -326887 -18491 255939
36634 255939 499400 722485 938087 1157247 1387386 1631557 1887637 2148183 2402049 2637324
36624 2637324 2844050 3015827 3150601 3251085 3324562 3381487 3432947 3487976 3551998 3626980
36614 3626980 3712851 3809199 3916528 4036758 4172769 4327000 4499624 4687153 4882028 5073132
36604 5073132 5247036 5389921 5489890 5538778 5532621 5471017 5356675 5196135 5001106 4788595
36594 4788595 4578503 4389336 4234137 4118365 4039597 3988059 3947695 3898576 3820862 3698743
36584C698743j76446k35391k94941l51298m00030m36967m60181m70891m72056
36575D00542m65707m51291m26361l88925l39433k81176k19321j59698j07993o9008
36565b508371m5492l6730l7950m1369l8666k3793M951M4062Q5284J17551J30278
36554b350245J17219P9238K4472l4643q6001j21663j38911j38888j24658j00324
36544b874404p0982m2428k0149p957o951j5096k7546l7850l9805k9340n772K7906
36532c150374O5687R9931J23415J31660J24634J06571Q3544O0327L8753J8438
36522b297414j446k1135m0273n8131p3594q5134r0976q9493p9914o3400m3611
36511b944521k5628j3458p843n939k540Q334L1913P0703J22115J77276K22867
$$ plain form
36584 3698743 3522297 3286906 2991965 2640667 2240637 1803670 1343489 872598 400542
36575 400542 -65165 -516456 -942817 -1331742 -1671175 -1952351 -2171672 -2331370 -2439363 -2508371
36565 -2508371 -2553863 -2590593 -2628543 -2669912 -2708578 -2732371 -2727420 -2683358 -2598074 -2480523 -2350245
36554 -2350245 -2233026 -2153788 -2129316 -2163959 -2249960 -2371623 -2510534 -2649422 -2774080 -2874404
36544 -2874404 -2945386 -2987814 -3007963 -3015920 -3022871 -3037967 -3065513 -3103363 -3143168 -3172508 -3178280 -3150374
36532 -3150374 -3084687 -2984756 -2861341 -2729681 -2605047 -2498476 -2414932 -2354605 -2315852 -2297414
36522 -2297414 -2298860 -2319995 -2360268 -2418399 -2491993 -2577127 -2668103 -2757596 -2837510 -2900910 -2944521
36511 -2944521 -2970149 -2983607 -2991450 -2997389 -2999929 -2991595 -2959682 -2888979 -2766864 -2589588 -2366721
36500b366721K46038K39968K06880J56746J02804N6617K5018R680Q599J8269L5408
36489a260694N7632Q3235J10484J36870J58564J70651J68514J49923J16446P3139
36479c5236K6597j7353n5185q5756j09277j25998j35664j38074j34053j25853
36469i35852j16561j08977j04821j04827j09471j19238j33716j50070j62713j65174
36459b211420j53289j27470r2571n5611k2851K448K0843L6027N2945P5498J04852
36448b370599J39081J74077K04952K27414K39038K40476K35681K30235K28111
36439d51534K28925K27607K16792J90321J46086Q7005K0247m4638r7848j31369
36429C91594j40909j27228r5961n5499j3908K3420N4475Q0116J02943J25898J50705
$$ plain form
36500 -2366721 -2120683 -1880715 -1673835 -1517089 -1414285 -1357668 -1332650 -1322970 -1314371 -1296102 -1260694
36489 -1260694 -1203062 -1119827 -1009343 -872473 -713909 -543258 -374744 -224821 -108375 -35236
36479 -35236 -8639 -25992 -81177 -166933 -276210 -402208 -537872 -675946 -809999 -935852
36469 -935852 -1052413 -1161390 -1266211 -1371038 -1480509 -1599747 -1733463 -1883533 -2046246 -2211420
36459 -2211420 -2364709 -2492179 -2584750 -2640361 -2663212 -2660764 -2639921 -2603894 -2550949 -2475451 -2370599
36448 -2370599 -2231518 -2057441 -1852489 -1625075 -1386037 -1145561 -909880 -679645 -451534
36439 -451534 -222609 4998 221790 412111 558197 645202 665449 620811 522963 391594
36429 391594 250685 123457 27496 -28003 -41911 -18491 35984 116100 219043 344941 495646
36418D95646J76779K01277K20365K30747K30529K19146J97022J65511J27055Q4991
36408B349068M2932M169k8731n4249p2378q4739r3935j02335j10992j19306j25559
36397A603945j28148j26866j23396j20642j21349j26842j36223j45942j50120
36388D24417j42189j17766p7416k7479K1663N9043P6456P0355M2152k523n5236
36377B71477j06930j50393j81931k01320k10509k12311k09560k04365j97351j87447
36367a590640j72612j51024j21899q5722m4264n45M1443P7479J04189J19849J24492
36356a699254J19472J07117R0943P5752O6718O7400P7810R3788J08101J12864
36346g79289J02351P4903L2948j8580p3993j27668j74346k09766k31561k39590
$$ plain form
36418 495646 672425 873702 1094067 1324814 1555343 1774489 1971511 2137022 2264077 2349068
36408 2349068 2392000 2396169 2367438 2313189 2240811 2156072 2062137 1959802 1848810 1729504 1603945
36397 1603945 1475797 1348931 1225535 1104893 983544 856702 720479 574537 424417
36388 424417 282228 164462 87046 59567 81230 140273 216729 287084 329236 326713 271477
36377 271477 164547 14154 -167777 -369097 -579606 -791917 -1001477 -1205842 -1403193 -1590640
36367 -1590640 -1763252 -1914276 -2036175 -2121897 -2166161 -2166706 -2125263 -2047784 -1943595 -1823746 -1699254
36356 -1699254 -1579782 -1472665 -1381722 -1305970 -1239252 -1171852 -1094042 -1000254 -892153 -779289
36346 -779289 -676938 -602035 -569087 -587667 -661660 -789328 -963674 -1173440 -1405001 -1644591
36336a644591k35460k21886k02202j79726j56767j33963j10599q5541n7733k5861
36326c054329J2030N7948J12258J71987K30500K79145L10075L18756L04947K72046
36316i84637K25493J71171J14365N9401R762l1830o3485q4208r3487r0641p4755
36305h42851m5874o751L6385P5052J01023J08635R5984O5037K0872k9644p9337
36294e01469j21679j51099j63253j55609j28118q3460k6982L3532Q8687J29499
36284a079951J50005J48789J28320R2887M6886n387n9170j09002j49341j75538
36274a011502j84488j74931j47621j05523n3638J554N2977R4084J20279J30259
36264a278550J26283J12799R4238P3936N4859M0875L6361M3461N8928P3401P4568
$$ plain form
36336 -1644591 -1880051 -2101937 -2304139 -2483865 -2640632 -2774595 -2885194 -2970735 -3028468 -3054329
36326 -3054329 -3042299 -2984351 -2872093 -2700106 -2469606 -2190461 -1880386 -1561630 -1256683 -984637
36316 -984637 -759144 -587973 -473608 -414207 -404445 -436275 -499760 -583968 -677455 -768096 -842851
36305 -842851 -888725 -895476 -859091 -784039 -683016 -574381 -478397 -413360 -392488 -422132 -501469
36294 -501469 -623148 -774247 -937500 -1093109 -1221227 -1304687 -1331669 -1298137 -1209450 -1079951
36284 -1079951 -929946 -781157 -652837 -559950 -513064 -518451 -577621 -686623 -835964 -1011502
36274 -1011502 -1195990 -1370921 -1518542 -1624065 -1677703 -1676149 -1623172 -1529088 -1408809 -1278550
36264 -1278550 -1152267 -1039468 -945230 -871294 -816435 -775560 -739199 -695738 -636810 -563409 -488841
36253d88841N2853O300n8268j28306j90832k37125k64924k77740k82042k83703
36243b152628k85310k85531k80408k65356k36558j91730j30947n7700K0844R5378
36233c769946J57421K01935K28120K38355K36427K26084K10270J90963J69378
36224a910993J46379J22958J00573Q1158O6601N7741N3509N1047M7106M0007L0666
36213a113248K1770J5531J1844Q404K573o703j8401l0147l9044m2180l7289k3863
36201a250753l945J8319L8334N2926O1459O5711O8554P2104P6570Q0727Q3498
36190f36496Q5029Q6257Q7494Q7641Q4802P7835O7451N5829M4890L4701K3600
36179I9033J0285l774j3509j1775P598M6438R9971J57147K04284K30468K31377
$$ plain form
36253 -488841 -435988 -429688 -487956 -616262 -807094 -1044219 -1309143 -1586883 -1868925 -2152628
36243 -2152628 -2437938 -2723469 -3003877 -3269233 -3505791 -3697521 -3828468 -3886168 -3865324 -3769946
36233 -3769946 -3612525 -3410590 -3182470 -2944115 -2707688 -2481604 -2271334 -2080371 -1910993
36224 -1910993 -1764614 -1641656 -1541083 -1459925 -1393324 -1335583 -1282074 -1231027 -1183921 -1143914 -1113248
36213 -1113248 -1091478 -1075947 -1064103 -1055699 -1053126 -1059829 -1078230 -1108377 -1147421 -1189601 -1226890 -1250753
36201 -1250753 -1254698 -1236379 -1198045 -1145119 -1083660 -1017949 -949395 -877291 -800721 -719994 -636496
36190 -636496 -551467 -465210 -377716 -290075 -205273 -127438 -59987 -4158 40732 75433 99033
36179 99033 109318 105544 92035 80260 87858 134296 234267 391414 595698 826166 1057543
36168A057543K09274J70076J20347O5980J2112l6916p7952j09279j30139j39611
36158A141435j35651j15617p8536k7521L0056Q5072J29797J59400J71694J66560
36148A526689J45827J13010P2311K7423j9128o5885j11905j56074j96570k30774
36138A104924k55764k69105k69662k58242k37637k11829j84614j58679j35427
36129h76035j15110r6715p8160n7511l4668j1967P133K0214K7265L0513L3257
36118a151784L8537M8183O2423P9935R8052J13031J20636J17416J02281P7226
36108b94064M6349J3485j9919n5172r4788j40363j91363k45200k97670l42938
36098a621643l73532l81631l61966l14780k46553j67702q8715j6992M4255R5151
$$ plain form
36168 1057543 1266817 1436893 1557240 1623220 1635332 1598416 1520464 1411185 1281046 1141435
36158 1141435 1005784 890167 811631 784110 814166 899238 1029035 1188435 1360129 1526689
36148 1526689 1672516 1785526 1857837 1885260 1866132 1800247 1688342 1532268 1335698 1104924
36138 1104924 849160 580055 310393 52151 -185486 -397315 -581929 -740608 -876035
36129 -876035 -991145 -1087860 -1166020 -1223531 -1258199 -1270166 -1263033 -1242819 -1215554 -1185041 -1151784
36118 -1151784 -1113247 -1065064 -1002641 -922706 -824654 -711623 -590987 -473571 -371290 -294064
36108 -294064 -247715 -234230 -254149 -309321 -404109 -544472 -735835 -981035 -1278705 -1621643
36098 -1621643 -1995175 -2376806 -2738772 -3053552 -3300105 -3467807 -3556522 -3573514 -3529259 -3434108
36088c434108J37265J71609J97444K12488K14261K01512J74821J36396Q9863M0446
36078a858003m887l8286n3150m6673k1310J5897N5818R0287J14292J26428J27680
36067a491907J19352J01557P3443L5071j0750n8245j00291j30561j44974j42285
36057a749590j24172r4746n9299k2601J2255M3978P2540R8753J24044J50069J77897
36046a370872K07173K35683K59508K73689K73287K54758K17088J62212R4594K0354
36036F27474n3640j20744j75811k16575k44484k64160k81325l00008l20470l39044
36026a688787l49931l47830l29922k96635k51612k01382j54563j19775j02295
36017c842732j01108j08798j15248j13105j01223q3894o6801n2947m1120k7547
$$ plain form
36088 -3434108 -3296843 -3125234 -2927790 -2715302 -2501041 -2299529 -2124708 -1988312 -1898449 -1858003
36078 -1858003 -1862890 -1901176 -1954326 -2000999 -2022309 -2006412 -1950594 -1860307 -1746015 -1619587 -1491907
36067 -1491907 -1372555 -1270998 -1197555 -1162484 -1173234 -1231479 -1331770 -1462331 -1607305 -1749590
36057 -1749590 -1873762 -1968508 -2027807 -2050408 -2038153 -1994175 -1921635 -1822882 -1698838 -1548769 -1370872
36046 -1370872 -1163699 -928016 -668508 -394819 -121532 133226 350314 512526 607120 627474
36036 627474 573834 453090 277279 60704 -183780 -447940 -729265 -1029273 -1349743 -1688787
36026 -1688787 -2038718 -2386548 -2716470 -3013105 -3264717 -3466099 -3620662 -3740437 -3842732
36017 -3842732 -3943840 -4052638 -4167886 -4280991 -4382214 -4466108 -4532909 -4585856 -4626976 -4654523
36007d654523r301J2705L3372M6334M8311M1612L2737K8262L1272M0710N3328
35996d295181O6118P7496Q7053R4863J01085J05887J09316J11136J10898J08269
35986c323060J03459R7635R3190R3308J00264J13336J28337J39872J44680J43175
35976b165804J38070J31887J25847J20650J17756J19601J28461J44746J65974
35967i72812J87174K02420K06582J96488J71525J33880Q8235M0661k684l6252
35957B15217n5193n5992l8131n655L3171O8504R2408J01205R5805Q0335N9966
35946E91640L8980J9813L308j0457k1806l1740m2271n5890p4264r7107j22186
35935A98020j46511j67725j84658j96610k02319j99869j88070j68020j43238j17823
$$ plain form
36007 -4654523 -4663824 -4651119 -4617747 -4571413 -4523102 -4481490 -4448753 -4420491 -4389219 -4348509 -4295181
35996 -4295181 -4229063 -4151567 -4064514 -3969651 -3868566 -3762679 -3653363 -3542227 -3431329 -3323060
35986 -3323060 -3219601 -3121966 -3028776 -2935468 -2835204 -2721868 -2593531 -2453659 -2308979 -2165804
35976 -2165804 -2027734 -1895847 -1770000 -1649350 -1531594 -1411993 -1283532 -1138786 -972812
35967 -972812 -785638 -583218 -376636 -180148 -8623 125257 213492 254153 251469 215217
35957 215217 160024 104032 65901 60246 93417 161921 254329 355534 451339 531674 591640
35946 591640 630620 650433 653741 643284 621478 589738 547467 491577 417313 320206 198020
35935 198020 51509 -116216 -300874 -497484 -699803 -899672 -1087742 -1255762 -1399000 -1516823
35925a516823r4156p1932m9062k3583M690L3593N9286P8004Q8003R0704R0297
35914a310979R1981R9674J14102J32172J48079J55860J52116J37397J15316Q9948
35904g4334O3234L4220N66l8875q2336j25236j61836j87314j99320j98426j87125
35893a156782j67894j41636j07680o5356j5985L5890Q2711J15572J26960J13579
35883a180621P7717K6361l1277q6331j31841j63285j78506j77324j61136j32784
35873b139027r6521n7418j9787J4496M6297P7692J09863J42156J72690J99429
35863a550130K20508K33904K37385K29249K09352J79419J42314J00893N7330J3121
35853G3345l0504p2050j09068j37685j53233j52373j35737j09022q1427o2228
$$ plain form
35925 -1516823 -1610979 -1682911 -1731973 -1755556 -1750866 -1717273 -1657987 -1579983 -1491980 -1401276 -1310979
35914 -1310979 -1218998 -1119324 -1005222 -873050 -724971 -569111 -416995 -279598 -164282 -74334
35904 -74334 -11100 23120 23686 -15189 -97525 -222761 -384597 -571911 -771231 -969657 -1156782
35893 -1156782 -1324676 -1466312 -1573992 -1639348 -1655333 -1619443 -1536732 -1421160 -1294200 -1180621
35883 -1180621 -1102904 -1076543 -1107820 -1194151 -1325992 -1489277 -1667783 -1845107 -2006243 -2139027
35873 -2139027 -2235548 -2292966 -2312753 -2298257 -2251960 -2174268 -2064405 -1922249 -1749559 -1550130
35863 -1550130 -1329622 -1095718 -858333 -629084 -419732 -240313 -97999 2894 60224 73345
35853 73345 42841 -29209 -138277 -275962 -429195 -581568 -717305 -826327 -907754 -969982
35843i69982n7479o8332r1261j19694j46264j64791j71306j64218j44284j14857
35833b212468q1750n1980l1696k4716l2494n4794q9786j33342j78681k17349k41450
35822c350506k46116k31103k00801j62430j23390q9180o2930m5997l8447l8768
35812d589668m3297m6272m1051k2320J1682N8358J11858J65220K11984K46700
35802c936806K65209K65408K48283K18064J81116J43968J11585Q6535O9067N7614
35792b289957M9530M2363L5660L2206L7127N4899Q6192J26615J67807J99941K14616
35781a243001K07303J78449J32709P6953J8492l5816q0061j09964j23617j21644
35771a100197j06694q2551n3274k2856M491K3947L0770K2500J421k5115m7623
$$ plain form
35843 -969982 -1027461 -1095793 -1187054 -1306748 -1453012 -1617803 -1789109 -1953327 -2097611 -2212468
35833 -2212468 -2294218 -2346198 -2377894 -2402610 -2435104 -2489898 -2579684 -2713026 -2891707 -3109056 -3350506
35822 -3350506 -3596622 -3827725 -4028526 -4190956 -4314346 -4403526 -4466456 -4512453 -4550900 -4589668
35812 -4589668 -4632965 -4679237 -4720288 -4742608 -4730926 -4672568 -4560710 -4395490 -4183506 -3936806
35802 -3936806 -3671597 -3406189 -3157906 -2939842 -2758726 -2614758 -2503173 -2416638 -2347571 -2289957
35792 -2289957 -2240427 -2198064 -2162404 -2130198 -2093071 -2038172 -1951980 -1825365 -1657558 -1457617 -1243001
35781 -1243001 -1035698 -857249 -724540 -647587 -629095 -664911 -744972 -854936 -978553 -1100197
35771 -1100197 -1206891 -1289442 -1342716 -1365572 -1361081 -1337134 -1306364 -1283864 -1282443 -1307558 -1355181
35760a355181n8990n7381m5657k8517j0240N729J6484K0112J6516P131o587k4199
35748a520780m5545o8989r0527j04746j06945r5123p0633l7294M00L8595P4268
35737b027319J04792J27948J42594J49218J49697J46377J41161J35153J28879
35728h01500J22658J16776J11454J06970J04081J04248J09220J20139J36982J58638
35718C89666J83190K07743K28033K38786K35357K15937J82812J41638R9083O0226
35708B182471K7028j570k8132n4493q0086j02167j18042j27828j35375j46469
35698A415337j65621j93860k28877k66990l05193l41825l75651m04200m22905
35689a289785m26030m09127l71303l15605k47366j72128r4678j9175N0668J11622
$$ plain form
35760 -1355181 -1414171 -1471552 -1517209 -1545726 -1555966 -1550237 -1533753 -1513641 -1497125 -1489994 -1496581 -1520780
35748 -1520780 -1566325 -1635314 -1725841 -1830587 -1937532 -2032655 -2103288 -2140582 -2140182 -2101587 -2027319
35737 -2027319 -1922527 -1794579 -1651985 -1502767 -1353070 -1206693 -1065532 -930379 -801500
35728 -801500 -678842 -562066 -450612 -343642 -239561 -135313 -26093 94046 231028 389666
35718 389666 572856 780599 1008632 1247418 1482775 1698712 1881524 2023162 2122245 2182471
35708 2182471 2209499 2207929 2179797 2125304 2045218 1943051 1825009 1697181 1561806 1415337
35698 1415337 1249716 1055856 826979 559989 254796 -87029 -462680 -866880 -1289785
35689 -1289785 -1715815 -2124942 -2496245 -2811850 -3059216 -3231344 -3326022 -3345197 -3294529 -3182907
35679c182907J60738J94868K10975K07526J85713J49066J01919M8403p515o1868
35669a993082j11086j52182j82134j97262j93853j69999j27220p0864r252M7986
35659c158948R2193J18101J25365J18232J03407Q7299P4091O5352O0677N8482
35649b255749N6561N2887M6998M1319M0905N0969P3361J04558J36813J61801J74310
35638a315267J73772J63390J48068J32347J18827J07462R6144Q2442O5312M5541
35628a81962K4928N408j0929k1294k2110j0165J5448N1835R2563J29748J56646
35617B30116J69155J65848J47447J16474P7058L4383o129l9671o2936p4956p7458
35606F79331p4022o8158o1404n2697l9452j9800N322L1410N1601N9277N0641K5857
$$ plain form
35679 -3182907 -3022169 -2827301 -2616326 -2408800 -2223087 -2074021 -1972102 -1923699 -1931214 -1993082
35669 -1993082 -2104168 -2256350 -2438484 -2635746 -2829599 -2999598 -3126818 -3197682 -3206934 -3158948
35659 -3158948 -3066755 -2948654 -2823289 -2705057 -2601650 -2514351 -2440260 -2374908 -2314231 -2255749
35649 -2255749 -2199188 -2146301 -2099303 -2057984 -2017079 -1966110 -1892749 -1788191 -1651378 -1489577 -1315267
35638 -1315267 -1141495 -978105 -830037 -697690 -578863 -471401 -375257 -292815 -227503 -181962
35628 -181962 -157034 -151626 -162555 -183849 -205959 -216124 -200676 -148841 -56278 73470 230116
35617 230116 399271 565119 712566 829040 906098 940481 934352 894681 831745 756789 679331
35606 679331 605309 537151 475747 423050 383598 363798 369120 400530 452131 511408 562049 587906
35594E87906j1636n6771j04339j49700j88832k18064k33815k32638k12055j72028
35584i91972j16022n0597J6325P7113J25086J54739J62549J48242J15233O9557
35574b89747J7842l4503q4290j30572j73673k13705k49415k77767k94055k92257
35564b022142k66341k12987j34565l9886N8345J47664K18806K66469K88947K87765
35554a407925K67174K32941J90717J44981R9014N5475J6889j4271l5835m6450
35544d97290m6043l5937j8504L308K6290M7346O4214P6118Q3324Q5510Q0356O4161
35532f7147L4432p399n4992r8316j26630j32525j15546q2968m6180j4595Q548
35521g03318K5522L9875N2455O0549O0170M9608L1875J4258M921Q507K3505M2589
$$ plain form
35594 587906 576270 519499 415160 265460 76628 -141436 -375251 -607889 -819944 -991972
35584 -991972 -1107994 -1158591 -1142266 -1065153 -940067 -785328 -622779 -474537 -359304 -289747
35574 -289747 -271905 -306408 -390698 -521270 -694943 -908648 -1158063 -1435830 -1729885 -2022142
35564 -2022142 -2288483 -2501470 -2636035 -2675921 -2617576 -2469912 -2251106 -1984637 -1695690 -1407925
35554 -1407925 -1140751 -907810 -717093 -572112 -473098 -417623 -400734 -415005 -450840 -497290
35544 -497290 -543333 -579270 -597774 -594466 -568176 -520830 -456616 -380498 -297174 -211664 -131308 -67147
35532 -67147 -32715 -40114 -95106 -193422 -320052 -452577 -568123 -651091 -697271 -711866 -703318
35521 -703318 -677796 -637921 -585466 -524917 -464747 -415139 -383264 -369006 -364085 -355578 -332073 -289484
35509b89484N5276N1466K4768k5309r3243j69417k42849l03334l42833l56502
35499a691461l43490l06986k53462j91416j29758p5776l3316k403J9208L3641
35489b975219M1317M0974L0848J0274j8873n1415p9326r3501q6279n3839K194
35478c232845P4433J51026K18561K65746K86420K80477K52651K09972J59239J05295
35468a229025N0627l759n6618j05163j45019j71421j80713j71369j44475j03760
35458b260695n4845l558M6042R2479J35798J75551K09618K34794K48253K48492
35448i28071K35267K09287J72262J27058P7446K7506j8921n8765r0469j14604
35438c62004j33558j50264j66881j84232k01743k17215k26734k25490k09636j78180
$$ plain form
35509 -289484 -234208 -182742 -157974 -183283 -276526 -445943 -688792 -992126 -1334959 -1691461
35499 -1691461 -2034951 -2341937 -2595399 -2786815 -2916573 -2992349 -3025665 -3028068 -3008860 -2975219
35489 -2975219 -2933902 -2892928 -2862080 -2851806 -2870679 -2922094 -3001420 -3094921 -3181200 -3235039 -3232845
35478 -3232845 -3158412 -3007386 -2788825 -2523079 -2236659 -1956182 -1703531 -1493559 -1334320 -1229025
35468 -1229025 -1178398 -1182157 -1238775 -1343938 -1488957 -1660378 -1841091 -2012460 -2156935 -2260695
35458 -2260695 -2315540 -2319098 -2273056 -2180577 -2044779 -1869228 -1659610 -1424816 -1176563 -928071
35448 -928071 -692804 -483517 -311255 -184197 -106751 -79245 -98166 -156931 -247400 -362004
35438 -362004 -495562 -645826 -812707 -996939 -1198682 -1415897 -1642631 -1868121 -2077757 -2255937
35428b255937j33799q2210l0339J5881N3111Q0498R8014J04667R8464P8371M6607
35417a926672Q972k7651n9097q6263j14022j47246j86626k27247k60816k79796
35407c306464k80441k62989k29682j82886j24865n8727J1070P9542J42548J97397
35397d015497K42340K75784K96226L02926K96597K79536K55202K27732K01495
35388a637659J80296J66135J58253J53468J47915J39075J26588J11531R5011P7196
35378b82191N7316L4484Q872j7400m0380n5608o0084n3668l9064k0689l194R817
35366d61789J6861J9332K1157K6997L9792N9164Q1462J00777J10153J03150P6283
35355A93339L1577k2719p4535j12434j29564j25141j03456p1742l8179j0516N022
$$ plain form
35428 -2255937 -2389736 -2471946 -2502285 -2486404 -2433293 -2352795 -2254781 -2150114 -2051650 -1973279 -1926672
35417 -1926672 -1917700 -1945351 -2004448 -2090711 -2204733 -2351979 -2538605 -2765852 -3026668 -3306464
35407 -3306464 -3586905 -3849894 -4079576 -4262462 -4387327 -4446054 -4434984 -4355442 -4212894 -4015497
35397 -4015497 -3773157 -3497373 -3201147 -2898221 -2601624 -2322088 -2066886 -1839154 -1637659
35388 -1637659 -1457363 -1291228 -1132975 -979507 -831592 -692517 -565929 -454398 -359387 -282191
35378 -282191 -224875 -190391 -181519 -198919 -239299 -294907 -354991 -408659 -447723 -468412 -471606 -461789
35366 -461789 -444928 -425596 -404439 -377442 -337650 -278486 -197024 -96247 13906 117056 193339
35355 193339 224916 202197 127662 15228 -114336 -239477 -342933 -414675 -452854 -463370 -458348
35344d58348M786j1441m0444p6654j13865j46741j71707j87249j93562j91568
35334a586793j81627j62995j34477r5779m8390M481N8503J08919J51324J82297
35324a704537J99544K01434J86718J55218J09052N3214n299n9240j02944j33691
35314a100531j52283j62344j68134j71944j72738j67018j51119j23490q5871m3188
35304b498660k136L1429N5440P3017R0645J13649J41895J69109J86512J87933
35294a451167J72514J43675J06407O5718K6814m885k5239l3414l2240k6301j9415
35283a077533j3532r459q235j1768k2188m0336o4511r0538j13309j28671j34249
35272a714329j28993j12525q5320m9613r920K7720N7718P7145Q6860R0871R4203
$$ plain form
35344 -458348 -453562 -465003 -505447 -582101 -695966 -842707 -1014414 -1201663 -1395225 -1586793
35334 -1586793 -1768420 -1931415 -2065892 -2161671 -2210061 -2205580 -2147077 -2038158 -1886834 -1704537
35324 -1704537 -1504993 -1303559 -1116841 -961623 -852571 -799357 -804656 -863896 -966840 -1100531
35314 -1100531 -1252814 -1415158 -1583292 -1755236 -1927974 -2094992 -2246111 -2369601 -2455472 -2498660
35304 -2498660 -2500796 -2469367 -2413927 -2340910 -2250265 -2136616 -1994721 -1825612 -1639100 -1451167
35294 -1451167 -1278653 -1134978 -1028571 -962853 -936039 -940924 -966163 -999577 -1031817 -1058118 -1077533
35283 -1077533 -1091065 -1100524 -1108759 -1120527 -1142715 -1183051 -1247562 -1338100 -1451409 -1580080 -1714329
35272 -1714329 -1843322 -1955847 -2041167 -2090780 -2100700 -2072980 -2015262 -1938117 -1851257 -1760386 -1666183
35261a666183J00491J10466J21911J30952J33956J29229J17686J02358Q7248P6038
35251e55848P0992P2112P6927Q1108P9841O9335M8097J7686j7242m9838p2982
35240a79812q1712p5144n6810l3094j0652N672J3632J3361O855k624j1453j6676
35228d28457j6780j2099m852J479L743R75m812r544q929k0J8092M4376P6635J12445
35214b27748J49568J85463K16696K39101K48859K43747K24006J92529J54112J13764
35204A740097P5152M0201R807j5564l6046n2712o7338q1651r6537j11539j24701
35193A279169j33070j33712j24512j04268p2602l0424J9294P1564J20535J60960
35183A052934J89018K02416K00376J83718J54912J17597P5553L1523j3060n7108
$$ plain form
35261 -1666183 -1565692 -1455226 -1333315 -1202363 -1068407 -939178 -821492 -719134 -631886 -555848
35251 -555848 -484856 -412744 -335817 -254709 -174868 -105533 -57436 -39750 -56992 -106830 -179812
35240 -179812 -261524 -336668 -393478 -426572 -437224 -431552 -417920 -404559 -397704 -400328 -411781 -428457
35228 -428457 -445237 -457336 -462188 -460709 -456966 -455991 -460803 -470347 -479276 -479296 -461204 -416828 -340193 -227748
35214 -227748 -78180 107283 323979 563080 811939 1055686 1279692 1472221 1626333 1740097
35204 1740097 1815249 1855450 1865257 1849693 1813647 1760935 1693597 1611946 1515409 1403870 1279169
35193 1279169 1146099 1012387 887875 783607 711005 680581 699875 771439 891974 1052934
35183 1052934 1241952 1444368 1644744 1828462 1983374 2100971 2176524 2208047 2194987 2137879
35173B137879r8483j33644j58809j71507j71145j58548j35366j04119o8586l3817
35163I03855n295J2511J7590J1081l040j9002l0483l1958k0144M684L8165P2752
35151I50716R9831J12219J06006Q1244M1598o659n6044r9477j31739j50280j55265
35140G92150j49247j36870j24291j17795j21820j37554j62900j93443k23488k46834
35130h22092k57781k52210k28024j84587j22280m3438M5840J35217K12523K67944
35120a248888K97155L01405K85065K52697K07609J52337R0265K6868l0571p4804
35110B59138j01009j08434j00633q4345o7233n5034m9047m5671l8757k3564L65
35099d14224K9310N7609P9885R2051R1767P9048N6542K8603l12k6663m7598o0344
$$ plain form
35173 2137879 2039396 1905752 1746943 1575436 1404291 1245743 1110377 1006258 937672 903855
35163 903855 898560 911071 928661 939742 936702 917700 887217 855259 835115 839799 877964 950716
35151 950716 1050547 1162766 1268772 1350016 1391614 1384955 1328911 1229434 1097695 947415 792150
35140 792150 642903 506033 381742 263947 142127 4573 -158327 -351770 -575258 -822092
35130 -822092 -1079873 -1332083 -1560107 -1744694 -1866974 -1910412 -1864572 -1729355 -1516832 -1248888
35120 -1248888 -951733 -650328 -365263 -112566 95043 247380 337645 364513 333942 259138
35110 259138 158129 49695 -50938 -135283 -202516 -257550 -306597 -352268 -391025 -414589 -414224
35099 -414224 -384914 -327305 -247420 -155369 -63602 15446 71988 100591 100279 73616 26018 -34326
35087c4326o2329n2265l1476m457K1961M0586M5998L5743J0479k6320o8867j10091
35075b35364j43232j63279j67576j55659j28934r0367m4044N389N3217R5070J27624
35064h47155J49422J61426J66614J68639J70003J70813J68915J61451J46799J25627
35054G42554J00565P4790N0348K7208L947k0098m2738n8888o3204n3684l3626
35043G27174j0393Q180J7189J5758N810r863k8921n0202p4123j02241j35367j71224
35031A91777k03757k25155k29216k13818j81312j37319q9004m3557p021J6855
35021a121527K7622K8378K4357K0181J7380J3644M027j6998n3470j06315j72344
35010a335065k44300l12310l66355l98961m06953l91661l57702l11119k57623
$$ plain form
35087 -34326 -96655 -148920 -180396 -184853 -162892 -122306 -76308 -40565 -30086 -56406 -125273 -235364
35075 -235364 -378596 -541875 -709451 -865110 -994044 -1084411 -1128455 -1123066 -1069849 -974779 -847155
35064 -847155 -697733 -536307 -369693 -201054 -31051 139762 308677 470128 616927 742554
35054 742554 843119 917909 968257 995465 999412 979314 936576 877688 814484 760800 727174
35043 727174 716781 724961 742150 757908 763718 753855 724934 674732 600609 498368 363001 191777
35031 191777 -11980 -237135 -466351 -680169 -861481 -998800 -1087804 -1131361 -1138382 -1121527
35021 -1121527 -1093905 -1065527 -1041170 -1020989 -1003609 -989965 -985938 -1002936 -1056406 -1162721 -1335065
35010 -1335065 -1579365 -1891675 -2258030 -2656991 -3063944 -3455605 -3813307 -4124426 -4382049
35001d382049k01388j44636q8042l1640K4356P9067J30440J74629K05938K18326
34991d014999K08084J76206J28666P4252K1186k5614o5001r7697j23450j39487
34981c857854j41494j26380r4656n0772j480M6377Q7327J17866J36532J43678
34971c740856J40731J29232J10179Q4199N2342J7071j7244m4916o0812o2532n1296
34960c443902l0773m787K4375N6161R0774J27910J65913K01742K31490K50946
34950b330151K56028K43680K13481J69057J17699O7913K6425l323k0573k5427
34940a285191j7388M463L9542Q3402J27088J59315J70483J56095J17684O1223
34930c83284n499p4866j40071j94940k33868k52562k49204k25238j85047j34730
$$ plain form
35001 -4382049 -4583437 -4728073 -4816115 -4847755 -4823399 -4744332 -4613892 -4439263 -4233325 -4014999
34991 -4014999 -3806915 -3630709 -3502043 -3427791 -3406605 -3432219 -3497220 -3594917 -3718367 -3857854
34981 -3857854 -3999348 -4125728 -4220384 -4271156 -4272636 -4226259 -4138932 -4021066 -3884534 -3740856
34971 -3740856 -3600125 -3470893 -3360714 -3276515 -3224173 -3207102 -3224346 -3269262 -3330074 -3392606 -3443902
34960 -3443902 -3474675 -3479462 -3455087 -3398926 -3308152 -3180242 -3014329 -2812587 -2581097 -2330151
34950 -2330151 -2074123 -1830443 -1616962 -1447905 -1330206 -1262293 -1235868 -1239191 -1259764 -1285191
34940 -1285191 -1302579 -1298116 -1258574 -1175172 -1048084 -888769 -718286 -562191 -444507 -383284
34930 -383284 -388783 -463649 -603720 -798660 -1032528 -1285090 -1534294 -1759532 -1944579 -2079309
34920b079309q0754k9061J5589N0581P6647R8073J20843J49244J82922K16265
34910a278960K40345K46286K28661J87594J28661O0419q966p3859j30994j78118
34900e78931k13382k35865k45986k44717k32203k07223j68055j13916m6130L1272
34890b255136J11596J86479K47589K88213L03948K92881K56055J98162J27568
34881b42645N4924r254n7173q5714r7016r7149r3136q9833q8279q6058p8867o2381
34869a032581l3950O150N4357J04752J50869J87597K12552K26671K33678K38160
34859C48255K43018K47875K49610K44251K28768K02054J65541J23361Q1290M4415
34849B178438J5135o847k2879l3911m0476m3465m4528m5520m7513n0243n2568
$$ plain form
34920 -2079309 -2160063 -2189124 -2173535 -2122954 -2046307 -1948234 -1827391 -1678147 -1495225 -1278960
34910 -1278960 -1038615 -792329 -563668 -376074 -247413 -186994 -195960 -269819 -400813 -578931
34900 -578931 -792313 -1028178 -1274164 -1518881 -1751084 -1958307 -2126362 -2240278 -2286408 -2255136
34890 -2255136 -2143540 -1957061 -1709472 -1421259 -1117311 -824430 -568375 -370213 -242645
34881 -242645 -187721 -196975 -254148 -339862 -436878 -534027 -627163 -716996 -805275 -891333 -970200 -1032581
34869 -1032581 -1066531 -1060381 -1006024 -901272 -750403 -562806 -350254 -123583 110095 348255
34859 348255 591273 839148 1088758 1333009 1561777 1763831 1929372 2052733 2134023 2178438
34849 2178438 2193573 2186726 2163847 2129936 2089460 2045995 2001467 1955947 1908434 1858191 1805623
34838A805623n3578n3108n0782m4343k9240n83M3490R9243J57555K07059K38628
34827B319964K48496K38349K12900J77149J35009Q9210M1703o020n2760r7732
34817C306268j40728j81826k20575k55422k84121l04937l17759l24381l27734
34808I48785l30270l32322l31673l24823l08964k83170k48421k07198j63037j19648
34798a700741p9438m2366o180L1847P2726J14356J51748J78968J91886J90322
34788h96872J78284J62271J48711J41765J42199J47342J52008J50288J37789J13493
34778E77278Q0423M4938J5022k018k031J4125M0513O8191Q8421R5491Q8174O9666
34766A178193M6229K4856J0914O614J0583J8169K2434J6243m801l9920q2868j24122
$$ plain form
34838 1805623 1752045 1698937 1648155 1603812 1574572 1573989 1617479 1716722 1874277 2081336 2319964
34827 2319964 2568460 2806809 3019709 3196858 3331867 3421077 3462780 3456760 3404000 3306268
34817 3306268 3165540 2983714 2763139 2507717 2223596 1918659 1600900 1276519 948785
34808 948785 618515 286193 -45480 -370303 -679267 -962437 -1210858 -1418056 -1581093 -1700741
34798 -1700741 -1780179 -1822545 -1828725 -1796878 -1724152 -1609796 -1458048 -1279080 -1087194 -896872
34788 -896872 -718588 -556317 -407606 -265841 -123642 23700 175708 325996 463785 577278
34778 577278 657701 702639 717661 715643 713612 727737 768250 836441 924862 1020353 1108527 1178193
34766 1178193 1224422 1249278 1260192 1266806 1277389 1295558 1317992 1334235 1329434 1289514 1206646 1082524
34754A082524j54325j67209j60888j37552j02419o2609k5923P57J3370J2076J403
34743B99205j1046j7075j0894Q465L6523O5095Q5572R2214Q3949O3957L7316Q164
34731G41445k1787n2580q4248j15544j43781j65170j75542j71901j54558j28103
34721d71769r9592p4685n4536l5718j3197J5771M9334Q1768J06750J20777J24237
34710b50860J19595J08845R2570P1017M5501J8583p004k9655m9459o7629q4871
34699c3367r9642j07667j03680q4645n2420j4033K0955M4503N3296M9239L7363
34688b90098K2948R621j375j1473k4611m5686p7410j17349j57679j88273k01137
34677a082522j93405j67426j28728q3556l7293N919M2859P0882Q7996R3187Q6581
$$ plain form
34754 1082524 928199 760990 600102 462550 360131 297522 271599 272356 285726 297802 299205
34743 299205 288159 271084 260190 268655 305178 370273 455845 548059 632008 695965 733281 741445
34731 741445 719658 667078 582830 467286 323505 158335 -17207 -189108 -343666 -471769
34721 -471769 -571361 -646046 -700582 -736300 -749497 -733726 -684392 -602624 -495874 -375097 -250860
34710 -250860 -131265 -22420 70150 141167 186668 205251 198247 168592 119133 51504 -33367
34699 -33367 -133009 -240676 -344356 -429001 -481421 -495454 -474499 -429996 -376700 -327461 -290098
34688 -290098 -267150 -257529 -258904 -270377 -294988 -340674 -418084 -535433 -693112 -881385 -1082522
34677 -1082522 -1275927 -1443353 -1572081 -1655637 -1692930 -1687011 -1644152 -1573270 -1485274 -1392087 -1305506
34666a305506O9128M2009O314l6604q4163j31625j72239j98868k06345j92850
34656b210749j59489j08983m5201K6238R7610J60361K07563K35974K46533K43239
34646a306904K31022K13461J91497J63959J29443Q8121M2344l896m5816p8695
34636c75464r8776j04085r4674p2112l8740K615M8306R3376J31712J57233J65836
34625a84773J57074J34335J03174O8655L3647j051l5331o8586r9299j25096j43075
34614a60326j50714j47336j34934j17236r7458p6617n3786k7926L33K8275N2129
34603h85596O8761P7058P8621P7803Q1012R5000J24124J67680K19133K68066L03876
34592F75538L19007L10206K78025K25851J59207Q5138J1209n5762j10623j50166
$$ plain form
34666 -1305506 -1236378 -1194369 -1188055 -1224659 -1308822 -1440447 -1612686 -1811554 -2017899 -2210749
34656 -2210749 -2370238 -2479221 -2524422 -2498184 -2400574 -2240213 -2032650 -1796676 -1550143 -1306904
34646 -1306904 -1075882 -862421 -670924 -506965 -377522 -289401 -247057 -250953 -296769 -375464
34636 -375464 -474240 -578325 -672999 -745111 -783851 -781236 -732930 -639554 -507842 -350609 -184773
34625 -184773 -27699 106636 209810 278465 312112 311061 275730 207144 107845 -17251 -160326
34614 -160326 -311040 -458376 -593310 -710546 -808004 -884621 -938407 -966333 -966000 -937725 -885596
34603 -885596 -816835 -739777 -661156 -583353 -502341 -407341 -283217 -115537 103596 371662 675538
34592 675538 994545 1304751 1582776 1808627 1967834 2052972 2064181 2008419 1897796 1747630
34582A747630j72995j79228j70187j48261j17051q1382m6448j6284P140K3221
34572H46155L1006K8178J1685k0291o6210j20083j72511k13905k38388k46010
34562a60374k41959k33597k27079k25110k26361k26476k19973k02073j70052j24144
34552b257198o7809o926N2026J03813J45226J74652J91144J93800J81888J55839
34542a133545J18392P4740L1089p465l8067n9646p1884p4958p0288o1184n2292
34531a345108m7922n0373n9239p1729q3465q9533q5958p1309m7459j8908Q851
34520a962152L1025M4826N0250M9991M8205M8515N2411N8981O5913P1177P4331
34509a366527P6649P9835Q4231Q8073Q8672Q4705P7776P1821P0775P6362Q7816
$$ plain form
34582 1747630 1574635 1395407 1225220 1076959 959908 878526 832078 815794 822934 846155
34572 846155 877161 905339 917024 896733 830523 710440 537929 324024 85636 -160374
34562 -160374 -402333 -635930 -863009 -1088119 -1314480 -1540956 -1760929 -1963002 -2133054 -2257198
34552 -2257198 -2325007 -2331933 -2279907 -2176094 -2030868 -1856216 -1665072 -1471272 -1289384 -1133545
34542 -1133545 -1015153 -940413 -909324 -916789 -954856 -1014502 -1086386 -1161344 -1231632 -1292816 -1345108
34531 -1345108 -1393030 -1443403 -1502642 -1574371 -1657836 -1747369 -1833327 -1904636 -1952095 -1971003 -1962152
34520 -1962152 -1931127 -1886301 -1836051 -1786060 -1737855 -1689340 -1636929 -1577948 -1512035 -1440858 -1366527
34509 -1366527 -1289878 -1210043 -1125812 -1037739 -949067 -864362 -786586 -714765 -643990 -567628 -479812
34498d79812J03280J21093J39409J54658J60978J51849J23138P5300J3208n5905
34488E07196j24574j85835k32986k59909k62751k41852k01983j50431r4333l8995
34478a286453J2343N8029R7466J30588J57182J76436J87244J89379J84633J76895
34468H3742J70949J70719J77888J91157K06236K16730K15993J99304J65503J17559
34458A915780O1999P337l8327o9721q5667q8632q2995p3076o1663m9640l6818
34447A398577k3457j1278k873mk390q139j5234k2442k9051l4321l7835m0480m4798
34434A126275n4037p0574r4551j23084j50220j68197j70184j53427j21053q1392
34424f0444m5311k2649j9098l4600o3763r7897j27561j44772j44713j26840r5191
$$ plain form
34498 -479812 -376532 -255439 -116030 38628 199606 351455 474593 549893 563101 507196
34488 507196 382622 196787 -36199 -296108 -558859 -800711 -1002694 -1153125 -1247458 -1286453
34478 -1286453 -1274110 -1216081 -1118615 -988027 -830845 -654409 -467165 -277786 -93153 83742
34468 83742 254691 425410 603298 794455 1000691 1217421 1433414 1632718 1798221 1915780
34458 1915780 1977779 1985116 1946789 1877068 1791401 1702769 1619774 1546698 1485035 1435395 1398577
34447 1398577 1375120 1363842 1360969 1360965 1358575 1350436 1335202 1312760 1283709 1249388 1211553 1171073 1126275
34434 1126275 1072238 1001664 907113 784029 633809 465612 295428 142001 20948 -60444
34424 -60444 -105755 -128404 -147502 -182102 -245865 -343762 -471323 -616095 -760808 -887648 -982839
34413i82839n7426k2586J838J2275R449l322k2384m4588o6540q3949r2555r0004
$$ plain form
34413 -982839 -1040265 -1062851 -1061013 -1048738 -1039289 -1042611 -1064995 -1109583 -1176123 -1260072 -1352627 -1442631
$$ [...]
##END NTUPLES=NMR SPECTRUM
##END=
