##TITLE=31Pdec_DE-30rm1h
 
 64 sc
 6.2.2024
##JCAMPDX= 6.0         $$ Bruker NMR JCAMP-DX V2.0
##DATA TYPE= NMR SPECTRUM
##DATA CLASS= NTUPLES
##ORIGIN= UXNMR, Bruker Analytische Messtechnik GmbH
##OWNER= root
$$ XWIN-NMR		Version 3.5
$$ Tue Feb  6 14:42:28 2024 Russian Standard Time (UT+4h)  she@DPX200
##.OBSERVE FREQUENCY= 81.013821
##.OBSERVE NUCLEUS= ^31P
##.ACQUISITION MODE= SIMULTANEOUS
##.ACQUISITION SCHEME= undefined
##.AVERAGES= 64
##.DIGITISER RES= 16
##SPECTROMETER/DATA SYSTEM= spect
##.PULSE SEQUENCE= zgpg30
##.SOLVENT NAME= CDCl3
##.SHIFT REFERENCE= (INTERNAL, CDCl3, 0, 248.564)
##AUDIT TRAIL= $$ (NUMBER, WHEN, WHO, WHERE, WHAT)
$$ ##TITLE= Audit trail, XWIN-NMR		Version 3.5
$$ ##JCAMPDX= 5.01
$$ ##ORIGIN= Bruker BioSpin GmbH
$$ ##OWNER= she
$$ F:/spectra/data/she/nmr/P31/1/pdata/1/auditp.txt
$$ ##AUDIT TRAIL=  $$ (NUMBER, WHEN, WHO, WHERE, WHAT)
(   1,<2024-02-06 14:40:38.57 +0400>,<she>,<DPX200>,
      <continue with go, POWCHK disabled, PULCHK disabled
       configuration hash MD5:
       00 E9 B6 7A A2 85 ED C7 34 08 36 98 17 FE 4E 26
       data hash MD5: 32K
       74 04 B8 01 DB A8 68 AC 3D 29 0D EF 02 2F D9 16>)
(   2,<2024-02-06 14:40:41.45 +0400>,<she>,<DPX200>,
      <Start of raw data processing
       efp BC_mod = 2 LB = 10 FT_mod = 6 PKNL = 1 PHC0 = -13189.1 PHC1 = 1810.285 SI = 64K 
       data hash MD5: 64K
       C2 70 16 27 33 41 94 36 06 50 FD E4 7C D2 9A FB>)
(   3,<2024-02-06 14:41:02.75 +0400>,<she>,<DPX200>,
      <pk PHC0 = -29.43561 PHC1 = 95.39999 
       data hash MD5: 64K
       17 07 D7 4E AA E9 3A CF 75 CA 56 D2 F3 A2 62 D3>)
(   4,<2024-02-06 14:41:05.90 +0400>,<she>,<DPX200>,
      <abs ABSG = 5 
       data hash MD5: 64K
       27 E3 C5 C6 A5 D2 16 29 98 77 2A DB 50 49 CB 7D>)
$$ ##END=
$$ 
$$ hash MD5
$$ 49 56 31 F0 72 8B E9 21 C3 17 32 BC BD D0 67 35
##$RELAX= 
##$RELAX= 
##$RELAX= 
##$RELAX= 
##$RELAX= 
##$RELAX= 
##$RELAX= 
##$RELAX= 
##$RELAX= 
$$ Bruker specific parameters
$$ --------------------------
##$DU= <F:/spectra>
##$EXPNO= 1
##$NAME= <P31>
##$PROCNO= 1
##$TYPE= <nmr>
##$USER= <she>
##$AMP= (0..31)
100 100 100 100 100 100 100 100 100 100 100 100 100 100 100 100 100 100 
100 100 100 100 100 100 100 100 100 100 100 100 100 100 
##$AQSEQ= 0
##$AQ_mod= 1
##$AUNM= <au_zg>
##$AUTOPOS= <>
##$BF1= 81.014009
##$BF2= 200.13
##$BF3= 200.13
##$BF4= 200.13
##$BF5= 200.13
##$BF6= 200.13
##$BF7= 200.13
##$BF8= 200.13
##$BYTORDA= 1
##$CFDGTYP= 0
##$CFRGTYP= 5
##$CHEMSTR= <none>
##$CNST= (0..31)
1 1 145 1 1 1 1 1 1 1 1 1 1 1 1 1 1 1 1 1 1 1 1 1 1 1 1 1 1 1 1 1 
##$CPDPRG= <waltz16>
##$CPDPRG1= <>
##$CPDPRG2= <waltz16>
##$CPDPRG3= <>
##$CPDPRG4= <mlev>
##$CPDPRG5= <mlev>
##$CPDPRG6= <mlev>
##$CPDPRG7= <mlev>
##$CPDPRG8= <mlev>
##$CPDPRGB= <>
##$CPDPRGT= <>
##$D= (0..31)
0 1 0 0 0 0 0 0 0 0 0 0.03 2e-05 3e-06 0 0 0 0 0 0 0 0 0 0 0 0 0 0 0 0 
0 0 
##$DATE= 1707215950
##$DBL= (0..7)
120 120 120 11 120 120 24 19 
##$DBP= (0..7)
150 150 150 150 150 150 150 150 
##$DBP07= 0
##$DBPNAM0= <>
##$DBPNAM1= <>
$$ [...]
##$SUBNAM3= <"">
##$SUBNAM4= <"">
##$SUBNAM5= <"">
##$SUBNAM6= <"">
##$SUBNAM7= <"">
##$SUBNAM8= <"">
##$SUBNAM9= <"">
##$SW= 501.771253377433
##$SWIBOX= (0..15)
0 1 3 0 0 0 0 0 0 0 0 0 0 0 0 0 
##$SW_h= 40650.406504065
##$TD= 32768
##$TD0= 1
##$TE= 0
##$TE2= 300
##$TE3= 300
##$TEG= 300
##$TL= (0..7)
0 120 53 12 22 120 120 120 
##$TP= (0..7)
150 150 150 150 150 150 150 150 
##$TP07= 0
##$TPNAME0= <>
##$TPNAME1= <>
##$TPNAME2= <>
##$TPNAME3= <>
##$TPNAME4= <>
##$TPNAME5= <>
##$TPNAME6= <>
##$TPNAME7= <>
##$TPOAL= (0..7)
0.5 0.5 0.5 0.5 0.5 0.5 0.5 0.5 
##$TPOFFS= (0..7)
0 0 0 0 0 0 0 0 
##$TUNHIN= 0
##$TUNHOUT= 0
##$TUNXOUT= 0
##$USERA1= <user>
##$USERA2= <user>
##$USERA3= <user>
##$USERA4= <user>
##$USERA5= <user>
##$V9= 5
##$VALIST= <valist>
##$VCLIST= <CCCCCCCCCCCCCCC>
##$VD= 0
##$VDLIST= <DDDDDDDDDDDDDDD>
##$VPLIST= <PPPPPPPPPPPPPPP>
##$VTLIST= <TTTTTTTTTTTTTTT>
##$WBST= 1024
##$WBSW= 4
##$XGAIN= (0..3)
0 0 0 0 
##$XL= 0
##$YL= 0
##$YMAX_a= 12705
##$YMIN_a= -10821
##$ZGOPTNS= <>
##$ZL1= 120
##$ZL2= 120
##$ZL3= 120
##$ZL4= 120
##$ABSF1= 248.5645
##$ABSF2= -253.2056
##$ABSG= 5
##$ABSL= 3
##$ALPHA= 0
##$AQORDER= 0
##$ASSFAC= 0
##$ASSFACI= 0
##$ASSFACX= 0
##$ASSWID= 0
##$AUNMP= <proc_1d>
##$AZFE= 0.1
##$AZFW= 0.5
##$BCFW= 0
##$BC_mod= 2
##$BYTORDP= 0
##$COROFFS= 0
##$CY= -3
##$DATMOD= 1
##$DC= 0
##$DFILT= <>
##$DTYPP= 0
##$F1P= 0
##$F2P= 0
##$FCOR= 1
##$FTSIZE= 65536
##$FT_mod= 6
##$GAMMA= 0
##$GB= 0
##$INTBC= 1
##$INTSCL= 6.047779e-11
##$ISEN= 30
##$LB= 10
##$LEV0= 0
##$LPBIN= 0
##$MAXI= 10000
##$MC2= 0
##$MEAN= 0
##$ME_mod= 0
##$MI= 50
##$NCOEF= 0
##$NC_proc= -10
##$NLEV= 6
##$NOISF1= 182.463
##$NOISF2= 159.3651
##$NSP= 0
##$NTH_PI= 0
##$NZP= 0
##$OFFSET= 248.5645
##$PC= 4
##$PHC0= -13218.54
##$PHC1= 1905.685
##$PH_mod= 1
##$PKNL= yes
##$PPARMOD= 0
##$PSCAL= 0
##$PSIGN= 0
##$REVERSE= no
##$SF= 81.0140089999694
##$SI= 65536
##$SIGF1= 159.3651
##$SIGF2= -187.1042
##$SINO= 113.3802
##$SIOLD= 16384
##$SREGLST= <1H.CDCl3>
##$SSB= 0
##$STSI= 65536
##$STSR= 0
##$SW_p= 40650.406504065
##$SYMM= 0
##$S_DEV= 0
##$TDeff= 32768
##$TDoff= 0
##$TI= <>
##$TILT= no
##$TM1= 0
##$TM2= 0
##$TOPLEV= 0
##$USERP1= <user>
##$USERP2= <user>
##$USERP3= <user>
##$USERP4= <user>
##$USERP5= <user>
##$WDW= 1
##$XDIM= 65536
##$YMAX_p= 531435480
##$YMIN_p= -64354203
$$ End of Bruker specific parameters
$$ ---------------------------------
##NTUPLES= NMR SPECTRUM
##VAR_NAME=  FREQUENCY,     SPECTRUM/REAL,   SPECTRUM/IMAG
##SYMBOL=    X,             R,               I
##VAR_TYPE=  INDEPENDENT,   DEPENDENT,       DEPENDENT
##VAR_FORM=  AFFN,          ASDF,            ASDF
##VAR_DIM=   65536,         65536,           65536
##UNITS=     HZ,            ARBITRARY UNITS, ARBITRARY UNITS
##FACTOR=    0.620285442955139, 1,           1
##FIRST=     20137.2065510682, 0,            0
##LAST=      -20513.1999529968, 0,           0
##MIN=       -20513.1999529968, -64354203,   0
##MAX=       20137.2065510682, 531435480,    0
$$ Real data points
##PAGE= N=1
##DATA TABLE= (X++(R..R)), XYDATA
$$ [...]
43736C2713498J240586J321597J304367J217073J106674J020027R81997R85101
43728D1890920R96733R78651R08838P95939O77828O01957N98425O65627P78964
43719D8893882R11550J045581J165685J245922J248211J137650R04161N73802
43711E7126444K00612j55612m50151o60506p80778q13286p64605o45343m70440
43702E2586335k58804l1099J96148M17807O40995Q74428J112647J328610J482552
43693E8349619J541661J497210J368033J188720R91167P92372N95676M00481K08401
43684F6933340J8865j80482m16251p17273j093253j518820j936065k276130k486473
43675E6327458k547033k468453k278849k010271j690851j342322r81051o21412
$$ y = [32713498, 33954084, 35275681, 36580048, 37797121, 38903795, 39923822, 40905819, 41890920, 42887653, 43866304, 44775142, 45571081, 46248909, 46850866, 47449291, 48114918, 48893882, 49805432, 50851013, 52016698, 53262620, 54510831, 55648481, 56552642, 57126444, 57327056, 57171444, 56721293, 56060787, 55280009, 54466723, 53702118, 53056775, 52586335, 52327531, 52296432, 52492580, 52910387, 53551382, 54425810, 55538457, 56867067, 58349619, 59891280, 61388490, 62756523, 63945243, 64936410, 65728782, 66324458, 66724939, 66933340, 66952205, 66771723, 66355472, 65638199, 64544946, 63026126, 61090061, 58813931, 56327458, 53780425, 51311972, 49033123, 47022852, 45332001, 43989679, 43008628, 42387216]
43667D2387216k79194K8106K84948M82182O18867P01463P42344P57502P61825
43658D6485259P62622P55438P25729O55799N34007L63529J68034r568j18308j18355
43648E0204186l83K04778M33368O12617O91188O58927N43383L86651K20515N6326
43638E4011556j08952k80865m58704o31036p74145q55288q43645p26508n21871
43629D8810542k78125n8266Q4729J28863Q9158N401q0945j46632j91498k27424
43619D8135803k62197k91455l02841k85488k36457j62387p9254j0746J7065j5983
43609D6506060j17179k77922m73950o69689q30114r37546j000182j040980j073143
43600D0085355j083762j040368r13632o96556m07776q1572K45392N43278P92162
$$ y = [42387216, 42108022, 42136128, 42421076, 42903258, 43522125, 44223588, 44965932, 45723434, 46485259, 47247881, 48003319, 48729048, 49384847, 49918854, 50282383, 50450417, 50440849, 50322541, 50204186, 50203803, 50408581, 50841949, 51454566, 52145754, 52804681, 53348064, 53734715, 53955230, 54011556, 53902604, 53621739, 53163035, 52531999, 51757854, 50902566, 50058921, 49332413, 48810542, 48532417, 48474151, 48558880, 48687743, 48776901, 48782302, 48701357, 48554725, 48363227, 48135803, 47873606, 47582151, 47279310, 46993822, 46757365, 46594978, 46515724, 46504978, 46522043, 46506060, 46388881, 46110959, 45637009, 44967320, 44137206, 43199660, 42199478, 41158498, 40085355, 39001593, 37961225, 37047593, 36351037, 35943261, 35861689, 36107081, 36650359, 37442521]
43591C7442521R80359J101825J156207J152092J109547J057593J025863J033773
43583D6059780J081973J150623J207360J223748J192469J133754J084745J077457
43575E5211909J119851J191934J256931J278176J231760J111138R25160O92322
43567F4019181M33106J61819j19220m18526p44210j086640j407523j647287j749807
43558E7440893j688679j477572j160270p90110m12224n5712K65211N46356P89802
43549E3457695J001378J185615J337239J436160J454922J377009J211700R91844
43541F3453562P55425N24571K95145M1272k67819o45333j069402j482150j809233
43532E9796038j990443k004833j878644j674740j469299j324414j267810j290240
$$ y = [37442521, 38422880, 39524705, 40680912, 41833004, 42942551, 44000144, 45026007, 46059780, 47141753, 48292376, 49499736, 50723484, 51915953, 53049707, 54134452, 55211909, 56331760, 57523694, 58780625, 60058801, 61290561, 62401699, 63326859, 64019181, 64452287, 64614106, 64494886, 64076360, 63332150, 62245510, 60837987, 59190700, 57440893, 55752214, 54274642, 53114372, 52324262, 51912038, 51856326, 52121537, 52667893, 53457695, 54459073, 55644688, 56981927, 58418087, 59873009, 61250018, 62461718, 63453562, 64208987, 64733558, 65028703, 65069975, 64802156, 64156823, 63087421, 61605271, 59796038, 57805595, 55800762, 53922118, 52247378, 50778079, 49453665, 48185855, 46895615]
43524D6895615j362033j456708j564273j686513j821105j947500k023688j996634
43516C3037161j823842j496419j049381n51091p9146L00944N45456O35226N78860
43507C0097768M14822K04799J6071r9807j21627o0732M8073J61415K42147K70277
43497C1173206K48580K01196J63585J66109K20001L15782M35257N66131P05001
43488C4194848Q45513R64395J022591R85026Q43132O20093L55018Q1148j84570
43479C9727194m36652o69542q69395j014160j081220j057029r41969p49163n02147
43470C2405917k33495K1873K42487M34230O24501Q35239J056309J243053J340845
43461C7970959J318713J191242J017640Q79251Q46435R50867J174792J458129
$$ y = [46895615, 45533582, 44076874, 42512601, 40826088, 39004983, 37057483, 35033795, 33037161, 31213319, 29716900, 28667519, 28116428, 28037282, 28338226, 28883682, 29518908, 30097768, 30512590, 30717389, 30733460, 30633653, 30512026, 30451294, 30499367, 30660782, 30902929, 31173206, 31421786, 31622982, 31786567, 31952676, 32172677, 32488459, 32923716, 33489847, 34194848, 35040361, 36004756, 37027347, 38012373, 38855505, 39475598, 39830616, 39911764, 39727194, 39290542, 38621000, 37751605, 36737445, 35656225, 34599196, 33657227, 32908064, 32405917, 32172422, 32194295, 32436782, 32871012, 33495513, 34330752, 35387061, 36630114, 37970959, 39289672, 40480914, 41498554, 42377805, 43224240, 44175107, 45349899, 46808028]
43453D6808028J717200J869592J860224J679875J366288R86451O10638K92415
43445E7190711O2215o7659r5280k7848J11405K77779M14294M76238M54539L78586
43435E9174980K95946K44890K37801K61037K85113K77579K14666Q9501q5549k82954
43425F0713010m67565o03906o62672o28191n06406l28619j46165j5957J7225o6272
43415E7304482k58010n28096q35427j134626j378621j522441j533291j402957
43407D8711013j152375q22973m61161j07030K08229M61074O36752P33417P65060
43398D8972006P59720P52203P72416Q32929R23055J016027J086632J125788J139622
43389E7380398J136062J114716J070345J002434R16204Q13112O84190N17331L12475
$$ y = [46808028, 48525228, 50394820, 52255044, 53934919, 55301207, 56287658, 56898296, 57190711, 57252926, 57185267, 57089987, 57062139, 57173544, 57451323, 57865617, 58341855, 58796394, 59174980, 59470926, 59715816, 59953617, 60214654, 60499767, 60777346, 60992012, 61081513, 60995964, 60713010, 60245445, 59641539, 58978867, 58350676, 57844270, 57515651, 57369486, 57353529, 57370754, 57304482, 57046472, 56518376, 55682949, 54548323, 53169702, 51647261, 50113970, 48711013, 47558638, 46735665, 46274504, 46167474, 46375703, 46836777, 47473529, 48206946, 48972006, 49731726, 50483929, 51256345, 52089274, 53012329, 54028356, 55114988, 56240776, 57380398, 58516460, 59631176, 60701521, 61703955, 62620159, 63433271, 64117461, 64634792, 64947267]
43380F4947267Q8784j23776l00475m32588n27171n99254o62648p23614p79386
43371F0887139q21355q40124q28333p79671o87381n46881l62623j52972N3196
43362E5920995K27008L49832M17198M37042M25770M03077L85263L79889L86155
43353E9332229M00323M19473M38905M46863M24419L52915K23468M1284j77097
43344F1902782m09349o29739q07356r06606q97796p76120n74580l56394j88662
43335E6356180j15485j47527k69135m51731o63926q77159j069178j225498j337601
43326E0198940j399178j404537j351695j247530j108886r56957q09211o75221
43318D1245725n56844m48308l35731k01995l8957J42809L18852M68666N90771
$$ y = [64947267, 65036051, 64912275, 64611800, 64179212, 63652041, 63052787, 62390139, 61666525, 60887139, 60065784, 59225660, 58397327, 57617656, 56930275, 56383394, 56020771, 55867799, 55920995, 56148003, 56497835, 56915033, 57352075, 57777845, 58180922, 58566185, 58946074, 59332229, 59732552, 60152025, 60590930, 61037793, 61462212, 61815127, 62038595, 62079879, 61902782, 61493433, 60863694, 60056338, 59149732, 58251936, 57475816, 56901236, 56544842, 56356180, 56240695, 56093168, 55824033, 55372302, 54708376, 53831217, 52762039, 51536541, 50198940, 48799762, 47395225, 46043530, 44796000, 43687114, 42730157, 41920946, 41245725, 40688881, 40240573, 39904842, 39702847, 39663890, 39806699, 40125551, 40594217, 41184988]
43309D1184988P02241Q25561R75261J152666J347744J542743J714789J839167
43301E1285160J896782J884491J819623J730048J633979J526673J387116J198769
43293F4362641R65760P13120M75718K86534J68763J30238J60049K30800L07841
43284F7801464L61711L77205L55147L07536K49785J93831J44404R8369M5792k8384
43274F9906860j41241l05716n22351p73806j026879j241409j380734j419507j348926
43265F1746291j179903r41793o73999m12669j79918J7763J82108L14006M11370
43256E9283256M75400N17426N57633O16295P06736Q35323J004039J209330J438933
43247F6644371J671906J881375K035855K101021K049265J876555J613918J321091
$$ y = [41184988, 41887229, 42712790, 43688051, 44840717, 46188461, 47731204, 49445993, 51285160, 53181942, 55066433, 56886056, 58616104, 60250083, 61776756, 63163872, 64362641, 65328401, 66041521, 66517239, 66803773, 66972536, 67102774, 67262823, 67493623, 67801464, 68163175, 68540380, 68895527, 69203063, 69452848, 69646679, 69791083, 69889452, 69935244, 69906860, 69765619, 69459903, 68937552, 68163746, 67136867, 65895458, 64514724, 63095217, 61746291, 60566388, 59624595, 58950596, 58537927, 58358009, 58375772, 58557880, 58871886, 59283256, 59758656, 60276082, 60833715, 61450010, 62156746, 62992069, 63996108, 65205438, 66644371, 68316277, 70197652, 72233507, 74334528, 76383793, 78260348, 79874266, 81195357]
43239H1195357J064034Q89333Q07797P92473P90537P44217O12047L81839P1787
43230H7349421k78615o24028r29228j177499j366177j493573j549281j517016
43222G8414004j388248j176630r23173o87915n30757m89460n64920p20603q95927
43213G1036371j026296j060267r68558p46783m17306l0954L38161O11194P32166
43204F8467728O89611N18709K83086M7574j44005k76793l57735m00256m12191
43195F8415728l94802l50974k93052k41792k15559k16321k22362j95269j00108
43186F6185489P3434L04214N51521P74507R44077J042866J060520R92004Q39715
43177G2768347O15881L42174M5183k51493n33612p94613j025806j207928j314296
$$ y = [81195357, 82259391, 83148724, 83956521, 84748994, 85539531, 86283748, 86895795, 87277634, 87349421, 87070806, 86446778, 85517550, 84340051, 82973874, 81480301, 79931020, 78414004, 77025756, 75849126, 74925953, 74238038, 73707281, 73217821, 72652901, 71932298, 71036371, 70010075, 68949808, 67981250, 67234467, 66817161, 66786207, 67124368, 67735562, 68467728, 69157339, 69676048, 69959134, 70006708, 69862703, 69585910, 69228175, 68827919, 68415728, 68020926, 67669952, 67376900, 67135108, 66919549, 66703228, 66480866, 66285597, 66185489, 66258923, 66563137, 67114658, 67889165, 68833242, 69876108, 70936628, 71928632, 72768347, 73384228, 73726402, 73771585, 73520092, 72986480, 72191867, 71166061, 69958133, 68643837]
43168F8643837j324705j238151j073765q60952o28912m03317k08128o4437J6473
43159F2857943L8611J6763l5308j11406k07445l12044m05460m68087m89707m73358
43149F0410502m34672l97192l81194l88770l96462l64682k59935p5944J58066
43140E7869717L85384N42629N84764N02324L22653R7404j13697k55925k90654
43131E9644599k07106l0310J84906L78080N14362O01166O75791P71977Q91251
43122F3424716J000619J055689J029080R24336P69839O00791M41620K97777J59241
43113F9703708J1590j52907l30364n08117o71883q10761r15781r74503r69964
43104F4381018q88680p32374n22728k95171q7422O9448J55679J65765J10499J5990
$$ y = [68643837, 67319132, 66080981, 65007216, 64146264, 63517352, 63114035, 62905907, 62841470, 62857943, 62896554, 62913317, 62878009, 62766603, 62559158, 62247114, 61841654, 61373567, 60883860, 60410502, 59975830, 59578638, 59197444, 58808674, 58412212, 58047530, 57787595, 57711651, 57869717, 58255101, 58797730, 59382494, 59884818, 60207471, 60304875, 60191178, 59935253, 59644599, 59437493, 59407183, 59592089, 59970169, 60484531, 61085697, 61761488, 62533465, 63424716, 64425335, 65481024, 66510104, 67434440, 68204279, 68805070, 69246690, 69544467, 69703708, 69715298, 69562391, 69232027, 68723910, 68052027, 67241266, 66325485, 65350982, 64381018, 63492338, 62759964, 62237236, 61942065, 61854643, 61924091, 62079770, 62245535, 62356034, 62372024]
43094F2372024q2462j51386j71952j48867j09371r1146j24921k20318l59814n00939
43084F0410848n85999n59478l90661r3432K67946N94356P85599P78033N67109
43075F1774321K03327k33484o64017j027760j287195j425959j447692j374370
43067E4517171j239939j079247r17167p62665o09064m39432k35357J3257L00299
43058D9547856O00567Q74196J078519J183388J182926J098127R70049Q46885P68377
43049E8150890P51964P87787Q47330R00978R32188R39871R30969R10443Q74134
43040F6026554Q08770P01783N55736L93587K46004J29955L7793n4895j72191l25291
43030F8347805n09275p06729q95074j053827j167073j220321j198401j091508
$$ y = [62372024, 62289562, 62138176, 61966224, 61817357, 61707986, 61616840, 61491919, 61271601, 60911787, 60410848, 59824849, 59265371, 58874710, 58781278, 59049224, 59643580, 60429179, 61207212, 61774321, 61977648, 61744164, 61080147, 60052387, 58765192, 57339233, 55891541, 54517171, 53277232, 52197985, 51280818, 50518153, 49909089, 49469657, 49234300, 49247557, 49547856, 50148423, 51022619, 52101138, 53284526, 54467452, 55565579, 56535628, 57382513, 58150890, 58902854, 59690641, 60537971, 61438949, 62371137, 63311008, 64241977, 65152420, 66026554, 66835324, 67537107, 68092843, 68486430, 68732434, 68862389, 68900182, 68845287, 68673096, 68347805, 67838530, 67131801, 66236727, 65182900, 64015827, 62795506, 61597105, 60505597]
43022F0505597r07038o76301m46911k62346j40851o8587j2584N6510J50048K64385
43012E8461922L93633N38261P03540Q91321J090701J272966J396601J424110J341612
43003F7514667J167100R41756P12315N16340L75554K95987K71512K87246L20139
42994G2402616L38801L08467K03181J8840k22346m78758p02716q53855r08563
42985G0105667q63842p35123n49137l34496j13139J03979L15011N21605P24917
42976F9175442R24960J118371J291425J415562J456544J396219J249700J061784
42968G9090007Q84639P54085O79328O47837O37844O29861O11552N74588N08394
42959H5018135L99165K38326L4421j82851l72331m99297n49761n33052m73375
$$ y = [60505597, 59598559, 58922258, 58475347, 58213001, 58072150, 58003563, 57990979, 58047489, 58197537, 58461922, 58855555, 59393816, 60097356, 60988677, 62079378, 63352344, 64748945, 66173055, 67514667, 68681767, 69623523, 70335838, 70852178, 71227732, 71523719, 71795231, 72082477, 72402616, 72741417, 73049884, 73253065, 73271905, 73049559, 72570801, 71868085, 71014230, 70105667, 69241825, 68506702, 67957565, 67623069, 67509930, 67613909, 67928920, 68450525, 69175442, 70100402, 71218773, 72510198, 73925760, 75382304, 76778523, 78028223, 79090007, 79974646, 80728731, 81408059, 82055896, 82693740, 83323601, 83935153, 84509741, 85018135, 85417300, 85655626, 85690047, 85507196, 85134865, 84635568, 84085807, 83552755, 83079380]
42950H3079380l97166l22044k49778j64656m0257J44859L89954O66486R30787
42941H4037565J146959J302874J407824J475578J506993J485291J387173J201936
42933I4952193R45313O58146L90398J80577M2539l4972p8993j20536j86124k94015
42923I6454526m52825o59952q99934j145225j361179j514334j581283j555579
42915H7284215j450973j299626j144837j029511r83444j013849j103040j214747
42907G8044188j306126j340493j297124j176882j002210q09175o32450m90368
42899F9989360l78595k75063j51355J5214K30938M77854P13073Q79808R27695
42890G2428929Q32061O01700K73173j01220m63660p56956r30606r50537q10670
$$ y = [83079380, 82682214, 82360170, 82110392, 81945736, 81905479, 82050338, 82440292, 83106778, 84037565, 85184524, 86487398, 87895222, 89370800, 90877793, 92363084, 93750257, 94952193, 95897506, 96555652, 96946050, 97126627, 97169166, 97134194, 97055201, 96934665, 96748541, 96454526, 96001701, 95341749, 94441815, 93296590, 91935411, 90421077, 88839794, 87284215, 85833242, 84533616, 83388779, 82359268, 81375824, 80361975, 79258935, 78044188, 76738062, 75397569, 74100445, 72923563, 71921353, 71112178, 70479728, 69989360, 69610765, 69335702, 69184347, 69199561, 69430499, 69908353, 70621426, 71501234, 72428929, 73260990, 73862690, 74135863, 74034643, 73570983, 72814027, 71883421, 70932884, 70122214]
42881G0122214n39116j92103J64662M78768P25088R02896J019844J076067J060715
42872G4819035R62468P85107N56473L24191J39714L9795L7470J28301L04542N61910
42862G8659006Q91120J263412J627089J922096K103043K155613K098694J973896
42854I2693969J827237J689568J565323J438200J290789J122185R48969P91721
42846A03367961O62673N64737M96387M51797M16274L67036K84048J62483J5219
42837A06788615j36192k73071l84887m67267n17406n31328n04268m32745l16756
42828A03224695j62003J6844J93292L30875L92843L56320K22960K0858k01588
42819A04395096l86846m83021m59656l17693q6501J91267M76759P42905R70795
$$ y = [70122214, 69583098, 69390995, 69555657, 70034425, 70759513, 71662409, 72682253, 73758320, 74819035, 75781503, 76566610, 77123083, 77447274, 77586988, 77626783, 77664253, 77792554, 78097096, 78659006, 79550126, 80813538, 82440627, 84362723, 86465766, 88621379, 90720073, 92693969, 94521206, 96210774, 97776097, 99214297, 100505086, 101627271, 102576240, 103367961, 104030634, 104595371, 105091758, 105543555, 105959829, 106326865, 106610913, 106773396, 106788615, 106652423, 106379352, 105994465, 105527198, 105009792, 104478464, 103974196, 103541451, 103224695, 103062692, 103079536, 103272828, 103603703, 103996546, 104352866, 104575826, 104596684, 104395096, 104008250, 103525229, 103065573, 102747880, 102661379, 102852646, 103329405, 104072310, 105043105]
42810A05043105J141226J230665J215937J085063Q47112N34255J93851j25686
42802A11165528l88367n78019o98706p70101q19417q69935r28034r75599r75993
42793A04161357q93695p15584m58620j60112J38763M03742O10879P49434Q26586
42784A04662750Q67281R03300R56479J028135J101313J151806J160322J122180
42776A12953566J053626R91388R81104J056718J221591J442868J662004J814699
42768A23177564J850935J748815J519345J201144Q46784N06129K13480j7181j89248
42759A30857767l16417m14837m96345n63618o08950o18090n77968m83574l39471
42750A26438497j55777N7133K91118N39086P92066J037238J259107J444267J586894
$$ y = [105043105, 106184331, 107414996, 108630933, 109715996, 110563108, 111097363, 111291214, 111165528, 110777161, 110199142, 109500436, 108730335, 107910918, 107040983, 106112949, 105137350, 104161357, 103267662, 102552078, 102093458, 101933346, 102072109, 102475851, 103086730, 103836164, 104662750, 105530031, 106433331, 107389810, 108417945, 109519258, 110671064, 111831386, 112953566, 114007192, 114998580, 115979684, 117036402, 118257993, 119700861, 121362865, 123177564, 125028499, 126777314, 128296659, 129497803, 130344587, 130850716, 131064196, 131047015, 130857767, 130541350, 130126513, 129630168, 129066550, 128457600, 127839510, 127261542, 126777968, 126438497, 126282720, 126339853, 126630971, 127170057, 127962123, 128999361, 130258468, 131702735, 133289629]
42741A33289629J690569J764496J816602J847641J849189J807058J710048J559867
42733A47335099J374362J179792R97764Q38321P04411O01642N42547N40612N98734
42724A54713284P01672Q19482R20959R88978J028721J065835J137622J281202
42716A62657755J521048J858686K268613K702659L101571L410782L596965L659485
42708A84777564L629502L554815L478244L421698L382946L343593L282083L184744
42700B12055189L049397K880094K677648K433269K129852J750070J287320P53775
42692B29016614J79966l94998r35410j413042j801473k070574k192087k155878
42684B18233118j984127j729896j458080j220748j043978r34479q97576r48647
$$ y = [133289629, 134980198, 136744694, 138561296, 140408937, 142258126, 144065184, 145775232, 147335099, 148709461, 149889253, 150887017, 151725338, 152429749, 153031391, 153573938, 154114550, 154713284, 155414956, 156234438, 157155397, 158144375, 159173096, 160238931, 161376553, 162657755, 164178803, 166037489, 168306102, 171008761, 174110332, 177521114, 181118079, 184777564, 188407066, 191961881, 195440125, 198861823, 202244769, 205588362, 208870445, 212055189, 215104586, 217984680, 220662328, 223095597, 225225449, 226975519, 228262839, 229016614, 229196580, 228801582, 227866172, 226453130, 224651657, 222581083, 220388996, 218233118, 216248991, 214519095, 213061015, 211840267, 210796289, 209861810, 208964234, 208015587]
42676B08015587j107359j381158j753958k190013k649545l104825l547210l982851
42668A88298668m422057m870326n325273n776310o201840o565513o820156o923771
42660A41393422o859798o647784o337836n992947n667210n386793n141396m893266
42652I4466392m601463m246344l838547l410905l004490k658035k400349k243518
42644F8062741k180158k188721k243488k321004k399215k453447k455793k381216
42636D9439699k218749j981181j704654j434348j203275j018124q61167p04708
42628C8313493n26603l17525p9431J78165M38174O73241Q47543R26837Q91412
42619D1345306P42760N01156J98298j31016m57139p61021j032047j259023j423677
$$ y = [208015587, 206908228, 205527070, 203773112, 201583099, 198933554, 195828729, 192281519, 188298668, 183876611, 179006285, 173681012, 167904702, 161702862, 155137349, 148317193, 141393422, 134533624, 127885840, 121548004, 115555057, 109887847, 104501054, 99359658, 94466392, 89864929, 85618585, 81780038, 78369133, 75364643, 72706608, 70306259, 68062741, 65882583, 63693862, 61450374, 59129370, 56730155, 54276708, 51820915, 49439699, 47220950, 45239769, 43535115, 42100767, 40897492, 39879368, 39018201, 38313493, 37786890, 37469365, 37389934, 37568099, 38006273, 38679514, 39527057, 40453894, 41345306, 42088066, 42589222, 42787520, 42656504, 42199365, 41438344, 40406297, 39147274, 37723597]
42610C7723597j505041j492275j395612j247563j092817r69957q93006q45264
42602B8282062p92795p08759n88358m42193k76407p9372J73095M98485Q89313
42593B6955071J309075J705335K031346K263043K403333K474562K504414K510535
42585D4156714K489984K420393K274470K039060J725533J365948J000986O68656
42577E8141744L97652K04083R0463M7027N5109R1518J33427J63405J73402J66236
42567E9664066J54115J54607J84764K55150L66791N13049O84509Q72054J064793
42558F3913898J244645J383596J449040J416718J283335J069195Q08356N33460
42550G3102243K64940Q743k38612m79836p06043q94080j018343j069647j063561
$$ y = [37723597, 36218556, 34726281, 33330669, 32083106, 30990289, 30020332, 29127326, 28282062, 27489267, 26780508, 26192150, 25749957, 25473550, 25394178, 25567273, 26065758, 26955071, 28264146, 29969481, 32000827, 34263870, 36667203, 39141765, 41646179, 44156714, 46646698, 49067091, 51341561, 53380621, 55106154, 56472102, 57473088, 58141744, 58539396, 58743479, 58833942, 58880969, 58936078, 59027596, 59161023, 59324428, 59497830, 59664066, 59818181, 59972788, 60157552, 60412702, 60779493, 61292542, 61977051, 62849105, 63913898, 65158543, 66542139, 67991179, 69407897, 70691232, 71760427, 72568783, 73102243, 73367183, 73375926, 73137314, 72657478, 71951435, 71057355, 70039012, 68969365, 67905804]
42541F7905804j029574r92521r63967r46805r42139r50215r68392r90942j009332
42532E9111917j011208r82177r14682q18517p21089o52810o27134o30541o30404
42523E2123355n95072n12097l92833k63035j49284p1059l8896n2597r7308j42970
42513D9808204j53088j00219K1606J94952L86843N60206O83557P37324P16943
42504E2856328O31961N00414L40141J62223k8452k25861m15649n75552o83902
42495E2561651p28797p10213o34626n07859l31336j02921J78203N03984Q51523
42486E1079609J184996J466458J667741J774175J779911J683294J488580J211470
42478F3336234Q81350N36470K13919o0301k76053m36658n52197o33302o87512
$$ y = [67905804, 66876230, 65883709, 64919742, 63972937, 63030798, 62080583, 61112191, 60121249, 59111917, 58100709, 57118532, 56203850, 55385333, 54664244, 54011434, 53384300, 52753759, 52123355, 51528283, 51016186, 50623353, 50360318, 50211034, 50139975, 50101079, 50048482, 49951174, 49808204, 49655116, 49554897, 49576503, 49771455, 50158298, 50718504, 51402061, 52139385, 52856328, 53488289, 53988703, 54328844, 54491067, 54462615, 54236754, 53821105, 53245553, 52561651, 51832854, 51122641, 50488015, 49980156, 49648820, 49545899, 49724102, 50228086, 51079609, 52264605, 53731063, 55398804, 57172979, 58952890, 60636184, 62124764, 63336234, 64217584, 64754054, 64967973, 64907672, 64631619, 64194961, 63642764, 63009462, 62321950]
42469F2321950p17434p20781o93528o34360n45246m26787k74864q5253J36555
42460E8360252L71154N92705P82229R34270J050841J128607J151911J099025R56729
42451F6427723P31495M50065J52327j17070l16046m13284l97343k82523j06165
42442F6129179Q4220K49426L72862M62021N36896O14419O99039P82915Q52843
42433G0783820Q98760R17760R09208Q64496P63818N88212L38172M0211k66067
42424G5838390n48015p90109r90115j149557j266667j333943j340122j276045
42416F7143817j141564r47937p13517m57233j96630M8757K55237L99351M65411
42407F4855692M47417L43121J48386j39937n15167r55953j429990j901475k336531
$$ y = [62321950, 61604516, 60883735, 60190207, 59555847, 59010601, 58583814, 58308950, 58223697, 58360252, 58731406, 59324111, 60106340, 61040610, 62091451, 63220058, 64371969, 65470994, 66427723, 67159218, 67609283, 67761610, 67644540, 67328494, 66915210, 66517867, 66235344, 66129179, 66213399, 66462825, 66835687, 67297708, 67834604, 68449023, 69148062, 69930977, 70783820, 71682580, 72600340, 73509548, 74374044, 75137862, 75726074, 76064246, 76104457, 75838390, 75290375, 74500266, 73510151, 72360594, 71093927, 69759984, 68419862, 67143817, 66002253, 65054316, 64340799, 63883566, 63686936, 63735693, 63990930, 64390281, 64855692, 65303109, 65646230, 65794616, 65654679, 65139512, 64183559, 62753569, 60852094, 58515563]
42398E8515563k706013k987662l167222l237554l196357l044132k783186k419431
42390C4974006j967926j458682r35541m45834k7593K97470N24028O59627P18728
42381C2338283P14356O52163N33470L65812J69954k5492j98618l45970m82509
42372C3721449o30198q02657r94592j181508j329742j411206j413661j339417
42364B4618468j193746r74140o72804k93220J33336N47588Q81492J084466J140674
42355B5272114J069790R14791P26041N49880M23752L73724M10056N22459O80744
42346C0943351Q43421R70301J033293J022658R48478Q36454P17474O13679N27900
42337C8457009M43787L38747K02918N1135q2405j64742j86221j68870j56293j92336
$$ y = [58515563, 55809550, 52821888, 49654666, 46417112, 43220755, 40176623, 37393437, 34974006, 33006080, 31547398, 30611857, 30166023, 30138430, 30435900, 30959928, 31619555, 32338283, 33052639, 33704802, 34238272, 34604084, 34774038, 34748546, 34549928, 34203958, 33721449, 33091251, 32288594, 31294002, 30112494, 28782752, 27371546, 25957885, 24618468, 23424722, 22450582, 21777778, 21484558, 21617894, 22165482, 23046974, 24131440, 25272114, 26341904, 27256695, 27982736, 28532616, 28956368, 29330092, 29740148, 30262607, 30943351, 31786772, 32757073, 33790366, 34813024, 35761502, 36597956, 37315430, 37929109, 38457009, 38900796, 39239543, 39442461, 39493596, 39411191, 39246449, 39060228, 38891358, 38735065, 38542729]
42327C8542729l00870m75610o81899q67204r75951r65441q19809n57653k28983
42318C2669309R9876L69453N49158O46768O98351P43258Q00146Q59635Q95605
42309C8331559Q84145Q18071P12390O00744N23170N08567N60828O57254P58773
42300D4355501Q23768Q18793P25516N45079K98622K2224k42547m58912o02679
42291D6285365o65539o53002n78498m57540l05461j38882K1610J50542K20333
42282D3878928K08484J07178p0075k90250n11187o93860q08747q34591p55207
42273D0230673n61542k60169J17978N17585Q71376J120038J229465J197360J048158
42264D5510922Q20851N56067K87547M0649j64160l09255l85112m00354l85689
$$ y = [38542729, 38241859, 37766249, 37084350, 36217146, 35241195, 34275754, 33455945, 32898292, 32669309, 32769185, 33138638, 33687796, 34334564, 35032915, 35776173, 36576319, 37435954, 38331559, 39215704, 40033775, 40746165, 41346909, 41870079, 42378646, 42939474, 43596728, 44355501, 45179269, 45998062, 46723578, 47268657, 47567279, 47589503, 47346956, 46888044, 46285365, 45619826, 44966824, 44388326, 43930786, 43625325, 43486443, 43508053, 43658595, 43878928, 44087412, 44194590, 44124515, 43834265, 43323078, 42629218, 41820471, 40985880, 40230673, 39669131, 39408962, 39526940, 40044525, 40915901, 42035939, 43265404, 44462764, 45510922, 46331773, 46887840, 47175387, 47216036, 47051876, 46742621, 46357509, 45957155, 45571466]
42255D5571466l82431m19465m95319n80433o38894o52441o28125n86117n40614
42246D0647627m89717m18879l11375j58099L5971K49854M51915O12946P20355
42237D1340598P84025Q29632Q83689R58489J044336J112916J130733J076825R57154
42228E0118397Q09269O92461O62630P41782R02149J079456J206605J241680J172852
42219E8627281J007019P59755M52762J12151k36489n71261q70719j109086j258260
42210E6913153j298266j229346j077186q87277p10282n84787n24900n17596n29935
42201D9553578n22826m66169l49639j84757J606J77449L13379L85403L75122K71814
42191D9554960P8462j81274m62287p08757q73880r37544r10254q20953o98590
$$ y = [45571466, 45189035, 44769570, 44274251, 43693818, 43054924, 42402483, 41774358, 41188241, 40647627, 40157910, 39739031, 39427656, 39269557, 39305528, 39555382, 40007297, 40620243, 41340598, 42124623, 42954255, 43837944, 44796433, 45840769, 46953685, 48084418, 49161243, 50118397, 50927666, 51620127, 52282757, 53024539, 53926688, 55006144, 56212749, 57454429, 58627281, 59634300, 60394055, 60846817, 60958968, 60722479, 60151218, 59280499, 58171413, 56913153, 55614887, 54385541, 53308355, 52421078, 51710796, 51126009, 50601109, 50083513, 49553578, 49030752, 48564583, 48214944, 48030187, 48031793, 48209242, 48522621, 48908024, 49283146, 49554960, 49633422, 49452148, 48989861, 48281104, 47407224, 46469680, 45559426, 44738473, 44039883]
42182D4039883n61491m20219k86391j75279r8186n2456j9521K6979J09505K38439
42172D2801263M09899O08973Q16926J019586J211986J395843J571740J732243
42164E1568459J861615J942534J964638J928696J843903J721356J569102J392122
42156F5792425J196919R97478Q18098O89346O37464O72938P85445R47727J124849
42147G3662689J282856J393369J433917J386448J237708R83638O36018K26155
42139H2242798j99060n89727r10243j153374j342489j519587j725909j985335
42131G2817074k294944k621776k907362l084272l101753k946561k646081k255051
42123E0959274j837177j449598j130842q93111p23025n91932m70310l38951j92797
$$ y = [44039883, 43478392, 43058173, 42771782, 42596503, 42498317, 42445861, 42426340, 42453319, 42562824, 42801263, 43211162, 43820135, 44637061, 45656647, 46868633, 48264476, 49836216, 51568459, 53430074, 55372608, 57337246, 59265942, 61109845, 62831201, 64400303, 65792425, 66989344, 67986822, 68804920, 69494266, 70131730, 70804668, 71590113, 72537840, 73662689, 74945545, 76338914, 77772831, 79159279, 80396987, 81380625, 82016643, 82242798, 82043738, 81454011, 80543768, 79390394, 78047905, 76528318, 74802409, 72817074, 70522130, 67900354, 64992992, 61908720, 58806967, 55860406, 53214325, 50959274, 49122097, 47672499, 46541657, 45648546, 44925521, 44333589, 43863279, 43524328, 43331531]
42114D3331531l6617J25567K99862N01215P39467J003890J260356J464720J582159
42105E0272150J598951J521111J364447J145085Q76338N71329K47273p1440l52349
42096E7172895n58425o57950o37115n06313k95156m1840K14101M34569N86799
42087E5711565O50503O23039N17973L58817J72080j8753j97662l56420m90160
42078E6970982n93193o60474o92480o95353o73462o21430n24579l68206j48322
42069E1993483J22867M18176P01987R40974J116072J230039J305379J373457J461065
42060F0663499J580947J728693J885432K025374K126511K179916K191094K170435
42052G6551901K118725K020657J855143J616433J327658J033192P75859N78672
$$ y = [43331531, 43294914, 43420481, 43720343, 44221558, 44961025, 45964915, 47225271, 48689991, 50272150, 51871101, 53392212, 54756659, 55901744, 56778082, 57349411, 57596684, 57525244, 57172895, 56614470, 55956520, 55319405, 54813092, 54517936, 54476096, 54690197, 55124766, 55711565, 56362068, 56985107, 57503080, 57861897, 58033977, 58015224, 57817562, 57461142, 56970982, 56377789, 55717315, 55024835, 54329482, 53656020, 53034590, 52510011, 52141805, 51993483, 52116350, 52534526, 53236513, 54177487, 55293559, 56523598, 57828977, 59202434, 60663499, 62244446, 63973139, 65858571, 67883945, 70010456, 72190372, 74381466, 76551901, 78670626, 80691283, 82546426, 84162859, 85490517, 86523709, 87299568, 87878240]
42044H7878240M43448L59729L10336K70900K12483J12701l1993k04402l77181
42035H8974261n27561o46093p35451q02008q47034q64338q46336p93064p15322
42026H2197054o28136n40049m48108l43044k19313q0128O6803K16943L70796N28209
42016H1121027O82697Q23916R47592J063833J195132J362731J568250J782076
42008I0547254J947737K002475J903014J641740J246225P67117K64999j98305
42000A00122256n66752q00738q90682q64430p78471o93190o46115o40598o55409
41991I3585871o64788o53223o17672n60875m83383l79425k38543n2261J77664
41982I0113365M34330O86744Q95599J021665J036100R31188P26074M61669J85609
$$ y = [87878240, 88321688, 88681417, 88991753, 89262653, 89475136, 89587837, 89555844, 89351442, 88974261, 88446700, 87800607, 87065156, 86263148, 85416114, 84551776, 83705440, 82912376, 82197054, 81568918, 81028869, 80580761, 80237717, 80018404, 79938276, 80005079, 80222022, 80592818, 81121027, 81803724, 82627640, 83575232, 84639065, 85834197, 87196928, 88765178, 90547254, 92494991, 94497466, 96400480, 98042220, 99288445, 100055562, 100320561, 100122256, 99555504, 98754766, 97864084, 96999654, 96221183, 95527993, 94881878, 94241280, 93585871, 92921083, 92267860, 91650188, 91089313, 90605930, 90226505, 89987962, 89935701, 90113365, 90547695, 91234439, 92130038, 93151703, 94187803, 95118991, 95845065, 96306734, 96492343]
41973I6492343o3757k65166m12709n10219n66516n91505n91408n64673n02546
41964I2423844l95641k42810n6274J39818L16055M46642N18485N37917N30704
41955I4218740N32431N73499O68077Q13440R96910J203164J417941J628595J822581
41946A03875378J984114K091120K116208K033020J825834J499314J085621O44632
41938A17155241K53314j4773j12427l5582J71499M25548O28241O97612N93194
41929A19761867L24148n8899m80339q58795j126712j245530j209824j039564p67430
41920A13298922m28580n5005L26395O92519J021203J290460J481791J584913J600291
41911A20812909J539911J428899J307645J229494J249317J403870J692299K068913
$$ y = [96492343, 96428586, 96163420, 95750711, 95240492, 94673976, 94082471, 93491063, 92926390, 92423844, 92028203, 91785393, 91729119, 91868937, 92184992, 92631634, 93150119, 93688036, 94218740, 94751171, 95324670, 95992747, 96806187, 97803097, 99006261, 100424202, 102052797, 103875378, 105859492, 107950612, 110066820, 112099840, 113925674, 115424988, 116510609, 117155241, 117408555, 117393782, 117281355, 117245773, 117417272, 117842820, 118471061, 119168673, 119761867, 120086015, 120027116, 119546777, 118687982, 117561270, 116315740, 115105916, 114066352, 113298922, 112870342, 112815337, 113141732, 113834251, 114855454, 116145914, 117627705, 119212618, 120812909, 122352820, 123781719, 125089364, 126318858, 127568175, 128972045, 130664344, 132733257]
41903A32733257K455829K771078K957223K995912K904677K723309K499786K280500
41895A54321571K102899J987002J927255J892429J839570J736335J576264J376263
41887A68759588J161351R51127P56760N86212M50645L67267L56337M31980N90484
41878A74411751Q03833J024665J201372J295569J293795J209554J077056R40371
41870A83257966Q41507Q09353Q52085R56983J099640J257447J416779J567808
41862A92059568J692588J758940J727622J568692J276476Q74680M09390o7094
41854B01300862n14850r18317j284311j626286j944922k218638k411219k491652
41846A87890667k453047k318954k134430j948694j799321j703404j655416j629769
$$ y = [132733257, 135189086, 137960164, 140917387, 143913299, 146817976, 149541285, 152041071, 154321571, 156424470, 158411472, 160338727, 162231156, 164070726, 165807061, 167383325, 168759588, 169920939, 170872066, 171628826, 172215038, 172665683, 173032950, 173389287, 173821267, 174411751, 175215584, 176240249, 177441621, 178737190, 180030985, 181240539, 182317595, 183257966, 184099473, 184908826, 185760911, 186717894, 187817534, 189074981, 190491760, 192059568, 193752156, 195511096, 197238718, 198807410, 200083886, 200958566, 201367956, 201300862, 200786012, 199867695, 198583384, 196957098, 195012176, 192793538, 190382319, 187890667, 185437620, 183118666, 180984236, 179035542, 177236221, 175532817, 173877401, 172247632]
41838A72247632j588574j494689j325559j080470p78005m47599j21098J73400
41830A65585038M15401N92276O94806P10842O22677M11224O4833m11747r92509
41821A67692841j632504k277620k876775l388903l781838m028220m105787m003520
41813A41597674l729064l312810k807155k279995j800451j418473j147854r65955
41805A24135917q34265p27382o49493o26861o84380q25319j026893j249447j449574
41796A16062303j591323j655698j647654j594782j533032j485163j446848j391771
41788A03716032j291645j135221r33768p13493n03477l25681j89126q9694j6550
41779I8517377L8524P5847Q9879P4268K4291o3750j92363l59965n57085p64532
$$ y = [172247632, 170659058, 169164369, 167838810, 166758340, 165980335, 165532736, 165411638, 165585038, 166000439, 166592715, 167287521, 167998363, 168621040, 169032264, 169097097, 168685350, 167692841, 166060337, 163782717, 160905942, 157517039, 153735201, 149706981, 145601194, 141597674, 137868610, 134555800, 131748645, 129468650, 127668199, 126249726, 125101872, 124135917, 123301652, 122574270, 121924777, 121297916, 120613536, 119788217, 118761324, 117511877, 116062303, 114470980, 112815282, 111167628, 109572846, 108039814, 106554651, 105107803, 103716032, 102424387, 101289166, 100355398, 99641905, 99138428, 98812747, 98623621, 98533927, 98517377, 98555901, 98631748, 98721627, 98795895, 98820186, 98756436, 98564073, 98204108, 97647023, 96882491]
41769I6882491r55311j100831j179905j186668j132952j044010r50061q77400
41761H8455353q41789q45997q82031r36596r96985j055511j111645j171018j240556
41752G9373225j322102j410041j496061j576737j655330j734399j805974j850009
41744F6522572j844610j780497j668448j534605j407582j305441j228831j162860
41736E4589698j086239r82469q45728o77494m78021k42240L4474L46033O72226
41727E1330240R87048J271025J515070J712367J847595J895659J831950J644668
41719F4035622J338666R29996M39841j04288o62559j181938j606336j891328k011608
41710E9286068j957942j732572j351648q51085k84432K91204Q31466J310488J713234
$$ y = [96882491, 95927180, 94826349, 93646444, 92459776, 91326824, 90282814, 89332753, 88455353, 87613564, 86767567, 85885536, 84948940, 83951955, 82896444, 81784799, 80613781, 79373225, 78051123, 76641082, 75145021, 73568284, 71912954, 70178555, 68372581, 66522572, 64677962, 62897465, 61229017, 59694412, 58286830, 56981389, 55752558, 54589698, 53503459, 52520990, 51675262, 50997768, 50519747, 50277507, 50311981, 50658014, 51330240, 52317288, 53588313, 55103383, 56815750, 58663345, 60559004, 62390954, 64035622, 65374288, 66304284, 66744125, 66639837, 65977278, 64795340, 63189004, 61297676, 59286068, 57328126, 55595554, 54243906, 53392821, 53108389, 53399593, 54231059, 55541547, 57254781]
41701E7254781K023289K217700K273512K181203J955082J633451J269061R15694
41693G1723773O16157L94121K51485J72682J33953J12378R1066O1330K3177j7481
41683G3562641n5611r3353j39092j98996k68100l28993l59882l47471k97467k36898
41673G1236778k06697k47507l83922o12479q98330j183842j405970j512736j470599
41664F3314696j264799r00987m09868J53491P22542J238423J661861J971030K151290
41655F8637679K188254K070842J802506J412331R56472N05064J19237j68748l59613
41646G7164024m72842n24851n15505m31985k65159k4958K55716N29200P47295
41637G6460935Q75435R03135Q47644P48090O50707N90755N79448O01657O24622
$$ y = [57254781, 59278070, 61495770, 63769282, 65950485, 67905567, 69539018, 70808079, 71723773, 72339930, 72734051, 72985536, 73158218, 73292171, 73404549, 73495615, 73556945, 73580122, 73562641, 73507030, 73413677, 73274585, 73075589, 72807489, 72478496, 72118614, 71771143, 71473676, 71236778, 71030081, 70782574, 70398652, 69786173, 68887843, 67704001, 66298031, 64785295, 63314696, 62049897, 61148910, 60739042, 60892533, 61615075, 62853498, 64515359, 66486389, 68637679, 70825933, 72896775, 74699281, 76111612, 77068084, 77573148, 77692385, 77523637, 77164024, 76691182, 76166331, 75650826, 75218841, 74953682, 74928724, 75184440, 75713640, 76460935, 77336370, 78239505, 79087149, 79835239, 80485946, 81076701, 81656149, 82257806, 82882428]
41628H2882428O12998N43835M15957K50348Q1105n9075j51293j93974j97456j76264
41618H4008609j45640j22817j28096j81507k95205m65472o69331q69212j025023
41609H0106306j108373j112181j051975r59570q71619q16019q00722q10300q12476
41600G1763071p70966o57952m61965j90538J31685M68932P83567J046835J248258
41591G3360927J399368J526915J655450J788829J904749J967634J949804J845014
41583H7398690J667328J440517J186237R15907O29130L21068l449l18193n76125
41574I2661110p24690p28952n91009l54853r1455J30224K70592L29932L38868
41565I1239767L37690L55859L99192M49026M74711M53974L88635L05001K39105
$$ y = [82882428, 83495426, 84039261, 84455218, 84705566, 84786671, 84727596, 84576303, 84382329, 84184873, 84008609, 83862969, 83740152, 83612056, 83430549, 83135344, 82669872, 82000541, 81131329, 80106306, 78997933, 77885752, 76833777, 75874207, 75002588, 74186569, 73385847, 72575547, 71763071, 70992105, 70334153, 69872188, 69681650, 69813335, 70282267, 71065834, 72112669, 73360927, 74760295, 76287210, 77942660, 79731489, 81636238, 83603872, 85553676, 87398690, 89066018, 90506535, 91692772, 92608679, 93237809, 93558877, 93555428, 93237235, 92661110, 91936420, 91207468, 90616459, 90261606, 90170151, 90300375, 90570967, 90900899, 91239767, 91577457, 91933316, 92332508, 92781534, 93256245, 93710219, 94098854, 94403855, 94642960]
41556I4642960K17350K44975L07901L84305M56304N14398N55235N79397N92681
41547I8495506O07242O37501O91778P65927Q43758R03881R29105R13138Q60627
41538A05648463P80940O81175N63831M28944K77099J12320n3565j97025k85620
41529A07956562k90043j98615k4099K00341M30780O21649P33316P40174O39354
41520A10809419M55953K39678N0988n8877o4187L1938K08417M42143P16174J015549
41510A13847195J318481J594656J813435J953490K005256J967538J846167J657556
41502A28003774J431645J207766J024047R06070Q59647Q69647R04957R28093R05893
41493A37041539Q18447O66078M74165K91117J73459J60257K51118M04311N58268
$$ y = [94642960, 94860310, 95105285, 95413186, 95797491, 96253795, 96768193, 97323428, 97902825, 98495506, 99102748, 99740249, 100432027, 101197954, 102041712, 102945593, 103874698, 104787836, 105648463, 106429403, 107110578, 107674409, 108103353, 108380452, 108492772, 108439207, 108242182, 107956562, 107666519, 107467904, 107443805, 107644146, 108074926, 108696575, 109429891, 110170065, 110809419, 111265372, 111505050, 111556038, 111497161, 111432974, 111464912, 111673329, 112115472, 112831646, 113847195, 115165676, 116760332, 118573767, 120527257, 122532513, 124500051, 126346218, 128003774, 129435419, 130643185, 131667232, 132573302, 133432949, 134302596, 135207553, 136135646, 137041539, 137859986, 138526064, 139000229, 139291346, 139464805, 139625062, 139876180, 140280491, 140838759]
41484A40838759O62439O97288O73439O15646N45480M72766L97142L15255K28468
41475A45446682J46853Q6465N9885O5748Q6441R8784R1619P6419Q1416J33363
41465A46373675K40712L88900N46994O78738P53718P58437P04815O29112N76983
41456A51652084N80408O40256P25568P90243P97125P35347O21266M83940L46150
41447A57372387K12968P2431r5633l08756n72928q78176j199806j503671j751452
41438A51347364j904764j931596j817300j575008j246566q91189n67979l20645
41430A41092317j68646j06178j09911j52764k15223k86079l53933l99355l95745
41421A38904483l18267j55029Q4310L65419O34084Q29326R01437Q29345O31858
$$ y = [140838759, 141501198, 142198486, 142871925, 143487571, 144033051, 144505817, 144902959, 145218214, 145446682, 145593535, 145680000, 145739885, 145805633, 145892074, 145990858, 146082477, 146158896, 146240312, 146373675, 146614387, 147003287, 147550281, 148229019, 148982737, 149741174, 150445989, 151075101, 151652084, 152232492, 152872748, 153598316, 154388559, 155185684, 155921031, 156542297, 157026237, 157372387, 157585355, 157657786, 157562153, 157253397, 156680469, 155802293, 154602487, 153098816, 151347364, 149442600, 147511004, 145693704, 144118696, 142872130, 141980941, 141412962, 141092317, 140923671, 140817493, 140707582, 140554818, 140339595, 140053516, 139699583, 139300228, 138904483, 138586216, 138431187, 138515497, 138880916, 139515000, 140344326, 141245763, 142075108, 142706966]
41412A42706966L66797J13203n9351j17515o8684N8063K36025M50190O89343R33902
41402A45308939J151737J304394J359730J305404J156994R55409P54484O06032
41394A53903123N48950O02466P61309R94757J254183J488854J662910J765749
41386A62982301J812581J835652J868446J928642K008848K081014K111158K074924
41378A78703566J967099J803552J615436J435457J281521J149249J020684Q82746
41370A89859310P40885O19653N53476N74088O97730R15729J195467J494705J780477
41361A98431520K038167K265874K463244K627361K758450K866958K971749L087339
41353B19510662L209290L310892L355731L316738L187630K982121K727201K456533
$$ y = [142706966, 143073763, 143186966, 143127615, 143010100, 142941416, 142999479, 143235504, 143685694, 144375037, 145308939, 146460676, 147765070, 149124800, 150430204, 151587198, 152542607, 153297091, 153903123, 154452073, 155054539, 155815848, 156810605, 158064788, 159553642, 161216552, 162982301, 164794882, 166630534, 168498980, 170427622, 172436470, 174517484, 176628642, 178703566, 180670665, 182474217, 184089653, 185525110, 186806631, 187955880, 188976564, 189859310, 190600195, 191219848, 191773324, 192347412, 193045142, 193960871, 195156338, 196651043, 198431520, 200469687, 202735561, 205198805, 207826166, 210584616, 213451574, 216423323, 219510662, 222719952, 226030844, 229386575, 232703313, 235890943, 238873064, 241600265, 244056798]
41345B44056798K203469J993302J839824J749623J727726J775301J881059K017467
41337B59244569K146967K231205K236329K138226J934062J654575J362532J131347
41329B74079812J015825J034018J169683J389720J662836J967945K290283K613489
41321B87223611K918891L195014L448455L703944L990607M323382M692630N068452
41313C18564986N415702N708304N932916O082069O147152O121344O010589N840573
41305C65823635N650703N478359N344122N245606N160956N060030M919846M738039
41297D07421296M536873M355174M233022M196773M248879M364078M494266M583812
41289D42434173M590943M503956M342573M145868L957204L814311L743209L751800
$$ y = [244056798, 246260267, 248253569, 250093393, 251843016, 253570742, 255346043, 257227102, 259244569, 261391536, 263622741, 265859070, 267997296, 269931358, 271585933, 272948465, 274079812, 275095637, 276129655, 277299338, 278689058, 280351894, 282319839, 284610122, 287223611, 290142502, 293337516, 296785971, 300489915, 304480522, 308803904, 313496534, 318564986, 323980688, 329688992, 335621908, 341703977, 347851129, 353972473, 359983062, 365823635, 371474338, 376952697, 382296819, 387542425, 392703381, 397763411, 402683257, 407421296, 411958169, 416313343, 420546365, 424743138, 428992017, 433356095, 437850361, 442434173, 447025116, 451529072, 455871645, 460017513, 463974717, 467789028, 471532237, 475284037]
41281D75284037L825470L931711M034628M109546M146987M144791M096327L983952
41273E07557449L782602L473167L058259K568211K050073J546765J082523O63017
41265E25782066K83730o3852l89830p02459j003485j288025j551397j796590k034620
41256E17235538k277596k531947k798216l076160l368085l675494l992007m300191
41248D91215842m575856m795578m941546n003299m979588m880275m724359m533635
41240D52781706m327597m124838l948705l830010l801973l888817m093723m393331
41232D20372712m743700n095949n412447n674168n877522o026141o122750o162780
41224C75257255o131909o011277n790159n477579n102624m702276m306300l929905
$$ y = [475284037, 479109507, 483041218, 487075846, 491185392, 495332379, 499477170, 503573497, 507557449, 511340051, 514813218, 517871477, 520439688, 522489761, 524036526, 525119049, 525782066, 526065796, 526001944, 525612114, 524909655, 523906170, 522618145, 521066748, 519270158, 517235538, 514957942, 512425995, 509627779, 506551619, 503183534, 499508040, 495516033, 491215842, 486639986, 481844408, 476902862, 471899563, 466919975, 462039700, 457315341, 452781706, 448454109, 444329271, 440380566, 436550556, 432748583, 428859766, 424766043, 420372712, 415629012, 410533063, 405120616, 399446448, 393568926, 387542785, 381420035, 375257255, 369125346, 363114069, 357323910, 351846331, 346743707, 342041431, 337735131, 333805226]
41216C33805226l576955l248787k951755k699132k506211k381245k318071k296218
41208C11826852k288936k272925k232629k158596k046210j899460j735573j581265
41200B95611258j458228j367300j284404j172100r98636p52941m49060j20154
41192B88008435J94094M61215O65649Q11476R18690J015432J129053J278911J473057
41183B95956012J708757J975223K258129K546140K836584L134629L444506L759958
41175C17619938M062434M327324M530903M653243M679326M601587M422947M157484
41167C53055186L828745L466722L103258K765508K470670K226105K035118J903122
41159C74854434J837880J842312J905671K002766K105639K200817K298180K423805
$$ y = [333805226, 330228271, 326979484, 324027729, 321328597, 318822386, 316441141, 314123070, 311826852, 309537916, 307264991, 305032362, 302873766, 300827556, 298928096, 297192523, 295611258, 294153030, 292785730, 291501326, 290329226, 289330590, 288577649, 288128589, 288008435, 288202529, 288663744, 289329393, 290140869, 291059559, 292074991, 293204044, 294482955, 295956012, 297664769, 299639992, 301898121, 304444261, 307280845, 310415474, 313859980, 317619938, 321682372, 326009696, 330540599, 335193842, 339873168, 344474755, 348897702, 353055186, 356883931, 360350653, 363453911, 366219419, 368690089, 370916194, 372951312, 374854434, 376692314, 378534626, 380440297, 382443063, 384548702, 386749519, 389047699, 391471504]
41151C91471504K602089K839082L115284L390052L616081L758114L805563L770712
41143D18368481L675100L535432L358508L145510K899888K632828K362447K106676
41135D42084870J874490J662161J457103J246287J024912Q02191O01235M50803
41127D51204052L72097L69253M29793N32401O54353P74210Q70535R19531Q94773
41118D57020998P72398N41911K16057j69536n69817r48977j292055j602843j891453
41109D52076683k161655k407252k619479k798930k962345l138858l358267l639010
41101D28990887l981995m370699m773892n149284n451223n644997n722303n706022
41093C88190472n638042n557667n485811n423784n362938n295247n217692n130268
$$ y = [391471504, 394073593, 396912675, 400027959, 403418011, 407034092, 410792206, 414597769, 418368481, 422043581, 425579013, 428937521, 432083031, 434982919, 437615747, 439978194, 442084870, 443959360, 445621521, 447078624, 448324911, 449349823, 450152014, 450753249, 451204052, 451576149, 451945402, 452375195, 452907596, 453561949, 454336159, 455206694, 456126225, 457020998, 457793396, 458335307, 458551364, 458381828, 457812011, 456863034, 455570979, 453968136, 452076683, 449915028, 447507776, 444888297, 442089367, 439127022, 435988164, 432629897, 428990887, 425008892, 420638193, 415864301, 410715017, 405263794, 399618797, 393896494, 388190472, 382552430, 376994763, 371508952, 366085168, 360722230, 355426983, 350209291, 345079023]
41085C45079023n032389m922701m803002m682048m574604m496097m457226m461755
41077C07649201m506817m583652m677434m765942m818306m797796m672249m429082
41069B70397923m084422l677738l254919k852856k496257k205226k002705j911988
41061B47911812j944253k085479k293819k512134k689911k802102k854047k871382
41053B27858685k883933k914525k975839l069754l183891l288595l343153l313902
41045B02885093l194086l009676k803935k610161k431712k242860k008120j705690
41037A82878853j341260r47911n75252k73090p5270R428n184r3966k31527l96568
41027A78948253n70884p38490q87367j011401j109184j178907j212467j194191
$$ y = [345079023, 340046634, 335123933, 330320931, 325638883, 321064279, 316568182, 312110956, 307649201, 303142384, 298558732, 293881298, 289115356, 284297050, 279499254, 274827005, 270397923, 266313501, 262635763, 259380844, 256527988, 254031731, 251826505, 249823800, 247911812, 245967559, 243882080, 241588261, 239076127, 236386216, 233584114, 230730067, 227858685, 224974752, 222060227, 219084388, 216014634, 212830743, 209542148, 206198995, 202885093, 199691007, 196681331, 193877396, 191267235, 188835523, 186592663, 184584543, 182878853, 181537593, 180589682, 180014430, 179741340, 179666070, 179675498, 179670314, 179576348, 179344821, 178948253, 178377369, 177638879, 176751512, 175740111, 174630927, 173452020, 172239553, 171045362]
41019A71045362j108653r55288p59414n68047m29519l69978l83932m44791n24964
41010A65500776o08678o89796p61602q11851q29130q14477p87066p78335q18521
41001A58601320r24211j092481j301761j517209j699062j812719j837306j769137
40993A46647434j619849j412811j180692r62874p99665p22580p43489q46904r90021
40984A37368549j114087j165298j115536r70979p64067n35801l19617j33896J6287
40975A31265555J31095K06469K29582J83282N7302j41927l90327o54327r01175
40966A29985529j104466j244820j311597j309195j262392j210910j190356j210114
40958A20141679j244538j245803j171237j007901p79851n36311l30450k00998
$$ y = [171045362, 169936709, 168981421, 168222007, 167653960, 167224441, 166854463, 166470531, 166025740, 165500776, 164892098, 164202302, 163440700, 162628849, 161799719, 160985242, 160198176, 159419841, 158601320, 157677109, 156584628, 155282867, 153765658, 152066596, 150253877, 148416571, 146647434, 145027585, 143614774, 142434082, 141471208, 140671543, 139948963, 139205474, 138358570, 137368549, 136254462, 135089164, 133973628, 133002649, 132238582, 131702781, 131383164, 131249268, 131265555, 131396650, 131603119, 131832701, 132015983, 132073285, 131931358, 131541031, 130886704, 129985529, 128881063, 127636243, 126324646, 125015451, 123753059, 122542149, 121351793, 120141679, 118897141, 117651338, 116480101, 115472200, 114692349, 114156038, 113825588, 113624590]
40950A13624590j63298k10565l23261m81457o71955q84418j100942j290851j417758
40941A07080085j454170j393518j253915j072778q93555p48338o45060n66901
40933I9051850m82868l61817j84245M9093L14022N70228P78233R15825R83249
40924A01633570R97326R82764R65427R65161R87138J017533J029928R99957R17697
40915A10496501P89662O31665M59992K87543J26810l453p5025n7869O1943K66908
40905A12984677N11524P46414R44787J108767J251552J373630J454299J463501
40897A21839151J382211J216772J000564P84499O21726N52944N97663P52631R94803
40888A29742964J286668J584593J850874K065585K231660K369768K505902K657709
$$ y = [113624590, 113461292, 113250727, 112927466, 112446009, 111774054, 110889636, 109788694, 108497843, 107080085, 105625915, 104232397, 102978482, 101905704, 101012149, 100263811, 99618751, 99051850, 98568982, 98207165, 98022920, 98072013, 98386035, 98956263, 99734496, 100650321, 101633570, 102630896, 103613660, 104579087, 105544248, 106531386, 107548919, 108578847, 109578804, 110496501, 111286163, 111917828, 112377820, 112665363, 112792173, 112788720, 112713695, 112655826, 112717769, 112984677, 113496201, 114242615, 115187402, 116296169, 117547721, 118921351, 120375650, 121839151, 123221362, 124438134, 125438698, 126223197, 126844923, 127397867, 127995530, 128748161, 129742964, 131029632, 132614225, 134465099, 136530684, 138762344, 141132112, 143638014, 146295723]
40880A46295723K825310K991115L130242L226716L284603L325078L370869L428614
40872A71878270L480381L489546L419260L255206L019714K766831K560191K448182
40864A96317581K451485K566325K775518L057426L388065L737092M062565M311489
40856B22667546M430927M387374M184636L868874L515194L200768K978192K862989
40848B52096500K838995K873268K929467K975896K990483K963500K895538K790922
40840B75354569K652053K480108K281160K071489J876547J722898J627813J593431
40832B91660068J609673J663658J748817J868027K029565K237907K483524K737820
40824C08039059K958424L103580L146765L082953K925697K701330K445317K200322
$$ y = [146295723, 149121033, 152112148, 155242390, 158469106, 161753709, 165078787, 168449656, 171878270, 175358651, 178848197, 182267457, 185522663, 188542377, 191309208, 193869399, 196317581, 198769066, 201335391, 204110909, 207168335, 210556400, 214293492, 218356057, 222667546, 227098473, 231485847, 235670483, 239539357, 243054551, 246255319, 249233511, 252096500, 254935495, 257808763, 260738230, 263714126, 266704609, 269668109, 272563647, 275354569, 278006622, 280486730, 282767890, 284839379, 286715926, 288438824, 290066637, 291660068, 293269741, 294933399, 296682216, 298550243, 300579808, 302817715, 305301239, 308039059, 310997483, 314101063, 317247828, 320330781, 323256478, 325957808, 328403125, 330603447]
40816C30603447K012344J922355J953808K099708K316548K532960K674305K692052
40808C48807527K579823K365777K089465J782366J463641J146193Q42044N64198
40800C61641034L28713J56016O4659N7393J11203J82424K23923K01335J00385
40791C63067085p2282k90665n14842p03200q28823q91779r20519r62056j066072
40782C56816847j269217j583833j993073k453376k904019l281039l531375l624270
40774C36176645l558746l365727l102369k838626k640472k555379k603205k773679
40766C12738442l031499l327786l612703l844270l993245m046589m007899l890868
40758B82983583l707693l461866l152013k782656k371899j951346j561055j243664
$$ y = [330603447, 332615791, 334538146, 336491954, 338591662, 340908210, 343441170, 346115475, 348807527, 351387350, 353753127, 355842592, 357624958, 359088599, 360234792, 361076836, 361641034, 361969747, 362125763, 362190422, 362247815, 362359018, 362541442, 362765365, 362966700, 363067085, 362994803, 362704138, 362189296, 361486096, 360657273, 359765494, 358844975, 357882919, 356816847, 355547630, 353963797, 351970724, 349517348, 346613329, 343332290, 339800915, 336176645, 332617899, 329252172, 326149803, 323311177, 320670705, 318115326, 315512121, 312738442, 309706943, 306379157, 302766454, 298922184, 294928939, 290882350, 286874451, 282983583, 279275890, 275814024, 272662011, 269879355, 267507456, 265556110, 263995055, 262751391]
40750B62751391j038315r73052j056110j269477j569921j901010k212867k479007
40742B50251632k700043k893907l081881l278967l489109l702379l895223m037372
40734B23172751m103587m082118l974655l792111l553428l286623l023748k786724
40726A94569757k573697k359143k109403j801910j435362j028632o14596k34072
40718A82412942P0320K62258L20708K45992N9450k03093n00617p94693j054382
40709A80818885j259289j401191j482695j512437j500178j455339j387866j306724
40701A69513166j215298j109580r84683q46422p17657o32213o20010o94708q52336
40692A61840259j078732j355247j656023j942560k167695k291469k296417k188498
$$ y = [262751391, 261713076, 260740024, 259683914, 258414437, 256844516, 254943506, 252730639, 250251632, 247551589, 244657682, 241575801, 238296834, 234807725, 231105346, 227210123, 223172751, 219069164, 214987046, 211012391, 207220280, 203666852, 200380229, 197356481, 194569757, 191996060, 189636917, 187527514, 185725604, 184290242, 183261610, 182647014, 182412942, 182483262, 182745520, 183066228, 183312220, 183371670, 183168577, 182667960, 181873267, 180818885, 179559596, 178158405, 176675710, 175163273, 173663095, 172207756, 170819890, 169513166, 168297868, 167188288, 166203605, 165357183, 164639526, 164007313, 163387303, 162692595, 161840259, 160761527, 159406280, 157750257, 155807697, 153640002, 151348533, 149052116, 146863618]
40684A46863618j985243j704837j364608r84661n89545k07212J33247M07739O08183
40675A41176681P50180Q66339R85571J112026J217506J251089J161033R20712
40667A49441137N47399J03010l25611o56378q35975q49112p13995m70450j67356
40658A46072669J46764M30859O59272Q29994R66590J107598J286314J511798J761485
40649A54773343J988022K135879K159844K039032J784140J438177J068419P45858
40641A68132714N16111L78457K90309J96549O2925j08977k90690m47671n55269
40632A68174458o01373n79248m81683l04064n2450K54175N90929R34815J264425
40623A69199984J554544J775425J899669J910531J806373J602254J329725J031677
$$ y = [146863618, 144878375, 143173538, 141808930, 140824269, 140234724, 140027512, 140160759, 140568498, 141176681, 141926861, 142793200, 143778771, 144890797, 146108303, 147359392, 148520425, 149441137, 149988536, 150091546, 149765935, 149109557, 148273582, 147424470, 146710475, 146240025, 146072669, 146219433, 146650292, 147309564, 148139558, 149106148, 150213746, 151500060, 153011858, 154773343, 156761365, 158897244, 161057088, 163096120, 164880260, 166318437, 167386856, 168132714, 168648825, 169027282, 169317591, 169514140, 169577065, 169468088, 169177398, 168729727, 168174458, 167573085, 166993837, 166512154, 166208090, 166155640, 166409815, 167000744, 167935559, 169199984, 170754528, 172529953, 174429622, 176340153, 178146526, 179748780, 181078505, 182110182]
40615A82110182P50899N18444L50114K51638K25192K70775L83290N50549P56159
40606A86167242R86937J240557J526978J859869K241602K652320L051994L394847
40598B03122346L646441L793614L844305L820402L747616L644810L515778L348301
40590B32483613L123893K834270K493883K139119J815238J561016J399836J337192
40582B49188060J360406J440366J539140J622859J671892J681378J654902J600680
40574B61759683J534645J485041J489192J579399J764817K021772K301311K551137
40566B76486997K737932K856028K919564K947624K953380K941027K907431K845046
40558B99595029K745589K605339K431299K244711K078072J965037J928157J971384
$$ y = [182110182, 182861081, 183379525, 183729639, 183981277, 184206469, 184477244, 184860534, 185411083, 186167242, 187154179, 188394736, 189921714, 191781583, 194023185, 196675505, 199727499, 203122346, 206768787, 210562401, 214406706, 218227108, 221974724, 225619534, 229135312, 232483613, 235607506, 238441776, 240935659, 243074778, 244890016, 246451032, 247850868, 249188060, 250548466, 251988832, 253527972, 255150831, 256822723, 258504101, 260159003, 261759683, 263294328, 264779369, 266268561, 267847960, 269612777, 271634549, 273935860, 276486997, 279224929, 282080957, 285000521, 287948145, 290901525, 293842552, 296749983, 299595029, 302340618, 304945957, 307377256, 309621967, 311700039, 313665076, 315593233, 317564617]
40550C17564617K080668K230508K392174K539585K649657K696925K648596K469893
40542C37272623K142172J682657J149142O23458J83184j22368k81546l14729k59754
40533C42074839j56249l4522Q8640K07450L19573M17856M88209N17628N07248
40524C44430672M78424M64115M90081N58578O44457P04502O93640N79905L52667
40515C49397041K2921l82442q29522j286633j730232k144600k516753k833074
40507C37696706l082744l264994l391724l480880l545375l586798l598503l574509
40499C10171179l516297l432544l333714l227909l122109l026431k956005k928053
40491B84628117k956530l046855l191336l367193l541652l685064l783457l838727
$$ y = [317564617, 319645285, 321875793, 324267967, 326807552, 329457209, 332154134, 334802730, 337272623, 339414795, 341097452, 342246594, 342870052, 343053236, 342930868, 342649322, 342334593, 342074839, 341918590, 341884068, 341972708, 342180158, 342499731, 342917587, 343405796, 343923424, 344430672, 344909096, 345373211, 345863292, 346421870, 347066327, 347770829, 348464469, 349044374, 349397041, 349419962, 349037520, 348207998, 346921365, 345191133, 343046533, 340529780, 337696706, 334613962, 331348968, 327957244, 324476364, 320930989, 317344191, 313745688, 310171179, 306654882, 303222338, 299888624, 296660715, 293538606, 290512175, 287556170, 284628117, 281671587, 278624732, 275433396, 272066203, 268524551, 264839487, 261056030, 257217303]
40483B57217303l855364l827267l739351l583645l374836l151402k961633k844446
40475B29879359k814780k858054k934808k994546k994412k914737k764435k574786
40467B07028801k385797k231542k129912k079252k061331k048417k012804j937417
40459A90142329j823310j687834j551787j424305j298402j161004j007614q48730
40451A79339343p05289n99940n50709n68209o55565q11343j033978j322874j673183
40442A71418253k067645k472350k840339l121795l277399l290202l170309k948888
40434A48229326k665187k355739k051484j779504j562395j413632j333898j312570
40426A33754917j332702j375141j420194j448572j443005j389362j276247j094901
$$ y = [257217303, 253361939, 249534672, 245795321, 242211676, 238836840, 235685438, 232723805, 229879359, 227064579, 224206525, 221271717, 218277171, 215282759, 212368022, 209603587, 207028801, 204643004, 202411462, 200281550, 198202298, 196140967, 194092550, 192079746, 190142329, 188319019, 186631185, 185079398, 183655093, 182356691, 181195687, 180188073, 179339343, 178634054, 178034114, 177483405, 176915196, 176259631, 175448288, 174414310, 173091436, 171418253, 169350608, 166878258, 164037919, 160916124, 157638725, 154348523, 151178214, 148229326, 145564139, 143208400, 141156916, 139377412, 137815017, 136401385, 135067487, 133754917, 132422215, 131047074, 129626880, 128178308, 126735303, 125345941, 124069694, 122974793]
40418A22974793q42454n28769j81816J54758M33226O16341O85679O40300M90707
40409A24442765K55762l5856l45263o29391q51283r87284j026738r67488q13536
40400A19041688n77239k83321K9284L09494N01102N55890M51133K03682j29959
40391A20101754m71485p48447r17071r69847r26977q18134o64085m67962k21405
40382A13896341P9484M21070P71449J089673J336590J483238J517555J447971
40374A22043371J299774J105739Q99064P12390N76202N10108N12831N63057O32211
40365A28854747O95973P33730P21242O30841M44573J70456j53012m69885p29398
40356A30899267r03370r88519r96314r42500q45572p31781o35567n88564o03034
$$ y = [122974793, 122132339, 121603570, 121421754, 121576512, 122009738, 122626079, 123311758, 123952058, 124442765, 124698527, 124662671, 124317408, 123688017, 122836734, 121849450, 120822712, 119855224, 119041688, 118464449, 118181128, 118210412, 118519906, 119021008, 119576898, 120028031, 120231713, 120101754, 119630269, 118881822, 117964751, 116994904, 116067927, 115249793, 114585708, 114117746, 113896341, 113975825, 114396895, 115168344, 116258017, 117594607, 119077845, 120595400, 122043371, 123343145, 124448884, 125347948, 126060338, 126636540, 127146648, 127659479, 128222536, 128854747, 129550720, 130284450, 131005692, 131636533, 132081106, 132251562, 132098550, 131628665, 130899267, 129995897, 129007378, 128011064, 127068564, 126222992, 125491211, 124855644, 124267080, 123664046]
40347A23664046o63428p34628p81857p88241p59539p16602o84107o82081p20503
40338A17133060p94862q84525r58981r92821r81670r47511r29047r64362j077158
40329A08602123j271684j533495j832449k128356k380507k558725k651057k664809
40321I1581041k620412k539941k435321k302965k128643j898470j608265j266465
40313G4780559q91426n06336j35072J98615M69517O51906P26275O87690N48105
40304G6529833L31602O8760k05894m56856o54178p79623q27117p99029p04536
40295G2502962n61154l93645k25953o9927Q0501K43953M36966O58943Q86571J081898
40285G4641115J208901J248011J200196J079878R03477O82169M22323J29856j86874
$$ y = [123664046, 123000618, 122265990, 121484133, 120695892, 119936353, 119219751, 118535644, 117853563, 117133060, 116338198, 115453673, 114494692, 113501871, 112520201, 111572690, 110643643, 109679281, 108602123, 107330439, 105796944, 103964495, 101836139, 99455632, 96896907, 94245850, 91581041, 88960629, 86420688, 83985367, 81682402, 79553759, 77655289, 76047024, 74780559, 73889133, 73382797, 73247725, 73446340, 73915857, 74567763, 75294038, 75981728, 76529833, 76861435, 76930195, 76724301, 76267445, 75613267, 74833644, 74006527, 73207498, 72502962, 71941808, 71548163, 71322210, 71252283, 71332784, 71576737, 72013703, 72672646, 73559217, 74641115, 75850016, 77098027, 78298223, 79378101, 80281578, 80963747, 81386070, 81515926, 81329052]
40276H1329052n16120q40784j136635j376140j539091j622260j639746j614301
40268G1043975j566532j507095j433620j333579j192256j000339p55851m62873
40260F1791830j33600K07083N23829P84615R77327J114808J223604J325435J425108
40251F9240039J512254J573094J601277J599772J575350J533849J480207J419542
40243H1535384J354604J281732J191336J074533R30304P66008N89624M00498J88768
40234H9312791n2718l13050n60148p56547q83246r52367r98168j053301j127340
40225H2615906j201866j243921j226996j144973j012418q55992p05275n85693
40217G4638772n11720m80875m73206m58921m10675l13901j70243O953K02175M05510
$$ y = [81329052, 80812932, 79972148, 78835513, 77459373, 75920282, 74298022, 72658276, 71043975, 69477443, 67970348, 66536728, 65203149, 64010893, 63010554, 62254703, 61791830, 61658230, 61865313, 62389142, 63173757, 64151084, 65265892, 66489496, 67814931, 69240039, 70752293, 72325387, 73926664, 75526436, 77101786, 78635635, 80115842, 81535384, 82889988, 84171720, 85363056, 86437589, 87367893, 88133901, 88723525, 89124023, 89312791, 89260073, 88947023, 88386875, 87630328, 86747082, 85794715, 84796547, 83743246, 82615906, 81414040, 80170119, 78943123, 77798150, 76785732, 75929740, 75224465, 74638772, 74127052, 73646177, 73172971, 72714050, 72303375, 71989474, 71819231, 71826184, 72028359, 72433869]
40207G2433869O11987Q12407R84507J094522J110406J017196Q23196N53760K39185
40198G9681035r3184m18272p08637r35070j075994j128146j107444j038518r44449
40189G2231321q47351p75130p59702q21235r51343j111404j247631j310358j266626
40180F3140541j104625q32213m70819m7931M05437Q50654J238930J520101J661878
40171F6361953J667127J576253J451244J348599J294849J278137J260622J202912
40163G7441696J083892R04856O80537M28477J65138r2196l24493n14837o54085
40154G9118985p42139p83059p78608p26253o22721m69649k77590o6413J38488
40145G4791041L13627M45864N37783O07294O80894P81631R15346J062369J182084
$$ y = [72433869, 73045856, 73858263, 74842770, 75937292, 77047698, 78064894, 78888090, 79441850, 79681035, 79587851, 79169579, 78460942, 77525872, 76449878, 75321732, 74214288, 73175770, 72231321, 71383970, 70608840, 69849138, 69027903, 68076560, 66965156, 65717525, 64407167, 63140541, 62035916, 61203703, 60732884, 60684953, 61090390, 61941044, 63179974, 64700075, 66361953, 68029080, 69605333, 71056577, 72405176, 73700025, 74978162, 76238784, 77441696, 78525588, 79430444, 80110981, 80539458, 80704596, 80612400, 80287907, 79773070, 79118985, 78376846, 77593787, 76815179, 76088926, 75466205, 74996556, 74718966, 74652553, 74791041, 75104668, 75550532, 76088315, 76695609, 77376503, 78158134, 79073480, 80135849, 81317933]
40136H1317933J230575J181632J038540Q30757N99426L80218J91490L2736j06027
40127H6697280k29615l27878l78786l63065k79922j51948j5068R9400J77633K22394
40117H5450425K41504K37584K07954J52163P7364l641p8051j36439j72315j79480
40107H5797068j48799o7304P5717K75967N04401P11308Q43000Q58711P39118M89105
40097I0078292J39172k57754o39538r54763j178654j317161j399403j462720j536438
40088H1471033j632018j744874j863930j978097k074276k132974k131174k052904
40080F5860786j898456j684311j435266j176425r29849p13401n37317l99844k88494
40071E6797423j90186j03518m2218k6390o9128j69477l15818m94856o97533r16293
$$ y = [81317933, 82548508, 83730140, 84768680, 85599437, 86198863, 86579081, 86770571, 86803307, 86697280, 86467665, 86139787, 85761001, 85397936, 85118014, 84966066, 84950998, 85050398, 85228031, 85450425, 85691929, 85929513, 86137467, 86289630, 86366994, 86363353, 86285302, 86148863, 85976548, 85797068, 85648269, 85580965, 85656682, 85932649, 86437050, 87148358, 87991358, 88850069, 89589187, 90078292, 90217464, 89959710, 89320172, 88365409, 87186755, 85869594, 84470191, 83007471, 81471033, 79839015, 78094141, 76230211, 74252114, 72177838, 70044864, 67913690, 65860786, 63962330, 62278019, 60842753, 59666328, 58736479, 58023078, 57485761, 57085917, 56797423, 56607237, 56503719, 56461501, 56435111, 56365983, 56196506, 55880688, 55385832, 54688299, 53772006]
40061E3772006j135647j324973j442030j447032j318074j058307o92782k59569
40053D5093592J99945O49306J062835J427354J738294J991548K176204K274487
40045E6613565K270593K162544J967832J718902J452894J202549R90621Q26218
40037F9205718P02762O00004M91724L56731J88694R45j75970l04061l51582l03751
40027G0411214j65112M5158K98217N57429P81519R34919J001701R91032R27448
40018G5783525Q34019P23191O00626M73710L54470K55552J85315J46837J40252
40009G9497497J64962K19295K98125L90997M82691N55334N90236N70432M87040
40000H3256609L48731J87886N6739J3361J02853L40034O99521J119059J517956
$$ y = [53772006, 52636359, 51311386, 49869356, 48422324, 47104250, 46045943, 45353161, 45093592, 45293537, 45942843, 47005678, 48433032, 50171326, 52162874, 54339078, 56613565, 58884158, 61046702, 63014534, 64733436, 66186330, 67388879, 68379500, 69205718, 69908480, 70508484, 71000208, 71356939, 71545633, 71546578, 71370608, 71066547, 70714965, 70411214, 70246102, 70291260, 70589477, 71146906, 71928425, 72863344, 73865045, 74856077, 75783525, 76617544, 77340735, 77941361, 78415071, 78769541, 79025093, 79210408, 79357245, 79497497, 79662459, 79881754, 80179879, 80570876, 81053567, 81608901, 82199137, 82769569, 83256609, 83605340, 83793226, 83849965, 83863326, 83966179, 84306213, 85005734, 86124793, 87642749]
39991H7642749J823380J990951K010332J897511J682263J398388J079328P57833
39983A00282735M65761K30358O7071k5925o6038p7874q4731j05494j55396k44899
39973A00285568l75034n35206p09638q89225j077134j280732j496444j702348
39965I2219807j866019j960859j977740j925021j820034j679581j515055j333502
39957G8141996j142092r51644p75900o27124n11706m29516l77491l54749l65212
39948G2606562m15144n05995o26477p49471q38012q59528q00977o74326n06476
39939F6630156l19605j17526J09522L64765O27301Q53880J000482J046482J001720
39930G1197177Q91571P34310N31286K77497j9628l33076o28004q80772j087517
$$ y = [87642749, 89466129, 91457080, 93467412, 95364923, 97047186, 98445574, 99524902, 100282735, 100748496, 100978854, 101045925, 101020000, 100953962, 100876088, 100791357, 100685863, 100530467, 100285568, 99910534, 99375328, 98665690, 97776465, 96699331, 95418599, 93922155, 92219807, 90353788, 88392929, 86415189, 84490168, 82670134, 80990553, 79475498, 78141996, 76999904, 76048260, 75272360, 74645236, 74133530, 73704014, 73326523, 72971774, 72606562, 72191418, 71685423, 71058946, 70309475, 69471463, 68611935, 67810958, 67136632, 66630156, 66310551, 66193025, 66302547, 66667312, 67294613, 68148493, 69148975, 70195457, 71197177, 72088748, 72823058, 73354344, 73631841, 73612213, 73279137, 72651133, 71770361, 70682844]
39921G0682844j256159j391061j483584j514290j463162j320545j093391q04962
39913F0355690m89652j85744P2097K60119L71182M15621M15473L94473L69114
39904F1978373L44625L16417K76375K22684J68456J40746J64592K39150L24744
39895F4176162L56279K78870Q2044j91555m67142o71732p60098p23241n82932
39886F1496655l79577j57988M6341K16565L54923M73850N84060O88929P88422
39877F4112180Q85832R87104J091461J183336J236176J227318J152135J026531
39869G2902073Q76517P23035N72201M16575K45085N3941j48645l45617n19084
39860G4776081o59104p69802q69669r83645j129046j302991j481130j631679j736729
$$ y = [70682844, 69426685, 68035624, 66552040, 65037750, 63574588, 62254043, 61160652, 60355690, 59866038, 59680294, 59752391, 60012510, 60383692, 60799313, 61214786, 61609259, 61978373, 62322998, 62639415, 62915790, 63138474, 63306930, 63447676, 63612268, 63851418, 64176162, 64532441, 64811311, 64893355, 64701800, 64234658, 63562926, 62802828, 62079587, 61496655, 61117078, 60959090, 61005431, 61221996, 61576919, 62050769, 62634829, 63323758, 64112180, 64998012, 65985116, 67076577, 68259913, 69496089, 70723407, 71875542, 72902073, 73778590, 74501625, 75073826, 75490401, 75735486, 75789427, 75640782, 75295165, 74776081, 74116977, 73347175, 72477506, 71493861, 70364815, 69061824, 67580694, 65949015, 64212286]
39851F4212286j804332j859718j921559j983026k013059j975159j848326j637143
39843D9169964j367693j073435p79027m92563k11979O0286L07837N04013O24473
39834D6741876O59619O20999N38870M49706L77935L23336K63494J69085K0387
39825E0165307j84093m27246o77270q93017j030789j052984r37580o85122l19705
39816D3957501J15985N67961R77668J289279J459280J466358J317096J045050
39808E2196178P03637L54168N1467j67835k89200l15844k61361j45127P663J64689
39798E2298435K89631L52276L40423K63377J43257K549j40091k64839l47068l63530
39788E2574420l04657j83310l4592R2104J46089R0597q4458l58301o86374j014801
$$ y = [64212286, 62407954, 60548236, 58626677, 56643651, 54630592, 52655433, 50807107, 49169964, 47802271, 46728836, 45949809, 45457246, 45245267, 45305553, 45613390, 46117403, 46741876, 47401495, 48022494, 48561364, 49011070, 49389005, 49712341, 49975835, 50144920, 50165307, 49981214, 49553968, 48876698, 47983681, 46952892, 45899908, 44962328, 44277206, 43957501, 44073486, 44641447, 45619115, 46908394, 48367674, 49834032, 51151128, 52196178, 52899815, 53253983, 53305450, 53137615, 52848415, 52532571, 52271210, 52126083, 52133746, 52298435, 52588066, 52940342, 53280765, 53544142, 53687399, 53689948, 53549857, 53285018, 52937950, 52574420, 52269763, 52086453, 52051861, 52143965, 52290054, 52380651, 52296193, 51937892, 51251518, 50236717]
39778E0236717j294636j490079j580312j558360j429896j212195r32355o24554
39770D0114330l26222p2325J11975K17333K51762K37607K05599J86590K01801
39761D1128450K55475L34282M12904M61765M54966L78702K36523M4890j79975
39752D3527982m32055p12198j015814j325002j611638j846411k006189k076814
39744C2501861k051254j924292j688963j342633r02560m17288M2345M12799O68216
39735B5298231Q28958R43264J057794J197974J366516J553071J742874J918589
39727C5907271K057862K132499K113351J980288J731944J388748R87802N75165
39719D8874930K01405q1531k29520k23226q2721J33320L46850M87740N14971M23990
$$ y = [50236717, 48942081, 47452002, 45871690, 44313330, 42883434, 41671239, 40738884, 40114330, 39788108, 39715783, 39827758, 40045091, 40296853, 40534460, 40740059, 40926649, 41128450, 41383925, 41718207, 42131111, 42592876, 43047842, 43426544, 43663067, 43707957, 43527982, 43095927, 42383729, 41367915, 40042913, 38431275, 36584864, 34578675, 32501861, 30450607, 28526315, 26837352, 25494719, 24592159, 24174871, 24217216, 24630015, 25298231, 26127189, 27070453, 28128247, 29326221, 30692737, 32245808, 33988682, 35907271, 37965133, 40097632, 42210983, 44191271, 45923215, 47311963, 48299765, 48874930, 49076335, 48994804, 48765284, 48542058, 48459337, 48592657, 48939507, 49427247, 49942218, 50366208]
39709E0366208K41457J3927k03113l53492l89124k83558m7644K64781N72825Q03173
39699E0985440R23252R50500R32371R13228R11415R17951R10936Q71455P91796
39690E9108344O75837N35914L88788K50931J33854M1786k7179p8393j19594j61706
39680F0748582k18260l00783m11969n41961o71342p78605q45952q59653q07393
39671E5312664o78630m70522j95606J15391M19149O72040Q43955R27824R40185
39662E7886450R12028Q74871Q50078Q46455Q63731Q95466R28087R39829R05134
39653F5902129Q04382O32118L97962J21763j72127m60179p26462r68147j192682
39644F4338757j404917j594130j733150j790452j745052j594381j353330j048154
$$ y = [50366208, 50607665, 50621592, 50418479, 50064987, 49675863, 49392305, 49344661, 49609442, 50182267, 50985440, 51908692, 52859192, 53791563, 54704791, 55616206, 56534157, 57445093, 58316548, 59108344, 59784181, 60320095, 60708883, 60959814, 61093668, 61135454, 61108275, 61029882, 60910288, 60748582, 60530322, 60229539, 59817570, 59275609, 58604267, 57825662, 56979710, 56120057, 55312664, 54634034, 54163512, 53967906, 54083297, 54502446, 55174486, 56018441, 56946265, 57886450, 58798478, 59673349, 60523427, 61369882, 62233613, 63129079, 64057166, 64996995, 65902129, 66706511, 67338629, 67736591, 67858354, 67686227, 67226048, 66499586, 65531439, 64338757, 62933840, 61339710, 59606560, 57816108, 56071056, 54476675, 53123345, 52075191]
39636E2075191p09651l69617o1822J76762L11014L20211K11011K2199j82798l34611
39626E1457889l82391l13132j53506M8490K49555M26947N76389O98604P87150
39617E3395995Q26299P99671P02276N45704L52078J43355o3213k50498l95752
39608E6055915m73127m65795l79862k49770j29115o9519r8500k08606l63125n13750
39598E3104746o20768o67356o63070o36025o18412o34010o94707q05425r69261
39589D6795712j184011j429859j659360j803709j797433j607047j244331p57492
39581C5312470k10678L32835Q17277J195152J429343J498859J404510J168755
39573D2948523Q27917M21342j5453m50721q52939j189038j426945j541416j520349
$$ y = [52075191, 51365540, 50995923, 50934101, 51110863, 51421877, 51742088, 51953099, 51975298, 51792500, 51457889, 51075498, 50762366, 50608860, 50657350, 50906905, 51333852, 51910241, 52608845, 53395995, 54222294, 55021965, 55724241, 56269945, 56622023, 56765378, 56702165, 56451667, 56055915, 55582788, 55116993, 54737131, 54487361, 54358246, 54288727, 54190227, 53981621, 53618496, 53104746, 52483978, 51816622, 51153552, 50517527, 49899115, 49265105, 48570398, 47764973, 46795712, 45611701, 44181842, 42522482, 40718773, 38921340, 37314293, 36069962, 35312470, 35101792, 35434627, 36251904, 37447056, 38876399, 40375258, 41779768, 42948523, 43776440, 44197782, 44182329, 43731608, 42878669, 41689631, 40262686, 38721270, 37200921]
39564C7200921j368186j104117p56425l57284N9079M56177P96108J042448J164774
39555C7133495J145215R87204P22616M10815J26409o0006j00560J6774K62249
39546D0644211N68292Q47059J019691J044437R27451P11196M51598J99912m661
39537D6409186j36554j85273j56584p0890M1433J46865K17563K40569K22645J86683
39527D6915643J61428J71204K31162L48660N26971P66269J058876J381495J692248
39518E3253956J938509K072644K065802J913028J631588J258017Q44378M49287
39510F5427209J22705j08681k46446l14037l45789l78119m43391n63301p42116
39501F2408034r64253j198801j408598j559519j628185j607810j510790j365903
$$ y = [37200921, 35832735, 34728618, 33972193, 33614909, 33673988, 34130165, 34926273, 35968721, 37133495, 38278710, 39265914, 39988530, 40399345, 40525754, 40465748, 40365188, 40381962, 40644211, 41212503, 42059562, 43079253, 44123690, 45051141, 45762337, 46213935, 46413847, 46409186, 46272632, 46087359, 45930775, 45859885, 45901318, 46048183, 46265746, 46506315, 46728960, 46915643, 47077071, 47248275, 47479437, 47828097, 48355068, 49121337, 50180213, 51561708, 53253956, 55192465, 57265109, 59330911, 61243939, 62875527, 64133544, 64977922, 65427209, 65549914, 65441233, 65194787, 64880750, 64534961, 64156842, 63713451, 63150150, 62408034, 61443781, 60244980, 58836382, 57276863, 55648678, 54040868, 52530078, 51164175]
39493E1164175j210163j078037r91735r56347r63071j000004j063348j158431
39485D2743039j286603j427401j532333j538898j396607j087505o30630p4089
39477C3768973N15178J060341J486326J736238J786783J653979J386208J049131
39469D4443157P09153M19713K12106R1607M0096K6328K1990J6478K1261O0952
39459D6062841J58122L22814N51279Q29957J138295J448569J725605J929982K024907
39450E6192371J983629J794176J462014J013382M98065j5415m56868p77628r65980
39441F0727746j045716j059939j049329j034286j008341r46801q26553o44603
39433E3112178m23204j99556q296J33225K31086L10497M01586N20188O53901P63908
$$ y = [51164175, 49954012, 48875975, 47884240, 46927893, 45964822, 44964818, 43901470, 42743039, 41456436, 40029035, 38496702, 36957804, 35561197, 34473692, 33843062, 33768973, 34284151, 35344492, 36830818, 38567056, 40353839, 42007818, 43394026, 44443157, 45152310, 45572023, 45784129, 45875736, 45915832, 45942160, 45964150, 45980628, 46001889, 46062841, 46220963, 46543777, 47095056, 47925013, 49063308, 50511877, 52237482, 54167464, 56192371, 58176000, 59970176, 61432190, 62445572, 62943637, 62928222, 62471354, 61693726, 60727746, 59682030, 58622091, 57572762, 56538476, 55530135, 54583334, 53756781, 53112178, 52688974, 52489418, 52481122, 52614347, 52845433, 53155930, 53557516, 54077704, 54731605, 55495513]
39423E5495513Q04460P49019O05832M13136K19960O7715j7144k1555N6458K06977
39413E8580371M06673O20497Q07909R32474R71331R19483P85758N83235L21937
39404F4929668R271l43262p13735j069323j372056j586745j687196j660496j511282
39395E4994844j264712r62098o46337l44971o4191K01709M55097O86257Q73375
39386E3928973R85956R89834Q57236N81325J86910k70486p16326j073663j281653
39377E4188106j314927j197312r98744q10639p09563p28001q46325j006924j140405
39368D5435266j189966j124290r38131o47033k82828J09941M81180P87820J006587
39359D3638546J139326J207330J237887J250176J247872J221900J160201J056518
$$ y = [55495513, 56299973, 57048992, 57654824, 58067960, 58287920, 58355635, 58338491, 58316936, 58373394, 58580371, 58987044, 59607541, 60415450, 61347924, 62319255, 63238738, 64024496, 64607731, 64929668, 64938939, 64595677, 63881942, 62812619, 61440563, 59853818, 58166622, 56506126, 54994844, 53730132, 52768034, 52121697, 51776726, 51712535, 51914244, 52369341, 53055598, 53928973, 54914929, 55904763, 56761999, 57343324, 57530234, 57259748, 56543422, 55469759, 54188106, 52873179, 51675867, 50677123, 49866484, 49156921, 48428920, 47582595, 46575671, 45435266, 44245300, 43121010, 42182879, 41535846, 41253018, 41362959, 41844139, 42631959, 43638546, 44777872, 45985202, 47223089, 48473265, 49721137, 50943037, 52103238, 53159756]
39351E3159756R12613P35868N37990L36389J54062J4777o4125p6583k8641O3415
39341E5745521J76555K86430L74672M36375M84365N45947O50121Q10191J012546
39332F0522723J219086J379951J447357J386911J189726Q84785N40744K46416
39324F8817699P4607M9911J40218K74522L72765L71055K35878k9368l82407p48330
39314F9176550j038632j179087j134124r17167n86215k29645N4953J87651J32435
39305F4466719q9464m08161p32994r86066j125870j151960j092075r82104q51567
39296E7046458p21383o10201n39059n26413n75565o65527p56342q09090q07833
39287E1035045p67410p21468p00201p13832p51299p91365q15657q14602p84163
$$ y = [53159756, 54072369, 54808237, 55346227, 55682616, 55836678, 55851455, 55787330, 55710747, 55682106, 55745521, 55922076, 56208506, 56583178, 57019553, 57503918, 58049865, 58699986, 59510177, 60522723, 61741809, 63121760, 64569117, 65956028, 67145754, 68030539, 68571283, 68817699, 68892306, 68942217, 69082435, 69356957, 69729722, 70100777, 70336655, 70307287, 69924880, 69176550, 68137918, 66958831, 65824707, 64907540, 64321325, 64091680, 64146633, 64334284, 64466719, 64377255, 63969094, 63236100, 62250034, 61124164, 59972204, 58880129, 57898025, 57046458, 56325075, 55714874, 55175815, 54649402, 54073837, 53408310, 52651968, 51842878, 51035045, 50267635, 49546167, 48845966, 48132134, 47380835, 46589470, 45773813, 44959211, 44175048]
39278D4175048p18193o03438m21833j59518J82606N83085J001702J386797J684696
39269D7110952J850655J861940J728912J495411J223645R70257P66795O13461
39261E7622028M86084L51708J86628j1898k28633m46884o64573q94150j144155
39252E5256155j397106j602821j695765j627913j397427j054860o82748l61362
39244D5436153j40726l1772j5152n6740j20404j76417k08596k19816k29518k58766
39234D3978246l10237l58830l62761k88685j34758O1474K34221L15476K64781
39225D3398927Q7559j67605m27877o17204o71287n49624k48662J89814O85387
39216D1679428J142482J479996J652980J658498J526524J302340J029310P39638
$$ y = [44175048, 43456855, 42853417, 42431584, 42272066, 42454672, 43037757, 44039459, 45426256, 47110952, 48961607, 50823547, 52552459, 54047870, 55271515, 56241772, 57008567, 57622028, 58108112, 58459820, 58646448, 58634550, 58405917, 57959033, 57294460, 56400310, 55256155, 53859049, 52256228, 50560463, 48932550, 47535123, 46480263, 45797515, 45436153, 45295427, 45263655, 45248503, 45191763, 45071359, 44894942, 44686346, 44466530, 44237012, 43978246, 43668009, 43309179, 42946418, 42657733, 42522975, 42584449, 42818670, 43134146, 43398927, 43486486, 43318881, 42891004, 42273800, 41602513, 41052889, 40804227, 40994041, 41679428, 42821910, 44301906, 45954886, 47613384, 49139908, 50442248, 51471558, 52211196]
39208E2211196M55855J99243l385j22403j38355n6032R3054K64185M18784N34409
39198E3856551O00557O10219N58946M50968L01845J31934m2135k07615l48583
39189E5912687m43586m75231m43866l71065k88870k24539j92478j95339k28254
39180E3049459k80835l37252l77424l81276l34941k35523r1361Q1658K63886M33016
39170E1789407N64105O32248O18970N19321L45748J26062j05389l20958n10410
39161E3659104o80840q44210j001401j135085j216085j216837j122688r37497
39153D5504461o85486m09541j62526Q836P9588N0880n9291k29610m42197o80663
39143D2974451r26200j157856j356505j508094j603518j636432j602108j499482
$$ y = [52211196, 52667051, 52866294, 52862909, 52740506, 52602151, 52546119, 52639173, 52903358, 53322142, 53856551, 54457108, 55067327, 55626273, 56077241, 56379086, 56511020, 56468885, 56261270, 55912687, 55469101, 54993870, 54550004, 54178939, 53890069, 53665530, 53473052, 53277713, 53049459, 52768624, 52431372, 52053948, 51672672, 51337731, 51102208, 51010847, 51092505, 51356391, 51789407, 52353512, 52985760, 53604730, 54124051, 54469799, 54595861, 54490472, 54169514, 53659104, 52978264, 52134054, 51132653, 49997568, 48781483, 47564646, 46441958, 45504461, 44818975, 44409434, 44246908, 44255744, 44335332, 44386212, 44326921, 44097311, 43655114, 42974451, 42048251, 40890395, 39533890, 38025796, 36422278, 34785846, 33183738, 31684256]
39135C1684256j335441j127151q98795o74016m70114k98149j65888p7134k6315
39126B6611253N308M5378J19359K39346L97967N68277P09587P79133P46447O03151
39116C0825206L62721N1999k98030o55914r87362j251321j400933j392979j202746
39107B4050641q35197l25109K72308Q92362J468605J939696K259187K406723K394083
39098C4523299K260763K059929J841361J639734J472153J341673J240357J149886
39090D7529155J043361Q91417O70626L70168m169m27269q54206j225556j480921
39081D6512606j577893j508108j300309j006353o78459l53685n4751J99339L86358
39072D0618745M83310M73880L55793J47378j08752l50843n15144n58708m75842
$$ y = [31684256, 30348815, 29221664, 28322869, 27648853, 27178739, 26880590, 26714702, 26637568, 26611253, 26616561, 26661939, 26781298, 27020644, 27418611, 27986888, 28696475, 29475608, 30222055, 30825206, 31187927, 31239926, 30941896, 30285982, 29298620, 28047299, 26646366, 25253387, 24050641, 23215444, 22890335, 23162643, 24055005, 25523610, 27463306, 29722493, 32129216, 34523299, 36784062, 38843991, 40685352, 42325086, 43797239, 45138912, 46379269, 47529155, 48572516, 49463933, 50134559, 50504727, 50500558, 50073289, 49219083, 47993527, 46512606, 44934713, 43426605, 42126296, 41119943, 40441484, 40087799, 40033048, 40232387, 40618745, 41102055, 41575935, 41931728, 42079106, 41970354, 41619511, 41104367, 40545659, 40069817]
39063D0069817k99918r0122R1106K00453K25781J82906J01229Q326p8168j49385
39053D0262025j98795k16775j90933j11769K1880K03508M26098O89325R98434
39044D1882998J351729J723874K059469K287397K350909K233999J966043J603268
39036E7459686J202431Q04585M36525J23410j01868k04472j67493j0848K07824
39027E9749780M13449N41718N58301M62159K77259L9742k14525m58903o78373
39018F0690607q64614j007045j086220j075291r51306p12352l91550n7322K05580
39009E4750487L28681K89572J21243j04357l06893m24194m25018l10957j13882
39000E3804682J10792K98294L94086L70038K29605K593k64429n18373p11119q12356
$$ y = [40069817, 39769899, 39679777, 39770883, 39971336, 40197117, 40380023, 40481252, 40489578, 40411410, 40262025, 40063230, 39846455, 39655522, 39543753, 39565633, 39769141, 40195239, 40884564, 41882998, 43234727, 44958601, 47018070, 49305467, 51656376, 53890375, 55856418, 57459686, 58662117, 59466702, 59903227, 60026637, 59924769, 59720297, 59552804, 59541956, 59749780, 60163229, 60704947, 61263248, 61725407, 62002666, 62042408, 61827883, 61368980, 60690607, 59825993, 58818948, 57732728, 56657437, 55706131, 54993779, 54602229, 54544907, 54750487, 55079168, 55368740, 55489983, 55385626, 55078733, 54654539, 54229521, 53918564, 53804682, 53915474, 54213768, 54607854, 54977892, 55207497, 55210090, 54945661, 54427288, 53716169, 52903813]
38990E2903813q19239p56407o64541n83096n36446n29667n52921n88404o14724
38981D7258368o09104n51284m30075k47905j8507K40260N10486P70621R89409
38972D7912269J127882J153360J057146Q61613O09804L44979R4966j30005l29990
38963E2702024n07461o62576p89629q74792q98872q45856p12394n13449k83843
38954D6613152p4635O0391Q7952J4805j13466k35943l04416k97546k18546q6439
38944D5445309P1185K23713L43916M14981M35228M17672L84415L59355L63615
38935D8459389M14311N23519O95031R20481J177237J428672J628059J728851J700641
38926E8676191J542646J285682R81803O88724M55524L12011K63355K91780L64020
$$ y = [52903813, 52084574, 51328167, 50663626, 50080530, 49544084, 49014417, 48461496, 47873092, 47258368, 46649264, 46097980, 45667905, 45420000, 45401493, 45641753, 46152239, 46922860, 47912269, 49040151, 50193511, 51250657, 52112270, 52722074, 53067053, 53162019, 53032014, 52702024, 52194563, 51531987, 50742358, 49867566, 48968694, 48122838, 47410444, 46896995, 46613152, 46538517, 46598908, 46686860, 46701665, 46588199, 46352256, 46047840, 45750294, 45531748, 45445309, 45516494, 45740207, 46084123, 46499104, 46934332, 47352004, 47736419, 48095774, 48459389, 48873700, 49397219, 50092250, 51012731, 52189968, 53618640, 55246699, 56975550, 58676191, 60218837, 61504519, 62486322, 63175046, 63630570, 63942581, 64205936, 64497716, 64861736]
38917F4861736M40139M81638M59857L63056J96728k4423k84874n67442q44459
38908F5081956j073220j206196j212987j099154r07268o98078n24001m11641l60479
38899E7588932l51445l55458l39343k72835j37161O9940L35828O36772R38442
38890E8113672J195563J358614J389160J274121J028222O84548K82538j39989
38882F5186449n52199r35228j283261j596642j871206k093837k248546k326584
38874E2278946k331379k275422k172264k027865j834631j571909j215419p53166
38866C8096891j99949L98498R75798J465000J817301K009737K041480J926590
38858D8531346J689945J366026R96458O24580K88664J6243j77717k86937l06755
$$ y = [64861736, 65301875, 65783513, 66243370, 66606426, 66803154, 66778731, 66493857, 65926415, 65081956, 64008736, 62802540, 61589553, 60490399, 59583131, 58885053, 58361052, 57949411, 57588932, 57237487, 56882029, 56542686, 56269851, 56132690, 56202630, 56538458, 57175230, 58113672, 59309235, 60667849, 62057009, 63331130, 64359352, 65043900, 65326438, 65186449, 64634250, 63699022, 62415761, 60819119, 58947913, 56854076, 54605530, 52278946, 49947567, 47672145, 45499881, 43472016, 41637385, 40065476, 38850057, 38096891, 37896942, 38295440, 39271238, 40736238, 42553539, 44563276, 46604756, 48531346, 50221291, 51587317, 52583775, 53208355, 53497019, 53513262, 53335545, 53048608, 52741853]
38849E2741853k31285o0484J86615M63118O98689Q18230P68501N40589J75314
38840E6101140k52621o61316r82295j167491j188216j034473p16464k66028K63121
38831E0095357P98439J259276J576328J711086J663080J461618J151040P80442
38823F0496666L99069N0344k39889m74048o79746q89228j114754j339867j532754
38814E4675793j667379j733238j729102j652140j495044j252974r33020n57912
38806D3654984j60586K27371N85551R05320J180822J398533J535464J568836J490098
$$ y = [52741853, 52510568, 52450084, 52636699, 53099817, 53798506, 54616736, 55385237, 55925826, 56101140, 55848519, 55187203, 54204908, 53037417, 51849201, 50814728, 50098264, 49832236, 50095357, 50893796, 52153072, 53729400, 55440486, 57103566, 58565184, 59716224, 60496666, 60895735, 60946079, 60706190, 60232142, 59552396, 58663168, 57548414, 56208547, 54675793, 53008414, 51275176, 49546074, 47893934, 46398890, 45145916, 44212896, 43654984, 43494398, 43721769, 44307320, 45212640, 46393462, 47791995, 49327459, 50896295, 52386393]
$$ [...]
##END NTUPLES=NMR SPECTRUM
##END=
