##TITLE=31Pdec_DE-30_oil
 D2O
 64 sc
 7.2.2024
##JCAMPDX= 6.0         $$ Bruker NMR JCAMP-DX V2.0
##DATA TYPE= NMR SPECTRUM
##DATA CLASS= NTUPLES
##ORIGIN= UXNMR, Bruker Analytische Messtechnik GmbH
##OWNER= root
$$ XWIN-NMR		Version 3.5
$$ Wed Feb  7 14:22:32 2024 Russian Standard Time (UT+4h)  she@DPX200
##.OBSERVE FREQUENCY= 81.013821
##.OBSERVE NUCLEUS= ^31P
##.ACQUISITION MODE= SIMULTANEOUS
##.ACQUISITION SCHEME= undefined
##.AVERAGES= 64
##.DIGITISER RES= 16
##SPECTROMETER/DATA SYSTEM= spect
##.PULSE SEQUENCE= zgpg30
##.SOLVENT NAME= CDCl3
##.SHIFT REFERENCE= (INTERNAL, CDCl3, 0, 248.564)
##AUDIT TRAIL= $$ (NUMBER, WHEN, WHO, WHERE, WHAT)
$$ ##TITLE= Audit trail, XWIN-NMR		Version 3.5
$$ ##JCAMPDX= 5.01
$$ ##ORIGIN= Bruker BioSpin GmbH
$$ ##OWNER= she
$$ F:/spectra/data/she/nmr/P31/1/pdata/1/auditp.txt
$$ ##AUDIT TRAIL=  $$ (NUMBER, WHEN, WHO, WHERE, WHAT)
(   1,<2024-02-07 14:21:22.34 +0400>,<she>,<DPX200>,
      <continue with go, POWCHK disabled, PULCHK disabled
       configuration hash MD5:
       00 E9 B6 7A A2 85 ED C7 34 08 36 98 17 FE 4E 26
       data hash MD5: 32K
       85 5C 86 C7 E3 EB F8 15 EA A6 84 E0 A1 6A A2 F4>)
(   2,<2024-02-07 14:21:27.87 +0400>,<she>,<DPX200>,
      <Start of raw data processing
       efp BC_mod = 2 LB = 10 FT_mod = 6 PKNL = 1 PHC0 = -13694.25 PHC1 = 2187.685 SI = 64K 
       data hash MD5: 64K
       44 3D 58 AE 72 97 16 C0 35 0B EC F6 21 97 6D 5E>)
(   3,<2024-02-07 14:21:55.21 +0400>,<she>,<DPX200>,
      <pk PHC0 = 78.33841 PHC1 = -228 
       data hash MD5: 64K
       E5 02 33 0E FD 23 F8 C3 0F 52 9E 46 15 70 DA CD>)
(   4,<2024-02-07 14:22:00.01 +0400>,<she>,<DPX200>,
      <abs ABSG = 5 
       data hash MD5: 64K
       03 47 4F E6 70 CB 05 B0 00 19 0B 74 83 CE E1 B6>)
$$ ##END=
$$ 
$$ hash MD5
$$ F5 EF 2C E8 9F 8D 4D 4E E0 16 A4 69 A1 EA BC 09
##$RELAX= 
##$RELAX= 
##$RELAX= 
##$RELAX= 
##$RELAX= 
##$RELAX= 
##$RELAX= 
##$RELAX= 
##$RELAX= 
$$ Bruker specific parameters
$$ --------------------------
##$DU= <F:/spectra>
##$EXPNO= 1
##$NAME= <P31>
##$PROCNO= 1
##$TYPE= <nmr>
##$USER= <she>
##$AMP= (0..31)
100 100 100 100 100 100 100 100 100 100 100 100 100 100 100 100 100 100 
100 100 100 100 100 100 100 100 100 100 100 100 100 100 
##$AQSEQ= 0
##$AQ_mod= 1
##$AUNM= <au_zg>
##$AUTOPOS= <>
##$BF1= 81.014009
##$BF2= 200.13
##$BF3= 200.13
##$BF4= 200.13
##$BF5= 200.13
##$BF6= 200.13
##$BF7= 200.13
##$BF8= 200.13
##$BYTORDA= 1
##$CFDGTYP= 0
##$CFRGTYP= 5
##$CHEMSTR= <none>
##$CNST= (0..31)
1 1 145 1 1 1 1 1 1 1 1 1 1 1 1 1 1 1 1 1 1 1 1 1 1 1 1 1 1 1 1 1 
##$CPDPRG= <waltz16>
##$CPDPRG1= <>
##$CPDPRG2= <waltz16>
##$CPDPRG3= <>
##$CPDPRG4= <mlev>
##$CPDPRG5= <mlev>
##$CPDPRG6= <mlev>
##$CPDPRG7= <mlev>
##$CPDPRG8= <mlev>
##$CPDPRGB= <>
##$CPDPRGT= <>
##$D= (0..31)
0 1 0 0 0 0 0 0 0 0 0 0.03 2e-05 3e-06 0 0 0 0 0 0 0 0 0 0 0 0 0 0 0 0 
0 0 
##$DATE= 1707301179
##$DBL= (0..7)
120 120 120 11 120 120 24 19 
##$DBP= (0..7)
150 150 150 150 150 150 150 150 
##$DBP07= 0
##$DBPNAM0= <>
##$DBPNAM1= <>
$$ [...]
##$SUBNAM3= <"">
##$SUBNAM4= <"">
##$SUBNAM5= <"">
##$SUBNAM6= <"">
##$SUBNAM7= <"">
##$SUBNAM8= <"">
##$SUBNAM9= <"">
##$SW= 501.771253377433
##$SWIBOX= (0..15)
0 1 3 0 0 0 0 0 0 0 0 0 0 0 0 0 
##$SW_h= 40650.406504065
##$TD= 32768
##$TD0= 1
##$TE= 0
##$TE2= 300
##$TE3= 300
##$TEG= 300
##$TL= (0..7)
0 120 53 12 22 120 120 120 
##$TP= (0..7)
150 150 150 150 150 150 150 150 
##$TP07= 0
##$TPNAME0= <>
##$TPNAME1= <>
##$TPNAME2= <>
##$TPNAME3= <>
##$TPNAME4= <>
##$TPNAME5= <>
##$TPNAME6= <>
##$TPNAME7= <>
##$TPOAL= (0..7)
0.5 0.5 0.5 0.5 0.5 0.5 0.5 0.5 
##$TPOFFS= (0..7)
0 0 0 0 0 0 0 0 
##$TUNHIN= 0
##$TUNHOUT= 0
##$TUNXOUT= 0
##$USERA1= <user>
##$USERA2= <user>
##$USERA3= <user>
##$USERA4= <user>
##$USERA5= <user>
##$V9= 5
##$VALIST= <valist>
##$VCLIST= <CCCCCCCCCCCCCCC>
##$VD= 0
##$VDLIST= <DDDDDDDDDDDDDDD>
##$VPLIST= <PPPPPPPPPPPPPPP>
##$VTLIST= <TTTTTTTTTTTTTTT>
##$WBST= 1024
##$WBSW= 4
##$XGAIN= (0..3)
0 0 0 0 
##$XL= 0
##$YL= 0
##$YMAX_a= 2986
##$YMIN_a= -2068
##$ZGOPTNS= <>
##$ZL1= 120
##$ZL2= 120
##$ZL3= 120
##$ZL4= 120
##$ABSF1= 248.5645
##$ABSF2= -253.2056
##$ABSG= 5
##$ABSL= 3
##$ALPHA= 0
##$AQORDER= 0
##$ASSFAC= 0
##$ASSFACI= 0
##$ASSFACX= 0
##$ASSWID= 0
##$AUNMP= <proc_1d>
##$AZFE= 0.1
##$AZFW= 0.5
##$BCFW= 0
##$BC_mod= 2
##$BYTORDP= 0
##$COROFFS= 0
##$CY= -3
##$DATMOD= 1
##$DC= 0
##$DFILT= <>
##$DTYPP= 0
##$F1P= 0
##$F2P= 0
##$FCOR= 1
##$FTSIZE= 65536
##$FT_mod= 6
##$GAMMA= 0
##$GB= 0
##$INTBC= 1
##$INTSCL= 6.047779e-11
##$ISEN= 30
##$LB= 10
##$LEV0= 0
##$LPBIN= 0
##$MAXI= 10000
##$MC2= 0
##$MEAN= 0
##$ME_mod= 0
##$MI= 50
##$NCOEF= 0
##$NC_proc= -10
##$NLEV= 6
##$NOISF1= 182.463
##$NOISF2= 159.3651
##$NSP= 0
##$NTH_PI= 0
##$NZP= 0
##$OFFSET= 248.5645
##$PC= 4
##$PHC0= -13615.91
##$PHC1= 1959.685
##$PH_mod= 1
##$PKNL= yes
##$PPARMOD= 0
##$PSCAL= 0
##$PSIGN= 0
##$REVERSE= no
##$SF= 81.0140089999694
##$SI= 65536
##$SIGF1= 159.3651
##$SIGF2= -187.1042
##$SINO= 113.3802
##$SIOLD= 16384
##$SREGLST= <1H.CDCl3>
##$SSB= 0
##$STSI= 65536
##$STSR= 0
##$SW_p= 40650.406504065
##$SYMM= 0
##$S_DEV= 0
##$TDeff= 32768
##$TDoff= 0
##$TI= <>
##$TILT= no
##$TM1= 0
##$TM2= 0
##$TOPLEV= 0
##$USERP1= <user>
##$USERP2= <user>
##$USERP3= <user>
##$USERP4= <user>
##$USERP5= <user>
##$WDW= 1
##$XDIM= 65536
##$YMAX_p= 336085596
##$YMIN_p= -38587608
$$ End of Bruker specific parameters
$$ ---------------------------------
##NTUPLES= NMR SPECTRUM
##VAR_NAME=  FREQUENCY,     SPECTRUM/REAL,   SPECTRUM/IMAG
##SYMBOL=    X,             R,               I
##VAR_TYPE=  INDEPENDENT,   DEPENDENT,       DEPENDENT
##VAR_FORM=  AFFN,          ASDF,            ASDF
##VAR_DIM=   65536,         65536,           65536
##UNITS=     HZ,            ARBITRARY UNITS, ARBITRARY UNITS
##FACTOR=    0.620285442955139, 1,           1
##FIRST=     20137.2065510682, 0,            0
##LAST=      -20513.1999529968, 0,           0
##MIN=       -20513.1999529968, -38587608,   0
##MAX=       20137.2065510682, 336085596,    0
$$ Real data points
##PAGE= N=1
##DATA TABLE= (X++(R..R)), XYDATA
$$ [...]
45338 -16147163 -14126395 -11800348 -9341358 -6902056 -4596938 -2500784 -657311 912860
45330 912860 2211279 3264122 4118515 4827383 5427686 5923440 6282244 6445968 6350319
45321 6350319 5946475 5218609 4192031 2929564 1519089 59214 -1351327 -2620657
45313 -2620657 -3670781 -4446150 -4920228 -5095532 -4997026 -4663368 -4140154 -3475558 -2716845
45304 -2716845 -1907187 -1082730 -268912 524184 1303830 2088766 2895413 3723882 4553625
45295 4553625 5352691 6096142 6783593 7444984 8128797 8877695 9706681 10598402 11517876
45286 11517876 12435144 13340800 14245870 15166931 16103988 17021985 17846194 18475827 18811165
45277 18811165 18782357 18366647 17586408 16490608 15131675 13551333 11781330 9855147 7822573
45268 7822573 5760192 3771784 1973163 461625 -718439 -1594399 -2255297 -2816596 -3378448
45259 -3378448 -3997153 -4678303 -5388415 -6077650 -6706809 -7269816 -7799501 -8348929 -8955590
45250 -8955590 -9609866 -10247870 -10771995 -11085159 -11119801 -10850208 -10288645 -9473909 -8461764
45241 -8461764 -7321118 -6132807 -4985305 -3964338 -3138219 -2544322 -2183717 -2028758 -2041411
45232 -2041411 -2192382 -2469912 -2874297 -3403589 -4039716 -4741161 -5443121 -6062909 -6509210
45223 -6509210 -6695909 -6560782 -6084703 -5302880 -4301699 -3201818 -2133361 -1209626 -504561
45214 -504561 -39428 216589 330049 374070 394664 386883 295484 42660 -433786 -1156778
45204 -1156778 -2113162 -3275059 -4620699 -6141596 -7834080 -9681985 -11642416 -13645837
45196 -13645837 -15612433 -17474382 -19189451 -20738096 -22105871 -23259078 -24124896 -24588260
45188 -24588260 -24512392 -23777933 -22324871 -20179237 -17452742 -14314347 -10945317 -7498210
45180 -7498210 -4077858 -748288 2445662 5458594 8237846 10731700 12905584 14754397
45172 14754397 16301948 17588727 18657967 19548338 20292449 20914793 21426017 21816841 22057733
45163 22057733 22107854 21932070 21520519 20903287 20153707 19377001 18685559 18167838 17862555
45154 17862555 17749264 17758700 17796283 17767202 17593468 17219709 16611528 15754342 14657949 13363564
45144 13363564 11944279 10493840 9107664 7863231 6803343 5924166 5173699 4466670
45136 4466670 3712908 2846067 1839937 709146 -500965 -1728873 -2909933 -3982474
45128 -3982474 -4885608 -5555476 -5929934 -5964238 -5648468 -5014150 -4125678 -3062763 -1903273
45119 -1903273 -711778 465640 1601178 2680620 3696145 4640101 5502701 6273439 6942614
45110 6942614 7499223 7925694 8195168 8277696 8155869 7842948 7394062 6904409 6493450 6278282
45100 6278282 6343542 6718753 7372165 8221861 9156491 10056936 10814838 11347353 11607155 11586164
45090 11586164 11312811 10843685 10250507 9604383 8961379 8353636 7787430 7247616 6708352
45081 6708352 6149605 5575229 5024556 4570449 4302539 4300683 4607609 5210402 6037433 6971690
45071 6971690 7875958 8622156 9115996 9309089 9195696 8799421 8159980 7326976 6359994
45062 6359994 5329557 4314055 3390707 2622135 2043938 1660263 1450347 1381853 1423324
45053 1423324 1550854 1748403 2003155 2298147 2606398 2891203 3113252 3239347 3246607 3121590
45043 3121590 2859923 2471390 1988357 1469422 991889 633879 452295 463043 629264 864414
45033 864414 1055171 1099335 942285 594002 119983 -386829 -839569 -1183794 -1407402 -1530932
45023 -1530932 -1585076 -1590534 -1553173 -1474650 -1366721 -1257013 -1184073 -1188529 -1306610 -1565283 -1975036
45012 -1975036 -2521556 -3163783 -3843824 -4504979 -5108070 -5639202 -6109224 -6548867 -7003224
45003 -7003224 -7527670 -8184954 -9039707 -10145830 -11527561 -13162581 -14977058 -16856847 -18672072
44994 -18672072 -20308299 -21694501 -22815769 -23702762 -24402600 -24949210 -25351619 -25604361 -25707356
44985 -25707356 -25677688 -25544962 -25335543 -25057796 -24697788 -24226766 -23615063 -22845488 -21922885
44976 -21922885 -20880544 -19783303 -18721943 -17791981 -17058645 -16523695 -16114504 -15704784 -15158143
44967 -15158143 -14375092 -13325957 -12060432 -10692679 -9367809 -8221485 -7346584 -6777002
44959 -6777002 -6490618 -6426189 -6505494 -6652631 -6805063 -6914941 -6943302 -6852467 -6601792 -6149286
44949 -6149286 -5459307 -4515484 -3336172 -1985477 -570515 778279 1935435 2803351 3322289
44940 3322289 3470494 3260588 2734558 1957236 1009718 -15704 -1020939 -1911169 -2607569
44931 -2607569 -3059092 -3248229 -3188293 -2913403 -2465803 -1886894 -1215229 -488763 254004 976102
44921 976102 1645993 2242170 2757779 3202167 3595753 3960455 4313418 4667694 5033911 5415399
44911 5415399 5798748 6149833 6420330 6558569 6514924 6239351 5677418 4772253 3474792
44902 3474792 1759963 -355505 -2799107 -5439169 -8097642 -10578515 -12702511 -14334302
44894 -14334302 -15392782 -15845518 -15697614 -14986549 -13787098 -12219462 -10447472 -8658693
44886 -8658693 -7031352 -5703278 -4755765 -4213195 -4049857 -4196864 -4550422 -4986958 -5385872
44877 -5385872 -5652650 -5732850 -5613839 -5318987 -4900325 -4430090 -3987849 -3643381 -3442117 -3400596
44867 -3400596 -3512698 -3760452 -4122405 -4576762 -5100726 -5668989 -6253870 -6828097 -7369551
44858 -7369551 -7865830 -8316211 -8729664 -9120170 -9502739 -9893060 -10309901 -10776082 -11314930
44849 -11314930 -11943430 -12665499 -13467157 -14313246 -15145895 -15886798 -16445508 -16733759 -16682797
44840 -16682797 -16258066 -15465732 -14349790 -12983990 -11463489 -9896211 -8390254 -7037085
44832 -7037085 -5896303 -4988230 -4295337 -3770467 -3351566 -2983287 -2639906 -2337223 -2123070
44823 -2123070 -2048734 -2137071 -2365959 -2675886 -2995500 -3269157 -3471073 -3599567 -3656931 -3629031
44813 -3629031 -3478420 -3154665 -2612844 -1826848 -791827 479235 1957546 3598269 5342314
44804 5342314 7121935 8866179 10501785 11950424 13128017 13950847 14347597 14271754 13708933
44795 13708933 12677602 11225499 9424823 7367744 5162367 2927957 786940 -1148353
44787 -1148353 -2792261 -4098689 -5063146 -5712563 -6088397 -6231234 -6173495 -5943044 -5575196
44778 -5575196 -5124942 -4669754 -4298598 -4091183 -4096278 -4317285 -4710562 -5198743 -5696143 -6136625
44768 -6136625 -6491683 -6771742 -7013212 -7260316 -7550079 -7903823 -8324142 -8795131 -9285323
44759 -9285323 -9754760 -10167511 -10506991 -10786165 -11043976 -11327320 -11670082 -12085025 -12573886
44750 -12573886 -13144315 -13815939 -14608229 -15519009 -16509782 -17508427 -18427942 -19189432 -19734179
44741 -19734179 -20017579 -19993731 -19609818 -18821525 -17620199 -16050114 -14201780 -12185546 -10101176
44732 -10101176 -8017990 -5971986 -3976833 -2038436 -162574 1645820 3382750 5036144
44724 5036144 6571299 7924627 9016158 9777457 10180139 10249459 10056636 9695535 9257087
44715 9257087 8812868 8409849 8069881 7787809 7528962 7231379 6815505 6198919 5312084
44706 5312084 4113251 2601237 822287 -1133837 -3149711 -5102847 -6886965 -8426051
44698 -8426051 -9679372 -10638555 -11319206 -11750749 -11968542 -12010846 -11919858 -11742322 -11524071 -11297035
44688 -11297035 -11065760 -10805386 -10476628 -10049267 -9518374 -8905232 -8247492 -7585938 -6949083
44679 -6949083 -6335753 -5704274 -4981080 -4090339 -2988623 -1683591 -227883 1304122 2841972
44670 2841972 4336123 5763246 7122566 8426865 9689456 10908753 12057248 13084971
44662 13084971 13940380 14597820 15075031 15433171 15764069 16171553 16748239 17549061 18570691
44653 18570691 19749431 20980636 22147993 23146662 23893920 24333044 24438503 24222913 23738803
44644 23738803 23068982 22306242 21529338 20783697 20073164 19364421 18599422 17706720 16606122
44635 16606122 15211093 13439676 11237943 8606355 5613166 2386867 -907244 -4094517
44627 -4094517 -7012779 -9525111 -11525363 -12940665 -13734070 -13906904 -13498052 -12578818 -11245018
44618 -11245018 -9609272 -7794867 -5929903 -4138576 -2527255 -1167319 -82274 752287
44610 752287 1392801 1900604 2313127 2624760 2787744 2736656 2425984 1858714 1088073 193904
44600 193904 -747366 -1679805 -2566693 -3379399 -4088716 -4665716 -5090615 -5362238 -5500885 -5543490
44590 -5543490 -5536843 -5535553 -5605130 -5822938 -6268664 -7004359 -8055142 -9403604 -10999560 -12773433
44580 -12773433 -14641584 -16505742 -18258619 -19800948 -21060598 -22001069 -22617860 -22931638
44572 -22931638 -22984585 -22836678 -22555235 -22197401 -21793267 -21338586 -20800648 -20133841 -19297623
44563 -19297623 -18270624 -17058060 -15692268 -14227271 -12729264 -11267111 -9907962 -8720041
44555 -8720041 -7777979 -7160931 -6936665 -7136036 -7733042 -8644356 -9748366 -10910714 -12004453
44546 -12004453 -12924472 -13601617 -14014767 -14190591 -14184918 -14053994 -13832413 -13528077 -13130586 -12621406
44536 -12621406 -11977717 -11171300 -10170218 -8948799 -7502746 -5858727 -4069255 -2193580
44528 -2193580 -275596 1668382 3646208 5674401 7758770 9878653 11979728 13977884
44520 13977884 15773607 17272309 18403120 19129485 19448679 19381725 18958881 18208155 17153144
44511 17153144 15820492 14250239 12500710 10644973 8762227 6929173 5214309 3676448
44503 3676448 2367520 1336879 631255 285916 309396 670019 1291959 2062864 2849467
44494 2849467 3515991 3941700 4036392 3753738 3100467 2136254 959393 -320047 -1609016
44485 -1609016 -2849413 -4019346 -5121374 -6164697 -7146701 -8039237 -8787212 -9324499 -9601969
44476 -9601969 -9612762 -9400454 -9046163 -8641986 -8263853 -7955537 -7728661 -7574232 -7476443 -7422701
44466 -7422701 -7409890 -7447580 -7555619 -7755339 -8060574 -8476365 -9004321 -9645229 -10393276 -11227789
44456 -11227789 -12112810 -13007515 -13880646 -14719359 -15527241 -16312826 -17074933 -17792674 -18424897
44447 -18424897 -18918437 -19220310 -19287957 -19093491 -18622234 -17870067 -16843787 -15562631 -14055076
44438 -14055076 -12350262 -10473036 -8452604 -6343124 -4241587 -2286846 -634472 583278
44430 583278 1293538 1497358 1257714 672143 -152024 -1109921 -2102480 -3039998 -3850010 -4485760
44420 -4485760 -4928907 -5183892 -5268093 -5205591 -5028675 -4781864 -4518046 -4282640 -4093972 -3933507
44410 -3933507 -3753085 -3495825 -3121859 -2629974 -2067620 -1524423 -1110798 -931329 -1064873
44401 -1064873 -1556362 -2414920 -3609930 -5064079 -6652440 -8217506 -9599743 -10671667
44393 -10671667 -11361061 -11656828 -11599965 -11266302 -10747094 -10132329 -9499976 -8911572 -8411661
44384 -8411661 -8027880 -7770355 -7631320 -7587079 -7604381 -7651592 -7711467 -7788682 -7905715 -8086685
44374 -8086685 -8336661 -8627766 -8900223 -9078789 -9097232 -8920045 -8552945 -8040644 -7456618 -6890742
44364 -6890742 -6436545 -6175970 -6160343 -6391454 -6811853 -7313271 -7764419 -8047284 -8084382 -7845399
44354 -7845399 -7335984 -6580548 -5607945 -4442558 -3103088 -1613125 -20499 1590095 3107386
44345 3107386 4425472 5478002 6255739 6804732 7213119 7591057 8042584 8633269 9367552
44336 9367552 10189168 11003745 11709521 12222498 12492137 12508925 12302426 11927766 11446083 10911379
44326 10911379 10370346 9867273 9440483 9107838 8853713 8631493 8382541 8059155 7637391
44317 7637391 7115283 6503588 5820315 5093945 4369009 3702406 3145635 2721311 2409385
44308 2409385 2152994 1881111 1535948 1093007 568277 13683 -495754 -879838 -1072547
44299 -1072547 -1038131 -780321 -344222 187859 706375 1090275 1226389 1029219 459904 -456954
44289 -456954 -1625114 -2887602 -4059978 -4974108 -5512099 -5616896 -5281893 -4533032 -3416410
44280 -3416410 -1994948 -347679 1436779 3272977 5088502 6822759 8418084 9815647
44272 9815647 10964429 11838609 12450710 12850970 13112651 13310385 13500628 13710773 13938816
44263 13938816 14161264 14345088 14459729 14486180 14421501 14278082 14077219 13837262 13559330 13217070
44253 13217070 12756863 12109506 11208519 10009173 8505132 6740573 4812941 2860238
44245 2860238 1032439 -543363 -1789278 -2684912 -3259634 -3577648 -3722377 -3780908 -3828074
44236 -3828074 -3912311 -4045776 -4199096 -4302148 -4255988 -3958881 -3338101 -2370947 -1085186 454823
44226 454823 2163061 3942761 5698401 7352195 8858913 10209134 11418187 12507209
44218 12507209 13485359 14339010 15030191 15504489 15705732 15591538 15143749 14372086 13313927
44209 13313927 12033408 10619856 9183253 7845152 6725435 5926612 5517640 5519135 5892078
44200 5892078 6534162 7291182 7989616 8485587 8710082 8685432 8502281 8269867 8066586 7913311
44190 7913311 7775718 7586886 7275641 6789245 6105921 5237554 4224268 3123994 2003183
44181 2003183 934960 3398 -696868 -1075653 -1073089 -679361 66751 1098945 2346979
44172 2346979 3745569 5226370 6707046 8094140 9303762 10288006 11049392 11633524 12103147
44163 12103147 12506413 12855145 13124412 13272777 13269510 13111157 12819194 12424077 11947193 11389514
44153 11389514 10730574 9937720 8981557 7849562 6550330 5107616 3551168 1913475
44145 1913475 235749 -1422772 -2983601 -4363557 -5501293 -6381069 -7038241 -7541873 -7964220
44136 -7964220 -8353935 -8725100 -9061933 -9329894 -9485050 -9482185 -9286824 -8891346 -8326113 -7654750
44126 -7654750 -6950765 -6264337 -5595833 -4892212 -4071885 -3066111 -1852897 -465226 1025244
44117 1025244 2533862 3984692 5323872 6522771 7568312 8443538 9112221 9522942 9634858
44108 9634858 9450231 9032544 8497778 7982894 7608618 7454244 7550247 7881373 8391265 8988687
44098 8988687 9561284 9997627 10210198 10151662 9822644 9271838 8587401 7878667 7252145 6789760
44088 6789760 6535431 6491007 6619189 6850848 7095186 7252461 7229153 6954254 6393214 5555745
44078 5555745 4495463 3301460 2083167 951177 -971 -708030 -1133718 -1262847 -1091865
44069 -1091865 -625331 118978 1100993 2253813 3488952 4708611 5817343 6727987 7363321
44060 7363321 7658376 7566118 7065095 6166457 4919774 3417441 1793639 210156 -1174752
44051 -1174752 -2245832 -2959490 -3345980 -3486313 -3480617 -3425633 -3406892 -3498780 -3762778 -4238873
44041 -4238873 -4931066 -5792076 -6715729 -7546849 -8113728 -8275969 -7968021 -7216852 -6125284
44032 -6125284 -4831726 -3467997 -2132945 -886948 237837 1219996 2032471 2635540 2985149
44023 2985149 3055121 2861421 2472540 1996969 1552208 1229256 1067104 1045635 1097964 1136255
44013 1136255 1079964 875294 500667 -38631 -718918 -1502814 -2337199 -3146459 -3828360 -4261188
44003 -4261188 -4324251 -3922960 -3005428 -1565288 363105 2707433 5355530 8154869 10921485
43994 10921485 13461818 15604141 17231012 18302011 18858071 19004626 18878455 18609018 18286546
43985 18286546 17945681 17567300 17095360 16462084 15613285 14525711 13210933 11705888 10056562
43976 10056562 8304584 6483933 4627394 2774731 973441 -729058 -2292988 -3683537
43968 -3683537 -4858309 -5756533 -6301685 -6418816 -6057846 -5212166 -3925577 -2285487 -405272
43959 -405272 1596597 3612633 5555125 7361070 8996047 10454276 11750495 12905777
43951 12905777 13936019 14849775 15653039 16353238 16958437 17474429 17903667 18246767 18505810
43942 18505810 18689738 18820491 18933811 19068142 19243200 19439687 19592900 19605118 19372206
43933 19372206 18814598 17901675 16660977 15170594 13540769 11893322 10343804 8987084
43925 8987084 7887271 7074511 6550289 6299366 6303359 6549437 7028833 7725268 8600817 9589193
43915 9589193 10600534 11533603 12289800 12787601 12977978 12857815 12475512 11925632 11334397
43906 11334397 10838985 10561802 10581763 10910104 11482944 12179966 12866995 13446104 13889885
43897 13889885 14242735 14589473 15009932 15544915 16189367 16909274 17664214 18418198 19135222
43888 19135222 19769835 20265526 20564983 20625661 20430411 19987394 19321285 18463017 17444485
43879 17444485 16298707 15060367 13761930 12426220 11061200 9661990 8220313 6737534
43871 6737534 5236070 3764037 2389405 1184012 203962 -523589 -1000308 -1244267 -1273394
43862 -1273394 -1094438 -703128 -94689 721409 1710397 2810118 3937712 5000797 5909311
43853 5909311 6587759 6988799 7104911 6969986 6644764 6191037 5650012 5039457 4370691
43844 4370691 3671356 2995862 2415811 1998485 1790257 1816564 2095303 2648825 3501557 4664200
43834 4664200 6117876 7810664 9666477 11596057 13501700 15277278 16811635 18000725
43826 18000725 18766342 19074395 18945834 18456472 17725196 16893058 16098354 15454195 15033797
43817 15033797 14865332 14935559 15201087 15605940 16100670 16653401 17244351 17846299 18406211
43808 18406211 18844839 19077878 19045666 18732949 18168907 17410914 16523395 15562909 14575477
43799 14575477 13605161 12706045 11946803 11401327 11128927 11155529 11466523 12013335 12727939
43790 12727939 13538203 14380763 15210828 16007354 16770556 17510868 18234206 18932661 19587171
43781 19587171 20179414 20701772 21155291 21536639 21826327 21990796 22000034 21849658 21572378 21230776
43771 21230776 20895239 20618873 20420189 20276716 20126780 19877882 19423929 18671913 17570816
43762 17570816 16130497 14422681 12565528 10698507 8953545 7427181 6160163 5132737
43754 5132737 4280626 3527971 2824246 2168441 1609511 1224346 1085404 1232489 1657426
43745 1657426 2303113 3075109 3863476 4571001 5140075 5568075 5904147 6228419 6622624
43736 6622624 7143474 7806437 8582573 9408174 10205045 10905210 11469253 11887847 12164406
43727 12164406 12288835 12219089 11882737 11198133 10103227 8577889 6652410 4403527 1943676
43718 1943676 -591727 -3057225 -5311637 -7236256 -8757173 -9865396 -10622736 -11143370
43710 -11143370 -11553075 -11942794 -12339153 -12705873 -12972414 -13072248 -12972201 -12684441 -12263331
43701 -12263331 -11793224 -11371274 -11087163 -11001768 -11128053 -11418950 -11768027 -12027301 -12041234 -11688563
43691 -11688563 -10918741 -9769715 -8358720 -6846783 -5388445 -4084993 -2957958 -1950965
43683 -1950965 -958089 131907 1392516 2834633 4406640 6011609 7528521 8831916
43675 8831916 9812665 10400049 10577028 10380421 9887415 9197229 8414097 7631680 6919252
43666 6919252 6314761 5829846 5464624 5223039 5120277 5180352 5427482 5875926 6521770 7339634
43656 7339634 8285991 9307782 10351911 11371241 12325646 13179779 13901189 14462993 14853139
43647 14853139 15086018 15206611 15279898 15368848 15512708 15715403 15945819 16147348 16254671 16215340
43637 16215340 16009734 15661204 15232465 14810872 14488395 14341434 14414343 14709795 15187994
43628 15187994 15774898 16377677 16904068 17281552 17472482 17482379 17359433 17184041 17049451 17037880
43618 17037880 17198933 17536831 18010401 18545468 19054171 19452319 19668625 19647342 19351528
43609 19351528 18771589 17935897 16915579 15818042 14769414 13889875 13267225 12935536 12867039
43600 12867039 12983410 13185261 13388543 13550827 13674869 13790271 13927112 14098170 14297010
43591 14297010 14506475 14706621 14875922 14988409 15013571 14922512 14697012 14334468 13844414 13239657
43581 13239657 12531050 11733577 10881314 10037858 9288173 8711544 8352195 8207716 8241110
43572 8241110 8404046 8653836 8957288 9288124 9627517 9969215 10321808 10700366 11108194
43563 11108194 11519021 11872108 12085546 12082022 11814292 11278826 10513454 9582888 8560003
43554 8560003 7509920 6481037 5504439 4600486 3787581 3086101 2513839 2076642 1761464
43545 1761464 1535009 1345479 1125490 798944 294308 -440445 -1430159 -2674601 -4152870
43536 -4152870 -5821651 -7608760 -9411788 -11108913 -12579265 -13724689 -14486785 -14856697
43528 -14856697 -14875604 -14624732 -14208067 -13735373 -13310616 -13022964 -12934146 -13062432 -13373010 -13785572
43518 -13785572 -14199815 -14527603 -14716878 -14759461 -14685880 -14556326 -14453341 -14473987 -14716383 -15261381
43508 -15261381 -16156645 -17408793 -18981383 -20793776 -22721991 -24608753 -26286776 -27609755
43500 -27609755 -28479688 -28860470 -28773263 -28275824 -27435717 -26311940 -24954015 -23413625 -21754022
43491 -21754022 -20047028 -18361118 -16751116 -15254492 -13890899 -12661736 -11552944 -10545314
43483 -10545314 -9628944 -8812254 -8119893 -7583817 -7235984 -7106605 -7225852 -7624927 -8333084
43474 -8333084 -9367879 -10718692 -12329540 -14091177 -15849564 -17429977 -18669761 -19450209
43466 -19450209 -19718221 -19491748 -18849329 -17909284 -16803733 -15650282 -14526442 -13456504 -12418234
43457 -12418234 -11365092 -10250462 -9043416 -7735563 -6343008 -4903850 -3469533 -2093242
43449 -2093242 -823554 292195 1201224 1847307 2186337 2206338 1936428 1437352 780474
43440 780474 29088 -768784 -1575765 -2353803 -3053251 -3609702 -3952987 -4025093 -3796689 -3272519
43430 -3272519 -2483525 -1471587 -276160 1069186 2527780 4044652 5538473 6911286
43422 6911286 8074061 8973691 9605708 10007003 10235092 10346291 10382652 10370590 10327601 10270524
43412 10270524 10219387 10194050 10205259 10245630 10286328 10281098 10175333 9918253 9478380 8859878
43402 8859878 8110938 7314480 6561141 5917108 5403518 4997469 4653503 4334776 4037953
43393 4037953 3798547 3675050 3723499 3978474 4449340 5129856 6012871 7100035 8397278
43384 8397278 9892437 11523737 13160033 14613958 15691906 16260257 16293239 15876964 15170808
43375 15170808 14351081 13565387 12910822 12432231 12131588 11983227 11951877 12008416 12137282 12333308
43365 12333308 12591339 12895095 13211282 13492410 13688169 13761968 13707093 13555647 13373547 13239372
43355 13239372 13214350 13318683 13526271 13776362 13989994 14081952 13970634 13593632 12929277 12012589
43345 12012589 10931770 9801893 8727194 7770852 6946338 6231256 5591941 5003061 4453615
43336 4453615 3942330 3472128 3050353 2694265 2437394 2332752 2449289 2858060 3609509
43327 3609509 4712665 6129888 7789978 9607744 11496368 13370899 15150687 16764923
43319 16764923 18157389 19286905 20126053 20661792 20896597 20846525 20536415 19995381 19253798
43310 19253798 18340804 17282600 16103154 14826987 13481784 12100258 10722850 9400845
43302 9400845 8195622 7170274 6375101 5833165 5532216 5426297 5446883 5520137 5584026 5598236
43292 5598236 5542678 5406923 5179679 4848777 4414036 3902745 3371819 2889248 2504037 2223877
43282 2223877 2014645 1820478 1590167 1294449 928914 508861 65386 -354735 -690336
43273 -690336 -873211 -840712 -548097 24602 873383 1976742 3302066 4806026 6428620
43264 6428620 8087074 9676196 11075838 12161848 12818642 12954434 12518633 11516459 10014407
43255 10014407 8132913 6027247 3861850 1785816 -83928 -1669757 -2933050 -3868972
43247 -3868972 -4496852 -4846638 -4944410 -4802357 -4418357 -3786620 -2914646 -1836787 -616138
43238 -616138 665071 1918858 3061595 4021025 4744515 5209569 5431307 5459967 5366169
43229 5366169 5219037 5066451 4924377 4775918 4576746 4265723 3782337 3089125 2189494
43220 2189494 1129549 -18734 -1183716 -2315740 -3394959 -4424893 -5418169 -6383074
43212 -6383074 -7316368 -8202391 -9015694 -9725979 -10306028 -10741040 -11033932 -11201221 -11259921 -11212788
43202 -11212788 -11041726 -10714686 -10202095 -9491481 -8590427 -7518598 -6299430 -4960780 -3542871
43193 -3542871 -2102536 -704724 596972 1779122 2853765 3855550 4817606 5749729
43185 5749729 6629822 7410736 8036883 8462712 8667451 8664182 8503761 8273518 8087709 8066039
43175 8066039 8302206 8833123 9622614 10566552 11516215 12310985 12811440 12924581 12613471
43166 12613471 11887769 10780979 9329153 7565811 5536850 3324187 1059107 -1087763
43158 -1087763 -2938260 -4346831 -5233764 -5601290 -5527595 -5138779 -4566722 -3909633 -3213247
43149 -3213247 -2479934 -1697194 -868443 -32194 735229 1331747 1652598 1619268 1205344 447672
43139 447672 -564774 -1720614 -2919672 -4094258 -5211129 -6259531 -7235918 -8132262 -8928256
43130 -8928256 -9586246 -10051722 -10264568 -10180719 -9794070 -9144538 -8306188 -7362882 -6386254 -5426380
43120 -5426380 -4514866 -3672686 -2915496 -2254639 -1696305 -1241655 -888036 -629900 -458920
43111 -458920 -364320 -334589 -360900 -441311 -583526 -803285 -1117537 -1536026 -2056969 -2668817
43101 -2668817 -3353901 -4088428 -4838453 -5557289 -6190870 -6692865 -7043548 -7260051 -7387295
43092 -7387295 -7471371 -7532248 -7555101 -7504277 -7345044 -7054293 -6615058 -6006075 -5201436 -4185004
43082 -4185004 -2970274 -1609859 -184934 1221104 2549229 3775931 4904302 5943989
43074 5943989 6895066 7745335 8478200 9079913 9538891 9842020 9978926 9956587 9812579 9613039
43064 9613039 9435003 9346933 9400374 9632443 10068940 10720803 11576210 12595508 13713642
43055 13713642 14850226 15925255 16876176 17667833 18285772 18712646 18903511 18783059 18275027
43046 18275027 17348726 16051790 14505986 12868081 11279615 9832715 8564216 7471253
43038 7471253 6532415 5722407 5016992 4390338 3808862 3227500 2594869 1868658 1033691
43029 1033691 111960 -839636 -1739279 -2492023 -3003280 -3197111 -3037955 -2546621 -1799631
43020 -1799631 -908775 10510 867338 1609683 2224441 2728991 3159545 3558850 3966191
43011 3966191 4413258 4925551 5523088 6214414 6986123 7797376 8586328 9285831 9839967
43002 9839967 10215620 10408570 10444647 10375040 10265733 10184284 10187438 10309984 10554382 10885110
42992 10885110 11234881 11525001 11691887 11706524 11578577 11346639 11062447 10776899 10532063
42983 10532063 10359389 10281472 10313812 10464139 10729759 11096100 11539238 12030473 12537242 13018562
42973 13018562 13422689 13697444 13812096 13775043 13631709 13443282 13261252 13111730 12992888
42964 12992888 12882086 12748474 12566434 12324134 12023998 11677967 11303979 10927018 10581154
42955 10581154 10304721 10124254 10033637 9984259 9898428 9701948 9357672 8883385 8349738 7862410
42945 7862410 7532873 7442731 7612005 7984587 8438336 8816872 8972667 8807442 8295123 7477722
42935 7477722 6437586 5262487 4021652 2759319 1499676 254520 -968808 -2157421
42927 -2157421 -3283132 -4300732 -5158903 -5817205 -6256236 -6474473 -6477196 -6267398 -5843480
42918 -5843480 -5202401 -4345459 -3284327 -2044786 -666404 801382 2305529 3797618
42910 3797618 5242712 6624490 7943026 9207287 10428058 11613853 12768124 13887504
42902 13887504 14964224 15993226 16977595 17924571 18831779 19671980 20386678 20894391 21112205
42893 21112205 20982576 20494012 19687344 18647154 17484087 16313745 15234496 14306112 13534974
42884 13534974 12873953 12240237 11544210 10715630 9716771 8542518 7214489 5774247 4275326
42875 4275326 2772980 1314884 -61751 -1324816 -2437708 -3352136 -4007894 -4340525 -4294518
42866 -4294518 -3838178 -2976077 -1755688 -266293 1369567 3009865 4509618 5739139
42858 5739139 6603231 7058160 7120613 6863278 6395580 5833408 5266988 4739207 4243712 3741638
42848 3741638 3184392 2528575 1739464 791568 -324101 -1586685 -2937468 -4288059 -5543513
42839 -5543513 -6627126 -7492935 -8122778 -8515689 -8679329 -8628023 -8386738 -7997069 -7517913
42830 -7517913 -7013126 -6526243 -6055852 -5551258 -4937634 -4159268 -3215498 -2167541 -1113315
42821 -1113315 -147897 665042 1296136 1733056 1962134 1965357 1734586 1290428 688943 8023
42811 8023 -678730 -1321793 -1894973 -2377059 -2733217 -2912203 -2861744 -2551176 -1986641 -1209676
42801 -1209676 -280611 742408 1816346 2914422 4022451 5138838 6277405 7463499
42793 7463499 8716690 10026229 11336117 12553655 13579308 14339431 14801681 14967751 14855188
42784 14855188 14484114 13875181 13054505 12058511 10934323 9734860 8511497 7310313 6176233
42775 6176233 5161941 4332582 3760324 3511644 3635158 4154769 5067038 6338497 7899645
42766 7899645 9636628 11387044 12949187 14109791 14685409 14563367 13726082 12248527 10270226
42757 10270226 7955738 5463428 2934602 497628 -1730607 -3657499 -5234106 -6461393
42749 -6461393 -7372468 -8000987 -8357531 -8426461 -8177482 -7578362 -6603410 -5242076 -3510428
42740 -3510428 -1458978 831679 3266473 5752024 8203864 10544802 12701089 14601879
42732 14601879 16183129 17394837 18210115 18633804 18707203 18505547 18126570 17671609 17223769
42723 17223769 16829698 16491095 16169445 15803377 15332597 14717383 13943237 13009710 11914649
42714 11914649 10648318 9201461 7577956 5799808 3901454 1919840 -112719 -2171607
42706 -2171607 -4240685 -6310246 -8369077 -10390918 -12322981 -14087994 -15605057 -16820872
42698 -16820872 -17732370 -18384629 -18843083 -19155443 -19324321 -19304088 -19021396 -18406939 -17422313
42689 -17422313 -16071611 -14398514 -12477725 -10408385 -8309345 -6311049 -4541409 -3108745
42681 -3108745 -2086420 -1501025 -1324936 -1476752 -1834455 -2261235 -2635474 -2871952 -2925392
42672 -2925392 -2777286 -2416340 -1825932 -986171 112269 1452905 2986680 4637692 6319352
42663 6319352 7954325 9487965 10885606 12113719 13118840 13823216 14144740 14030559 13485037
42654 13485037 12578691 11437025 10217100 9082365 8183082 7642416 7542372 7906652 8687286
42645 8687286 9766479 10977055 12132789 13057670 13610397 13704598 13320547 12500835 11329845
42636 11329845 9908574 8337737 6711563 5114859 3617650 2270355 1106097 150758
42628 150758 -567406 -1018690 -1185694 -1080379 -749170 -257946 335734 1004455 1752051 2595058
42618 2595058 3539085 4564875 5629243 6677811 7664141 8569195 9412132 10243884 11123551
42609 11123551 12089365 13139003 14225858 15268483 16168617 16835211 17209310 17279553 17079876
42600 17079876 16671548 16120635 15480669 14782845 14032016 13208184 12274850 11193929 9943809
42591 9943809 8534824 7015626 5465600 3973964 2613825 1424031 408839 -444501
42583 -444501 -1142016 -1670401 -2005820 -2138104 -2091909 -1929631 -1736143 -1597673 -1586187 -1751374
42573 -1751374 -2116098 -2672295 -3378890 -4165816 -4946352 -5634738 -6161760 -6482260 -6575402 -6444300
42563 -6444300 -6119768 -5664941 -5171534 -4741726 -4460479 -4372458 -4476744 -4740068 -5115967 -5555223
42553 -5555223 -6003951 -6398537 -6668601 -6750158 -6600444 -6203284 -5560936 -4679704 -3562708
42544 -3562708 -2217605 -672939 1012648 2758958 4486191 6135508 7676105 9097494
42536 9097494 10394054 11550309 12531999 13284996 13743182 13845472 13557856 12890632 11900479
42527 11900479 10675166 9309658 7886221 6465534 5087428 3776212 2547780 1419486
42519 1419486 423385 -383208 -922517 -1123755 -961795 -480112 221339 1025741 1839176
42510 1839176 2608574 3316223 3962274 4545726 5050007 5438414 5662793 5681936 5479505 5071866
42500 5071866 4503257 3832511 3118033 2406547 1728669 1101659 536968 48254 -344259
42491 -344259 -614318 -732972 -671815 -405528 84875 807333 1753407 2893465 4173169
42482 4173169 5512886 6812424 7961940 8857115 9415730 9593770 9398536 8893691 8190260
42473 8190260 7422176 6713020 6146430 5751512 5506650 5356089 5230562 5066738 4824213
42464 4824213 4498140 4123313 3767671 3518449 3466141 3688614 4236242 5121394 6317170
42455 6317170 7766464 9397201 11138231 12931747 14738451 16532927 18292521 19989460
42447 19989460 21594029 23085671 24459889 25721461 26865703 27859147 28632181 29090104
42439 29090104 29139568 28718932 27818876 26485649 24808997 22902361 20881889 18848112 16874493
42430 16874493 15007714 13279782 11723043 10375286 9269867 8419404 7807635 7396724
42422 7396724 7144773 7022634 7023205 7162392 7473030 7993045 8750753 9751441 10967576 12332947
42412 12332947 13743520 15071721 16196635 17039162 17581495 17857374 17919513 17805953 17525513
42403 17525513 17067705 16427054 15625187 14718134 13786582 12916430 12180216 11626785 11280877
42394 11280877 11149728 11231065 11516775 11990144 12620031 13358014 14141885 14904216 15582495
42385 15582495 16128160 16513279 16733733 16806869 16761330 16619614 16380058 16009590 15454572 14665329
42375 14665329 13620432 12338729 10877105 9320171 7768637 6329001 5102688 4171484
42367 4171484 3579684 3319859 3331686 3516986 3764267 3972817 4071191 4029870 3867093 3644495
42357 3644495 3450989 3378911 3501044 3857550 4456771 5284533 6310289 7483100 8723276
42348 8723276 9922602 10958748 11717518 12113889 12108990 11722902 11038549 10189426 9330996
42339 9330996 8606316 8119993 7929221 8051680 8482739 9210583 10219491 11479567 12931521
42330 12931521 14480319 16007050 17396874 18570007 19499943 20210450 20754779 21188757 21549357
42321 21549357 21844840 22056925 22152220 22098939 21884222 21526773 21079015 20614861 20205480 19894008
42311 19894008 19683723 19547295 19451298 19381120 19353132 19409840 19601651 19962257 20485951 21116054
42301 21116054 21751186 22268410 22553657 22527682 22161551 21482112 20568702 19539820 18529230
42292 18529230 17655722 16994241 16556254 16286378 16080751 15825140 15438134 14898235 14243200
42283 14243200 13548494 12901559 12382445 12050078 11930496 12008879 12231667 12521952 12803331
42274 12803331 13020843 13147882 13176955 13104432 12924609 12639649 12275692 11887162 11540058 11283424
42264 11283424 11129271 11054771 11022570 11001992 10976661 10937960 10874571 10767439 10591520 10320049
42254 10320049 9927553 9391556 8695986 7839798 6850621 5796419 4784434 3941325 3379173
42245 3379173 3160880 3280088 3665987 4213195 4823698 5439148 6047203 6663002 7300741
42236 7300741 7950060 8563869 9060688 9344486 9338468 9016695 8413352 7602885 6664314 5651877
42226 5651877 4586104 3464101 2277244 1023306 -293329 -1669888 -3111793 -4628960
42218 -4628960 -6221734 -7865123 -9501981 -11049826 -12417287 -13521385 -14298636 -14708582
42210 -14708582 -14733120 -14376136 -13665806 -12657998 -11436123 -10103749 -8771635 -7545621 -6519713
42201 -6519713 -5772078 -5358871 -5306074 -5605267 -6217515 -7083000 -8131885 -9295074 -10514639
42192 -10514639 -11750305 -12978075 -14183096 -15353658 -16478834 -17545193 -18529646 -19393884
42184 -19393884 -20087957 -20562104 -20778563 -20718599 -20387600 -19821064 -19087444 -18281271 -17505429
42175 -17505429 -16847459 -16355453 -16018796 -15761543 -15457409 -14967760 -14189950 -13094278 -11732496
42166 -11732496 -10216689 -8682220 -7252041 -6012312 -5000885 -4208422 -3592866 -3103673
42158 -3103673 -2703805 -2376494 -2114594 -1903001 -1706660 -1469110 -1120047 -589583 173123
42149 173123 1182044 2404537 3764810 5160620 6488706 7671478 8675719 9515826
42141 9515826 10239879 10904372 11548283 12177138 12762805 13256783 13608650 13781561 13762715 13571160
42131 13571160 13262897 12927190 12667818 12572541 12685508 12998521 13464356 14019942 14603615
42122 14603615 15161188 15647184 16027812 16284098 16409787 16404027 16264986 15988950 15572968 15016602
42112 15016602 14322415 13498853 12567063 11566805 10553647 9585287 8704514 7930090 7259937
42103 7259937 6680587 6173973 5718733 5289592 4858646 4398939 3889101 3318506 2693219
42094 2693219 2042859 1427063 936895 683863 773178 1269192 2170489 3409403 4876989
42085 4876989 6460167 8072150 9661968 11201001 12658351 13983913 15112153 15984375
42077 15984375 16574882 16905492 17042387 17080004 17121304 17260365 17567442 18075452 18771083 19596619
42067 19596619 20464461 21278882 21956576 22440615 22706276 22759235 22628377 22357415 21998863
42058 21998863 21610872 21255362 20995697 20891209 20985349 21288969 21768308 22348121 22929019
42049 22929019 23406185 23678931 23654681 23259400 22458314 21275496 19795948 18144706 16453715
42040 16453715 14833957 13363367 12088677 11032915 10202872 9595525 9202940 9013291 9007446
42031 9007446 9155900 9423170 9781454 10226303 10782082 11488479 12369986 13402700 14499180
42022 14499180 15525991 16350230 16891694 17151414 17201321 17144672 17073286 17043907 17077506 17169444
42012 17169444 17297363 17423631 17498227 17468065 17292795 16960712 16495526 15947372 15370429 14800416
42002 14800416 14247753 13710790 13196649 12731380 12351923 12087915 11946701 11908813 11933738 11973204
41992 11973204 11987840 11960174 11897182 11822455 11765480 11754991 11816200 11967743 12217266 12558424
41982 12558424 12971140 13424598 13883343 14318040 14718632 15101639 15504141 15966359 16512836
41973 16512836 17141091 17819709 18494365 19101595 19589458 19938621 20173446 20356711 20570763
41964 20570763 20892918 21371571 22007602 22747646 23495861 24142230 24592911 24785765 24687327
41955 24687327 24283952 23582434 22621975 21485023 20293268 19186137 18290369 17692863 17425826
41946 17425826 17467894 17759411 18225651 18799940 19439272 20127238 20862911 21641239 22437064
41937 22437064 23203898 23887556 24443249 24844807 25085022 25173976 25139294 25024682 24881448 24753246
41927 24753246 24659988 24587980 24490472 24298479 23937479 23343611 22475049 21317967 19888779
41918 19888779 18234034 16428775 14573144 12785207 11187191 9885468 8950192 8403014
41910 8403014 8217711 8332000 8663677 9123656 9622773 10075937 10409512 10572191 10542135 10323789
41900 10323789 9937142 9408515 8768064 8051587 7302625 6574155 5929490 5439013 5169695
41891 5169695 5169825 5455709 6005611 6761910 7639606 8538147 9352911 9984098 10344896 10373247
41881 10373247 10048020 9402859 8527245 7549281 6605017 5806587 5220451 4860784 4696880
41872 4696880 4670862 4720144 4797340 4880609 4972043 5087396 5243226 5447443 5698246 5992656
41862 5992656 6338532 6758691 7280758 7918675 8658410 9454641 10235758 10913012 11393797
41853 11393797 11599654 11484385 11045323 10324980 9405340 8396687 7420373 6586755 5974616
41844 5974616 5620155 5519396 5641652 5947918 6406407 6997468 7704853 8499820 9331891
41835 9331891 10135207 10844842 11408328 11785168 11942392 11858911 11539963 11029967 10412121 9793431
41825 9793431 9281499 8959492 8864543 8976511 9223872 9507161 9731528 9835658 9806257 9672617
41815 9672617 9482286 9266738 9012451 8653082 8089437 7229593 6030132 4518947 2790735
41806 2790735 980716 -769085 -2337333 -3636919 -4613653 -5235494 -5481917 -5342160 -4823374
41797 -4823374 -3961018 -2821918 -1496292 -81894 1333994 2690072 3960381 5154287
41789 5154287 6305437 7451675 8612938 9777791 10907313 11955746 12896175 13735971
41781 13735971 14514327 15285249 16094781 16960400 17859230 18730948 19496309 20082773 20442900
41772 20442900 20556056 20416226 20017367 19346932 18390829 17145760 15631384 13895465 12009111
41763 12009111 10053908 8106096 6223749 4442196 2780505 1256635 -98004 -1236144
41755 -1236144 -2108936 -2688877 -2986246 -3048804 -2945642 -2743631 -2485498 -2176759 -1787568 -1272117
41745 -1272117 -600069 214460 1103322 1963155 2695664 3247633 3626304 3881139 4066696
41736 4066696 4213869 4326616 4399604 4439595 4477602 4569266 4785793 5197945 5856951 6779079
41726 6779079 7939666 9277343 10704554 12120090 13421630 14518387 15344085 15868419
41718 15868419 16102646 16095178 15917705 15647634 15352929 15081150 14851402 14649838 14432131 14134673
41708 14134673 13690915 13046707 12171177 11063491 9756079 8313195 6824543 5396973
41700 5396973 4147662 3197722 2661244 2627500 3141545 4192867 5718313 7617619 9773566
41691 9773566 12067993 14389579 16636357 18719371 20569390 22140619 23404508 24337163
41683 24337163 24914699 25127456 25006107 24637614 24152894 23688902 23346769 23168885 23142714
41674 23142714 23222538 23354176 23492218 23606458 23678727 23693711 23629250 23452020 23122151 22605997
41664 22605997 21891902 21001146 19987461 18924580 17888856 16946459 16149113 15534774 15127726
41655 15127726 14937267 14958849 15180684 15593224 16194427 16985077 17955461 19071476 20267949
41646 20267949 21450277 22500163 23282968 23659131 23502588 22724192 21293879 19255602 16731471
41637 16731471 13913269 11041149 8371698 6139863 4520852 3600154 3361111 3696107
41629 3696107 4438821 5406165 6436309 7414065 8282312 9042711 9748816 10491198 11372694
41620 11372694 12476554 13838460 15435541 17196009 19019306 20792330 22396255 23710502
41612 23710502 24623135 25049220 24949982 24343471 23301597 21933947 20363122 18699104 17021030
41603 17021030 15372045 13767131 12207906 10695816 9237267 7840248 6508157 5237632
41595 5237632 4021313 2850004 1710368 582689 -553269 -1704498 -2853338 -3956894
41587 -3956894 -4954226 -5773104 -6335661 -6570411 -6433245 -5927471 -5108981 -4072679 -2929243
41578 -2929243 -1784433 -726664 178857 893066 1404519 1729004 1906812 1998043 2076032
41569 2076032 2218448 2496497 2964554 3653236 4566739 5682486 6951288 8299614 9638821
41560 9638821 10884059 11977394 12901763 13674234 14320356 14845974 15225651 15415603 15383796
41551 15383796 15140260 14749878 14317935 13954501 13738817 13705188 13853951 14171560 14641901
41542 14641901 15245471 15954848 16733023 17533993 18304564 18989951 19544369 19941450 20177319
41533 20177319 20265788 20232197 20111466 19948273 19792865 19689592 19661946 19700207 19755225 19740407
41523 19740407 19545461 19064002 18228889 17039924 15569217 13941221 12297244 10759425
41515 10759425 9406753 8270234 7346407 6619148 6075275 5705651 5496176 5419806 5435736
41506 5435736 5492709 5531507 5487785 5300252 4924435 4344571 3576309 2661345 1660733 649190
41496 649190 -294705 -1105833 -1750462 -2232204 -2580857 -2831729 -3008185 -3114702 -3139721 -3063582
41486 -3063582 -2866600 -2533883 -2056161 -1428477 -648888 282190 1361110 2576022 3896585
41477 3896585 5263035 6583741 7746256 8637550 9164115 9266902 8933240 8208647 7204513
41468 7204513 6091312 5069958 4326268 3986164 4091015 4601454 5422415 6433628 7512838
41459 7512838 8548224 9444151 10126081 10547056 10693328 10584610 10266814 9799705 9244607
41450 9244607 8656395 8080821 7555245 7108974 6760143 6510337 6342519 6226839 6131886 6034039
41440 6034039 5921067 5793265 5666046 5570984 5548627 5632793 5835759 6144890 6532043 6967769
41430 6967769 7431642 7916336 8427514 8979860 9586182 10239552 10897711 11484020 11910326
41421 11910326 12109495 12056145 11763511 11263480 10587523 9760796 8808446 7764324 6672939
41412 6672939 5582433 4533296 3549907 2639022 1794856 1008444 279066 -375231 -912864
41403 -912864 -1273454 -1390887 -1208778 -693013 159899 1318023 2714548 4258346 5856095
41394 5856095 7438967 8979773 10489560 11995578 13515340 15042775 16551241 18005184
41386 18005184 19368518 20605218 21677516 22549589 23197844 23620452 23838494 23889707 23823140
41377 23823140 23699888 23595170 23592394 23765752 24157241 24758035 25502262 26277217 26948655 27392738
41367 27392738 27521920 27295927 26719049 25832129 24705899 23435333 22130113 20898397 19827433
41358 19827433 18969063 18336442 17911523 17657818 17533532 17503219 17546151 17657593 17841115 18096308
41348 18096308 18410113 18756427 19102453 19417581 19681063 19884582 20025994 20095907 20066490 19893200
41338 19893200 19530843 18953537 18164837 17191739 16067458 14815013 13442705 11953894 10362498
41329 10362498 8701142 7016218 5356386 3765246 2281286 939238 -232357 -1214588
41321 -1214588 -1996118 -2564676 -2898506 -2965250 -2730424 -2171257 -1288196 -107050 1330151
41312 1330151 2980017 4808767 6793194 8913535 11145090 13454154 15799181 18134536
41304 18134536 20413340 22587886 24609877 26434737 28030007 29380333 30479962 31313671
41296 31313671 31840227 31995134 31716865 30983512 29838799 28392752 26797082 25208187 23754074
41287 23754074 22515620 21523748 20768805 20216497 19822650 19538319 19303265 19038184 18651475
41278 18651475 18065198 17246109 16220594 15064318 13875556 12748901 11760005 10961411 10383351
41269 10383351 10034328 9901867 9958000 10171649 10522290 11005089 11623657 12377102 13252351
41260 13252351 14226374 15273843 16372590 17503397 18646563 19780142 20882206 21935298
41252 21935298 22929026 23858211 24716754 25489252 26144177 26634141 26907384 26927935 26694759
41243 26694759 26250082 25673774 25067048 24530373 24140571 23933141 23895470 23972382 24080830 24129026
41233 24129026 24035320 23741792 23218587 22460161 21479196 20303148 18973627 17546603 16092151
41224 16092151 14691636 13428526 12372348 11563287 11007967 10688617 10576345 10637698 10833028
41215 10833028 11114555 11431997 11746501 12046430 12355942 12729597 13233096 13918497 14805752
41206 14805752 15877533 17085261 18359844 19623606 20804047 21848696 22735379 23471088
41198 23471088 24078357 24575383 24958877 25196588 25233038 25008676 24487529 23681792 22659065
41189 22659065 21524967 20388240 19326568 18369835 17505176 16696579 15908629 15126344 14364438
41180 14364438 13660692 13054948 12566331 12185059 11884948 11645834 11467433 11364316 11347129
41171 11347129 11404508 11497143 11565269 11543424 11376361 11033890 10523234 9894556 9233972 8643045
41161 8643045 8210888 7989038 7978392 8132909 8377546 8630826 8820790 8890029 8794749 8505512
41151 8505512 8011944 7327939 6493161 5569040 4629546 3748682 2988929 2395495 1998425
41142 1998425 1820200 1883581 2214381 2835805 3754910 4946398 6342036 7832842 9286341
41133 9286341 10574256 11599970 12314220 12714133 12830784 12715254 12428983 12037505 11604604
41124 11604604 11185923 10821912 10530120 10299446 10092863 9862926 9575142 9226390 8848130
41115 8848130 8494649 8225142 8088409 8113370 8304428 8641159 9083725 9584541 10102300 10611969
41105 10611969 11107147 11596923 12100866 12642017 13235520 13874669 14522597 15117520 15591255
41096 15591255 15892606 16005371 15953874 15793417 15589050 15393179 15234467 15121823 15054708 15028015
41086 15028015 15030162 15043107 15049940 15043833 15027432 15000427 14944702 14819601 14573039 14164484 13588407
41075 13588407 12884826 12129566 11409338 10796486 10336002 10045665 9921220 9940907 10071489
41066 10071489 10279955 10548179 10880949 11300551 11831688 12487566 13264283 14141447 15084078
41057 15084078 16046059 16978997 17844846 18622633 19301680 19865807 20281750 20500201 20465988
41048 20465988 20128380 19447736 18402144 16998789 15289615 13384887 11455690 9718109
41040 9718109 8397969 7684427 7688085 8418621 9787711 11632339 13749227 15932512 18008270
41031 18008270 19858357 21426792 22708429 23728099 24520950 25119655 25547754 25816425 25924378
41022 25924378 25862360 25622239 25206710 24632896 23925319 23101235 22158633 21076621 19828953
41013 19828953 18402188 16808837 15091455 13318609 11575070 9949272 8522516 7363681
41005 7363681 6528990 6062890 5996677 6344428 7097642 8221170 9654565 11321694 13145268
40996 13145268 15056872 16995634 18898728 20694216 22304307 23658966 24713557 25461584
40988 25461584 25933963 26181529 26248267 26151350 25881218 25421709 24778027 23997004 23168442 22404228
40978 22404228 21802809 21417091 21244768 21246459 21378012 21615349 21959082 22421886 23010971 23717058
40968 23717058 24515132 25375905 26282054 27240280 28281276 29445852 30764010 32238527 33841122
40959 33841122 35520038 37210633 38841331 40334181 41605440 42572037 43165214 43347372
40951 43347372 43125957 42560087 41758942 40872471 40073327 39528612 39364484 39634417 40305144
40942 40305144 41268609 42376712 43485559 44492354 45351946 46069737 46679146 47218420 47718696
40933 47718696 48204459 48697278 49211946 49742456 50247204 50648237 50852215 50785460 50424749
40924 50424749 49809044 49030878 48216799 47506226 47032367 46906134 47205161 47969481 49201960
40915 49201960 50870023 52908642 55227702 57724587 60297972 62858476 65336244 67688090
40907 67688090 69903709 72007077 74051137 76108593 78262601 80598159 83193985 86117530
40899 86117530 89426821 93177961 97431452 102251289 107697374 113816277 120633801 128149365
40891 128149365 136331494 145115148 154402042 164064389 173952129 183902460 193747516 203314131
40883 203314131 212412721 220819281 228259655 234405607 238890379 241348538 241477881 239109023
40875 239109023 234258313 227142622 218150609 207783413 196585948 185085708 173746581
40868 173746581 162938149 152918503 143828572 135696739 128454789 121968083 116079187 110653410
40860 110653410 105606247 100899820 96517110 92439190 88644044 85122347 81890611 78988843
40852 78988843 76467306 74375460 72760220 71669943 71155397 71261793 72013069 73396003
40844 73396003 75352700 77785673 80574186 83597612 86760260 90010294 93345575 96804523
40836 96804523 100447717 104339319 108534671 113075694 117993225 123314490 129072867 135316229
40828 135316229 142110521 149536969 157683998 166637207 176469974 187233450 198942548 211558486
40820 211558486 224974625 239012402 253426498 267911411 282103173 295578460 307861135
40813 307861135 318448190 326861320 332717488 335797437 336085596 333765348 329174387 322741093
40805 322741093 314924520 306170453 296884533 287418054 278062529 269050148 260556166 252698856
40797 252698856 245536589 239067526 233238478 227963355 223144330 218687799 214512539 210552974
40789 210552974 206761145 203107690 199579446 196173162 192890235 189739168 186746034 183963690
40781 183963690 181469560 179351643 177691583 176552543 175973005 175966139 176527262 177649732 179341821
40772 179341821 181633730 184570025 188190767 192506602 197472330 202965956 208782062 214642822
40764 214642822 220219083 225150081 229059315 231577073 232382190 231261534 228166185 223235916
40756 223235916 216776712 209200485 200953172 192456375 184073821 176099758 168759659 162214040
40748 162214040 156560749 151836467 148021083 145047685 142817933 141220267 140147297 139508695
40740 139508695 139237990 139295301 139669551 140380325 141474802 143015139 145057672 147632164 150731963
40731 150731963 154322095 158362945 162836803 167761367 173183263 179158928 185736260 192943706
40723 192943706 200783655 209225163 218195452 227571436 237169450 246730806 255907525 264261387
40715 264261387 271290215 276485083 279407178 279762945 277455817 272600747 265499088 256582341
40707 256582341 246341372 235260155 223768251 212216590 200873308 189933291 179534333
40700 179534333 169771555 160703620 152352326 144705603 137731354 131396186 125673720 120534627
40692 120534627 115928304 111774027 107969270 104406600 100986131 97620379 94238396 90794220
40684 90794220 87274429 83694688 80083273 76462225 72840249 69221759 65623831 62088787
40676 62088787 58685741 55501345 52623801 50126222 48056385 46436222 45265934 44522969
40668 44522969 44153329 44065603 44141226 44261332 44334264 44305809 44148510 43841607 43355494 42646441
40658 42646441 41660718 40347333 38678583 36671893 34400732 31986595 29577016 27322578
40650 27322578 25360606 23802248 22717577 22121654 21971122 22176617 22626398 23211724 23846969
40641 23846969 24481019 25097618 25703923 26311059 26915140 27487262 27976615 28325779 28493610
40632 28493610 28477807 28326494 28129568 27989531 27983989 28138588 28423331 28771565 29109860 29384471
40622 29384471 29573755 29682246 29720421 29683086 29541584 29255812 28797398 28168223 27403968 26563249
40612 26563249 25709716 24895592 24153091 23495060 22919192 22407596 21921135 21399653 20780282
40603 20780282 20031602 19184224 18335502 17620585 17162202 17023878 17189691 17579462 18088137
40594 18088137 18625034 19132292 19579616 19948353 20219974 20375323 20402166 20305052 20111191 19867905
40584 19867905 19632603 19461699 19403916 19496293 19757184 20175823 20706028 21271799 21784402 22163021
40574 22163021 22350946 22323604 22088218 21675832 21127164 20475523 19732595 18884360 17902192
40565 17902192 16767205 15497444 14163679 12884355 11800530 11040953 10689813 10765401 11211707
40556 11211707 11903301 12666505 13319683 13726195 13840513 13724933 13528068 13436981 13625910
40547 13625910 14219832 15278764 16799187 18725467 20963620 23391437 25863782 28218269
40539 28218269 30288477 31926074 33024306 33532135 33453997 32838679 31763962 30320405 28593954
40530 28593954 26648170 24511736 22179683 19632604 16867724 13926171 10900864 7921198
40522 7921198 5125022 2633262 534615 -1122863 -2338884 -3165785 -3703663 -4080274 -4419579
40513 -4419579 -4811300 -5293862 -5854609 -6442267 -6984221 -7404416 -7639691 -7651134 -7427438 -6982439
40503 -6982439 -6352625 -5596235 -4787818 -4002282 -3292841 -2676330 -2136016 -1638899 -1154948
40494 -1154948 -667732 -175252 313892 785257 1224825 1627505 2003790 2377685 2773875
40485 2773875 3200728 3639050 4041929 4344578 4481073 4405198 4110137 3637801 3069493 2498622
40475 2498622 1997383 1593919 1270651 982724 685905 361410 29348 -252439 -404247
40466 -404247 -351663 -54628 475198 1178577 1972185 2777662 3540497 4231986 4839983 5360439
40456 5360439 5797390 6168808 6509599 6866720 7289731 7823003 8500530 9339366 10330171
40447 10330171 11430110 12564890 13641241 14565321 15261885 15691042 15858883 15815888 15638327
40438 15638327 15396383 15123646 14806494 14401877 13873234 13221072 12488724 11741540 11033852
40429 11033852 10381624 9751476 9067872 8234791 7166070 5818423 4220480 2488269 815277
40420 815277 -568556 -1458071 -1728373 -1360344 -430087 925508 2549835 4302068 6080256
40411 6080256 7827874 9523768 11161389 12727082 14186888 15487818 16573831 17408992
40403 17408992 17994827 18371608 18604100 18762372 18909341 19098625 19377655 19788665 20364388
40394 20364388 21120271 22046768 23104563 24225020 25317341 26280969 27018283 27443348 27487325
40385 27487325 27103874 26274704 25011490 23351893 21352723 19085186 16634240 14100144
40377 14100144 11598273 9252501 7179586 5468625 4165613 3270183 2741695 2507364
40369 2507364 2471447 2530632 2595475 2607561 2542512 2401844 2206618 2000945 1860098 1890529
40359 1890529 2213828 2937811 4126335 5779780 7831330 10156726 12593038 14964087
40351 14964087 17109528 18909249 20292797 21231434 21722561 21779182 21427982 20710097 19678772
40342 19678772 18394524 16920785 15319756 13646530 11942333 10230278 8515141 6786143
40334 6786143 5022563 3203196 1317774 -625691 -2601952 -4575338 -6506190 -8354724
40326 -8354724 -10084993 -11669700 -13090770 -14330732 -15358950 -16125065 -16569036 -16643241 -16330810
40317 -16330810 -15647327 -14628135 -13315625 -11758596 -10022432 -8198264 -6400080 -4747481
40309 -4747481 -3340602 -2237322 -1441158 -902938 -533887 -225549 127710 607854 1259457
40300 1259457 2087651 3067235 4157331 5314969 6504031 7699347 8887487 10065422
40292 10065422 11236241 12399755 13538879 14609062 15540429 16255581 16695063 16837481 16705417
40283 16705417 16356291 15863596 15296790 14708018 14130386 13586677 13102007 12711795 12458953
40274 12458953 12381745 12501487 12819483 13323535 13995194 14810248 15734270 16720123 17710195
40265 17710195 18640892 19447476 20070547 20464632 20605894 20494822 20152111 19608495 18891092
40256 18891092 18010595 16954155 15686789 14161349 12335600 10193494 7764587 5133698
40248 5133698 2435839 -162307 -2488547 -4391920 -5763066 -6543042 -6720682 -6324730 -5417275
40239 -5417275 -4088767 -2449762 -617003 1301733 3217209 5059931 6775439 8317567
40231 8317567 9642704 10708047 11476220 11925034 12055778 11892531 11471248 10825260 9975797
40222 9975797 8931336 7693847 6268249 4672573 2947448 1163609 -574484 -2132225
40214 -2132225 -3359431 -4116361 -4304781 -3892952 -2925519 -1516191 173187 1961651 3680211
40205 3680211 5198483 6440233 7383074 8041728 8440749 8589519 8473797 8069507 7369452
40196 7369452 6404468 5245875 3991308 2747184 1618453 704467 92178 -158264 -30522
40187 -30522 438041 1159438 2010753 2859164 3591625 4141711 4504292 4732209 4916398 5156304
40177 5156304 5529200 6067927 6756115 7544664 8382916 9249328 10165986 11189434 12382206
40168 12382206 13779406 15367166 17082327 18830218 20509553 22034781 23351377 24442118
40160 24442118 25322462 26025686 26583571 27011425 27304264 27445579 27424449 27252435 26970178
40151 26970178 26637288 26308155 26005996 25710785 25370005 24928006 24358964 23687060 22984965
40142 22984965 22352344 21884389 21643910 21648020 21872062 22263748 22757112 23280797 23761740 24126865
40132 24126865 24303532 24220847 23816923 23054741 21938810 20517638 18864210 17045424 15104047
40123 15104047 13068835 10984526 8934594 7033823 5391851 4071814 3070485 2328751
40115 2328751 1760800 1282817 828273 348235 -196279 -839870 -1609716 -2515731 -3542733
40106 -3542733 -4652263 -5793108 -6913060 -7966326 -8917085 -9741275 -10425621 -10962569 -11344243
40097 -11344243 -11561008 -11605714 -11478623 -11188494 -10751252 -10190330 -9539130 -8840919 -8141089
40088 -8141089 -7471335 -6831621 -6179403 -5433220 -4490254 -3251691 -1650415 321601 2592780
40079 2592780 5011981 7379147 9497987 11224884 12491231 13296670 13688124 13740428 13544165
40070 13544165 13197104 12793166 12406352 12073601 11785944 11496176 11142587 10677849 10088266
40061 10088266 9394419 8635632 7849560 7058010 6262756 5448722 4591678 3669976 2678370
40052 2678370 1638214 598632 -371900 -1200433 -1827632 -2224336 -2398777 -2388498 -2240851
40043 -2240851 -1994575 -1672700 -1286945 -847056 -368852 122552 596022 1022846 1385481
40034 1385481 1681597 1922926 2131552 2335143 2560681 2828084 3147750 3524034 3961109
40025 3961109 4465461 5043655 5699544 6434765 7249973 8139995 9080488 10013764 10846733
40016 10846733 11467752 11776432 11712465 11271748 10506358 9511323 8403217 7295615 6277261
40007 6277261 5399066 4673537 4084311 3598107 3172099 2757022 2302994 1773187 1160947
39998 1160947 498816 -148778 -706771 -1114324 -1343049 -1403728 -1341840 -1225184 -1127574 -1111885
39988 -1111885 -1214738 -1435407 -1732773 -2033161 -2247574 -2292096 -2105097 -1658803 -965887 -80263
39978 -80263 911180 1907380 2817495 3580882 4174454 4606744 4904685 5100533 5223201 5294651
39968 5294651 5330209 5340437 5331271 5300147 5230586 5092193 4850900 4485368 3998548 3417061
39958 3417061 2781774 2138987 1537254 1026795 656105 464399 472394 674634 1036098 1495515
39948 1495515 1975720 2397217 2689502 2797749 2686864 2344538 1781821 1029581 133863
39939 133863 -844467 -1825392 -2708408 -3382998 -3751504 -3755847 -3397763 -2746924 -1935015 -1134444
39929 -1134444 -522636 -239815 -354980 -853742 -1651682 -2624334 -3638496 -4572879 -5325879
39920 -5325879 -5816320 -5983672 -5789494 -5218629 -4279601 -3004615 -1447500 323268 2235631
39911 2235631 4223723 6232066 8215426 10137673 11969869 13685962 15257636 16652652
39903 16652652 17838142 18785663 19475055 19898333 20065922 20013443 19803384 19517875 19244558
39894 19244558 19062164 19031564 19192241 19558655 20111957 20790349 21487818 22067981 22389667
39885 22389667 22334522 21829517 20862455 19488480 17822145 16012022 14205025 12516281 11017159
39876 11017159 9740884 8693984 7862646 7212964 6692320 6237759 5788811 5295563 4715026
39867 4715026 3998380 3080745 1885452 345595 -1566231 -3814728 -6296242 -8852419
39859 -8852419 -11296325 -13440782 -15121451 -16213065 -16641130 -16390504 -15508940 -14103123 -12326947
39850 -12326947 -10363542 -8402494 -6615058 -5133202 -4038590 -3362517 -3092416 -3180045 -3549147
39841 -3549147 -4101630 -4721888 -5282157 -5655263 -5737835 -5477552 -4891262 -4064239 -3130514 -2242368
39831 -2242368 -1539470 -1126090 -1059811 -1349458 -1956912 -2799520 -3755465 -4678833 -5429126 -5910458
39821 -5910458 -6104239 -6076550 -5953264 -5874255 -5947673 -6220471 -6670837 -7221169 -7766265 -8206111
39811 -8206111 -8469704 -8522087 -8358359 -7994911 -7464361 -6813010 -6096425 -5370582 -4679308 -4041636
39801 -4041636 -3444856 -2848248 -2196888 -1438535 -535968 527124 1743188 3078413 4473159
39792 4473159 5848370 7117348 8199187 9031734 9583406 9860201 9900974 9758317 9473046
39783 9473046 9057195 8496650 7773896 6900980 5946417 5039387 4343179 4006136 4112154
39774 4112154 4653651 5537670 6619843 7749862 8809403 9729603 10487264 11089602 11559749
39765 11559749 11929436 12237755 12530668 12855725 13250745 13731660 14288129 14890695 15504527
39756 15504527 16101139 16663733 17187201 17674937 18133386 18564871 18959226 19284833 19482435
39747 19482435 19469322 19159615 18495121 17470502 16138664 14595840 12957096 11333409 9815657
39738 9815657 8467025 7323799 6402045 5704568 5222797 4932942 4790852 4731523 4676623
39729 4676623 4549318 4292366 3883697 3344040 2733878 2141152 1664249 1394826 1403375 1729539
39719 1729539 2379343 3329891 4538114 5948066 7494086 9102350 10695304 12200486
39711 12200486 13561204 14745091 15747296 16586585 17294978 17904972 18440263 18913522 19329443
39702 19329443 19688086 19985756 20215388 20369737 20447123 20455463 20411115 20333531 20239343 20138232
39692 20138232 20030422 19905190 19740445 19503398 19152187 18639785 17922511 16973610 15798235
39683 15798235 14444043 13003077 11603209 10389070 9494387 9011394 8966689 9312804 9939808
39674 9939808 10703538 11460338 12095293 12534020 12736898 12684567 12367156 11783551 10946763 9887099
39664 9887099 8649714 7290010 5870269 4455246 3102670 1850563 709808 -331144
39656 -331144 -1290759 -2175429 -2964175 -3601180 -3998814 -4052958 -3669043 -2791541 -1425180 362868
39646 362868 2462770 4755060 7140159 9549828 11937742 14258604 16449607 18423865
39638 18423865 20078331 21313064 22054811 22275744 22000036 21297935 20274508 19061074 17809655
39629 17809655 16682743 15831964 15369310 15343078 15728880 16437928 17338860 18288228 19163548
39620 19163548 19889469 20447626 20867632 21205676 21520293 21851253 22203862 22541293 22789322
39611 22789322 22856100 22663037 22175743 21421349 20483818 19479795 18526872 17717252 17103392
39602 17103392 16695441 16467981 16373434 16357456 16369775 16367065 16311790 16174857 15945090 15639246
39592 15639246 15301736 14987778 14734533 14534466 14326995 14015766 13504503 12734541 11708577
39583 11708577 10494629 9212648 8009560 7029368 6386033 6146233 6324908 6891010 7777862
39574 7777862 8893634 10132001 11387084 12575044 13655552 14638478 15566595 16482392 17399277
39565 17399277 18291640 19102883 19762642 20207046 20397971 20333995 20046159 19580769 18980780
39556 18980780 18275922 17482583 16608526 15658404 14638522 13559755 12437907 11292328 10144450
39547 10144450 9016562 7929979 6902271 5944329 5058316 4237314 3467559 2733827 2027540
39538 2027540 1355163 742320 228592 -148276 -372423 -462073 -464778 -437821 -426581 -454062
39528 -454062 -524896 -636302 -786295 -976509 -1214161 -1516956 -1918151 -2465499 -3211556 -4198658
39518 -4198658 -5443356 -6924009 -8575587 -10296653 -11969640 -13487874 -14778511 -15813556
39510 -15813556 -16607581 -17205168 -17662942 -18031426 -18340580 -18590241 -18746604 -18748860 -18530001 -18047755
39500 -18047755 -17311058 -16387036 -15385750 -14433883 -13651589 -13138154 -12962687 -13153756 -13686641
39491 -13686641 -14473313 -15363972 -16167388 -16689754 -16781005 -16370778 -15480095 -14207415 -12699650
39482 -12699650 -11121424 -9630436 -8360361 -7409874 -6836141 -6651652 -6824673 -7285445 -7939402
39473 -7939402 -8684215 -9423613 -10072961 -10558533 -10817749 -10806091 -10509685 -9956025 -9214430 -8383146
39463 -8383146 -7567221 -6854599 -6295552 -5888109 -5573365 -5246397 -4784186 -4082393 -3087092
39454 -3087092 -1811207 -333417 1218043 2693419 3955958 4914281 5543250 5888019 6051083
39445 6051083 6165402 6359186 6721387 7279544 7999592 8808935 9632398 10422474 11167722
39436 11167722 11877052 12553885 13179590 13716121 14122503 14372074 14461534 14411757 14264694 14077995
39426 14077995 13915164 13830786 13856844 13998872 14244499 14576823 14981879 15445838 15946398 16445956
39416 16445956 16891659 17222769 17381395 17320591 17006963 16421208 15561860 14451223 13136420
39407 13136420 11681631 10156657 8629728 7166087 5827915 4672354 3747736 3087231
39399 3087231 2697548 2544413 2544005 2571045 2486557 2177559 1594551 772563 -173188 -1076830
39389 -1076830 -1766329 -2107107 -2031315 -1547568 -734317 276433 1320102 2224101 2836075
39380 2836075 3052158 2836320 2220995 1286957 132213 -1154271 -2503783 -3865476 -5198861
39371 -5198861 -6468271 -7642480 -8701313 -9648256 -10520378 -11382403 -12301148 -13314434 -14415216
39362 -14415216 -15557959 -16675382 -17690362 -18520195 -19081191 -19299301 -19123525 -18534523 -17543876
39353 -17543876 -16185541 -14506017 -12560850 -10420070 -8176135 -5942461 -3835745 -1947466
39345 -1947466 -318842 1068447 2283237 3423353 4589172 5857553 7260088 8770414
39337 8770414 10304947 11738479 12932202 13768327 14181703 14176294 13817902 13205994 12439255
39328 12439255 11591528 10705807 9802691 8894607 7998641 7144376 6375279 5742774 5293436
39319 5293436 5053670 5020053 5161642 5431932 5781167 6162904 6537570 6878069 7175324 7436449
39309 7436449 7673313 7888515 8067752 8181516 8193317 8070094 7790703 7349021 6751250 6011714
39299 6011714 5152508 4208358 3232668 2298786 1492862 899440 585815 591959 928053 1575540
39289 1575540 2487162 3586337 4769804 5915757 6896676 7595518 7923347 7833423 7325276
39280 7325276 6437149 5232164 3784700 2168800 448338 -1327243 -3115520 -4863190
39272 -4863190 -6490861 -7896543 -8981372 -9683171 -9996462 -9968400 -9678145 -9215991 -8671723
39263 -8671723 -8129195 -7659700 -7312107 -7103875 -7016657 -6996791 -6960604 -6805858 -6428865 -5742116
39253 -5742116 -4686315 -3235954 -1403055 757693 3146274 5625297 8042460 10261711
39245 10261711 12190577 13792269 15078831 16090704 16874436 17471120 17921485 18281326 18632067
39236 18632067 19074423 19706770 20600718 21784882 23239131 24896960 26655373 28391887
39228 28391887 29983974 31324119 32328772 32945275 33158991 32995433 32510500 31769860 30827752
39219 30827752 29715880 28444903 27013434 25418984 23668168 21783256 19799546 17751220
39211 17751220 15654233 13501779 11279789 8992437 6679613 4416949 2302421 437732
39203 437732 -1090066 -2222742 -2936819 -3241185 -3170754 -2778433 -2122946 -1253408 -200968
39194 -200968 1012053 2350188 3749046 5121228 6381613 7475780 8395345 9173454 9864717
39185 9864717 10521634 11180913 11865767 12598609 13411344 14343229 15426254 16667896 18043655
39176 18043655 19504725 20994308 22460034 23855293 25133294 26243065 27132535 27756493
39168 27756493 28083698 28099167 27801664 27199699 26310084 25160609 23794483 22271951 20665749
39159 20665749 19050517 17490278 16029935 14694992 13498953 12453715 11577202 10893883
39151 10893883 10425852 10176561 10116403 10182980 10301253 10412439 10490561 10533549 10536132 10466320
39141 10466320 10263189 9856143 9191064 8248207 7046912 5640852 4107837 2534865 999752
39132 999752 -444895 -1778131 -3004558 -4138893 -5188063 -6138211 -6952087 -7577594 -7962990
39123 -7962990 -8071856 -7892914 -7442645 -6759971 -5894407 -4893293 -3795948 -2638254 -1462641
39114 -1462641 -323630 717779 1609419 2323862 2863544 3249301 3498347 3607399 3554270
39105 3554270 3316825 2894330 2316167 1635089 912979 206580 -445257 -1031719 -1570945
39096 -1570945 -2094886 -2621957 -3133632 -3571218 -3856046 -3922191 -3746349 -3363715 -2865667 -2380767
39086 -2380767 -2044383 -1964635 -2194072 -2717692 -3464933 -4342659 -5272901 -6215078 -7162954 -8122631
39076 -8122631 -9086464 -10016241 -10843299 -11486334 -11879112 -11993708 -11847916 -11496825 -11017097
39067 -11017097 -10491246 -9993734 -9580090 -9282428 -9112144 -9063620 -9111177 -9200000 -9241836 -9126212
39057 -9126212 -8747025 -8032982 -6968156 -5595377 -4003262 -2302912 -602554 1011348
39049 1011348 2481677 3778633 4894140 5836443 6623337 7272010 7789077 8167936 8396456
39040 8396456 8470632 8406940 8248387 8061024 7918813 7879513 7961794 8135842 8331317 8455944
39030 8455944 8415476 8131585 7558650 6697990 5603504 4372535 3121347 1952316 926129
39021 926129 52612 -694660 -1349108 -1925704 -2413415 -2784744 -3009812 -3063116 -2921505 -2561328
39011 -2561328 -1963216 -1125013 -74099 1131768 2418191 3714336 4967181 6143483
39003 6143483 7223316 8193310 9044104 9770493 10370268 10839680 11167420 11332233 11309820
38994 11309820 11090432 10700231 10212552 9737199 9388553 9248142 9341792 9641515 10086977
38985 10086977 10613228 11173578 11751868 12361364 13030166 13778530 14598743 15447534 16254070
38976 16254070 16939011 17435560 17703011 17727720 17515145 17083120 16463104 15704957 14874400
38967 14874400 14038929 13250161 12534739 11898711 11340701 10865731 10494186 10264748 10232623
38958 10232623 10464343 11028240 11978572 13334627 15061989 17065609 19199582 21290686
38950 21290686 23167793 24689394 25764209 26362973 26521605 26336080 25948282 25523286 25223265
38941 25223265 25186933 25519873 26291727 27530464 29209089 31231507 33430578 35586660 37464159
38932 37464159 38855451 39619642 39705654 39153670 38076825 36633494 35002191 33362448 31875107
38923 31875107 30657028 29757380 29149745 28745787 28422003 28047651 27510350 26741195 25735141
38914 25735141 24554414 23306589 22104646 21030028 20118906 19375795 18798494 18390054 18145555
38905 18145555 18025246 17939852 17765168 17380183 16706660 15729410 14490126 13061986 11520520
38896 11520520 9926214 8326102 6769770 5327121 4095575 3191016 2724765 2774956 3363161
38887 3363161 4444909 5916774 7636560 9449439 11212248 12810276 14165909 15243159
38879 15243159 16051031 16641480 17092758 17475625 17815377 18072795 18159498 17981428 17485438
38870 17485438 16684299 15653409 14510428 13390954 12422742 11695480 11231876 10976461 10814396
38861 10814396 10614096 10272384 9741460 9029012 8175053 7217430 6162394 4975346 3596934
38852 3596934 1976049 103160 -1970854 -4137296 -6252108 -8169598 -9774306 -10998450
38844 -10998450 -11819204 -12240613 -12273866 -11931098 -11238744 -10259869 -9103373 -7904576 -6783989
38835 -6783989 -5809456 -4983500 -4257330 -3556599 -2804773 -1940144 -927981 233368 1516615
38826 1516615 2880901 4292229 5737653 7223834 8759226 10329484 11880375 13318372
38818 13318372 14530054 15413264 15908448 16018503 15810565 15401870 14937661 14567676 14422999
38809 14422999 14594577 15118463 15973719 17093596 18384075 19741761 21065415 22260123
38801 22260123 23238805 23928758 24286158 24310731 24047513 23569902 22951648 22242097 21455301
38792 21455301 20575742 19576745 18442942 17186396 15849914 14498858 13207518 12045212
38784 12045212 11064729 10295525 9743968 9399543 9241584 9241513 9361412 9554874 9774860 9986422
38774 9986422 10176638 10355244 10545749 10771944 11045394 11358201 11684754 11993905 12266439
38765 12266439 12506450 12737923 12989229 13277434 13602055 13947872 14289148 14588779 14792825
38756 14792825 14827645 14609078 14067274 13178835 11988550 10605958 9176808 7844278 6717845
38747 6717845 5859003 5281978 4962687 4850518 4881005 4989126 5122137 5248801 5360647 5463271
38737 5463271 5561849 5650490 5713660 5738249 5725392 5691472 5658347 5642855 5655269 5707050 5820341
38726 5820341 6031385 6384504 6917552 7643057 8533157 9517787 10499584 11377986 12069439
38717 12069439 12517014 12693661 12605585 12294749 11833853 11312279 10819862 10435684 10221941
38708 10221941 10219225 10443454 10887891 11529787 12335202 13257030 14229765 15170819 15994851 16636984
38698 16636984 17071935 17317216 17419844 17438059 17430779 17457110 17577733 17849957 18316101 18990610
38688 18990610 19851076 20836922 21859092 22821051 23644084 24284778 24736417 25016895 25153947
38679 25153947 25177094 25116525 25001573 24852591 24668686 24420725 24056752 23518198 22758123 21751942
38669 21751942 20494843 18986703 17214447 15147608 12756820 10047331 7085838 4003246
38661 4003246 974153 -1812829 -4182012 -5993131 -7162525 -7681671 -7625214 -7139807 -6411891
38652 -6411891 -5622719 -4905864 -4321487 -3854573 -3436405 -2982384 -2433329 -1782743 -1075692
38643 -1075692 -379855 252863 810221 1317214 1814544 2335370 2893954 3488516 4111288
38634 4111288 4755884 5416470 6081214 6728257 7330155 7863964 8317514 8685125 8955668
38625 8955668 9102974 9086903 8865237 8409301 7714833 6803985 5720382 4522250 3276614
38616 3276614 2053084 914223 -96447 -962230 -1690267 -2298297 -2799944 -3198522 -3492115
38607 -3492115 -3683000 -3781045 -3795837 -3722045 -3529370 -3167820 -2590967 -1788366 -810692 226987
38597 226987 1167336 1849404 2149923 2015810 1480167 655953 -293632 -1198766 -1922740 -2383635
38587 -2383635 -2557297 -2470944 -2194161 -1825652 -1472459 -1224934 -1136884 -1218738 -1444486 -1766934
38577 -1766934 -2133708 -2498413 -2825649 -3092441 -3289393 -3422468 -3513583 -3597262 -3711107 -3880255
38567 -3880255 -4100958 -4333424 -4512398 -4572747 -4475401 -4218639 -3832365 -3365667 -2878037 -2434706
38557 -2434706 -2099637 -1923232 -1930033 -2114594 -2449274 -2900491 -3445736 -4083409 -4831264 -5715899
38547 -5715899 -6761379 -7984017 -9392456 -10985892 -12746653 -14632618 -16578351 -18506201
38539 -18506201 -20339821 -22013337 -23477295 -24705254 -25698554 -26481431 -27084196 -27523585 -27793616
38530 -27793616 -27872114 -27736208 -27375642 -26797807 -26026315 -25098404 -24063745 -22982141 -21915552
38521 -21915552 -20913518 -19997178 -19150191 -18322150 -17444171 -16451561 -15306801 -14016551 -12637492
38512 -12637492 -11267709 -10024820 -9018746 -8331020 -8007471 -8058889 -8457100 -9122281 -9914067
38503 -9914067 -10644282 -11114271 -11159661 -10681143 -9653919 -8122990 -6192509 -4009340 -1737101
38494 -1737101 477663 2537170 4409077 6120734 7734215 9313985 10900523 12497851
38486 12497851 14077003 15593912 17016074 18345754 19624655 20913566 22257671 23659587
38478 23659587 25076698 26441611 27689930 28778820 29690759 30427585 31002374 31433040 31738456
38469 31738456 31938124 32055696 32123091 32179617 32263950 32402900 32603068 32848880 33107494 33339691
38459 33339691 33513527 33614322 33645235 33619130 33548499 33439884 33294059 33109518 32887003 32634162
38449 32634162 32369409 32123217 31934673 31842280 31871443 32025300 32285959 32626749 33027068 33478749
38439 33478749 33979512 34519050 35067539 35572432 35962350 36153462 36056307 35585552 34675710
38430 34675710 33300192 31484874 29307811 26885084 24350976 21840975 19479421 17368243
38422 17368243 15575231 14125732 13002944 12157161 11519807 11018869 10595339 10219048 9898055
38413 9898055 9675770 9616816 9788993 10247658 11023246 12110531 13461501 14986653 16567610
38404 16567610 18078924 19412538 20496665 21302661 21838552 22133574 22220656 22122394 21843976
38395 21843976 21375200 20701396 19818545 18744607 17520910 16203757 14852484 13521598
38387 13521598 12260801 11120271 10153685 9412044 8927392 8693375 8653497 8705195 8720549
38378 8720549 8577070 8188561 7526371 6624457 5567128 4466164 3439652 2601762 2061432
38369 2061432 1919220 2254706 3107112 4457825 6221737 8251121 10354073 12325174 13978943
38360 13978943 15175221 15833422 15939576 15547439 14768867 13751347 12650269 11606913 10736057
38351 10736057 10119855 9805469 9808043 10119729 10720502 11584003 12674239 13934868 15279337
38342 15279337 16593602 17757996 18681535 19330928 19738720 19988322 20185746 20430049 20789999
38333 20789999 21290141 21907579 22579221 23217266 23729571 24041234 24112897 23949973 23598211
38324 23598211 23126939 22609037 22109390 21686947 21404069 21330633 21534638 22061538 22912156
38315 22912156 24029979 25304843 26594255 27756384 28682232 29313924 29643964 29700956 29531891
38306 29531891 29187166 28709202 28125078 27445601 26671243 25799390 24825936 23741504 22531485
38297 22531485 21188203 19732256 18229125 16786736 15529663 14558752 13913762 13557218
38289 13557218 13388148 13279157 13118889 12842157 12439259 11945631 11418396 10909716 10448559
38280 10448559 10038555 9668920 9326317 8997299 8661804 8286997 7829783 7248947 6521434
38271 6521434 5655183 4692459 3702080 2764888 1959994 1355761 1002841 924895 1108980 1504716
38261 1504716 2039024 2641833 3268121 3903124 4549312 5205844 5854800 6462227 6991763
38252 6991763 7421168 7752246 8011556 8246541 8522128 8915605 9501671 10324359 11366598
38243 11366598 12537554 13690923 14667906 15343111 15651943 15591266 15199186 14527182 13618507
38234 13618507 12502659 11207346 9778881 8296192 6867552 5610110 4621554 3955722
38226 3955722 3610844 3533917 3638741 3829792 4022754 4156758 4199252 4146337 4019288 3856795
38216 3856795 3704521 3605608 3594306 3692168 3905605 4224776 4624451 5067218 5509893 5914068
38206 5914068 6258844 6549566 6815810 7097237 7423414 7797434 8191335 8555621 8838565
38197 8838565 9006744 9058761 9028231 8976157 8974432 9083588 9330932 9697462 10119691 10506076
38187 10506076 10762051 10815722 10636818 10242982 9690650 9053834 8400401 7776865 7207055
38178 7207055 6701416 6267903 5915975 5650850 5462384 5317946 5167915 4964953 4688671
38169 4688671 4362702 4055498 3864578 3890330 4207865 4845928 5779636 6937361 8214933
38160 8214933 9489791 10634000 11529009 12081215 12232094 11959171 11272222 10212210 8854829
38151 8854829 7313417 5735284 4289498 3147326 2457339 2318656 2758762 3724571 5094376
38142 5094376 6712464 8438732 10195667 11991474 13905970 16043276 18472374 21182515
38134 21182515 24071505 26968404 29678270 32031230 33919958 35315628 36260650 36844787
38126 36844787 37174973 37346893 37422365 37416005 37296514 37005925 36492275 35742356 34798890 33753308
38116 33753308 32718294 31795366 31053843 30527212 30220167 30115568 30176344 30344371 30540410
38107 30540410 30668378 30626396 30324051 29699515 28727915 27418454 25806103 23943713 21893831
38098 21893831 19717537 17464690 15174817 12890720 10673974 8608553 6789451 5304330
38090 5304330 4216665 3552467 3291360 3367475 3685664 4148049 4674932 5207202 5693940
38081 5693940 6082481 6324320 6393533 6301860 6097511 5848017 5618279 5455576 5386306 5421297
38071 5421297 5562467 5804792 6132926 6517291 6915237 7277708 7556778 7710577 7707302 7531251
38061 7531251 7189177 6712130 6151976 5577202 5070897 4726504 4634231 4856905 5402651 6206438
38051 6206438 7131734 7998016 8628443 8899424 8770435 8283673 7540349 6668982 5797324
38042 5797324 5031713 4444294 4069061 3906505 3933027 4109173 4383591 4695283 4979710 5181562
38032 5181562 5270741 5253177 5167941 5068081 4992839 4947245 4902999 4820939 4680965 4502444 4346670
38021 4346670 4302742 4463056 4897266 5635036 6663695 7937427 9389046 10939138 12503683
38012 12503683 14001699 15362314 16532032 17484282 18228489 18810429 19300151 19774979 20307463
38003 20307463 20957624 21760685 22707749 23730106 24701673 25464981 25872662 25827214 25300747
37994 25300747 24325922 22966539 21289115 19353562 17223945 14985130 12749224 10644606
37986 10644606 8791132 7272619 6119832 5312433 4797551 4513152 4404251 4428717 4557631
37977 4557631 4774916 5075238 5456449 5907575 6399744 6887538 7320963 7660548 7887042
37968 7887042 8002591 8025613 7982719 7898885 7786314 7634729 7408028 7050967 6505208 5729940
37958 5729940 4720491 3518585 2209603 906259 -276740 -1248413 -1958511 -2399853 -2596154
37949 -2596154 -2582881 -2392403 -2050124 -1578366 -1000068 -339632 374491 1102366 1785415 2347990
37939 2347990 2710393 2808599 2613824 2146163 1477152 718630 2223 -540396 -789362 -643609
37929 -643609 -32395 1064635 2597200 4439783 6413261 8327779 10028309 11423210
37921 11423210 12488165 13252325 13779088 14149294 14447512 14749462 15110525 15557367 16084892
37912 16084892 16659987 17232950 17755339 18198225 18561388 18867512 19145491 19414248 19675348
37903 19675348 19913327 20098467 20190977 20149851 19946575 19576990 19063632 18447491 17775502 17091257
37893 17091257 16431566 15825929 15294645 14844372 14463794 14122498 13774111 13364108 12843572
37884 12843572 12187766 11411573 10570091 9739764 8989429 8358653 7854667 7465409 7176406
37875 7176406 6980094 6874604 6857385 6921396 7056876 7255008 7507904 7803956 8123398 8439271
37865 8439271 8723652 8954443 9118980 9214750 9248790 9234930 9186768 9107522 8982241 8778374
37855 8778374 8456711 7989340 7376780 6654430 5882416 5123607 4424094 3808455 3289144
37846 3289144 2878323 2591513 2441715 2429904 2538494 2731324 2959770 3171524 3318768 3365967
37836 3365967 3299034 3133382 2913200 2696877 2534047 2447710 2432133 2466272 2532534 2628906
37826 2628906 2768432 2968851 3240463 3579301 3968233 4384491 4809639 5236143 5665374
37817 5665374 6097015 6516833 6891807 7176274 7324784 7303680 7096472 6703790 6141744 5440066
37807 5440066 4637562 3772966 2874816 1957285 1024721 80684 -864884 -1794052 -2686023
37798 -2686023 -3528185 -4327130 -5108946 -5902964 -6717177 -7523251 -8262986 -8872145 -9306421
37789 -9306421 -9554850 -9634688 -9572424 -9382898 -9058731 -8574983 -7905175 -7039967 -5999197 -4829718
37779 -4829718 -3587319 -2311222 -1007271 348321 1786537 3317942 4914345 6506975
37771 6506975 7999662 9289306 10284303 10915183 11137964 10933997 10308675 9289088 7920884
37762 7920884 6266174 4404253 2434292 475476 -1342008 -2897987 -4107840 -4936619
37754 -4936619 -5390631 -5492814 -5261610 -4707751 -3845983 -2708259 -1349889 149939 1690086
37745 1690086 3154761 4432274 5444768 6176664 6683733 7072694 7459714 7930976 8526254
37736 8526254 9248480 10084931 11022889 12053005 13164613 14340270 15553744 16771655 17956381
37727 17956381 19067292 20059261 20880562 21473878 21782649 21761387 21385646 20656463 19597216
37718 19597216 18247145 16660338 14914869 13125043 11441180 10026647 9018203 8489263
37710 8489263 8434614 8781107 9413960 10203873 11026831 11777136 12376429 12777994 12964414 12940838
37700 12940838 12730121 12373852 11937095 11510460 11202576 11118538 11327291 11833027 12571586
37691 12571586 13440272 14343883 15225285 16061515 16834332 17501478 17989649 18212571 18102662
37682 18102662 17638663 16854593 15826387 14646177 13401019 12167414 11020733 10049733
37674 10049733 9364605 9090558 9345640 10210382 11703034 13771643 16303854 19146506 22126790
37665 22126790 25071935 27827011 30269139 32316015 33928504 35108098 35888904 36324741
37657 36324741 36476490 36406295 36178501 35858933 35505406 35153402 34808729 34454572 34069512
37648 34069512 33646796 33206676 32798211 32491530 32365763 32498706 32959475 33799171 35036156
37639 35036156 36641410 38534436 40593573 42674031 44625152 46305861 47601811 48442693
37631 48442693 48811258 48737196 48278386 47499351 46456265 45192811 43746154 42158297 40484901
37622 40484901 38794483 37157360 35631553 34254627 33044223 32002658 31120027 30375106
37614 30375106 29737101 29169225 28631629 28082747 27483647 26810274 26069557 25306156 24589332
37605 24589332 23984231 23524361 23200498 22968575 22767593 22536122 22221264 21781027 21184600
37596 21184600 20413337 19461651 18337390 17065075 15694925 14311775 13030839 11974072
37588 11974072 11238210 10874307 10888581 11256915 11938640 12881819 14021064 15272011 16526907
37579 16526907 17657093 18527765 19024348 19080973 18697802 17939189 16914127 15747185 14549074
37570 14549074 13394275 12311671 11291403 10304623 9325433 8344116 7369506 6427425 5561910
37561 5561910 4837412 4334326 4133875 4297047 4847156 5763527 6988285 8442925 10047047
37552 10047047 11729480 13425379 15062388 16548567 17775590 18640651 19077449 19080627 18711722
37543 18711722 18083846 17331838 16581221 15929109 15441460 15159535 15104275 15274086 15640894
37534 15640894 16151563 16736681 17323695 17850828 18279450 18602119 18841867 19039055 19227435
37525 19227435 19408916 19540903 19545330 19336259 18852006 18076817 17045388 15833031 14538687
37516 14538687 13266845 12110933 11138409 10378296 9814410 9388746 9016759 8611150 8106903
37507 8106903 7479519 6750600 5979565 5245390 4625310 4176447 3923891 3857739 3940792 4125057
37497 4125057 4369667 4651151 4962171 5303433 5678388 6096665 6582031 7172497 7903729
37488 7903729 8781647 9762700 10757076 11653604 12351568 12785115 12934878 12827555 12525263
37479 12525263 12107999 11655479 11234436 10892375 10655221 10528209 10502251 10564809 10707745 10925058
37469 10925058 11203706 11519401 11844908 12164835 12484017 12823005 13204564 13638538 14110283
37460 14110283 14576806 14974421 15237235 15318694 15206237 14923204 14517483 14040692 13527012
37451 13527012 12984468 12405771 11791490 11168235 10588864 10115054 9792618 9632050 9603480
37442 9603480 9647979 9697663 9692683 9589845 9368241 9037670 8644039 8258655 7948330 7742509
37432 7742509 7620950 7531877 7428720 7302748 7195271 7186897 7371100 7822665 8572103 9595522
37422 9595522 10823501 12163282 13522943 14828358 16029873 17099755 18023415 18789772
37414 18789772 19387517 19809590 20059681 20151337 20097897 19902945 19563151 19084817 18501874 17879480
37404 17879480 17296619 16815337 16452836 16171049 15888538 15508105 14946805 14156278 13128465
37395 13128465 11889061 10484735 8970285 7400096 5825168 4293521 2850571 1537981
37387 1537981 391407 -563594 -1319122 -1894006 -2337107 -2718819 -3114216 -3589176 -4197554
37378 -4197554 -4986226 -5997348 -7260435 -8777584 -10512923 -12395586 -14334872 -16236871
37370 -16236871 -18012828 -19579408 -20858452 -21781421 -22296615 -22374857 -22012277 -21231187 -20079405
37361 -20079405 -18627499 -16963524 -15184103 -13380463 -11621615 -9942826 -8347892 -6825094
37353 -6825094 -5366410 -3977908 -2677681 -1487159 -423881 501306 1284513 1927926 2435974
37344 2435974 2808106 3033851 3097907 2994537 2738968 2362779 1893766 1335389 662416 -162658
37334 -162658 -1162388 -2323188 -3593423 -4902518 -6189192 -7419822 -8584383 -9675068
37326 -9675068 -10667864 -11525579 -12221381 -12761468 -13183898 -13530272 -13810001 -13982444 -13967864 -13678359
37316 -13678359 -13050438 -12064786 -10749366 -9171210 -7424670 -5620046 -3872213 -2289025
37308 -2289025 -961840 40595 678073 947938 894046 607598 214902 -145517 -350746
37299 -350746 -320878 -39358 442174 1019202 1565276 1968014 2160646 2142139 1979074 1784883
37289 1784883 1681876 1762389 2066231 2580330 3253742 4016410 4793669 5514948 6119441 6561714
37279 6561714 6816768 6881120 6768601 6505057 6127601 5687902 5252512 4895277 4684755 4672991
37269 4672991 4887666 5325605 5948483 6686059 7449915 8152782 8724229 9117129 9306613
37260 9306613 9287913 9079262 8730282 8327709 7986097 7818914 7901356 8245420 8800137 9472564
37250 9472564 10154654 10744488 11160280 11350650 11302296 11041324 10623249 10111369 9550860 8950598
37240 8950598 8281586 7491357 6525213 5343661 3930401 2291193 446912 -1574706 -3743746
37231 -3743746 -6025715 -8373624 -10721064 -12982673 -15062816 -16868711 -18324434 -19383955
37223 -19383955 -20040094 -20324567 -20298036 -20035858 -19617091 -19118254 -18607580 -18137141 -17735973
37214 -17735973 -17408638 -17139010 -16895549 -16636476 -16317622 -15905741 -15394569 -14814950 -14230239
37205 -14230239 -13715713 -13330822 -13098336 -13000591 -12992856 -13024562 -13056016 -13062769 -13028476 -12934412 -12755099
37194 -12755099 -12464387 -12048923 -11521127 -10924132 -10325638 -9803462 -9429379 -9257732 -9321928
37185 -9321928 -9637590 -10207677 -11023873 -12061842 -13274079 -14587536 -15909459 -17138042 -18172965
37176 -18172965 -18925891 -19333849 -19373633 -19068701 -18481005 -17689314 -16764656 -15755747 -14691214
37167 -14691214 -13594299 -12496577 -11438570 -10457962 -9577988 -8806609 -8143668 -7584918 -7117362
37158 -7117362 -6711764 -6321837 -5893468 -5379591 -4753787 -4017932 -3202557 -2360961 -1558653
37149 -1558653 -859381 -309538 75559 318194 473513 613876 808220 1105080 1525628
37140 1525628 2066856 2709906 3427510 4187320 4951279 5673746 6302350 6784220 7075877
37131 7075877 7151163 7002552 6636608 6068366 5318516 4414053 3391343 2300724 1211182
37122 1211182 211577 -596354 -1115327 -1275896 -1056287 -490306 337705 1306489 2277032
37113 2277032 3117236 3728443 4063157 4124099 3946189 3573895 3046066 2391769 1633295 790648
37103 790648 -116708 -1071874 -2063432 -3085519 -4134931 -5208665 -6303830 -7417708 -8545415
37094 -8545415 -9676152 -10791048 -11863974 -12864495 -13761333 -14524923 -15128712 -15551566 -15783955
37085 -15783955 -15835863 -15738895 -15537656 -15274694 -14977945 -14653809 -14281863 -13809421 -13152466 -12211389
37075 -12211389 -10900904 -9182202 -7082556 -4694926 -2160609 355887 2691511 4705134
37067 4705134 6292888 7396730 8003941 8138252 7847576 7194590 6252541 5103290 3832183
37058 3832183 2517196 1216495 -36112 -1220766 -2310052 -3251373 -3968012 -4381166 -4440603
37049 -4440603 -4147088 -3556418 -2764857 -1882450 -1003820 -187450 548043 1210362 1812315
37040 1812315 2355899 2828113 3205726 3462842 3578220 3541786 3358133 3043693 2618707 2101231
37030 2101231 1509142 866804 205984 -444629 -1074182 -1694934 -2331568 -3001287 -3697182
37021 -3697182 -4381751 -4989430 -5435726 -5633354 -5514915 -5055279 -4282771 -3273252 -2131411
37012 -2131411 -969510 108973 1019712 1703549 2128629 2288969 2202547 1912642 1490920
37003 1490920 1034472 650606 433177 442071 694891 1170911 1822164 2587755 3409128 4242521
36993 4242521 5063812 5863959 6638324 7375791 8052812 8634988 9085189 9373305 9480943
36984 9480943 9396740 9103838 8567156 7730910 6532694 4929907 2924518 572682 -2023616
36975 -2023616 -4735633 -7429801 -9989017 -12330529 -14414919 -16242427 -17839454 -19241768
36967 -19241768 -20478057 -21555010 -22448148 -23105302 -23464245 -23475962 -23121876 -22420359 -21426172
36958 -21426172 -20227262 -18938373 -17688015 -16598274 -15762263 -15227149 -14989945 -15008749 -15224488
36949 -15224488 -15581536 -16035675 -16547568 -17071455 -17551199 -17926924 -18145858 -18170712 -17985335
36940 -17985335 -17599400 -17049544 -16391933 -15687183 -14985847 -14321654 -13711297 -13154303 -12630199
36931 -12630199 -12096818 -11495381 -10763990 -9856594 -8762152 -7517697 -6208203 -4948541 -3850424
36922 -3850424 -2987175 -2373312 -1969564 -1710430 -1540108 -1439697 -1433423 -1570798 -1892486 -2396607
36912 -2396607 -3023105 -3664038 -4193019 -4498453 -4507243 -4193410 -3572827 -2689026 -1596762 -349843
36902 -349843 1003094 2415610 3837374 5210284 6470533 7556734 8420602 9035968 9403906
36893 9403906 9552766 9530862 9390946 9172387 8893120 8559287 8186591 7816200 7510673 7329560
36883 7329560 7298531 7390425 7529469 7616241 7559695 7301430 6825731 6157733 5354074 4488177
36873 4488177 3632441 2842419 2148583 1557808 1063138 658362 351209 167032 139145 292437
36863 292437 632864 1148572 1815806 2599158 3445567 4282405 5029221 5620483 6024978 6247317
36853 6247317 6309049 6222042 5972769 5527772 4854957 3945824 2826772 1557710 223668
36844 223668 -1074260 -2226780 -3126427 -3684623 -3855238 -3654192 -3159815 -2486915 -1744451
36835 -1744451 -998460 -258722 506509 1337838 2251718 3224005 4198499 5114872 5938085
36826 5938085 6670446 7340210 7977324 8594037 9181409 9719667 10191820 10590279 10912940
36817 10912940 11152420 11286306 11275512 11073265 10641018 9963317 9053934 7951420 6709852
36808 6709852 5393455 4077740 2849871 1798307 991071 454354 164836 58602 48740
36799 48740 43293 -38055 -247223 -594094 -1044016 -1531488 -1985694 -2355820 -2624905 -2808721
36789 -2808721 -2944249 -3074327 -3232346 -3428628 -3641466 -3816905 -3878493 -3743199 -3338467 -2618664
36779 -2618664 -1580801 -275496 1195625 2701808 4118228 5357298 6380125 7185055
36771 7185055 7784422 8184827 8379290 8350730 8082843 7574413 6851356 5969017 5002193 4030181
36761 4030181 3127802 2364782 1805382 1501450 1483307 1758490 2320377 3156637 4245671
36752 4245671 5539672 6945937 8322879 9500704 10322626 10689880 10591635 10109281 9395188
36743 9395188 8631846 7981008 7538455 7313733 7246013 7248041 7253670 7243778 7239839 7273845 7355803
36732 7355803 7458923 7528708 7505858 7347179 7035753 6581053 6012209 5366157 4673981 3952605
36722 3952605 3207443 2443904 1679230 947024 292419 -239258 -615451 -825990 -886086 -832477
36712 -832477 -715488 -590501 -510819 -522177 -659288 -946083 -1399730 -2032941 -2845892 -3806648
36702 -3806648 -4833853 -5801192 -6568944 -7025931 -7117594 -6849203 -6270991 -5457915 -4491018
36693 -4491018 -3441625 -2359112 -1264884 -155685 982886 2156295 3342706 4485340
36685 4485340 5499533 6291354 6780334 6918341 6698668 6153028 5338742 4321855 3162941
36676 3162941 1911588 612586 -679636 -1889004 -2919438 -3672610 -4073919 -4095210 -3765677
36667 -3765677 -3166217 -2406632 -1592062 -791886 -23634 744368 1576902 2550289 3731413
36658 3731413 5161016 6843103 8740294 10774258 12831786 14778799 16483135 17841954
36650 17841954 18803784 19374074 19599963 19542399 19252326 18764177 18106844 17320243 16463780
36641 16463780 15610884 14833686 14186537 13694620 13349512 13112926 12930868 12755994 12566365
36632 12566365 12366809 12172730 11993238 11830659 11695795 11623158 11673044 11920288 12436942 13273849
36622 13273849 14442604 15900155 17541975 19211449 20728850 21932542 22714690 23034910
36614 23034910 22909539 22388995 21537921 20424462 19117361 17687747 16212489 14774866
36606 14774866 13458464 12333562 11440045 10774363 10288320 9902862 9531163 9099467 8557158
36597 8557158 7877007 7052643 6098249 5049578 3962272 2904793 1946433 1143030 523618
36588 523618 81488 -225702 -461895 -685341 -919046 -1136304 -1271751 -1251988 -1027223 -586824
36578 -586824 45562 828574 1718715 2678674 3679975 4702065 5725120 6715641 7615640
36569 7615640 8352545 8872721 9176717 9326551 9416149 9525379 9688407 9892380 10099415 10272367
36559 10272367 10388680 10440269 10428478 10362935 10264241 10163261 10091669 10065641 10070751 10057347 9951908
36548 9951908 9681447 9199695 8502924 7631030 6657724 5675649 4780237 4055490 3564824
36539 3564824 3348074 3422961 3788771 4429756 5314351 6387939 7564594 8728760 9752247
36530 9752247 10519018 10944722 10984419 10630919 9908087 8860822 7543124 6008305 4306823
36521 4306823 2494262 645169 -1138290 -2733929 -4024349 -4927235 -5416490 -5528057 -5352033
36512 -5352033 -5012178 -4632760 -4300603 -4040481 -3818811 -3572578 -3244013 -2801694 -2242111
36503 -2242111 -1578259 -825703 6234 915449 1902245 2963932 4093319 5280813 6515122
36494 6515122 7777859 9033277 10220612 11256635 12049623 12518934 12612723 12319060 11668075
36485 11668075 10723626 9565949 8272572 6907686 5525023 4179308 2936141 1873799
36477 1873799 1077739 631291 603267 1030212 1893839 3102213 4489683 5846485 6972632
36468 6972632 7732801 8085216 8073458 7792299 7348900 6834394 6309285 5800054 5304172 4801149
36458 4801149 4267514 3693744 3099420 2539158 2092290 1838737 1834850 2103394 2639466 3422172
36448 3422172 4421975 5602812 6924399 8348344 9846064 11403263 13016638 14682315
36440 14682315 16380618 18065532 19666483 21104109 22313871 23266747 23977462 24496607
36432 24496607 24890228 25215720 25504097 25755541 25948034 26051453 26037224 25879257 25551308
36423 25551308 25029915 24306406 23401394 22370671 21296313 20265621 19345653 18560719 17878861
36414 17878861 17213690 16446268 15463578 14199090 12657699 10916392 9104966 7376641
36406 7376641 5876167 4711438 3935840 3546245 3493682 3698827 4068382 4513667 4969488
36397 4969488 5403952 5811200 6190775 6527134 6781770 6902505 6846637 6607378 6227742 5789980
36387 5789980 5384355 5076199 4890166 4816696 4833041 4927905 5120151 5462790 6027254 6873077
36377 6873077 8018030 9424208 11006403 12657818 14281140 15811908 17225746 18529209
36369 18529209 19740761 20869692 21898835 22776472 23422617 23750583 23696631 23245269 22440294
36360 22440294 21378567 20189575 19007615 17945249 17074982 16420908 15957917 15617167 15299807
36351 15299807 14899553 14328156 13533972 12508351 11282547 9920373 8507497 7134859
36343 7134859 5877623 4778671 3847258 3074623 2455474 1998846 1719854 1619953 1674055
36334 1674055 1837810 2071131 2359881 2719662 3180265 3761919 4455705 5215504 5964732
36325 5964732 6617142 7103795 7392645 7491381 7435828 7273117 7046082 6780977 6481252 6131184
36315 6131184 5708171 5196671 4598371 3939272 3274244 2682976 2250277 2034476 2040079 2210741
36305 2210741 2445908 2631500 2671267 2509509 2141354 1610129 993291 380989 -146136 -532878
36295 -532878 -755499 -819488 -753299 -600529 -409745 -221578 -57721 79486 192825 270047
36285 270047 276315 171064 -60288 -386087 -739736 -1057333 -1315713 -1546473 -1820413 -2215123
36275 -2215123 -2784127 -3540468 -4457451 -5480339 -6539672 -7560862 -8471302 -9208091 -9725490
36266 -9725490 -9997674 -10014836 -9776928 -9291404 -8576848 -7667869 -6615233 -5479287 -4319790
36257 -4319790 -3186869 -2116123 -1128114 -230191 582266 1326150 2028998 2719997 3413066
36248 3413066 4090060 4695568 5148667 5366972 5292513 4909063 4243627 3350578 2286180
36239 2286180 1089231 -219027 -1616646 -3059374 -4472206 -5759097 -6823277 -7586849
$$ [...]
##END NTUPLES=NMR SPECTRUM
##END=
