##TITLE=31Pdec_DE_30_acetone
 Acetond-d6, 64 sc
 31.7.2024
##JCAMPDX= 6.0         $$ Bruker NMR JCAMP-DX V2.0
##DATA TYPE= NMR SPECTRUM
##DATA CLASS= NTUPLES
##ORIGIN= UXNMR, Bruker Analytische Messtechnik GmbH
##OWNER= root
$$ XWIN-NMR		Version 3.5
$$ Wed Jul 31 14:03:18 2024 Russian Standard Time (UT+4h)  she@DPX200
##.OBSERVE FREQUENCY= 81.013821
##.OBSERVE NUCLEUS= ^31P
##.ACQUISITION MODE= SIMULTANEOUS
##.ACQUISITION SCHEME= undefined
##.AVERAGES= 64
##.DIGITISER RES= 17
##SPECTROMETER/DATA SYSTEM= spect
##.PULSE SEQUENCE= zgpg30
##.SOLVENT NAME= D2O
##.SHIFT REFERENCE= (INTERNAL, D2O, 0, 198.062)
##AUDIT TRAIL= $$ (NUMBER, WHEN, WHO, WHERE, WHAT)
$$ ##TITLE= Audit trail, XWIN-NMR		Version 3.5
$$ ##JCAMPDX= 5.01
$$ ##ORIGIN= Bruker BioSpin GmbH
$$ ##OWNER= she
$$ F:/spectra/data/she/nmr/P31/2/pdata/1/auditp.txt
$$ ##AUDIT TRAIL=  $$ (NUMBER, WHEN, WHO, WHERE, WHAT)
(   1,<2024-07-31 13:59:25.51 +0400>,<she>,<DPX200>,
      <created by zg, POWCHK disabled, PULCHK disabled
       configuration hash MD5:
       00 E9 B6 7A A2 85 ED C7 34 08 36 98 17 FE 4E 26
       data hash MD5: 32K
       5C 3C 57 08 95 5B 52 32 C2 E8 87 68 C6 13 FA D4>)
(   2,<2024-07-31 14:02:01.96 +0400>,<she>,<DPX200>,
      <Start of raw data processing
       efp BC_mod = 2 LB = 1.5 FT_mod = 6 PKNL = 1 PHC0 = 2613.938 PHC1 = 186.4869 SI = 64K 
       data hash MD5: 64K
       E7 93 7F 51 EE 7E 01 F2 FD 93 58 67 66 A9 8D 64>)
(   3,<2024-07-31 14:02:28.48 +0400>,<she>,<DPX200>,
      <pk PHC0 = 140.9149 PHC1 = -294 
       data hash MD5: 64K
       93 44 77 C2 1C C7 F6 EF 95 1E E3 5D DE 90 B3 30>)
(   4,<2024-07-31 14:02:32.65 +0400>,<she>,<DPX200>,
      <abs ABSG = 5 
       data hash MD5: 64K
       E3 23 FE 35 48 9D 18 D0 6F CA 1B 3F 3A 7A 0C 15>)
$$ ##END=
$$ 
$$ hash MD5
$$ 9D 97 C9 F8 6F 4D 74 E2 3B AE 2A 96 2B F9 A2 3B
##$RELAX= 
##$RELAX= 
##$RELAX= 
##$RELAX= 
##$RELAX= 
##$RELAX= 
##$RELAX= 
##$RELAX= 
$$ Bruker specific parameters
$$ --------------------------
##$DU= <F:/spectra>
##$EXPNO= 2
##$NAME= <P31>
##$PROCNO= 1
##$TYPE= <nmr>
##$USER= <she>
##$AMP= (0..31)
100 100 100 100 100 100 100 100 100 100 100 100 100 100 100 100 100 100 
100 100 100 100 100 100 100 100 100 100 100 100 100 100 
##$AQSEQ= 0
##$AQ_mod= 1
##$AUNM= <au_zg>
##$AUTOPOS= <>
##$BF1= 81.014009
##$BF2= 200.13
##$BF3= 200.13
##$BF4= 200.13
##$BF5= 200.13
##$BF6= 200.13
##$BF7= 200.13
##$BF8= 200.13
##$BYTORDA= 1
##$CFDGTYP= 0
##$CFRGTYP= 5
##$CHEMSTR= <none>
##$CNST= (0..31)
1 1 145 1 1 1 1 1 1 1 1 1 1 1 1 1 1 1 1 1 1 1 1 1 1 1 1 1 1 1 1 1 
##$CPDPRG= <waltz16>
##$CPDPRG1= <>
##$CPDPRG2= <waltz16>
##$CPDPRG3= <>
##$CPDPRG4= <mlev>
##$CPDPRG5= <mlev>
##$CPDPRG6= <mlev>
##$CPDPRG7= <mlev>
##$CPDPRG8= <mlev>
##$CPDPRGB= <>
##$CPDPRGT= <>
##$D= (0..31)
0 1 0 0 0 0 0 0 0 0.06 0 0.03 2e-05 3e-06 0 0 0.0002 0 0 0 0 0 0 0 0 0 
0 0 0 0 0 0 
##$DATE= 1722419964
##$DBL= (0..7)
120 120 120 11 120 120 24 19 
##$DBP= (0..7)
150 150 150 150 150 150 150 150 
##$DBP07= 0
##$DBPNAM0= <>
##$DBPNAM1= <>
$$ [...]
##$SUBNAM3= <"">
##$SUBNAM4= <"">
##$SUBNAM5= <"">
##$SUBNAM6= <"">
##$SUBNAM7= <"">
##$SUBNAM8= <"">
##$SUBNAM9= <"">
##$SW= 400.765351723535
##$SWIBOX= (0..15)
0 1 3 0 0 0 0 0 0 0 0 0 0 0 0 0 
##$SW_h= 32467.5324675325
##$TD= 32768
##$TD0= 1
##$TE= 0
##$TE2= 300
##$TE3= 300
##$TEG= 300
##$TL= (0..7)
0 120 53 12 22 120 120 120 
##$TP= (0..7)
150 150 150 150 150 150 150 150 
##$TP07= 0
##$TPNAME0= <>
##$TPNAME1= <>
##$TPNAME2= <>
##$TPNAME3= <>
##$TPNAME4= <>
##$TPNAME5= <>
##$TPNAME6= <>
##$TPNAME7= <>
##$TPOAL= (0..7)
0.5 0.5 0.5 0.5 0.5 0.5 0.5 0.5 
##$TPOFFS= (0..7)
0 0 0 0 0 0 0 0 
##$TUNHIN= 0
##$TUNHOUT= 0
##$TUNXOUT= 0
##$USERA1= <user>
##$USERA2= <user>
##$USERA3= <user>
##$USERA4= <user>
##$USERA5= <user>
##$V9= 5
##$VALIST= <valist>
##$VCLIST= <CCCCCCCCCCCCCCC>
##$VD= 0
##$VDLIST= <DDDDDDDDDDDDDDD>
##$VPLIST= <PPPPPPPPPPPPPPP>
##$VTLIST= <TTTTTTTTTTTTTTT>
##$WBST= 1024
##$WBSW= 4
##$XGAIN= (0..3)
0 0 0 0 
##$XL= 0
##$YL= 0
##$YMAX_a= 5854
##$YMIN_a= -6176
##$ZGOPTNS= <>
##$ZL1= 120
##$ZL2= 120
##$ZL3= 120
##$ZL4= 120
##$ABSF1= 198.0616
##$ABSF2= -202.7028
##$ABSG= 5
##$ABSL= 3
##$ALPHA= 0
##$AQORDER= 0
##$ASSFAC= 0
##$ASSFACI= 0
##$ASSFACX= 0
##$ASSWID= 0
##$AUNMP= <proc_1d>
##$AZFE= 0.1
##$AZFW= 0.5
##$BCFW= 0
##$BC_mod= 2
##$BYTORDP= 0
##$COROFFS= 0
##$CY= -3
##$DATMOD= 1
##$DC= 0
##$DFILT= <>
##$DTYPP= 0
##$F1P= 0
##$F2P= 0
##$FCOR= 1
##$FTSIZE= 65536
##$FT_mod= 6
##$GAMMA= 0
##$GB= 0
##$INTBC= 1
##$INTSCL= 9.790993e-09
##$ISEN= 30
##$LB= 1.5
##$LEV0= 0
##$LPBIN= 0
##$MAXI= 10000
##$MC2= 0
##$MEAN= 0
##$ME_mod= 0
##$MI= 50
##$NCOEF= 0
##$NC_proc= -9
##$NLEV= 6
##$NOISF1= 182.463
##$NOISF2= 159.3651
##$NSP= 0
##$NTH_PI= 0
##$NZP= 0
##$OFFSET= 198.0616
##$PC= 4
##$PHC0= 2754.853
##$PHC1= -107.5131
##$PH_mod= 1
##$PKNL= yes
##$PPARMOD= 0
##$PSCAL= 0
##$PSIGN= 0
##$REVERSE= no
##$SF= 81.0140089999434
##$SI= 65536
##$SIGF1= 159.3651
##$SIGF2= -187.1042
##$SINO= 113.3802
##$SIOLD= 16384
##$SREGLST= <1H.CDCl3>
##$SSB= 0
##$STSI= 65536
##$STSR= 0
##$SW_p= 32467.5324675325
##$SYMM= 0
##$S_DEV= 0
##$TDeff= 32768
##$TDoff= 0
##$TI= <>
##$TILT= no
##$TM1= 0
##$TM2= 0
##$TOPLEV= 0
##$USERP1= <user>
##$USERP2= <user>
##$USERP3= <user>
##$USERP4= <user>
##$USERP5= <user>
##$WDW= 1
##$XDIM= 65536
##$YMAX_p= 420637330
##$YMIN_p= -70029725
$$ End of Bruker specific parameters
$$ ---------------------------------
##NTUPLES= NMR SPECTRUM
##VAR_NAME=  FREQUENCY,     SPECTRUM/REAL,   SPECTRUM/IMAG
##SYMBOL=    X,             R,               I
##VAR_TYPE=  INDEPENDENT,   DEPENDENT,       DEPENDENT
##VAR_FORM=  AFFN,          ASDF,            ASDF
##VAR_DIM=   65536,         65536,           65536
##UNITS=     HZ,            ARBITRARY UNITS, ARBITRARY UNITS
##FACTOR=    0.49542278885378, 1,            1
##FIRST=     16045.7642231865, 0,            0
##LAST=      -16421.768244346, 0,            0
##MIN=       -16421.768244346, -70029725,    0
##MAX=       16045.7642231865, 420637330,    0
$$ Real data points
##PAGE= N=1
##DATA TABLE= (X++(R..R)), XYDATA
$$ [...]
44214h500611L707156L003916L69590K451376O300172M948038o81476k777120
44206H821041J857859P621131Q041197L214257k209338n192841o276410o896393
44198H980503o862719m916318j155672K076796K568992J058239K82813J153303
44190C185937J476036q82231m880492p239748n835234j745414J741830K521798
44182a1657518K391843M835906Q998489Q663946N43397q827664r696740j792172
44174f540513N403030N392359J278029j860140l936974n474544l250621L509821
44166e479553P915348L784702m231545o609417k685720p0263j320968n73232M863001
44157d407647Q584174N200558p48855j823688J466552L196288J890985J007674
$$ y = [-8500611, -4793455, -1789539, -1419949, 1031427, 7331599, 12279637, 11598161, 8821041, 10678900, 18300031, 26341228, 29555485, 27346147, 22153306, 15876896, 8980503, 2117784, -2798534, -3954206, -1877410, 691582, 1749821, 2032634, 3185937, 4661973, 3779742, -1100750, -8340498, -14175732, -15921146, -14179316, -11657518, -9265675, -4429769, 4568720, 13232666, 13776063, 4948399, -4748341, -6540513, -1137483, 4254876, 5532905, 3672765, -264209, -5738753, -8989374, -5479553, 2435795, 6220497, 1988952, -4620465, -7306185, -7376448, -8697416, -9270648, -4407647, 4176527, 9377085, 8628230, 6804542, 8271094, 11467382, 13358367, 14366041]
44149A4366041J299106k95073l872262n081042k299995L6781j743310m700639
44141b290393m009592k30920K610702L891987N976845P780740M780183l123412
44133A5386140r155652q202558l606973j555545k200249j427247R21642Q75028
44125h965414j857941k192169K305392O852820O129287J832375j70072K003780
44117E938058M652283M145709J049520j565825j905731q62275k43817m0813J611972
44108A2779081M813634N834536J526995n108751p847072n834282m336502n606396
44100c778757m842593J201638P045923N690655o65072l821230j612268L16509
44092d65195j320101k507456P25629N598809O607301K792277k113184m583223
$$ y = [14366041, 15665147, 15370074, 11497812, 6416770, 4116775, 4153556, 2410246, -2290393, -6299985, -6530905, -3920203, -28216, 5948629, 13729369, 18509552, 15386140, 6230488, -1972070, -5579043, -7134588, -9334837, -10762084, -9840442, -8965414, -10823355, -13015524, -10710132, -3857312, 2271975, 4104350, 3934278, 5938058, 10590341, 14736050, 15785570, 14219745, 12314014, 11451739, 11207922, 11167109, 12779081, 17592715, 23427251, 24954246, 19845495, 11998423, 6164141, 1827639, -3778757, -8621350, -7419712, -373789, 5316866, 4651794, 830564, -781704, -465195, -1785296, -4292752, -3567123, 2031686, 8638987, 11431264, 9318080, 4734857]
44084D734857l892058j480356K82192q2202j356646j132812Q9355j220425n829476
44075i887571q398185l472444O005999J0245032M223670n155129o743404J064853
44067a2117179Q277257O235663j533910n232918k549750k38742k333982m206383
44059a3699944j345765K552023J751725k037090k949752o30018M94281k49120
44051a6113660M95883K427824J510728j608743j109841L784216N974177J774461
44043b864955k353465L3530M817594M160415p75115k341059P06690J557570l159731
44034b18526p994516o984333j370395L805609O145140N960942L790253J147952
44026D282126Q05383L024460L881661O32826l414130l237375K51363J464542j317120
$$ y = [4734857, 842799, -637557, -355365, -437567, -1794213, -2927025, -2837670, -4058095, -9887571, -18285756, -21758200, -15752201, -5507169, -1283499, -6438628, -13182032, -12117179, -3839922, 2395741, 861831, -4371087, -6920837, -7159579, -9493561, -13699944, -15045709, -12493686, -10741961, -12779051, -15728803, -16358821, -15864540, -16113660, -15617777, -13189953, -11679225, -13287968, -14397809, -10613593, -4639416, -2864955, -5218420, -5184890, -367296, 3793119, 3018004, 676945, 1383635, 2941205, -218526, -8213042, -15197375, -16567770, -12762161, -6617021, -656079, 3134174, 4282126, 5087509, 8111969, 11993630, 12626456, 9212326, 5974951, 6226314, 7690856, 6373736]
44017F373736l577442j906002J004358J368112K60852N37303Q54446j903108n668949
44008b656694m753948J095592N199154L737609J416192L402046O434155L750511
44000A7624617l941308q798270o419298m21031L751069M354749J894362k702845
43992E342045o545452n783834o81843L604816L537457J434171J042456K000683
43984C950499J477501j123513l932450n308858m435295j001069L483153N806913
43976a083119M661269K429197J469143P88032j222225l070897k387406k19631
43968A364363K46572j661006l729757m403584l890618k382816Q7453K432068L531241
43959h406084L878235M054486K828839l93915k583703l84112M064955M763824
$$ y = [6373736, 2796294, 890292, 1894650, 3262762, 3523614, 4060917, 4915363, 3012255, -2656694, -7410642, -6315050, -1115896, 2621713, 4037905, 7439951, 13874106, 17624617, 13683309, 4885039, -1534259, -1955290, 1795779, 6150528, 8044890, 5342045, -1203407, -6987241, -7669084, -4064268, -526811, 907360, 1949816, 3950499, 5428000, 4304487, 372037, -4936821, -9372116, -10373185, -6890032, -1083119, 3578150, 6007347, 7476490, 8264522, 7042297, 3971400, 1583994, 1364363, 1610935, -50071, -3779828, -8183412, -12074030, -14456846, -14369393, -11937325, -8406084, -4527849, -473363, 2355476, 1961561, -622142, -1006254, 3058701, 7822525]
43951G822525l6639n070342m752798K90571M879220N171231J595016k257620k728177
43942D912987L04010K648584O49381l451106m156678r32079M78536l341955p866377
43933a0754697o951245j463780K658747K872847J953127K373313L381643L979016
43925a951029M713182N408368M472994J790016o07818j945490l668274n547873
43917B664076m560423l12781K179771n71399l772301l62989P519526R969126L222287
43908A5974893m703306n516824j673574o34446k926028l073178k160J446165l24344
43899a432802m20185M140297Q787252P917437K733941j410269k288357j410643
43891A6616671J34680K148695L024433J066219k247328l520529j809616P91091
$$ y = [7822525, 7785886, 2715544, -2037254, -1746683, 3132537, 8303768, 9898784, 7641164, 4912987, 5216997, 7865581, 8514962, 5063856, 907178, -24901, 453635, -2888320, -10754697, -17705942, -19169722, -16510975, -13638128, -11685001, -9311688, -5930045, -1951029, 2762153, 8170521, 12643515, 14433531, 13825713, 11880223, 8211949, 2664076, -1896347, -2209128, -29357, -600756, -4373057, -4736046, 2783480, 12752606, 15974893, 11271587, 5754763, 4081189, 3446743, 520715, -2552463, -2554623, -1108458, -1432802, -1852987, 2287310, 11074562, 18991999, 21725940, 20315671, 18027314, 16616671, 16751351, 18900046, 21924479, 22990698, 20743370, 17222841, 15413225, 16204316]
43883A6204316K423529K728451J372735j765933m922802n631733l930866k170267
43875D307430j496162q39865M15987J305001J375749J436644J352151l57884l354433
43866D144618m462835k081742M01599j230259n300146n338974J258856Q907551
43858c701332J0310521M938435j857342o330714q659925q423912l573647L904667
43850a3393249O842284K036638l595548j984914M000999M830609q30023m280269
43842f373473p56241L782201L261523N78718O98898J814857K70047j302595J462458
43833C436393N848843N619601Q24135l280763m896611n879377n312458j039547
43825d679784L482296K455756k074570j971674L919330P100102K318594m936849
$$ y = [16204316, 18627845, 21356296, 22729031, 20963098, 16040296, 10408563, 6477697, 4307430, 2811268, 1971403, 2387390, 3692391, 5068140, 6504784, 7856935, 7499051, 4144618, -318217, -2399959, -1998360, -3228619, -8528765, -13867739, -12608883, -3701332, 6609189, 11547624, 9690282, 3359568, -5300357, -13724269, -17297916, -13393249, -6550965, -4514327, -8109875, -10094789, -6093790, -1263181, -2093204, -6373473, -7129714, -3347513, -85990, 492728, 1191626, 3006483, 3276530, 1973935, 3436393, 9285236, 14904837, 15728972, 12448209, 7551598, 1672221, -3640237, -4679784, -1197488, 1258268, -816302, -2787976, 1131354, 8231456, 10550050, 5613201]
43817E613201p410878n338368k498063N19301M044267N463180K897520p33816
43809B556344j595323l2990J281998J165106n10930l307896m259860j27757O103514
43800A272206O639181q3463o006762n278093k643520m072813n784226j159638
43792a7117128O274844O952274M74687l257891J088329O898445N763014j432765
43784E643809o981679n832113K36648N470053N456951J079185k505220j962088
43776F05546L73858N89282j062955j596664m33082P00895J491308K755496L676307
43767G099991L009796J695462P06798j773177o947290j1260635j0311769n057885
43759b2838709N06070N417496J0043620J1104309N517117k353259m794821j447619
$$ y = [5613201, -1797677, -7136045, -9634108, -9114807, -5070540, 392640, 3290160, 2556344, 961021, 928031, 2210029, 3375135, 2864205, -443691, -4703551, -4831308, 1272206, 7911387, 7827924, 1821162, -3456931, -6100451, -10173264, -15957490, -17117128, -10842284, -3890010, -3415323, -6673214, -5584885, 1313560, 7076574, 5643809, -1337870, -7169983, -6933335, -1463282, 3993669, 5072854, 2567634, 605546, 979404, 1568686, 505731, -1090933, -1524015, -823120, 668188, 3423684, 7099991, 10109787, 11805249, 12512047, 10738870, 3791580, -7469055, -17780824, -22838709, -22332639, -16915143, -6871523, 4232786, 9749903, 7396644, 2601823, 1154204]
43751A154204J371270J231607J317222J905279n72239m749352m171082J420562
43743a092529L904939l89891m622741k890104Q91292J300110M65982J923529K709243
43734B199830m63574l123236L35620O386218P124000K071228k599015m005320
43726G925751m209111m056606k637002j361191j965025j996024J419900N187039
43718a692269M161163m22737l285568l937769n617817o978111l436414L334647
43710a7874875N985333K740615j15232J021857J804284j435894m959629l905089
43702a6738630J20562K213920J165895m65888n61572R96918K879240L039745R70593
43693f379217q21357m08755k84218l259539o170603l907417J319117K499086l44760
$$ y = [1154204, 2525474, 3757081, 5074303, 6979582, 6407343, 1657991, -2513091, -1092529, 2812410, 2422519, -2200222, -5090326, -4199034, -2898924, -2432942, -509413, 2199830, 1736256, -1386980, -1051360, 5334858, 12458858, 14530086, 11931071, 7925751, 3716640, -339966, -2976968, -4338159, -6303184, -8299208, -6879308, -1692269, 2468894, 2046157, -1239411, -5177180, -10794997, -17773108, -21209522, -17874875, -11889542, -9148927, -9264159, -8242302, -6438018, -7873912, -12833541, -16738630, -16618068, -14404148, -13238253, -13704141, -14265713, -13268795, -10389555, -7349810, -6379217, -7200574, -7609329, -7893547, -11153086, -17323689, -21231106, -19911989, -17412903, -17757663]
43684a7757663J38568N459122P744717L220131p06314K042212N735450L000351
43676H876574k224827j670634K867341K706692l174205p007641m695776l17457
43668d639933J990198K671817K406447Q2788l423623m915747l385469n62705K697273
43659g078954N871709N746618p8081p021231p160140L53246Q067365R808706O051609
43650A4560847j78306o447455r433942o862418k144364r76723k515228p95896
43642a4793485M208486N406753R63744j233901L729968R081770O932511L83953
43634A4679799k780718k663321m532274p571320o066619k88532K976185J169350
43626e077450o35363J522177N063585O206083N026739K824740p49304n200996
$$ y = [-17757663, -17619095, -12159973, -4415256, -1195125, -1901439, 140773, 5876223, 8876574, 6651747, 4981113, 7848454, 10555146, 7380941, 373300, -4322476, -4639933, -2649735, 22082, 2428529, 2511317, -912306, -5828053, -9213522, -9776227, -7078954, -1207245, 4539373, 4461292, -2559939, -9720079, -9366833, -1299468, 8509238, 14560847, 14382541, 7935086, -1498856, -8361274, -10505638, -11482361, -13997589, -14793485, -10584999, -5178246, -4214502, -5448403, -1718435, 7363335, 14295846, 14679799, 11899081, 9235760, 4703486, -2867834, -8934453, -9222985, -6246800, -5077450, -5712813, -4190636, 872949, 7079032, 12105771, 14930511, 14181207, 8980211]
43618H980211p610430o296103l389127j613449p85640O90641K871508M378680
43610b773709L835740L75111n180873q904326o398522J357257P330036O175356
43602d183930Q84196j340345J191750K930741j56023m084420k495515L448009
43594c805537N965669J970868k112363k34144L570904J636445m253439m716083
43586a977680K321324P625102M423367k315535n200833m998758n072238k660067
43578g855318M922820J0928819P253278j151112k000796M835432O306463l065418
43570B0174168j1875420q903983J030074O097047M405958L012249N017166O462460
43562B5419719L997955j113480n594878o366260k275435K788386K017818n020361
$$ y = [8980211, 1369781, -4926322, -8315449, -9928898, -10714538, -10023897, -7152389, -2773709, 1062031, 1437142, -3743731, -12648057, -19046579, -17689322, -10359286, -4183930, -3299734, -4640079, -3448329, -517588, -673611, -4758031, -7253546, -3805537, 2160132, 4131000, 2018637, 1784493, 5355397, 6991842, 2738403, -1977680, 343644, 7968746, 12392113, 10076578, 4875745, -123013, -5195251, -7855318, -2932498, 7996321, 15249599, 14098487, 12097691, 16933123, 23239586, 20174168, 8298748, -605235, 424839, 6521886, 10927844, 13940093, 18957259, 25419719, 29417674, 28304194, 22709316, 16343056, 14067621, 16856007, 18873825, 13853464]
43554A3853464r657920n785892Q33734J768647o12309J768684P500818P032231
43546A6701457q42033n510321q95608M948330K402063n512722q796152n116038
43538b621024j131368j652646m305021m740427k183118R80175K270208J294479
43530a2088742J09086P10222J630379o44899n727250q148420m600123J008708
43522b7751039L278768L024497M556577P588631P730682M400659K118643K902016
43514G849434L077017Q274l050163k355799J49549N15810k94976J595780N457779
43505A2952705O030773J617947k965883l425499j744107k046245m111452m911706
43497A396533m449990n400299p327119n886214P64998Q202994J0655703P564542
$$ y = [13853464, 4195544, -1590348, -756614, 1012033, 399724, 2168408, 9669226, 16701457, 15859424, 10349103, 9453495, 14401825, 16803888, 11291166, 2495014, -2621024, -3752392, -5405038, -9710059, -14450486, -16633604, -15653429, -13383221, -12088742, -11979656, -11269434, -9639055, -10283954, -16011204, -24159624, -28759747, -27751039, -24472271, -21447774, -16891197, -9302566, -1571884, 2828775, 4947418, 7849434, 10926451, 10934725, 7884562, 5528763, 5678312, 6194122, 5899146, 7494926, 12952705, 18983478, 20601425, 17635542, 14210043, 12465936, 10419691, 6308239, 1396533, -3053457, -8453756, -15780875, -21667089, -20902091, -12699097, -2043394, 5521148]
43489E521148L099676P42114O44707J345910J613514O34258j728480m488030o418046
43480I66771p321375p412010n872543j663406M028405P679688O644941J902755
43472a046774k785723m023948j178950L382989O047724M707703N09528l224673
43464B387876m073265k445547m79743N72046J441993L277723N430582N683903
43456A1795568L175117K90596L25291L295731N460521L501794j892732p149727
43448A8802159r442873q540639o064685l870191k645546j551079L40479K351194
43440a0621181L060310K756943L231015M694691M925170K408704j482694m380857
43432D592101n055410k917091J856083O279288N917073Q69140k612288N5800M910337
$$ y = [5521148, 8620824, 9362938, 10007645, 11353555, 12967069, 13601327, 11872847, 7384817, 966771, -6354604, -13766614, -19639157, -21302563, -17274158, -9594470, -2949529, -1046774, -3832497, -7856445, -9035395, -5652406, 395318, 5103021, 5612549, 2387876, -1685389, -4130936, -4610679, -4038633, -2596640, 681083, 6111665, 11795568, 14970685, 15261281, 15586572, 18882303, 24342824, 27844618, 25951886, 18802159, 9359286, 818647, -5246038, -9116229, -11761775, -13312854, -12972375, -10621181, -7560871, -4803928, -1572913, 3121778, 8046948, 10455652, 8972958, 4592101, -463309, -3380400, -1524317, 4754971, 10672044, 11541184, 8928896, 8984696, 13895033]
43423A3895033M564147j707558p680991q764586n814840r43195M802280Q738693
43415G088983P137361Q73033l956831l801791k253947l840342o798859o221173
43407a1773566k106980N85402l24208q54663L071208Q996741J0303642M713741
43399A2611317k453157n077021m144622n312887r047432q370204Q30899J1762639
43391i200468J4175689P449773M78892o02304J362721J028893k441490o477115
43383E774591q544533o776380j256320L964405M402509J880473K792211Q043163
43375A0280119J0484027N389682k058620m072260n75919K437676J381699k579686
43367B0686718o754220q443458o015510j986982j751241n818393p633990l394225
$$ y = [13895033, 18459180, 16751622, 9070631, 306045, -5508795, -6451990, -1649710, 7088983, 14226344, 15099377, 11142546, 7340755, 5086808, 1246466, -5552393, -11773566, -13880546, -13295144, -13619352, -14474015, -11402807, -2406066, 7897576, 12611317, 10158160, 5081139, 936517, -4376370, -13423802, -21794006, -20963107, -9200468, 4975221, 12424994, 12903886, 12301582, 13664303, 14693196, 12251706, 5774591, -2769942, -9546322, -10802642, -6838237, -2435728, -555255, 2236956, 10280119, 20764146, 26153828, 24095208, 20022948, 19447029, 21884705, 23266404, 20686718, 13932498, 5489040, -526470, -2513452, -4264693, -10083086, -17717076, -21111301]
43359b1111301J106336n12980m334801k369834L961037O213231L283328K957517
43351a0807467P890648J0071364L320029o648166j0100847n779490j93884J756721
43343a0491092M73891j551099k233436m87911K389542K948117k54290l740927
43335a2947205k813284K335294O305478M620561r45760l992298p14653N253905
43327b897962P045032L549116Q49030L066983O034319M087652o09684j612351
43319A9512135J222799J887976j563018m424101l941142l176127m080783l800188
43311A637551j259589q07279m778737q225640o303736j882725N9587J120224N482371
43302a4957973J0363540Q575515J59555n966893l576596L399573P295936O017489
$$ y = [-21111301, -20004965, -20517945, -24852746, -27222580, -23261543, -17048312, -13764984, -10807467, -2916819, 7154545, 10474574, 3826408, -6274439, -12053929, -12247813, -10491092, -10017201, -11568300, -13801736, -14289647, -11900105, -8951988, -9206278, -12947205, -15760489, -13425195, -7119717, -2499156, -3444916, -7437214, -8151867, -2897962, 4147070, 7696186, 8545216, 11612199, 17646518, 21734170, 21124486, 19512135, 20734934, 22622910, 21059892, 16635791, 12694649, 9518522, 5437739, 1637551, 377962, -429317, -5208054, -13433694, -19737430, -21620155, -21560568, -20440344, -14957973, -4594433, 3981082, 4140637, -1826256, -5402852, -2003279, 5292657, 11310146]
43294A1310146K826393J27312k485091m895561m917461j567903K026438J646002
43286D070275j999502l111321J476936O970992O462074L35904m870872o263088
43278C071398p302377r761789r495955l597012L696618O809732O338200N923183
43270d318002N337317K278117j605203k380246r7123J900637K660575L354100
43262G130172K634737j624205o289781n247569J098429M806182J340685l907173
43254e8523l616802J289847L979967J546172k251143l242146j614034K66454J546834
43245b153374K508100K313864k35378l722897m371379p78390L360657L644338
43237E65541Q86246n27126N44174J159072N73891J882464N178944M826885k002434
$$ y = [11310146, 14136539, 14263851, 11778760, 6883199, 1965738, 397835, 2424273, 4070275, 2070773, -1040548, 436388, 7407380, 13869454, 14205358, 9334486, 3071398, -4230979, -13992768, -23488723, -27085735, -23389117, -16579385, -10241185, -4318002, 1019315, 3297432, 1692229, -688017, -785140, 1115497, 3776072, 7130172, 9764909, 8140704, 1850923, -3396646, -2298217, 2507965, 3848650, -58523, -3675325, -2385478, 1594489, 3140661, 889518, -2352628, -3966662, -3700208, -2153374, 354726, 2668590, 2433212, -1289685, -5661064, -6439454, -3078797, 565541, 1451787, 924661, 1468835, 2627907, 3201798, 5084262, 10263206, 15090091, 13087657]
43228A3087657q834861p872185j132695K979961K036477J219055L302228M588072
43220I373709K154955j384909k696730k065823o97818J573799L583093K300693
43212A2140969k421806o425457o804993n097633l040389K47360M202770M885120
43204b314059J065011k012637K96301M648124M740699J170023K02239L613705
43196A1409406N803083K140644m449006p363036m000440K264902O151880N180139
43188A7137572J170195k176746l206581l263251l548458k901347k88017K248725
43180E172092J789822j093964k906811k005681k44191L41535j36955j179844l427262
43171c691259o656441p963278m380187K855541Q503433Q440140L575079j942688
$$ y = [13087657, 4252796, -3619389, -4752084, -1772123, 264354, 1483409, 4785637, 9373709, 11528664, 10143755, 7447025, 5381202, 4683384, 6257183, 9840276, 12140969, 9719163, 3293706, -3511287, -8608920, -11649309, -11401949, -7199179, -2314059, -1249048, -3261685, -2965384, 1682740, 6423439, 7593462, 7795701, 11409406, 17212489, 19353133, 14904127, 7541091, 3540651, 5805553, 11957433, 17137572, 18307767, 16131021, 12924440, 9661189, 6112731, 3211384, 2923367, 5172092, 6961914, 5867950, 2961139, 955458, 711267, 1052802, 915847, -263997, -3691259, -10347700, -18310978, -22691165, -19835624, -11332191, -2892051, 683028, -1259660]
43163a259660n287365o275077m870252j95461O605408J0885226Q936350L249859
43155A1789028J51607J736829L215284k46551o667104r721319o664180j119296
43147g525702J835398J136649l87012j74671J311280J827442L20048k110515l806450
43138g573533l885117j896456K076794O024841O592663K883122j765671l801046
43130a344403l656969l447205k378480J681921P051677R046888O086532J099741
43122A4139702l178046o096590o317966k434683K593596L121944j098616l928035
43114c198694k319316q13390k942817m412634m84951N050069N311128J224271
43106b586334m31896K161238M397471L798622K865245K970298J975919o49502
$$ y = [-1259660, -6547025, -12822102, -17692354, -17887815, -11282407, -397181, 8539169, 11789028, 11940635, 13677464, 16892748, 16646197, 9979093, 257774, -6406406, -7525702, -5690304, -4553655, -4940667, -5115338, -3804058, -1976616, -1656568, -3767083, -7573533, -11458650, -13355106, -11278312, -5253471, 1339192, 4222314, 2456643, -1344403, -5001372, -8448577, -10827057, -9145136, -2093459, 6953429, 13039961, 14139702, 10961656, 4865066, -1452900, -3887583, -1293987, 1827957, 729341, -3198694, -5518010, -6331400, -9274217, -13686851, -14171802, -9121733, -3810605, -2586334, -3018230, -856992, 3540479, 7339101, 10204346, 13174644, 15150563, 14501061]
43098A4501061j884744j04416K506461L847033M026137K624260j581504o711138
43090A7223150q100012m538780l95049K82464j854610m379687o167287n699764
43082a3629575j009394N696784P697013K014668n380464o955522l485646j726746
43074a6778882m007505n603228k665074K092586L626016J494534k3743K195787
43066a9669509O175481P348009M183216o1295j705998j132211r81536j241016
43058g084859L84824L227969L047519j511149n572901m160146J053515M510975
43050f104253M248707K849098K212779J447032j55085j607872k220050k245815
43042a575459j202118J535378L880567K047446l953536q474259o198037J542377
$$ y = [14501061, 12616317, 12511901, 15018362, 18865395, 22891532, 25515792, 23934288, 17223150, 9123138, 4584358, 4189309, 4471773, 2617163, -1762524, -7929811, -13629575, -14638969, -8942185, -1245172, 769496, -4610968, -11566490, -15052136, -16778882, -20786387, -26389615, -29054689, -26962103, -23336087, -21841553, -21865296, -19669509, -13494028, -6146019, -1962803, -2024098, -3730096, -4862307, -5843843, -7084859, -6700035, -3472066, -424547, -1935696, -7508597, -11668743, -10615228, -6104253, -1855546, 993552, 3206331, 4653363, 4498278, 2890406, 670356, -1575459, -2777577, -1242199, 2638368, 4685814, 732278, -7741981, -13940018, -12397641]
43034a2397641Q366119R612943N769858L64699l287776l722191j890647k79424
43026B535940n5448N22685L113331N484531L764624j204616l502586q9478M222225
43017A4791208L060539k726649o756289o019290l268581j067900J020780K368136
43009A401954M9742n634426r092209o328752k09692M398066O839486Q272779P298173
43000F995121L098139o43664r01644j334919o301610j1333252p991295K336240
42992a6076884Q412057M496198k587917m674801k797603k137982l133746l201694
42984b1702372k435220j993006l69490L663919P251977P050852M058537J059648
42976c415155j720073m477860m688485p05456M224889O004493N147456M089343
$$ y = [-12397641, -4031522, 5581421, 11351279, 11715978, 8428202, 4706011, 2815364, 2535940, 2480492, 3003177, 6116508, 11601039, 15365663, 14161047, 10658461, 10568983, 14791208, 17851747, 15125098, 8368809, 2349519, -919062, -1986962, -966182, 1401954, 1451696, -4182730, -13274939, -19603691, -19813383, -15415317, -8575831, -303052, 6995121, 10093260, 9449596, 8547952, 7213033, 911423, -10421829, -18413124, -16076884, -7664827, -3168629, -5756546, -10431347, -13228950, -15366932, -18500678, -21702372, -24137592, -26130598, -26500088, -22836169, -15584192, -8533340, -4474803, -3415155, -5135228, -9613088, -14301573, -15007029, -10782140, -4777647, 369809, 4459152]
42968D459152K326390r62562k932636j405897O7808k143007m283763j057149L717290
42959b214374J613671o027932q390293j448801N856673N431657J211758J085868
42951b881773M825233O675947M872228J883013j282123m636203n550354j734459
42943B171509L323217L535881j302313m955333l148356J395693L413560J733708
42935F167566j01799J335161M925676N780728J195886m781422n272856N14225
42927I763165N580422L911356k425145p351278q461963p139366m083804O00420
42919i606193M600638N356841M008323L268416K362012j277656n844074o077495
42911c209188j215643K927459J696531k624031m835158l137518P44164M598292
$$ y = [4459152, 6785542, 5822980, 2890344, 1484447, 1552255, -590752, -4874515, -5931664, -2214374, -600703, -6628635, -15018928, -16467729, -10611056, -5179399, -3967641, -2881773, 1943460, 8619407, 13491635, 15374648, 14092525, 9456322, 3905968, 2171509, 5494726, 9030607, 7728294, 2772961, -375395, 1020298, 4433858, 6167566, 6065767, 7400928, 12326604, 18107332, 19303218, 14521796, 9248940, 9763165, 15343587, 19254943, 16829798, 9478520, 1016557, -6122809, -10206613, -9606193, -5005555, 351286, 4359609, 7628025, 9990037, 8712381, 2868307, -3209188, -4424831, -1497372, 199159, -2424872, -7260030, -10397548, -9653384, -5055092]
42903e055092O559364N613489L447218L211391M565926L182257k368134o939311
42895A2217108n767190j784671j081787l509481l696794l45558J858538R6180
42887b013655k924452m657013o106673p049091l935653L284890P687003M386119
42879a1328525j195596q23281L852430M121200j401491m160904Q09182P007581
42871c119404O272814m2426n027481o379924o491668n727054k267336K573540
42863b0208939M774576L366865J137754l14990j722676k306694K62831M907312
42855a0103961O589346K733409l218727o569206o551371m774400j685451K508672
42847b1071689N646848N580483L316920J593546J017873O7771j419147j389293
$$ y = [-5055092, 1504272, 7117761, 10564979, 13776370, 18342296, 21524553, 19156419, 12217108, 6449918, 4665247, 3583460, 73979, -3622815, -3968373, -2109835, -2013655, -4938107, -9595120, -15701793, -22750884, -26686537, -23401647, -15714644, -11328525, -12524121, -13347402, -9494972, -5373772, -6775263, -10936167, -10126985, -3119404, 3153410, 3110984, -1916497, -8296421, -14788089, -20515143, -22782479, -20208939, -15434363, -12067498, -10929744, -11244734, -12967410, -15274104, -15011273, -10103961, -3514615, -781206, -3999933, -10569139, -17120510, -21894910, -23580361, -21071689, -15424841, -9844358, -6527438, -4933892, -3916019, -3848248, -5267395, -6656688]
42839f656688J020089L166352J719622k716123n574072l708675N15080K352564
42831i881851J216558J132326M036320O243269M128779J42163r52351K58102r43724
42822E379591n086448o847403k861353L404775O528812N269410J930304j131927
42814F585761k341702j108152Q51233Q19318r70105j526460l14404n62712l645051
42805b212274o189958n314578k839978j286777M34299L681097O135642N513873
42797b078654L958547M006932L235857j505328o869903o375682q5129N179829
42789e33531N297566K797943Q62696q45780k767966l035126j032660M57502q22482
42780C78162l414527m801338m564063l176578l85448L172110N010487L633437
$$ y = [-6656688, -5636599, -2470247, -750625, -3466748, -9040820, -12749495, -12234415, -9881851, -8665293, -7532967, -3496647, 2746622, 6875401, 7017564, 6065213, 6323315, 5379591, 293143, -6554260, -9415613, -6010838, 517974, 5787384, 7717688, 6585761, 4244059, 3135907, 3987140, 4806458, 3836353, 2309893, 1995489, 1432777, -2212274, -8402232, -13716810, -16556788, -17843565, -17409266, -13728169, -7592527, -2078654, 1879893, 5886825, 9122682, 7617354, 747451, -5628231, -5713360, -533531, 4764035, 7561978, 8424674, 7578894, 4810928, 1775802, 743142, 1200644, 378162, -3036365, -7837703, -12401766, -15578344, -15963792, -12791682, -7781195, -4147758]
42772d147758Q27677n70359M1187J308085K305764L284868M560016N457668M414852
42763A7482000O05852m106542o132283m294221j520189p47188j076408l92899
42755a81878N09115j1055l41367J787075M042483K248670k192584l591097j059630
42746A209732n8888l372084o713836n831852k201284J425645N397945R134081
42738a010541Q317765J520207m741676l589190K584653N909538M032253J181882
42730A4204891o9910j378153l007191k138466J470350L289483J68094m810826
42722G728272o324185l377297N64472K565147K905794K972892K378191n42233
42714H871053n528030r104079p880644k666579K351202M282346L501661J423892
$$ y = [-4147758, -3320081, -3890440, -3849253, -2541168, -235404, 3049464, 7609480, 13067148, 17482000, 18087852, 13981310, 7849027, 3554806, 2034617, 1287429, 211021, -181878, 327237, 316182, -25185, 1761890, 5804373, 8053043, 5860459, 2269362, 1209732, 1150844, -2221240, -8935076, -14766928, -16968212, -15542567, -10144622, -1010541, 7307224, 8827431, 4085755, 496565, 3081218, 8990756, 13023009, 14204891, 14134981, 12756828, 9749637, 7611171, 9081521, 12371004, 12539098, 7728272, 1404087, -1973210, -1408738, 1156409, 4062203, 7035095, 9413286, 8871053, 3343023, -5761056, -13641700, -16308279, -13957077, -9674731, -6173070, -4749178]
42706d749178q64629j771141l84599J102015j5960j505142J552159P689444Q682713
42697I735682J759013m419650j792368M785534M993896j256590m700276j613395
42689G491846J520666q96341n930127p888638n481382q71509L370459M646161
42681d038865K283616R4775K147520N695448M281476j639193m467196j483434
42673B874147J009829j072592k566871J180982M996122J835040n387817q136764
42665e267924m850174j101992N08483K444963N000358M762767J113643k167435
42657D42689l018849l360274m055345k799758J220314M907106N319413K829032
42649A484328p10541l461102k926945J779289O136766L661916m970390j1075642
$$ y = [-4749178, -5613807, -7384948, -7769547, -6667532, -6683492, -8188634, -6636475, 1052969, 9735682, 11494695, 7075045, 5282677, 10068211, 15062107, 13805517, 9105241, 7491846, 9012512, 8116171, 2186044, -5702594, -11183976, -12055485, -8685026, -4038865, -1755249, -1660474, 487046, 6182494, 10463970, 8824777, 4357581, 2874147, 3883976, 2811384, 244513, 1425495, 6421617, 8256657, 2868840, -5267924, -10118098, -11220090, -10711607, -8266644, -3266286, 1496481, 2610124, 442689, -2576160, -5936434, -9991779, -12791537, -11571223, -6664117, -1344704, 1484328, 773787, -2687315, -5614260, -3834971, 2301795, 5963711, 993321, -10082321]
42641a0082321q844768k476755Q78168P87626J542977M034362N195633L755799
42633e209279J262925j705595n292026o794472k891314L732228N394556n96181
42625a2099158p370622o985526M6570P147970J0389998J0308174P261774Q16180
42617I515360o049033p584452k460643L379314L823481j6779k295057k35533L782281
42608A858939O711680P854897P362156M879943Q59076k703736m044282l299842
42600A9478831k003646j692107k890488m483265m511849k848640k194698m291125
42592e436987n959218k307123N640249J0230308O211772k278931o552717l450802
42584c903449K310233M822640K905183o13447k654837j916412R73662L934120
$$ y = [-10082321, -18927089, -21403844, -20525676, -19738050, -18195073, -14160711, -8965078, -5209279, -3946354, -5651949, -10943975, -17738447, -20629761, -16897533, -11502977, -12099158, -19469780, -26455306, -26408736, -19260766, -8870768, 1437406, 8699180, 9515360, 3466327, -4118125, -6578768, -3199454, 624027, 607248, -1687809, -1923342, 1858939, 8570619, 16425516, 23787672, 28667615, 29526691, 26822955, 22778673, 19478831, 17475185, 15783078, 12892590, 8409325, 3897476, 1048836, -1145862, -5436987, -11396205, -13703328, -8063079, 2167229, 8379001, 6100070, -452647, -3903449, -1593216, 3229424, 6134607, 5521160, 2866323, 949911, 1923573, 5857693]
42576E857693M821887L261828P60419j338849l262855n399389o202002l342491
42568d843759K332448N866854L622882j139879j581632L205063O271874K981470
42560A6715321j444151J77060M905776L296758n497768j1131833p321404j339012
42552a639253k514080p825264p036389J351286Q023047O406187Q02243p91168
42544c223391L404083Q474910Q705702K313513o928510j1820120q081408O80362
42536f474859O517082N647970J041200k818499m296779l868550k690476k390728
42528i333639l181777k313747K051309O031058M012699k331036m801520q1812
42520i948465N414573M974253M51403k222941j665386l96433O80301J984194K210523
$$ y = [5857693, 10679580, 13941408, 14701827, 13362978, 10100123, 4700734, -1501268, -4843759, -2511311, 3355543, 6978425, 5838546, 4256914, 7461977, 13733851, 16715321, 15271170, 15448230, 20354006, 23650764, 18152996, 7021163, -300241, -1639253, -4153333, -11978597, -19014986, -17663700, -9640653, -3234466, -2432223, -3223391, 180692, 8655602, 17361304, 19674817, 12746307, 926187, -7155221, -6474859, 42223, 5690193, 6731393, 3912894, -383885, -4252435, -6942911, -9333639, -12515416, -14829163, -12777854, -6746796, -2734097, -5065133, -9866653, -9948465, -4533892, 440361, 891764, -1331177, -2996563, -3392996, -2712695, -728501, 1482022]
42511A482022O59092K94379L273409N511288J714181n268483o758100n79127N167316
42502E495977K980594m400250q538043o007991r06011J555512O49296n03050P26326
42493h947640L215544L059617j749945q014631j0043966n625673K045784Q094854
42485a7966056R881135P554593L157190l25306j088247l52532m61870j142464
42477g43557q0461K474467K877507n81719m358721m191811j083694J43540k484065
42468h028514n553058m739510j15956L854700L309320l27319j375107L252781
42460i722663Q967933P991989m84148p929360o564777R31679N377467L029275
42452A597395r11606p14352K465176L390733k43036n985389r750134q623749k435043
$$ y = [1482022, 2141114, 2435493, 5708902, 11220190, 12934371, 7665888, 907788, 328661, 5495977, 8476571, 4076321, -4461722, -10469713, -11375724, -9820212, -9170916, -9673966, -8947640, -5732096, -2672479, -4422424, -12437055, -22481021, -28106694, -26060910, -17966056, -8084921, -530328, 2626862, 2301556, 1213309, 860777, 398907, -743557, -824018, 1650449, 4527956, 3946237, -412484, -4604295, -5687989, -5544449, -8028514, -13581572, -18321082, -18437038, -14582338, -11273018, -11600337, -12975444, -9722663, -754730, 7237259, 6753111, -1176249, -7741026, -6809347, -1431880, 1597395, 685789, -28563, 2436613, 5827346, 5584310, -401079, -10151213, -18774962, -21210005]
42443b1210005M979769P597614L379919k069411j376709M931214Q326695L308766
42435G867852n058785p745090l264435J897761L311125L431306M865486M348370
42427I653590j863871r761054j0863824l521919M605744O728430M510118K793767
42419B280981J597156j712514n319708m314036J161720M821098K795255j226158
42411H3794j715704J387379L884211L221707L03231k791612m259787l133677o41458
42402c661916L84760n99286n41493K245672M281059J609630l667614n791267l022532
42393h762987J405430M798678O438506M560776j690971p074290m295578M699294
42385G8858Q750042K405566o149635p100386k276332L25879m23149K64643K840210
$$ y = [-21210005, -16230236, -8632622, -5252703, -7322114, -8698823, -3767609, 4559086, 7867852, 2809067, -4936023, -8200458, -6302697, -2991572, 439734, 5305220, 9653590, 7789719, -1971335, -12835159, -16357078, -11751334, -5022904, -512786, 2280981, 3878137, 2165623, -3154085, -7468121, -6306401, -1485303, 1309952, 83794, -1631910, -244531, 3639680, 6861387, 7164618, 4373006, 113219, -3020458, -3661916, -3277156, -3876442, -4417935, -2172263, 2108796, 3718426, 50812, -5740455, -8762987, -7357557, -2558879, 3879627, 8440403, 6749432, -324858, -4620436, 78858, 8828900, 11234466, 5084831, -2015555, -4291887, -3966008, -4389157, -4124514, -1284304]
42376a284304L234991J171036N1169l86649k708209l938431J187995Q728508Q059605
42367A4115711j484647p383218k231327N070250L547972l646578o556150m653633
42359c221620m748772p087488n120307K007359P076817N853718K202998O74259
42351b363036R25436J122712J000725K11950j275742p64166L727239P779265N019738
42342A5384121k263582m545289J020888N927607L110146k911649l943797k77693
42334A1500752J395723j538402n340295o108690l386874R77897L824909K239066
42326C564086k548945m874887j608601K898083K630870j471854l166718J5347
42318d562619L702508K660599l341604r685576j0905289n406006K045462M270628
$$ y = [-1284304, 1950687, 3121723, 3172892, 2786243, 78034, -3860397, -2672402, 6056106, 14115711, 12631064, 5247846, 3016519, 8086769, 11634741, 7988163, 1432013, -3221620, -7970392, -15057880, -20178187, -18170828, -11094011, -5240293, -3037295, -2363036, -1437600, -314888, 685837, 897787, -377955, -1142121, 2585118, 10364383, 15384121, 13120539, 8575250, 9596138, 15523745, 18633891, 15722242, 11778445, 11500752, 12896475, 11358073, 6017778, -90912, -3477786, -2499889, 1325020, 3564086, 1015141, -3859746, -5468347, -2570264, 60606, -1411248, -4577966, -4562619, -860111, 1800488, -1541116, -11226692, -22131981, -27537987, -25492525, -21221897]
42310b1221897P7109l834387j884594K932853M686115M003000N686869Q869621
42302f85311P175763n43348o651612m753104J884438N357634K927615j583888
42294C128187l626902j956879J626067L954092K736984j082368l865631l289898
42286b376348j037650o14315l143639n895096m750815J351494P832949P932419
42278g01001O64110o418348n523804J688127O780129N947767L388647K863116
42270H688743K165497j181511m189838k905375R96748K893363K127854J676291
42262A0271772K494983K635514J178924r20354l365074o147593p141812m053548
42254e047188J127617L525315J825375l53508l97384j17538j519263k843760j683824
$$ y = [-21221897, -21144788, -24979175, -26863769, -23930916, -19244801, -15241801, -9554932, -685311, 6490452, 5947104, -704508, -5457612, -3573174, 1784460, 4712075, 3128187, -498715, -2455594, -829527, 3124565, 5861549, 4779181, 913550, -2376348, -3413998, -4028313, -7171952, -13067048, -17817863, -16466369, -8633420, -701001, -36891, -6455239, -11979043, -10290916, -3510787, 2436980, 5825627, 8688743, 10854240, 9672729, 5482891, 2577516, 3574264, 6467627, 8595481, 10271772, 12766755, 15402269, 16581193, 15660839, 12295765, 6148172, -993640, -5047188, -3919571, -394256, 1431119, 1077611, 680227, 562689, -956574, -3800334, -5484158]
42245e484158N81453P49330j324638k957889k957542k645518k666807j707107
42237a8412876Q38017L277986L987731L653974L741938M005910L144107J086510
42229E323297j101542l145409n527429p454472o666380k000379M866982J0492676
42221e212656J1555909O411591k710381r049678o595090K088720O778156J558771
42213D825342o997716p944363j22778P292624P678977M041202J838607R39636
42205A1551531j477005m268943l408201J830779P199150P560103J362630p424476
42197A2925568j1253226n889949L487862O897521J967370k965927r29613M177418
42189H417024N000298K105583P33283L25348l699926r512496r750241l422851
$$ y = [-5484158, -4902705, -4153375, -5478013, -8435902, -11393444, -14038962, -16705769, -18412876, -17574859, -14296873, -10309142, -6655168, -2913230, 1092680, 4236787, 5323297, 4221755, 1076346, -4451083, -11905555, -18571935, -20572314, -15705332, -5212656, 6343253, 12754844, 10044463, 994785, -5600305, -3511585, 3266571, 4825342, -2172374, -10116737, -10239515, -2946891, 4732086, 8773288, 10611895, 11551531, 10074526, 5805583, 2397382, 4228161, 11427311, 18987414, 20350044, 12925568, 1672342, -4217607, -729745, 6167776, 8135146, 5169219, 4239606, 8417024, 13417322, 15522905, 16256188, 16581536, 12881610, 3369114, -6381127, -9803978]
42181i803978J870838J514079n37389m72624q68360m060079o467003m681994j281723
42172b4788233N24596K302735N033160M363021j928724p012638l661929M134329
42164b1033683O837695L584776J300448J579670p45408n531053n034848K849702
42156a6192701Q958628N961100q91625k610600M14408J553199n16305j381756
42148d705652N05932K302752K891472L945743M996110L335520o56303l345451
42140I270123l709833m338230n564365l856092J880179P181952Q099558O280617
42132A5243909M681831K097079l565166r418433j0372312o539345k674709o17565
42124a1164711K148603N594287M927405j519826p242509n372266J627162N523772
$$ y = [-9803978, -7933140, -6419061, -6956450, -7429074, -8297434, -12357513, -18824516, -23506510, -24788233, -24263637, -21960902, -16927742, -12564721, -14493445, -21506083, -25168012, -21033683, -14195988, -10611212, -9310764, -7731094, -8476502, -14007555, -19042403, -16192701, -7234073, -1272973, -2164598, -4775198, -4360790, -2807591, -3323896, -4705652, -4199720, -1896968, 994504, 4940247, 9936357, 13271877, 12615574, 9270123, 5560290, 1222060, -4342305, -8198397, -6318218, 863734, 8963292, 15243909, 19925740, 22022819, 18457653, 9039220, -1333092, -7872437, -10547146, -11164711, -9016108, -3421821, 1505584, -14242, -7256751, -12629017, -11001855, -5478083]
42116e478083L630956N09937r09663k876531n889299n225579J305935P490849
42108g441478O383360M78703k041761O83508K671168M08285k049699k42461L915809
42099B765434N650685L850411R99913p03729n18305J362799L264486K963349R20181
42090B0555224K81912K078274L371771K234782J047761J695508J002444m391629
42082B7876047j0986138j1739505n782513L07225J400597n12031p34249J862609
42074A692042M779496N412504L000432j064731l849199l477476j603772j458285
42066C431011l375349m664666l999632k825173j749717Q45316M797469O188928
42058a351813K446128k850602l823262l1740L048173J465427k253296k925063
$$ y = [-5478083, -1847127, -1337190, -2246853, -5123384, -11012683, -16238262, -14932327, -7441478, -1058118, -579415, -2621176, -1937668, 733500, 1141785, -907914, -1150375, 2765434, 8416119, 12266530, 13266443, 12562714, 12044409, 13407208, 16671694, 19635043, 20555224, 20837136, 22915410, 26287181, 28521963, 29569724, 31265232, 32267676, 27876047, 16889909, 5150404, -632109, -324884, 1075713, 563682, -170567, 1692042, 6471538, 11884042, 14884474, 13819743, 9970544, 6493068, 4889296, 3431011, 55662, -4609004, -8608636, -11433809, -13183526, -12338210, -7540741, -1351813, 1094315, -1756287, -5579549, -5611289, -2563116, -1097689, -3350985, -6276048]
42050f276048M21049L585156K804582n94679k296871p31347J329206J148183k54723
42041h65492k48563J386673K886889L727142M633200M923325K884274r14183l458639
42032A4954626l251508k190729k675617m732315o621069o500642l217652K475621
42024a1759285P288766Q325389O785433O040972O097911L809889o32570k098699
42016B3857806K010406O640567N191538j778031p671031q055991m392668p50730
42008A5051866M9879k238490n113099n003728j300419K120217J446967k052469
42000B960724l799607j693189K158784M660500M492349K347192K86309R3516Q80588
41991A2387166j71208l205931m245286q18317L515039L830914J028562Q7149K310264
$$ y = [-6276048, -5854999, -2269843, 534739, -59940, -2356811, -3088158, -1758952, -610769, -865492, -1114055, 272618, 3159507, 6886649, 11519849, 16443174, 19327448, 18413265, 14954626, 11703118, 9512389, 6836772, 2104457, -4516612, -11017254, -14234906, -11759285, -4470519, 3854870, 10640303, 16681275, 22779186, 26589075, 25956505, 23857806, 25868212, 32508779, 37700317, 35922286, 28251255, 20195264, 15802596, 15051866, 15101745, 12863255, 7750156, 2746428, 1446009, 3566226, 5013193, 2960724, -838883, -2532072, -373288, 4287212, 8779561, 11126753, 11413062, 11506578, 12387166, 12215958, 9010027, 4764741, 3946424, 7461463, 11292377, 12320939, 12408088, 14718352]
41982A4718352L944615K492531O7653m43909Q37470J940696J473766p72266l535565
41973B0723343m236065j576609J989727K428833j369784o856432j0648429j0386967
41965i932383n636942N77117L325406J839346J189736M153855N424948P7374o065828
41956e047371l593621M768463O541569j196481o449005q03321P536915O988407
41948H745555J87421j750218K860147N064716K02480n836908o246791j671507
41940A554895K935120M328415K077272k106900m547285k279392L240624P253163
41932A2455912O708231K303052l530178q048942q666544n170582j012841K91903
41924d669989o47451q76856L85613J864266L186261M433115M458756L187330L413997
$$ y = [14718352, 18662967, 21155498, 21223151, 20779242, 21616712, 23557408, 25031174, 24258908, 20723343, 16487278, 14910669, 16900396, 19329229, 17959445, 11103013, 454584, -9932383, -15569325, -14992208, -11666802, -9827456, -8637720, -4483865, 941083, 1018457, -5047371, -8640992, -3872529, 2669040, 1472559, -4976446, -5779767, 1757148, 8745555, 8932976, 7182758, 10042905, 15107621, 15310101, 9473193, 3226402, 1554895, 4490015, 8818430, 10895702, 8788802, 4241517, 1962125, 5202749, 12455912, 19164143, 21467195, 17937017, 9888075, 1221531, -3949051, -4961892, -4669989, -5317440, -6194296, -5808683, -3944417, -758156, 3674959, 8133715, 11321045, 14735042]
41915A4735042N999912N841464j374448j0182190j0628500k689745K583673j345278
41907B939930p243427m881251M727012J1583750R840771L143150j734486j997097
41899A6378352M61978K402089K409816J540795R75818k7707k193769l542878k035935
41890A6368559q1712j694016n148589m386108R05312L391842m70982m078591j186806
41881C618909L609277K599286j684911m90325N980347P959167J660742m529551
41873A8722941l161391J396184J014982l405081m293486P83757O532841Q101706
41865B5692453O154860L581768J634703L07043n42135j292103j766936n19624
41857C3250029K753470M729948J792715l978651n945831j433834M258078M604365
$$ y = [14735042, 20734954, 26576418, 25201970, 15019780, 4391280, 1701535, 4285208, 2939930, -4303497, -9184748, -4457736, 7126014, 16966785, 20109935, 18375449, 16378352, 16840330, 19242419, 21652235, 23193030, 24168848, 24141141, 21947372, 18404494, 16368559, 16286847, 14592831, 9444242, 5058134, 5963446, 9355288, 8884306, 4805715, 3618909, 7228186, 9827472, 8142561, 7652236, 13632583, 21591750, 23252492, 18722941, 15561550, 16957734, 17972716, 14567635, 10274149, 11057906, 17590747, 25692453, 31847313, 35429081, 37063784, 37370827, 36828692, 35536589, 33769653, 33250029, 36003499, 40733447, 42526162, 38547511, 32601680, 31167846, 35425924, 40030289]
41849D0030289q4003m105568l877895q34558K016020L036707J610502j978683
41841C5812811n458854n724977k335047J586688K901192J826335J023360K222477
41833C1853985M458854N276188L575223J443007K202782N785013P698126M728889
41825F7022067k757j126016R91869J123097j881228k874612P66763M009129K008075
41816G0036387j934599j979932M63372m65960m539469n312394n86978M215085
41808E9895512M677881K895486J955359J062985l33692Q07034N521594Q391098
41800H4873257M520675j954950k569654L616492R036284Q563245N429528M506086
41792A16020963N077214L884385J673770K038296N156878P264896O851188P497113
$$ y = [40030289, 39946286, 35840718, 31962823, 31128265, 33144285, 36180992, 37791494, 35812811, 30353957, 24628980, 22293933, 23880621, 26781813, 28608148, 29631508, 31853985, 36312839, 41589027, 45164250, 46607257, 48810039, 54595052, 62293178, 67022067, 67019310, 65893294, 66885163, 68008260, 66127032, 63252420, 64019183, 68028312, 70036387, 68101788, 66121856, 66585228, 66119268, 61579799, 56267405, 55680427, 59895512, 64573393, 67468879, 69424238, 70487223, 70153531, 70960565, 76482159, 84873257, 89393932, 87438982, 84869328, 88485820, 97522104, 106085349, 111514877, 116020963, 121098177, 124982562, 126656332, 128694628, 133851506, 141116402, 147967590, 155464703]
41784A55464703J2505785J9411703K2882064K1766218J9797925J9432404J8854745
41777B90115547J6500260J4768236J6075197J7817865J5354852Q802149K712854
41770C82146960o41172l382158o964245r406200r237364q334597q300184p079310
41762C28801730k298636L969369O919982M799008P81948n50158K701402Q512343
41754C53636988J2776890J3092850J1098635R918132R587818P443653L082364
41747D20637330n80892k264111m392587q122609j0373418r176911q285910j1952411
41739C65488481j7947998k0950308k0794607k1393666k2481020j9366598j2011078
41732B30543206p520249j0153232j4241109j2041601n111010j890626n207238
$$ y = [155464703, 167970488, 187382191, 210264255, 232030473, 251828398, 271260802, 290115547, 306615807, 321384043, 337459240, 355277105, 370631957, 379434106, 382146960, 381505788, 378123630, 371159385, 361753185, 352515821, 344181224, 335881040, 328801730, 326503094, 330472463, 337392445, 342191453, 342973401, 342423243, 345124645, 353636988, 366413878, 379506728, 390605363, 400523495, 410111313, 417554966, 420637330, 420056438, 417792327, 413399740, 405277131, 394903713, 385726802, 377440892, 365488481, 347540483, 326590175, 305795568, 284401902, 261920882, 242554284, 230543206, 223022957, 212869725, 198628616, 186587015, 181476005, 179585379, 174378141]
41725A74378141q418442n517917J64163J322723k259489l429680J495360O855833
41717A64590692N473354j284787n641751l846462L93934K617275K643638J741238
41709A66687131l65556l147825l988061k309816j490081l314993m042269k47909
41701A47780621M468250L933731j296764m761637l572463j486024k064921m006053
41693A38994740m739009m237774l258061j392400R19476J308396j362244m803118
41685A21430006o088447n017122l348811k284293j973442k251657k838091l609824
41677I4018319m879486o420984o735815m927915k622688j923226k352897k508438
41669F1646870l541014o995138r769588o450820K187391Q112091N926259n16830
$$ y = [174378141, 165959699, 160441782, 160605945, 161928668, 159669179, 156239499, 157734859, 164590692, 170064046, 168779259, 163137508, 159291046, 159684980, 162302255, 164945893, 166687131, 166321575, 163173750, 159185689, 156875873, 155385792, 152070799, 148028530, 147780621, 152248871, 156182602, 154885838, 150124201, 146551738, 145065714, 143000793, 138994740, 134255731, 130017957, 126759896, 125367496, 126286972, 127595368, 126233124, 121430006, 115341559, 110324437, 106975626, 104691333, 102717891, 100466234, 97628143, 94018319, 89138833, 82717849, 75982034, 71054119, 68431431, 66508205, 64155308, 61646870, 58105856, 51110718, 41341130, 34890310, 37077701, 45189792, 51116051, 50599221]
41661E0599221m371025m461908l668170k342397J089008M749143M482078P48633
41653D6824583p55348K877316P078632N777589o12324o220469p194464m819648
41645D2955867j562357K294497O555663Q624406O182114J161207j987463j625444
41637F2598490K44107J901689K992175J862634l198204q808517q229694j227348
41629D8135332L514164L96504m397515k823356J579804o30364q637444j1679958
41621B5457167n651064J272368K165891O42593K067457M193580K818817M1407
41613C3008216K8046J518390J186656N12466K654902N424000M027384p57058l162494
41604D4440508p27234K777024K770979j120306n361325n854515k023206J504430
$$ y = [50599221, 46228196, 41766288, 38098118, 35755721, 36844729, 41593872, 46075950, 46824583, 46069235, 48946551, 56025183, 61802772, 61190448, 54969979, 47775515, 42955867, 41393510, 43688007, 50243670, 58868076, 65050190, 66211397, 64223934, 62598490, 62842597, 64744286, 67736461, 69599095, 66400891, 57592374, 49362680, 48135332, 51649496, 52046000, 47648485, 44825129, 46404933, 45774569, 37137125, 25457167, 19806103, 21078471, 23244362, 23886955, 25954412, 30147992, 32966809, 33008216, 33036262, 34554652, 35741308, 36253774, 38908676, 44332676, 48360060, 47603002, 44440508, 43713274, 46490298, 49261277, 48140971, 42779646, 36925131, 34901925, 36406355]
41596C6406355r5346m404845l876474K872142P823724N189125p4062p96092J372089
41587D4416616O50058k077398j633206J473920K109563j95832j152587J92058
41579D3783192R07881P23926J586260J825295j286238m254535j381790M561835
41571D6465826N205246K37866k158078K92401N66028l476855l538698M313631
41563D7907367J0256245M996289m993295o741873L32732N170650J707657m851031
41555E3784741p639745o019805l211026j894869l062625n380271n655121k611879
41547A8309400J056553K745157L395284M060384K804270p26273j621143L486529
41539C3510161Q950476O392256k993332r386978p443095j875884Q32258J50111
$$ y = [36406355, 36311009, 31906164, 28029690, 30901832, 38725556, 43914681, 43840619, 43044527, 44416616, 45066674, 42989276, 41356070, 42829990, 44939553, 44743721, 43591134, 43783192, 44691073, 45414999, 47001259, 48826554, 47540316, 43285781, 41903991, 46465826, 51671072, 51908938, 49750860, 50043261, 50609289, 47132434, 43593736, 47907367, 58163612, 63159901, 58166606, 51424733, 51757465, 56928115, 58635772, 53784741, 46144996, 40125191, 36914165, 35019296, 31956671, 26576400, 20921279, 18309400, 19365953, 22111110, 25506394, 29566778, 32371048, 31644775, 30023632, 33510161, 42460637, 48852893, 45859561, 36472583, 29029488, 27153604, 27985862, 28135973]
41531B8135973r98663j364074j336293j171711j391744k586973l723391l012274
41523A2550850r92743l8789l74696L04945K389433K716070q90521n694498o628450
41514C341601j901165N040878Q840212P440586M105623L318586M671087L450485
41506C8307893j557792m714552j353466M437069M935311m04565n026123n178348
41498B9445427l538245k659769j183357J519992K440935m42309m659460o826531
41490A4096683o232636l156800K103413O326306M363598l362206q652245n336505
41482A49608K200124N425830L697943L445671O448330O333152j023245r563861
41474A7113552j0210352k980417L198549K340190j803941k636264l00696J0338
$$ y = [28135973, 27137310, 25773236, 24436943, 23265232, 21873488, 19286515, 15563124, 12550850, 11558107, 11519318, 11144622, 11449567, 13839000, 16555070, 15664549, 9970051, 3341601, 1440436, 6481314, 15321526, 22762112, 26867735, 30186321, 34857408, 38307893, 36750101, 32035549, 30682083, 35119152, 40054463, 39649898, 34623775, 29445427, 25907182, 23247413, 22064056, 23584048, 26024983, 25582674, 20923214, 14096683, 7864047, 4707247, 6810660, 13136966, 17500564, 14138358, 5486113, 149608, 2349732, 7775562, 11473505, 14919176, 21367506, 27700658, 26677413, 17113552, 6903200, 3922783, 7121332, 9461522, 7657581, 5021317, 4720621, 4730959]
41466D730959k528772k622842K102123N945159L133836l065982m882012j398875
41458A413594J009897r07815l047003j412003K122675M005741M074493L564966
41450A0824545K183522Q7003p88229o8192k09707k099838l193796k369425k129049
41441B236834l116840j702443K926497M808962k9484n888000n355449o92592Q06845
41432f005670n47232J587661O825925P259252O14335n520284n690628m134964
41424e611605n923877q076687n307426Q91278M850904M646931K353954l66324
41416a2542852k264367j061348L371033O816578N881545K952810K011692K260594
41408G425685N44845k325350k918677j276727m50948q86182l61557Q97197J10497
$$ y = [4730959, 2202187, -420655, 1681468, 7626627, 10760463, 7694481, 2812469, 1413594, 2423491, 1515676, -1531327, -2943330, -820655, 3185086, 7259579, 10824545, 13008067, 13095070, 12306841, 12238649, 12028942, 9929104, 6735308, 4365883, 2236834, -880006, -2582449, 344048, 5153010, 5123526, -764474, -6119923, -6812515, -6005670, -6552902, -4965241, 1860684, 9119936, 9734271, 4213987, -1476641, -5611605, -11535482, -19612169, -24919595, -24028317, -19177413, -14530482, -12176528, -12542852, -14807219, -15868567, -12497534, -5680956, 200589, 3153399, 5165091, 7425685, 7970530, 5645180, 2726503, 1449776, 998828, 112646, -248911, 648286, 758783]
41399G58783k778683m368368l072760j050285o9858P04333J868504K381597K180458
41390c446279K868321M513459M745582K347260q40089k638110k758847j697526
41382C093771l9941O57687p65156k374111j069309K289937L418404J000175j696027
41373D515430k748864m169535o390146n575409k44799M271056L058430n60133
41365g843970l06403K824673K345165k958202o883415m929780M08302M697563
41357a2646067O563252N922287K336731k252542l474679l07193K594887J472685
41349B09361q53791N25596N103368Q015971O847259L277324q30370m587309n800493
41340A1906916k349186L193998M698667L27762m361059l970605q46537j197907
$$ y = [758783, -2019900, -6388268, -9461028, -10511313, -10581171, -9876838, -8008334, -5626737, -3446279, -577958, 3935501, 8681083, 11028343, 10188254, 7550144, 4791297, 3093771, 3053830, 3711517, 2946361, 572250, -497059, 1792878, 5211282, 6211457, 4515430, 1766566, -2402969, -8793115, -14368524, -14613323, -10342267, -7283837, -7843970, -8150373, -5325700, -2980535, -5938737, -12822152, -17751932, -17343630, -12646067, -6082815, -160528, 2176203, -76339, -3551018, -3858211, -1263324, 209361, -644430, -118834, 4984534, 13000505, 19847764, 23125088, 22294718, 17707409, 11906916, 9557730, 12751728, 17450395, 17778157, 13417098, 9446493, 8599956, 7402049]
41332G402049n505949p608047l554898L033536O293311N427759L895578L502828
41324A2886167K804655Q62925n97101L11528K787587L996707J925734k542017
41316B2436185n880305m889635l85570L093729K725031J063645J742208L054474
41308B2959762J33766o542845j0012277o293648m54385L97952l180311m755814
41300g747800j544562K662443L757592K252587J095186J603056K802329K993537
41292G874368J190416j806613l609108k626378j27222J072281l84062l444981
41284a861299n881808n777015l048286j01692P90304J052147L775363P635157
41276c417129P547862L289953J420062M460826M783235l621912j3121853j2124195
$$ y = [7402049, 1896100, -5711947, -9266845, -6233309, 60002, 5487761, 9383339, 12886167, 15690822, 16553747, 15956646, 16268174, 19055761, 23052468, 24978202, 22436185, 16555880, 11666245, 11280675, 14374404, 17099435, 18163080, 19905288, 22959762, 23093528, 16550683, 6538406, 244758, -209627, 188325, -2991986, -7747800, -9292362, -6629919, -2872327, -619740, 475446, 2078502, 4880831, 7874368, 9064784, 7258171, 3649063, 1022685, 895463, 1967744, 1583682, -1861299, -7743107, -13520122, -16568408, -16670100, -15879796, -14827649, -11052286, -3417129, 4130733, 7420686, 8840748, 13301574, 18084809, 14462897, 1341044, -10783151]
41268a0783151l022829J360951j995395k917130L185746O954422J485177n199413
41260a0931622l143519L727351N409127K283667K251059O008481O902675L305925
41252A5813144J00573j584596n574476j0741527j0009533k022030M818685L810666
41244e389094j482660m034009k632440p0872K686229N564656O387914L747201
41236D776925M65049q6053O79884r85092m498649n032303o58288M276273M891165
41227C828911K552471K612304N599769M849423l957123j3895447j3371476j465803
41219a3246971R922888J1371593O447552K842083M31145m398084q407314n457095
41211d94203K056405N758277M136022K937094L223462j7849o028048o579945J14382
$$ y = [-10783151, -13805980, -12445029, -14440424, -17357554, -14171808, -7217386, -5732209, -10931622, -14075141, -10347790, -4938663, -2654996, -403937, 5604544, 12507219, 15813144, 15913717, 14329121, 8754645, -1986882, -11996415, -14018445, -9199760, -5389094, -6871754, -10905763, -13538203, -13609075, -10922846, -5358190, 1029724, 4776925, 5241974, 5155921, 5835805, 4850713, 352064, -4680239, -5338527, -1062254, 3828911, 6381382, 8993686, 14593455, 19442878, 15485755, 1590308, -11781168, -13246971, -3324083, 8047510, 14495062, 17337145, 17768290, 13370206, 4962892, -494203, 1562202, 7320479, 11456501, 14393595, 17617057, 17599208, 11571160, 4991215, 5105597]
41202E105597M606566P61128m811465m496068j491202j732937k456896J293804
41194c221473N465860L308547j812159j375491L316296K810475m518324r451632
41186e477901o269584j9630L171758M032801M745457L560875m34238l392386k529470
41177b612318j124121k963376n636843m182435J167427N339923N161314K223416
41169b627013k95783j061586j001052j696440l197989l370942n05845L806842
41161i949808O293686O039295M543489K485485k51900j879840l61252J965070
41153H884225K99180m877512p135170l458232Q48693J09935l453068l915397m44619
41144a3141965L242359N564319P689752Q983255P386799L987181K208786K344512
$$ y = [5105597, 9712163, 10473291, 5661826, 1165758, -325444, -2058381, -4515277, -3221473, 2244387, 5552934, 3740775, 2365284, 5681580, 8492055, 3973731, -5477901, -11747485, -11767115, -8595357, -4562556, 182901, 3743776, 3309538, -82848, -2612318, -3736439, -6699815, -12336658, -16519093, -15351666, -10011743, -4850429, -2627013, -2922796, -3984382, -4985434, -6681874, -9879863, -13250805, -13756650, -9949808, -3656122, 2383173, 6926662, 9412147, 9160247, 7280407, 6919155, 8884225, 9183405, 4305893, -2829277, -6287509, -5438816, -5328881, -8781949, -12697346, -13141965, -9899606, -4335287, 3354465, 12337720, 19724519, 23711700, 25920486, 28264998]
41136B8264998J619251q039O73372L541338L481306j688836o333432m574134M87408
41127B5463232P75752m676969p696313k473365N891363P836242J372046o532684
41119A9959304r462127q016807o001940m210123r24231L445411N749990M231102
41111D770579Q73743j108362o95524P13021J443148J097281L43429l32820j384514
41102E719981l180589m319929k568591J460102L393992K89980m430550m573298
41094h208902M00243M355040L066469j33584j12325K000012J095221l010816m383312
41085d931954J80944N753008N832103J293347j391225L26370K001756m15382m353984
41076D294983m675123j168127J865732K212321J729489J842057J435770L69848
$$ y = [28264998, 29884249, 29876210, 30549582, 34090920, 37572226, 35883390, 29549958, 24975824, 25463232, 26238984, 21562015, 13865702, 11392337, 17283700, 25119942, 26491988, 19959304, 10497177, 2480370, -3521570, -7731693, -8655924, -5210513, 539477, 4770579, 5644322, 4535960, 3840436, 4553457, 5996605, 7093886, 7437315, 7104495, 5719981, 2539392, -1780537, -4349128, -2889026, 504966, 794946, -3635604, -8208902, -7808659, -3453619, -387150, -520734, -633059, 1366953, 2462174, -548642, -4931954, -4751010, 1001998, 6834101, 8127448, 6736223, 7062593, 9064349, 8648967, 4294983, -380140, -1548267, 317465, 2529786, 4259275, 6101332, 7537102, 7906950]
41068G906950Q16735K876168K873166p42224l582205j876868M21609k851061r291040
41059c448770r970353k796465L503483J594177m594939o655172l331531L48547
41051b5351023K232836M692843Q065850Q759584N158791O93569j057566q97890
41043B296994j347307k123778j163706J316020K874084K918851L975463P544535
41035A6291156J0505164Q102514M17100o587043p741441m558715k405599l174244
41027A0848892l740474j433360K225091M114703L104012j49408m377893p167717
41019C423846n881998j276694K013962R67745j884596k589358j671138k421727
41011i319958m849778n513946k994348N05673L240722N542773O553038L805275
$$ y = [7906950, 8723685, 11599853, 14473019, 13730795, 10148590, 8271722, 8693331, 5842270, -3448770, -13419123, -16215588, -12712105, -11117928, -15712867, -22368039, -25699570, -25351023, -23118187, -18425344, -10359494, -1599910, 3558881, 4252450, 3194884, 2296994, 949687, -1174091, -2337797, -1021777, 1852307, 4771158, 8746621, 16291156, 26796320, 34898834, 35315934, 28728891, 20987450, 16428735, 14023136, 10848892, 7108418, 5675058, 7900149, 12014852, 15118864, 14969456, 10591563, 3423846, -2458152, -3734846, -1720884, -753139, -2637735, -5227093, -6898231, -9319958, -14169736, -19683682, -22678030, -22172357, -18931635, -13388862, -6835824, -3030549]
41003c030549j628919l641703J293962P588845O615698j244771n952758j081487
40995a081682O832894O615230k179330q129356l185415O478308Q808124J390997
40987A5549770p065851r310303o982208m476919k106119Q74980J841522j006049
40979a2681177l539878j121215K900413J109010n808222q223690j032640Q634428
40971a9762971J1151400O683458K532995J835621J218048j514193l638847k664873
40963d159362m38819K18538k76109K9116J087040J864264L221373O347228Q790429
40954A6683698N863264k645701j0179779j0370644m505023P65332J921341J208371
40946a259141J046049K34301k417072m363149k508250J999274N351431N942906
$$ y = [-3030549, -4659468, -8301171, -7007209, 581636, 7197334, 5952563, -195, -1081682, 5751212, 12366442, 10187112, 2057756, -1127659, 5350649, 14158773, 15549770, 8483919, -826384, -7808592, -12285511, -14391630, -13516650, -11675128, -12681177, -16221055, -17342270, -14441857, -13332847, -19141069, -27364759, -28397399, -19762971, -8611571, -1928113, 604882, 2440503, 3658551, 2144358, -1494489, -4159362, -4598181, -4379643, -4655752, -4626636, -3539596, -1675332, 1546041, 7893269, 16683698, 22546962, 19901261, 9721482, -649162, -5154185, -4388853, -2467512, -1259141, -213092, 21209, -2395863, -6759012, -9267262, -7267988, -1916557, 4026349]
40938D026349M551476J311004l461074o359606l689705K338312N026180K352514
40930F095450n9323K081514M504648J004888n887758p326785q45075N681437M828452
40921A0077448p44653l226426n89156K554268L411439M260604O094680M769197
40913B6607401k477524j0408830j1160373m756366J286529K624976K291689L016044
40905G023546K138207j962118m390815p65453M512987M115448p47841k468032
40897G455929O13224K433452K98084j022062J074290J581490l197842q176520
40889A060045o906421j375704J838921J351028O51447R26604M40379p50836j160943
40880c925480j571919l238036l913663q40757L804584N772105N496700O243386
$$ y = [4026349, 8577825, 9888829, 6427755, 68149, -3621556, -1283244, 3742936, 6095450, 6036127, 8117641, 12622289, 13627177, 7739419, 412634, -432441, 5248996, 10077448, 9332795, 6106369, 5517213, 8071481, 11482920, 15743524, 21838204, 26607401, 24129877, 13721047, 2560674, -2195692, -909163, 1715813, 4007502, 7023546, 9161753, 7199635, 2808820, 2043367, 6556354, 10671802, 9923961, 7455929, 8069153, 10502605, 10800689, 9778627, 10852917, 12434407, 9236565, 1060045, -5846376, -7222080, -5383159, -4032131, -3380684, -2454080, -2013701, -2764537, -3925480, -5497399, -8735435, -12649098, -13489855, -9685271, -3913166, 1583534, 7826920]
40872G826920O954387L558721l107306p416157p150529n126728k590658J779454
40864e271896N651253L887272k344377n235248k002901J057538j98174j059225
40856e515758K110970L725100j528797q033121p282892j504728O13127j553229
40848a8969328o92339M955142Q339318M980061p87358l044687j213634K014387
40840d418438M055206K582695k344963n681217k455138M272213O575666K964880
40832E550904m11629l53907l12721j794832q92678K984394L416039k728930q748597
40823c291957p976293l627265k101648k477657l98030K463787J339053k395309
40815a8465319l141236l20797J770959J800623J999377K350192J202201L89585
$$ y = [7826920, 14781307, 18340028, 15232722, 7816565, 666036, -4460692, -7051350, -5271896, 379357, 4266629, 1922252, -3312996, -5315897, -4258359, -4456533, -5515758, -3404788, 320312, -1208485, -9241606, -16524498, -18029226, -17416099, -18969328, -19661667, -14706525, -6367207, -1387146, -2174504, -5219191, -6432825, -4418438, -363232, 2219463, -125500, -5806717, -8261855, -3989642, 2586024, 5550904, 5139275, 4785368, 4472647, 2677815, 1785137, 4769531, 8185570, 5456640, -3291957, -11268250, -14895515, -16997163, -19474820, -19872850, -17409063, -16070010, -18465319, -21606555, -21927352, -20156393, -18355770, -16356393, -14006201, -12804000, -12414415]
40807a2414415K524091M391302R29169m788588m121290L819401R848144P607486
40799G795300R69800l829388n759589n607604k588062J497179J518095k836581
40791h840850m329217J285528P742473P119039J197731k438646j601172N4325
40783A89211Q05412K001371K908420J034713k595313l933940j883762N76341J203248
40774C05701O15818o5525j80892J194425L468917L196233j452182o073066m754421
40765c744992J068458L830023N56777k971919q53026M656733O755250L235909
40757A2533213j401004k058141J212772L817071J971687l009395o138816m492595
40749B434792l46244K141546J755401J98972j104606j789863j096741J733239
$$ y = [-12414415, -9890324, -5499022, -4569853, -9358441, -13479731, -9660330, 187814, 7795300, 8765100, 4935712, -823877, -6431481, -9019543, -7522364, -6004269, -8840850, -13170067, -11884539, -4142066, 2976973, 4174704, 1736058, 134886, 189211, 994623, 2995994, 5904414, 6939127, 4343814, 409874, -1473888, -897547, 305701, 921519, 855994, 675102, 1869527, 5338444, 8534677, 7082495, 1009429, -3744992, -2676534, 1153489, 1710266, -1261653, -2114679, 2542054, 9297304, 12533213, 11132209, 9074068, 10286840, 14103911, 16075598, 13066203, 6927387, 2434792, 2088548, 4230094, 5985495, 6184467, 5079861, 3289998, 2193257, 3926496]
40741C926496N638780Q096050P319259L391379j722358m640480l231138p9843
40733A8698145m09019m485931n655250N42472Q608886R332595J711265o396669
40725B1946494q145172l399894L905015Q649030N969839l864704j2130475r628650
40717C301483J102519P686574L449506n104776q619034o473462m125954l749543
40709a2532687k670557R22513M754337M900664K29469n202568n192942J054834
40701a3736937O306738M187164j324752j258955M672210P497591K825160k995650
40693F172569l209878N67820L634176N008694M498019j10438p549086j0974040
40685a962164p102667j781711p85240j180594J545787M081051J402995k817058
$$ y = [3926496, 9565276, 17661326, 24980585, 28371964, 26649606, 22009126, 18777988, 18698145, 18289126, 13803195, 8147945, 8690417, 17299303, 26631898, 28343163, 21946494, 13801322, 10401428, 14306443, 22955473, 28925312, 25060608, 12930133, 3301483, 4404002, 12090576, 15540082, 10435306, 1816272, -4657190, -8783144, -12532687, -15203244, -14280731, -9526394, -4625730, -4396261, -9598829, -14791771, -13736937, -7430199, -3243035, -4567787, -5826742, -1154532, 6343059, 9168219, 6172569, 2962691, 3530511, 7164687, 12173381, 16671400, 16560962, 9011876, -1962164, -9064831, -10846542, -11631782, -12812376, -11266589, -7185538, -5782543, -8599601]
40677h599601j467641L629232M212087j283145o119311n962565k822427J171292
40669a7242079N738819Q297811N848789J392411Q84350L464171K499753l068838
40661G815187o654919m654192r89278R69391K893540N159291M054552q66125l865481
40652C861966j662517J623321K337774L256185O620464P897580L052232l191924
40644B3795081l522136J113151L676788J557272j640581l278925m418936n667058
40636A1614656n554700l667348j682955p88707n64260l20922L16898J480955K378308
40627C211925K045832J825222M329152Q241279P746226K39561q583385j1174445
40619G881367p179506k154328M17029J387250J899326J823902J806809K938384
$$ y = [-8599601, -10067242, -6438010, -2225923, -3509068, -9628379, -15590944, -18413371, -17242079, -11503260, -3205449, 2643340, 4035751, 4920101, 8384272, 10884025, 7815187, 1160268, -3493924, -4483202, -3513811, -620271, 4539020, 8593572, 7727447, 3861966, 2199449, 3822770, 6160544, 9416729, 16037193, 23934773, 26987005, 23795081, 20272945, 21386096, 25062884, 26620156, 24979575, 21700650, 17281714, 11614656, 6059956, 2392608, 709653, -79054, -643314, -964236, -647338, 833617, 3211925, 5257757, 7082979, 11412131, 19653410, 27399636, 27639197, 19055812, 7881367, 701861, -1452467, -1035438, 351812, 2251138, 4075040, 5881849, 8820233]
40611H820233M341703L977815J538407j670232m565973n846223l814353M32685
40603C214062K115795j078924m331560j930382L735695N133565O55812l499472
40595D014591l020065q99492j284076l389333m521907m663852m327429j298910
40587a9390473N902412J2894342J2392025L157074o898884q528468j269660O071383
40579D329751N615045p05022m720385l268798j382333l160455m906802j663320
40571i862319L672247M226962J4999k381930p96359m12404l743677n187515j04051
40562a4574047O530267O689392R92033k694454q61830J867176J156393o18226
40554a513296Q93153M716975N949142L068383J12321R09818L850905M243955M46571
$$ y = [8820233, 13161936, 17139751, 18678158, 17007926, 12441953, 6595730, 2781377, 3214062, 5329857, 4250933, -80627, -2011009, 1724686, 6858251, 7514063, 4014591, 994526, 95034, -1189042, -4578375, -9100282, -13764134, -18091563, -19390473, -13488061, -593719, 11798306, 14955380, 8056496, -471972, -1741632, 4329751, 9944796, 9239774, 4519389, 1250591, -131742, -3292197, -8198999, -9862319, -6190072, -1963110, -1948111, -4330041, -5126400, -5538804, -9282481, -14469996, -14574047, -8043780, -1354388, -362355, -3056809, -3918639, -2051463, -895070, -1513296, -620143, 4096832, 10045974, 13114357, 13226678, 14136496, 17987401, 22231356, 22677927]
40545B2677927m554254p077533n913274j803712L218737N403080J790848m950077
40537H791742p637349l288447K607215M020821K838507M145221O410230L849911
40529B1737851k718837n818874l052443n47211k032535k831461N31941K573318
40521G841749k134207q139855o114856K648963P850501N240174J142959Q15210
40513I150638O87885m005439j0147808j0657978m347840K959398O076643N521071
40505d763430M838377N524210N883124M127581J256143j27671M77663P45651p68698
40496A7192950k287082j894959r15213j573938l024568l051666k421253l366835
40488a342564m272016q10528O550733J0852794O908884k086836q679275r035844
$$ y = [22677927, 18123673, 11046140, 5132866, 3329154, 6547891, 11950971, 13741819, 8791742, 1154393, -2134054, 473161, 4493982, 7332489, 11477710, 17887940, 21737851, 19019014, 13200140, 10147697, 9600486, 7567951, 4736490, 5268431, 7841749, 5707542, -2432313, -8547169, -5898206, 1952295, 7192469, 8335428, 9150638, 9838523, 5833084, -4314724, -14972702, -19320542, -16361144, -10284501, -4763430, 74947, 5599157, 11482281, 15609862, 16866005, 16738334, 17215997, 17961648, 17192950, 14905868, 13010909, 12095696, 10521758, 7497190, 4445524, 2024271, -1342564, -5614580, -6425108, 125625, 10978419, 17887303, 15800467, 7121192, -1914652]
40480a914652m360207K405914P814256Q192725K989468k864848l697521k57102
40472H308033J241175k119931n495487k668177N201824J0244414P344020L84669
40464B2440540k842465p55511L02686m351883r991504q538070p67119L603840
40456h99486n40938o132388m147939L268140O327678J898398l061608k618684
40448e906827P11982K172351K217460L336870L882327O64101m526465o465372
40440c913573l931051p52274O75351K106871M444625M656874O44268m085334m468182
40431d622425j049847Q20507j159235k909758L22N604525P487164K793624m087612
40422B877265o467767k482488L736048O941546N273217L24994n101186q363809
$$ y = [-1914652, -6274859, -3868945, 3945311, 12138036, 15127504, 12262656, 8565135, 8308033, 9549208, 7429277, 1933790, -734387, 4467437, 14711851, 22055871, 22440540, 19598075, 18842564, 19145250, 14793367, 4801863, -3736207, -4503326, -899486, -1440424, -7572812, -11720751, -8452611, -2124933, -226535, -3288143, -5906827, -5194845, -3022494, -805034, 2531836, 6414163, 7078264, 2551799, -3913573, -7844624, -8596898, -7921547, -5814676, -1370051, 3286823, 3931091, -154243, -4622425, -5672272, -4851765, -6011000, -8920758, -8920436, -3315911, 4171253, 6964877, 2877265, -3590502, -6072990, -2336942, 4604604, 9877821, 10202815, 5101629, -3262180]
40414c262180p848311m449793j566890j614245k605713l33076N527080R772105
40406f381023P697077J041019m255037n173822l902284l285815l055081j712422
40398a9027388L39584J724019K722464M574016O679191O840342M428695J248246
40390I529169j165246l011906m251473l545277q32322J168332M83388p49713M31736
40381a943312K359861O80897m285250o881635m369689j117204j415856k501376
40373a9473564L37663M963017N248995J470252N03002M624964P449469M420531
40365I544329P38566L000846P725658N924297k686112q150898m285090K767535
40357A4579131L725000j071688l492146p0039L165081m24965q259206j0955761
$$ y = [-3262180, -11110491, -15560284, -17127174, -18741419, -21347132, -21680208, -16153128, -6381023, 1316054, 2357073, -1897964, -7071786, -10974070, -14259885, -17314966, -19027388, -18687804, -16963785, -14241321, -9667305, -2988114, 3852228, 8280923, 9529169, 8363923, 5352017, 1100544, -2444733, -3277055, -2108723, -1625335, -2375048, -1943312, 416549, 1097446, -3187804, -10069439, -14439128, -15556332, -16972188, -19473564, -19135901, -14172884, -8923889, -7453637, -6950635, -2325671, 5123798, 9544329, 10282895, 13283741, 21009399, 26933696, 24247584, 16096686, 11811596, 14579131, 18304131, 17232443, 13740297, 13670258, 16835339, 16410374, 8151168, -2804593]
40349b804593l978479O057303Q616322J744814n537969m449739K683308O012148
40341H343115J412644m431840l592626K563050O046068L226439j534589l231503
40333H800758k559941k691000l216449j294125K536098M090747J794940n80542
40325F880486N56532L340025L622829J307997j62630M25471Q61634J19006R1322
40316A7042672J633389K524700J119183j110384k496866l498677m086059k416664
40308H711294R55447J240537m015075r529636q558154k490727J423748P01386
40300a1561180k20143J609661L576590L336588K780994L526629L451101Q91063
40292G391303j834360k243316j311489l18656J826088M562155L467456k820555
$$ y = [-2804593, -6783072, -725769, 7890553, 9635367, 4097398, -352341, 2330967, 8343115, 9755759, 5323919, 1731293, 4294343, 10340411, 13566850, 12032261, 8800758, 6240817, 3549817, 333368, -960757, 1575341, 5666088, 7461028, 6880486, 7437018, 10777043, 14399872, 15707869, 15545239, 15970710, 16832344, 16951350, 17042672, 18676061, 21200761, 22319944, 21209560, 18712694, 15214017, 11127958, 8711294, 9666741, 10907278, 6892203, -2637433, -11195587, -13686314, -12262566, -11561180, -11781323, -10171662, -6595072, -3258484, -477490, 3049139, 6500240, 7391303, 5556943, 3313627, 2002138, 1683482, 3509570, 8071725, 11539181, 8718626]
40284H718626p292537k867310O089293Q076788L92675o795489m770924K069451
40276C620573L756473p31479l209146P77509N531163L910117k364230n443545
40268E847435k339148J751745J591321j156599j742977K82136J568962J050175
40260F853050Q30565J316907K26108k614029l902419k018996M87554J567560K591021
40251E337321L939585K350089l087982o468608k502961M277308M588051k143588
40243F289215o465975k378116M317833M564351j609159n886560k910751L410486
40235f68676N260069K92672n749143n792128J68934N223025M518308J328313J678434
40226F259808N258305N947827Q48490n647599p763902m739231M3422L292836L559588
$$ y = [8718626, 1426089, -1441221, 4648072, 12724860, 13117535, 6322046, 1551122, 3620573, 7377046, 6645567, 3436421, 4213930, 9745093, 13655210, 11290980, 5847435, 3508287, 5260032, 6851353, 5694754, 3951777, 4233913, 5802875, 6853050, 7683615, 9000522, 9226630, 6612601, 2710182, 691186, 1178740, 2746300, 5337321, 9276906, 11626995, 8539013, 2070405, -432556, 3844752, 8432803, 6289215, -176760, -2554876, 1762957, 6327308, 4718149, -1168411, -4079162, -668676, 4591393, 4884065, -865078, -6657206, -6488272, -1265247, 3253061, 4581374, 6259808, 11518113, 17465940, 18314430, 12666831, 4902929, 163698, 207120, 3499956, 7059544]
40217G059544J288795j124381j209401L54102K46638k713799n499475m949742
40209f547719j765915J281985L150118M283808L973519O87499m818844q632997
40201h388546p074464p76665N323648O842143M666832L491142N398131P218566
40193A6700787N636268K147006J73579k12934q42004q94597J226395K870675j42038
40184B6663137o006452q298078n491929k688563k513377j455969J950601K801293
40176D960663j562295n318107k805587K081747K295394q96093p62986L406265
40168A399001N899884M309109J753361k17895l202120n934770m397195L98222
40160G597J954151j737467m442829j470875K936469K879843N35375K401218Q292954
$$ y = [7059544, 8348339, 7223958, 6014557, 6368659, 6615297, 3901498, -1597977, -6547719, -8313634, -7031649, -3881531, 402277, 4375796, 5063295, 244451, -8388546, -15463010, -16239675, -10916027, -4073884, 592948, 4084090, 9482221, 16700787, 22337055, 24484061, 24657640, 24444706, 23602702, 22708105, 23934500, 26805175, 26663137, 20656685, 12358607, 6866678, 4178115, 1664738, 208769, 2159370, 4960663, 3398368, -1919739, -4725326, -2643579, -348185, -1244278, -2007264, 1399001, 7298885, 11607994, 13361355, 13143460, 9941340, 4006570, -390625, 7597, 1961748, 224281, -4218548, -5689423, -2752954, 126889, 662264, 3063482, 11356436]
40151A1356436J0371452L637970o819851j0982577m920252M664691P410666P42798
40143A5461333p233345p696605j740178K458058J363973n59151N40209K186092
40135D780386R91473j628137k912233l491687m341170k882909K591759P388935
40127D96417N269173k201965o726480l909890J866411L963768Q48080m164805
40119d559291o985322n061943J392685Q403411J0318535N014294l426905q286912
40111c191448o450057j002030K276635J291195M5925L091947Q054151P460543
40103A1576861m71254p433761n463218J956594N049198J548176j924611j647748
40095C190237j609888m381824n197517j17001N846402M997106k213136q506641
$$ y = [11356436, 21727888, 25365858, 18546007, 7563430, 2643178, 7307869, 14718535, 15461333, 8227988, 531383, -1208795, 1249263, 2613236, 2054085, 2594294, 4780386, 5771859, 4143722, 1231489, -2260198, -6601368, -9484277, -6892518, 496417, 5765590, 3563625, -3162855, -7072745, -5206334, -1242566, -394486, -4559291, -11544613, -16606556, -15213871, -6810460, 3508075, 8522369, 5095464, -3191448, -9641505, -10643535, -8366900, -7075705, -7029780, -3937833, 4116318, 11576861, 11105607, 3671846, -1791372, 165222, 5214420, 6762596, 4837985, 3190237, 1580349, -2801475, -7998992, -8115993, -2269591, 2727515, 514379, -7992262]
40087g992262r492006o420877j136680N468932J0185035Q630490J395198m848911
40079d211081m142978K915875J0364431J1914615N747463k965377n781796q26380
40071A3014772L130856k250599j1584314j1377358O30728J0835605Q008012k407738
40063G999964q174981o805440l939133j213545L648395P622712M720724k219410
40055A639286k952543M380907Q971140L491570m634950n038184k4623N19804m873202
40046A479205q237587n620030k158684k551447m295004l296551k48411K128527
40038b2799982L740584N272458N004917J487973k566680k841252Q94941M665293
40030g141748N603459M791715M489344M705531L646392N86465k811697m185970
$$ y = [-7992262, -17484268, -23905145, -25041825, -19572893, -9387858, -757368, 637830, -4211081, -8354059, -5438184, 4926247, 16840862, 22588325, 19622948, 13841152, 13014772, 16145628, 13895029, 2310715, -9066643, -8435915, 2399690, 10407702, 7999964, -175017, -6980457, -10919590, -12133135, -8484740, -862028, 3858696, 1639286, -1313257, 3067650, 12038790, 15530360, 10895410, 5857226, 5832603, 6352407, 1479205, -6758382, -12378412, -14537096, -17088543, -21383547, -24680098, -24928509, -22799982, -19059398, -13786940, -8782023, -7294050, -9860730, -12701982, -11807041, -7141748, -1538289, 3253426, 7742770, 12448301, 16094693, 16681158, 13869461, 9683491]
40022I683491l179735j971943k635071m331755m223623j306434J990139K863897
40014c111034J734332J386714K932592M241108K905447n24602l536038n161072
40006H67447o443449o956144l483177N101768J3000756J1777605P04368j0661541
39998C907633j2662157n692841K488967O717313P442953N849845J841123k615915
39990G276921l621736j039456K51032k400626m643411j288907N436945Q109434
39982H080196L516959l852470p516725n285442M6509L730661K747244j392924
39974G4008l618304r75362L272201L702845K97749j479755J392918N176851M840120
39965A2683271R01693k024937j840778r95760k220587m854475o149769m652913
$$ y = [9683491, 6503756, 4531813, 1896742, -2435013, -6658636, -7965070, -5974931, -3111034, -1376702, 10012, 2942604, 7183712, 10089159, 9564557, 6028519, 867447, -5576002, -12532146, -16015323, -10913555, 2087201, 13864806, 14569174, 3907633, -8754524, -14447365, -11958398, -5241085, 2201868, 8051713, 9892836, 7276921, 3655185, 2615729, 2866761, 466135, -4177276, -5466183, -29238, 8080196, 11597155, 7744685, 227960, -5057482, -5010973, -1280312, 1466932, 74008, -3544296, -4519658, -1247457, 2455388, 2753137, 1273382, 2666300, 7843151, 12683271, 13584964, 11560027, 9719249, 8723489, 6502902, 1648427, -4501342, -9154255]
39957i154255j374410J639134L169847L517054L746928M386869N031507N228652
39949A6191326N102062M526837K361197k144292p079573q626765n297096m72916
39941D560780J033670j239242l074756j558408R39538O16767j779874j975058
39933b476583J204633L606393J293377m266104q230416p748092l641430J530479
39925a8727743N080858N187903K462638j43767n69899J74280L79708L91994Q96017
39916d868011N13165j754713l404414j650936J532630K231645J577965M122300
39908a700369Q905035Q920979J835000n425758o783378n387623o238476o366486
39900a2241076n05520P372015P975423J169306l194359j97013L605769J758787
$$ y = [-9154255, -10528665, -8889531, -5719684, -2202630, 1544298, 5931167, 10962674, 16191326, 21293388, 25820225, 28181422, 26037130, 18957557, 10330792, 5033696, 4560780, 5594450, 4355208, 1280452, -277956, 661582, 1278349, -501525, -2476583, -1271950, 2334443, 3627820, -638284, -8868700, -16616792, -20258222, -18727743, -13646885, -8458982, -5996344, -6140111, -6710010, -6535730, -6156022, -5764028, -4868011, -4354846, -6109559, -9513973, -11164909, -9632279, -7400634, -5822669, -1700369, 7204666, 16125645, 17960645, 12534887, 5751509, 363886, -5874590, -12241076, -12746596, -5374581, 2600842, 3770148, 575789, 378776, 3984545, 5743332]
39892E743332k369010k426422J154416L986613M859756M166376J36121o896393
39884H354789j0736743o860836j07617K460876K658798O277771J0247870O052642
39876A8347550m392497q621917k318184L620877K20493o182827n669959n95280
39868e591744N15446j907058j039083K739098K808560o99510o87210L529776L998986
39859C667261j943256n976027j812318M882848N602862J018382k529212k793290
39851A17250j157499K702384Q241956R783881L017159o012368o586014J977929
39843A2084678Q885362O485277q41698n283246o410749q158951r592791n758618
39835h590736L050102R187407O936039j37946m198429l069596j360315k591605
$$ y = [5743332, 3374322, 947900, 2102316, 6088929, 10948685, 15115061, 15251182, 8354789, -2381954, -9242790, -9350407, -6889531, -4230733, 2047038, 12294908, 18347550, 13955053, 5333136, 3014952, 6635829, 6856322, 673495, -4996464, -5591744, -5076298, -6983356, -8022439, -5283341, -2474781, -3174291, -3861501, -331725, 3667261, 1724005, -4252022, -6064340, -1181492, 4421370, 5439752, 2910540, 117250, -1040249, 1662135, 9904091, 19687972, 22705131, 16692763, 10106749, 12084678, 20970040, 27455317, 26613619, 21330373, 14919624, 6760673, -2832118, -8590736, -5540634, 3646773, 10582812, 10444866, 6246437, 3176841, 1816526, -775079]
39827g75079m692220m583930l112087k355063j258934J695040L730916J282603
39819a0068754k588347q45249O327931R780267M113899l983085n187588m24885
39811b875811K143386j61492k154224l62148J873453L09600m047539o658246m481217
39802a6414238J533627O733413N929165r30716o988088n670957J126257N711340
39794h970197M478546P41485j541787j626990M36047M370084O840281L750685
39786H478154k875179n775070k406432J430637N93438k462004l318399k564592
39778h899447k452917j669446J011291K259277l42910k094849K417846R373089
39770c98066R966730L366211k507722l050850j741189j671264o79111J854468
$$ y = [-775079, -5467299, -10051229, -13163316, -15518379, -16777313, -15082273, -11351357, -10068754, -12657101, -13502350, -7174419, 2605848, 6719747, 2736662, -2450926, -2875811, -732425, -893917, -3048141, -3410289, -1536836, -1227236, -5274775, -11933021, -16414238, -14880611, -8147198, -2218033, -3148749, -10136837, -15807794, -14681537, -8970197, -4491651, -3750166, -5291953, -6918943, -6482896, -2112812, 4727469, 8478154, 5602975, -172095, -2578527, -1147890, -554452, -3016456, -6334855, -8899447, -11352364, -13021810, -12010519, -9751242, -10094152, -12189001, -9771155, -398066, 9568664, 12934875, 10427153, 7376303, 5635114, 3963850, 3284739, 5139207]
39762E139207J054175n321621j0661399p678584J053729O975657P262378O211318
39754D034860O353216N078849Q58173l197234m221840l520369l038791j726906
39746F19958J417402L712092K085143j690755k919445m71007K203962K457371
39738G414721J331517M54396n70341k226458l347509l109273k427028j637339
39730d117314O80028M425017O321374M566268K381773K780337K307912m010025
39722A5335370j2439533j2704134k486600P095339N242082m226222q486815k937405
39714a5607918M146173M334947j6253p88081L810258O954830K859811n075920
39706F17847q352250m256107R33996Q16584k543818k448490K251887N960608N021941
$$ y = [5139207, 6193382, 871761, -9789638, -17468222, -16414493, -9438836, -2176458, 4034860, 10388076, 15466925, 16325098, 13127864, 8906024, 5385655, 2346864, 619958, 2037360, 5749452, 7834595, 6143840, 3224395, 2753388, 4957350, 7414721, 8746238, 9200634, 8630293, 6403835, 3056326, -52947, -2479975, -4117314, -3437286, 987731, 7309105, 11875373, 14257146, 17037483, 19345395, 15335370, 2895837, -9808297, -12294897, -5199558, 42524, -4183698, -12670513, -15607918, -11461745, -7126798, -7143051, -7931132, -4120874, 2833956, 5693767, 617847, -7734403, -11990510, -11056514, -10239930, -12783748, -15232238, -12980351, -7019743, -1997802]
39697a997802K090912N73074M6893m55683K33472J661047L70839l744133m821335
39688f042716J05579M605599J872967m025859m120730J196796L351487J6855j800631
39679d840653J531443M388042K267301p99892l69724M45535k503284n921037m250603
39670a0052872Q94665L656731L415455M263288O666455O622726K947381q05948
39662A7607881k471784l955925o330682o819280k999689L019479O835620O384137
39654A1269757K925666j081560l805646m604125l741102j645386J158232L257109
39646C732945K886241K95241j799398j511980j15491M97215R02621K403328L832541
39637A1123263L139497J212924P92150J755193Q27065l309193p415763p588237
$$ y = [-1997802, 93110, 666184, 713077, 257394, 490866, 2151913, 2522752, -1221381, -6042716, -5937137, -1331538, 541429, -3484430, -7605160, -6408364, -3056877, -3040022, -4840653, -3309210, 1078832, 3346133, 2546241, 2176517, 2622052, 118768, -5802269, -10052872, -9158207, -5501476, -2086021, 2177267, 8843722, 15466448, 18413829, 17607881, 15136097, 11180172, 4849490, -1969790, -4969479, -1950000, 4885620, 11269757, 14195423, 13113863, 9308217, 4704092, 962990, -682396, 475836, 3732945, 6619186, 6914427, 5115029, 3603049, 3487558, 3984773, 4887394, 7290722, 11123263, 14262760, 15475684, 16267834, 18023027, 18850092, 15540899, 8125136, 536899]
39629E36899l976986k70936O94489j22505O14580M284096P721672O275027k36128
39620A5520208o514202p764380m637926q72031J405943J849385K03763k290759
39612c099999k236949J282679L590693N97009l807964k440867L881241O614849
39604D380692K219241k251889M34980P327454J0026434O064528N30818j827981
39596B6904277j632760k203162m839917p265012n901777k80858M968574M761443
39588A4510808M02215j561477J577361M716198K381891l704833p838828p802728
39580B680607n207904j221173L434938O202106N255683L203227L618721M909825
39572B2876030K670770k374364m468601j623403J292331L03063j912904j195298
$$ y = [536899, -3440087, -3711023, -3016534, -3139039, -2524459, 1759637, 9481309, 15756336, 15520208, 9006006, 1241626, -3396300, -4268331, -2862388, -1013003, -809240, -3099999, -5336948, -4054269, -463576, 133433, -3674531, -6115398, -2234157, 4380692, 6599933, 4348044, 4783024, 12110478, 22136912, 28201440, 28732258, 26904277, 25271517, 23068355, 18228438, 10963426, 5061649, 4780791, 9749365, 14510808, 14913023, 13351546, 14928907, 19645105, 22026996, 18322163, 10483335, 2680607, -2527297, -3748470, -313532, 5888574, 11144257, 14347484, 17966205, 22876030, 25546800, 23172436, 18703835, 17080432, 18372763, 18675826, 16762922, 15567624]
39564A5567624J285192J451278j118694l258536l492625l429610m286864n221782
39556b504017n256163m272519j859206K367435O662593P714346M640038P55416
39548H247923k40916J292315K079077O89649j142771j941837k518072l419628
39540C045740l011265n85172O98754k288677o784093o734934j654769K152777
39532a5161639J094448k73946K914435P397958O964448K678629Q83246K651508
39524I149087K992303O36132L80883L577604M368410m32380m994189l786848r10240
39515A0980762k774071o600966n323271q02100j649976q042770r417717l78894
39507b4009003J0391890J2223860N944531p56730m823193p054454n150242K682511
$$ y = [15567624, 16852816, 18304094, 17185400, 13926864, 10434239, 7004629, 2717765, -2504017, -7760180, -12032699, -13891905, -11524470, -4861877, 2852469, 7492507, 8247923, 8007007, 9299322, 11378399, 12068048, 10925277, 8983440, 6465368, 3045740, 34475, -550697, 148057, -2140620, -8924713, -15659647, -17314416, -15161639, -14067191, -14341137, -11426702, -4028744, 2935704, 5614333, 6497579, 9149087, 12141390, 12777522, 13158405, 16736009, 21104419, 20672039, 15677850, 11891002, 10980762, 8206691, 1605725, -3717546, -4519646, -6169622, -14212392, -23630109, -24009003, -13617113, -1393253, 4551278, 3794548, -1028645, -8083099, -13233341, -10550830]
39499a0550830R420340N037194q035500j4653136o108652Q039668J2903136P197424
39491C249644K001490L837170P167730M269046m004531j0154650r006442j995862
39483d636405N427529Q452284O006962Q39787l471200n427518m974389j568370
39475F48680M245799Q035462M634137m397897j0387514p486491J408L656547J741753
39466F91884m96815K00098J271575J9127j903556j982957j283693k527551n753654
39457a1765542q211709p263909k075206N592430J0869837Q819396N55889n971693
39449i450507m457163K291550O619109N705002K518606j256697o853843j2198874
39441a7082817j0871892j153390Q786532R915870L735525n42815J490644N321944
$$ y = [-10550830, -1130490, 3906704, -4128796, -18781932, -24890584, -16850916, -3947780, 3249644, 5251134, 9088304, 16256034, 20525080, 16520549, 6365899, -2640543, -4636405, 791124, 9243408, 15250370, 16090157, 12618957, 7191439, 2217050, 648680, 4894479, 12929941, 17564078, 13166181, 2778667, -4707824, -4706416, -1049869, 691884, 195069, 395167, 1666742, 1685869, -217687, -2200644, -3484337, -6011888, -11765542, -19977251, -27241160, -29316366, -23723936, -12854099, -4034703, -3478814, -9450507, -13907670, -11616120, -4997011, 707991, 3226597, 1969900, -4883943, -17082817, -27954709, -29108099, -20321567, -10405697, -6670172, -7212987, -5722343, -400399]
39433d00399N682648L203472J168979J38380j197451k552660k510332j088508
39425B444129N04212J760402K635333K262766j53877l480172n276514m384448
39417c688169j971556m9527M35305J33262J82784N04282j73542j687762j038948
39408g353871L843023R393083R178887K385419m310595n435889l371072l040012
39400A288973l820216j748772K848772N820497N973623N346508L325522k670859
39392A6364048r904304j1058803m925199M96454l90895k446088J291682P771133
39384b801972Q427709K277110l427742m516999m188926n287486n376980k100156
39376a6995442J907360K797623P74274j181981j270895O08930L910804O948676
$$ y = [-400399, 5282249, 8485721, 9654700, 9793080, 8595629, 6042969, 3532637, 2444129, 2948341, 4708743, 7344076, 9606842, 9452965, 5972793, 696279, -3688169, -5659725, -5709252, -5273947, -5140685, -4957901, -4453619, -4627161, -6314923, -7353871, -3510848, 5882235, 15061122, 17446541, 13135946, 7700057, 4328985, 1288973, -2531243, -4280015, -1431243, 4389254, 10362877, 15709385, 19034907, 16364048, 6459744, -4599059, -9524258, -9027804, -9418699, -11864787, -10573105, -2801972, 5625737, 7902847, 4475105, -41894, -4230820, -9518306, -14895286, -16995442, -15088082, -12290459, -11516185, -12698166, -13969061, -13360131, -9449327, -2500651]
39368b500651P429249N408078L887630M653002N282911K429007l115917o776217
39360A6697092n348095l94519L625064M037195K504461K429548L826137K674798
39352C0051681l039412q866724q898267m019028p90746k165087m193924l174625
39344e096132r62880l98829J1342K664883N312548L786612j215301m531924l391220
39335c820901k42144J391656Q86101j71563m15325K49335R09892R10904J220816
39326I18771L230042N469743L990019j947547p089308o353455j835087L66647
39318c250175r71424j405157J064504K531135L8238k595590J92133P061742J0411762
39309A3077168N776284k457342o064930k247560L689311M653791o98848p482649
$$ y = [-2500651, 4928598, 10336676, 14224306, 18877308, 24160219, 26589226, 23473309, 16697092, 11348997, 10954478, 14579542, 18616737, 21121198, 23550746, 27376883, 30051681, 27012269, 18145545, 9247278, 5228250, 4437504, 2272417, -1921507, -5096132, -6059012, -6457841, -6446499, -3781616, 1530932, 5317544, 4102243, -429681, -3820901, -4063045, -2671389, -1785288, -1956851, -2372176, -2122841, -1212949, -302045, 918771, 4148813, 9618556, 13608575, 11661028, 4571720, -1781735, -3616822, -3250175, -4221599, -5626756, -4562252, -2031117, -1992879, -4588469, -4396336, 2665406, 13077168, 18853452, 16396110, 10331180, 8083620, 11772931, 16426722, 15727874, 8245225]
39301H245225j0419259q373734l544131J267240L766373L040185R48073N98278
39293d471750J757535K81913n394981j0046571q031122j894664P59195j493468
39285b8533913j903784L580141R366757Q166510J690418j973586K32986L173668
39277f200803K030501j117119j584859O77681J893944Q68098L17339J412979J147563
$$ y = [8245225, -2174034, -10547768, -14091899, -12824659, -9058286, -6018101, -5070028, -4471750, -2714215, -2432302, -7827283, -17873854, -25904976, -27799640, -27040445, -28533913, -30437697, -26857556, -17490799, -9324289, -7633871, -9607457, -9374471, -6200803, -4170302, -5287421, -6872280, -6194599, -4300655, -3432557, -3115218, -1702239, -554676]
$$ [...]
##END NTUPLES=NMR SPECTRUM
##END=
