##TITLE=31Pdec_DE-30_DMSO_TFA
 DMSO-d6, 64 sc
 29.7.2024
##JCAMPDX= 6.0         $$ Bruker NMR JCAMP-DX V2.0
##DATA TYPE= NMR SPECTRUM
##DATA CLASS= NTUPLES
##ORIGIN= UXNMR, Bruker Analytische Messtechnik GmbH
##OWNER= root
$$ XWIN-NMR		Version 3.5
$$ Mon Jul 29 15:00:18 2024 Russian Standard Time (UT+4h)  she@DPX200
##.OBSERVE FREQUENCY= 81.013821
##.OBSERVE NUCLEUS= ^31P
##.ACQUISITION MODE= SIMULTANEOUS
##.ACQUISITION SCHEME= undefined
##.AVERAGES= 64
##.DIGITISER RES= 17
##SPECTROMETER/DATA SYSTEM= spect
##.PULSE SEQUENCE= zgpg30
##.SOLVENT NAME= D2O
##.SHIFT REFERENCE= (INTERNAL, D2O, 0, 198.062)
##AUDIT TRAIL= $$ (NUMBER, WHEN, WHO, WHERE, WHAT)
$$ ##TITLE= Audit trail, XWIN-NMR		Version 3.5
$$ ##JCAMPDX= 5.01
$$ ##ORIGIN= Bruker BioSpin GmbH
$$ ##OWNER= she
$$ F:/spectra/data/she/nmr/P31/2/pdata/1/auditp.txt
$$ ##AUDIT TRAIL=  $$ (NUMBER, WHEN, WHO, WHERE, WHAT)
(   1,<2024-07-29 14:58:48.89 +0400>,<she>,<DPX200>,
      <created by zg, POWCHK disabled, PULCHK disabled
       configuration hash MD5:
       00 E9 B6 7A A2 85 ED C7 34 08 36 98 17 FE 4E 26
       data hash MD5: 32K
       C2 B0 C0 9B FD B8 A1 B9 46 F6 62 32 7E 47 C0 73>)
(   2,<2024-07-29 14:58:51.32 +0400>,<she>,<DPX200>,
      <Start of raw data processing
       efp BC_mod = 2 LB = 1.5 FT_mod = 6 PKNL = 1 PHC0 = 2615.731 PHC1 = 186.4869 SI = 64K 
       data hash MD5: 64K
       0E 92 5A B3 60 74 96 60 79 B1 A6 1E 2D 44 07 D2>)
(   3,<2024-07-29 14:59:04.79 +0400>,<she>,<DPX200>,
      <pk PHC0 = -1.792692 PHC1 = 0 
       data hash MD5: 64K
       FD 81 BF CE 72 33 F1 97 F6 8A 27 12 46 A3 AA C8>)
(   4,<2024-07-29 14:59:10.28 +0400>,<she>,<DPX200>,
      <abs ABSG = 5 
       data hash MD5: 64K
       58 BA BC 50 B1 E5 1B F5 A8 17 2C F6 15 C0 C6 22>)
$$ ##END=
$$ 
$$ hash MD5
$$ 22 F3 A4 B6 E3 97 E5 FD EF 04 67 2E 4E 0D 08 03
##$RELAX= 
##$RELAX= 
##$RELAX= 
##$RELAX= 
##$RELAX= 
##$RELAX= 
##$RELAX= 
##$RELAX= 
$$ Bruker specific parameters
$$ --------------------------
##$DU= <F:/spectra>
##$EXPNO= 2
##$NAME= <P31>
##$PROCNO= 1
##$TYPE= <nmr>
##$USER= <she>
##$AMP= (0..31)
100 100 100 100 100 100 100 100 100 100 100 100 100 100 100 100 100 100 
100 100 100 100 100 100 100 100 100 100 100 100 100 100 
##$AQSEQ= 0
##$AQ_mod= 1
##$AUNM= <au_zg>
##$AUTOPOS= <>
##$BF1= 81.014009
##$BF2= 200.13
##$BF3= 200.13
##$BF4= 200.13
##$BF5= 200.13
##$BF6= 200.13
##$BF7= 200.13
##$BF8= 200.13
##$BYTORDA= 1
##$CFDGTYP= 0
##$CFRGTYP= 5
##$CHEMSTR= <none>
##$CNST= (0..31)
1 1 145 1 1 1 1 1 1 1 1 1 1 1 1 1 1 1 1 1 1 1 1 1 1 1 1 1 1 1 1 1 
##$CPDPRG= <waltz16>
##$CPDPRG1= <>
##$CPDPRG2= <waltz16>
##$CPDPRG3= <>
##$CPDPRG4= <mlev>
##$CPDPRG5= <mlev>
##$CPDPRG6= <mlev>
##$CPDPRG7= <mlev>
##$CPDPRG8= <mlev>
##$CPDPRGB= <>
##$CPDPRGT= <>
##$D= (0..31)
0 1 0 0 0 0 0 0 0 0.06 0 0.03 2e-05 3e-06 0 0 0.0002 0 0 0 0 0 0 0 0 0 
0 0 0 0 0 0 
##$DATE= 1722250728
##$DBL= (0..7)
120 120 120 11 120 120 24 19 
##$DBP= (0..7)
150 150 150 150 150 150 150 150 
##$DBP07= 0
##$DBPNAM0= <>
##$DBPNAM1= <>
$$ [...]
##$SUBNAM3= <"">
##$SUBNAM4= <"">
##$SUBNAM5= <"">
##$SUBNAM6= <"">
##$SUBNAM7= <"">
##$SUBNAM8= <"">
##$SUBNAM9= <"">
##$SW= 400.765351723535
##$SWIBOX= (0..15)
0 1 3 0 0 0 0 0 0 0 0 0 0 0 0 0 
##$SW_h= 32467.5324675325
##$TD= 32768
##$TD0= 1
##$TE= 0
##$TE2= 300
##$TE3= 300
##$TEG= 300
##$TL= (0..7)
0 120 53 12 22 120 120 120 
##$TP= (0..7)
150 150 150 150 150 150 150 150 
##$TP07= 0
##$TPNAME0= <>
##$TPNAME1= <>
##$TPNAME2= <>
##$TPNAME3= <>
##$TPNAME4= <>
##$TPNAME5= <>
##$TPNAME6= <>
##$TPNAME7= <>
##$TPOAL= (0..7)
0.5 0.5 0.5 0.5 0.5 0.5 0.5 0.5 
##$TPOFFS= (0..7)
0 0 0 0 0 0 0 0 
##$TUNHIN= 0
##$TUNHOUT= 0
##$TUNXOUT= 0
##$USERA1= <user>
##$USERA2= <user>
##$USERA3= <user>
##$USERA4= <user>
##$USERA5= <user>
##$V9= 5
##$VALIST= <valist>
##$VCLIST= <CCCCCCCCCCCCCCC>
##$VD= 0
##$VDLIST= <DDDDDDDDDDDDDDD>
##$VPLIST= <PPPPPPPPPPPPPPP>
##$VTLIST= <TTTTTTTTTTTTTTT>
##$WBST= 1024
##$WBSW= 4
##$XGAIN= (0..3)
0 0 0 0 
##$XL= 0
##$YL= 0
##$YMAX_a= 5545
##$YMIN_a= -5257
##$ZGOPTNS= <>
##$ZL1= 120
##$ZL2= 120
##$ZL3= 120
##$ZL4= 120
##$ABSF1= 198.0616
##$ABSF2= -202.7028
##$ABSG= 5
##$ABSL= 3
##$ALPHA= 0
##$AQORDER= 0
##$ASSFAC= 0
##$ASSFACI= 0
##$ASSFACX= 0
##$ASSWID= 0
##$AUNMP= <proc_1d>
##$AZFE= 0.1
##$AZFW= 0.5
##$BCFW= 0
##$BC_mod= 2
##$BYTORDP= 0
##$COROFFS= 0
##$CY= -3
##$DATMOD= 1
##$DC= 0
##$DFILT= <>
##$DTYPP= 0
##$F1P= 0
##$F2P= 0
##$FCOR= 1
##$FTSIZE= 65536
##$FT_mod= 6
##$GAMMA= 0
##$GB= 0
##$INTBC= 1
##$INTSCL= 9.790993e-09
##$ISEN= 30
##$LB= 1.5
##$LEV0= 0
##$LPBIN= 0
##$MAXI= 10000
##$MC2= 0
##$MEAN= 0
##$ME_mod= 0
##$MI= 50
##$NCOEF= 0
##$NC_proc= -9
##$NLEV= 6
##$NOISF1= 182.463
##$NOISF2= 159.3651
##$NSP= 0
##$NTH_PI= 0
##$NZP= 0
##$OFFSET= 198.0616
##$PC= 4
##$PHC0= 2613.938
##$PHC1= 186.4869
##$PH_mod= 1
##$PKNL= yes
##$PPARMOD= 0
##$PSCAL= 0
##$PSIGN= 0
##$REVERSE= no
##$SF= 81.0140089999434
##$SI= 65536
##$SIGF1= 159.3651
##$SIGF2= -187.1042
##$SINO= 113.3802
##$SIOLD= 16384
##$SREGLST= <1H.CDCl3>
##$SSB= 0
##$STSI= 65536
##$STSR= 0
##$SW_p= 32467.5324675325
##$SYMM= 0
##$S_DEV= 0
##$TDeff= 32768
##$TDoff= 0
##$TI= <>
##$TILT= no
##$TM1= 0
##$TM2= 0
##$TOPLEV= 0
##$USERP1= <user>
##$USERP2= <user>
##$USERP3= <user>
##$USERP4= <user>
##$USERP5= <user>
##$WDW= 1
##$XDIM= 65536
##$YMAX_p= 315113178
##$YMIN_p= -124272303
$$ End of Bruker specific parameters
$$ ---------------------------------
##NTUPLES= NMR SPECTRUM
##VAR_NAME=  FREQUENCY,     SPECTRUM/REAL,   SPECTRUM/IMAG
##SYMBOL=    X,             R,               I
##VAR_TYPE=  INDEPENDENT,   DEPENDENT,       DEPENDENT
##VAR_FORM=  AFFN,          ASDF,            ASDF
##VAR_DIM=   65536,         65536,           65536
##UNITS=     HZ,            ARBITRARY UNITS, ARBITRARY UNITS
##FACTOR=    0.49542278885378, 1,            1
##FIRST=     16045.7642231865, 0,            0
##LAST=      -16421.768244346, 0,            0
##MIN=       -16421.768244346, -124272303,   0
##MAX=       16045.7642231865, 315113178,    0
$$ Real data points
##PAGE= N=1
##DATA TABLE= (X++(R..R)), XYDATA
$$ [...]
44899 -9597652 -6768240 -6712509 -8350761 -10343878 -13847869 -19356432 -23899020 -24594116 -22595529
44890 -22595529 -20063647 -15503929 -6642435 3255050 7133584 2897041 -3883185 -7263687
44882 -7263687 -7067596 -5998475 -4485979 -1540871 1738903 3020909 2178784 1263214 1534411
44873 1534411 2471012 3152321 2863989 849892 -2982242 -7574716 -12035348 -16415940 -20014446
44864 -20014446 -20661529 -17849892 -15001990 -15703383 -18640489 -19547962 -17759071 -17178523 -20295481
44855 -20295481 -24738343 -26861691 -25530527 -21003824 -13558808 -5570017 -1793603 -4110763
44847 -4110763 -7867315 -6984063 -1679209 2338148 1916576 151512 1478550 6082698
44839 6082698 10400054 11039910 7073117 269684 -5679988 -7683450 -6323803 -5394835
44831 -5394835 -7427382 -10875924 -12633950 -11673268 -8681919 -3928639 1816668 5281299
44823 5281299 3231526 -2323811 -4775641 -723042 5312129 6675809 3437465 2024192
44815 2024192 6374864 13082570 16391403 14847225 10816135 5874482 65757 -4989906
44807 -4989906 -5777807 -1093975 5099085 6674544 1216154 -7533715 -13153906 -12535294
44799 -12535294 -8392790 -5692729 -6295021 -8377292 -10465178 -13179498 -16170891 -16611294
44791 -16611294 -13283884 -9644432 -9473803 -11398614 -11606816 -10397769 -11122411 -13290662
44783 -13290662 -12525651 -8257073 -5538870 -6840691 -7699722 -4404551 -1011555 -3304544
44775 -3304544 -9203212 -11332153 -7488810 -2566808 -488929 -115432 -167399 -2769731 -9255831
44766 -9255831 -15922963 -17283956 -12369579 -5801041 -2956377 -4693665 -6380810 -2431456
44758 -2431456 7289964 16505973 19553956 17992729 17365720 18465019 16157455 7723848
44750 7723848 -1832151 -5385413 -2005929 3088034 5400250 5285505 5577080 7273495
44742 7273495 8480509 7248195 4808780 4831409 8561229 11925891 9647580 1913490
44734 1913490 -5393471 -7352338 -4708894 -1598865 -933792 -2826074 -5440007 -6331149
44726 -6331149 -4532250 -1944241 -1138974 -1867750 -2042908 -1905460 -3712088 -6768633 -7022910
44717 -7022910 -3363681 -24752 152428 657014 5317212 10950282 11647951 8406954 8156023
44708 8156023 13293464 18387524 18906330 17707592 19656673 23969626 26068629 24509062
44700 24509062 21613444 18281105 12707470 5042674 -373766 304830 5349910 9140078
44692 9140078 7939310 2230404 -5656807 -13536971 -18859850 -19114903 -14425113 -8021073
44684 -8021073 -2507850 2746327 8694195 13123781 13288461 10866655 10292165 12034270
44676 12034270 11791022 7831798 5114304 9047833 17734649 23890297 23385773 18942454
44668 18942454 15685944 15433197 15727626 13188475 7436379 1790460 -605426 -1055676
44660 -1055676 -3717384 -9412482 -13854860 -13450450 -9875637 -6424488 -2610387 3880937
44652 3880937 11588915 15949104 15378654 12951108 11462081 10104951 7303452 4294131
44644 4294131 3977744 7213751 11474332 12893016 9371681 2111531 -5677249 -11361180
44636 -11361180 -13692483 -11896753 -6406962 -999366 -1078754 -7621691 -15034135 -17445967
44628 -17445967 -15141657 -12244662 -10504714 -9052919 -8307065 -9392965 -10370420 -7795056
44620 -7795056 -2445529 706583 -909236 -4629454 -7166346 -8160315 -7759659 -4686690
44612 -4686690 636770 4038905 2022157 -3054874 -4997531 -808315 6047884 9733318
44604 9733318 8606953 6986746 9706853 15340680 17047110 11156139 2153887 -3302275
44596 -3302275 -4509412 -4975644 -5035249 -1955611 3216724 5290284 2983264 1935624 6933933
44587 6933933 15146302 19913431 18227864 12188296 6030649 3875376 7242286 12085220
44579 12085220 10934607 1002925 -11346380 -16351443 -9945074 3682903 16370638 21890802
44571 21890802 20227169 17238317 17904979 19844233 17004450 9623415 4936960 6421524
44563 6421524 8636160 6466294 3720044 6948915 14730504 19260898 16564850 9924793
44555 9924793 4626342 3783712 7961774 14623388 18864642 18084235 14642371 11368839
44547 11368839 7382065 1909650 -1417747 592020 4301226 3639508 -912605 -3738370
44539 -3738370 -3193299 -3094510 -5679168 -9151088 -12202514 -15137069 -16267344 -13006145 -7242158
44530 -7242158 -4265026 -5705759 -8644161 -11646925 -15490961 -17545650 -12799602 -2561810
44522 -2561810 4799973 4817959 2229823 1960316 1460779 -3050002 -8496498 -9250569 -5511871
44513 -5511871 -1346100 2550531 7847861 12307152 11114856 4716392 111819 2872590
44505 2872590 10889964 17039724 16240677 9790221 4259873 5807223 14333452 23785701
44497 23785701 28701928 28701710 25866649 20871993 14199806 8600638 6875064 8321116 10081700
44488 10081700 10931049 11258808 10620156 8245908 5262698 3610355 3023248 1471873 -1520630
44479 -1520630 -4092402 -4655702 -3754990 -3277629 -4715516 -7744061 -9894517 -8731313 -5153386
44470 -5153386 -3098666 -4955404 -8804122 -11160818 -10501751 -6983522 -1248776 4576084
44462 4576084 7128221 5488853 2750773 1878761 2293620 2732869 4451055 8216163 10913617
44453 10913617 9457785 6081453 5019119 5318530 2183944 -4860149 -10423399 -10686683
44445 -10686683 -7763212 -5238375 -3480517 -1423667 299712 481332 -402178 -928876
44437 -928876 -472457 698007 1681731 942934 -2270923 -6315811 -8753225 -9416420 -9729119
44428 -9729119 -9467227 -7259373 -4202730 -3219846 -4076856 -3037894 857411 3132870 289752
44419 289752 -4365390 -4950276 -1020767 2431211 2001251 -709594 -2552622 -2311146 124551
44410 124551 5165134 12016276 17148334 16756927 11276789 5944076 5492912 8788118 10337621
44401 10337621 7143074 1774826 -2424258 -6439104 -12911345 -20048520 -22235204 -16823896
44393 -16823896 -6943745 2753705 9617722 11794726 8032704 921950 -3581950 -3133512
44385 -3133512 -2574747 -7145344 -14834391 -19568123 -19688990 -18186220 -15879116 -10541446
44377 -10541446 -3416623 -427313 -4180700 -9686639 -11607575 -11567231 -13698807 -16516467
44369 -16516467 -15455434 -11808002 -11978304 -17033991 -19837773 -15490959 -8757859 -6700977
44361 -6700977 -8832650 -10363200 -11384317 -15241935 -19338215 -16094184 -4760991 5000918
44353 5000918 4880433 -2103221 -7026810 -5754404 -164462 6890246 12707551 13900519
44345 13900519 9755334 4705382 3171594 3910645 3560225 2983334 4779469 6998245
44337 6998245 5830467 3151796 4370946 9028935 10649042 6627099 1258520 -2294778
44329 -2294778 -5565313 -8004725 -4570977 5476562 14089250 14219410 8756955 4226509
44321 4226509 848610 -4388853 -9057155 -7780429 -1486838 3446443 4842444 6607645
44313 6607645 10538938 12850502 10771648 7304745 6788141 9447812 12710102 15034084
44305 15034084 16216378 15921074 13828769 10230706 5654077 759827 -3547692 -7156969
44297 -7156969 -11086142 -14863470 -14683222 -7133009 5610427 17220920 23564368 24565266
44289 24565266 20423077 10623804 -1993623 -10456060 -9995115 -3263555 2776461 3730944
44281 3730944 456818 -3015807 -2646917 2780398 10230878 14766282 14238626 10601516
44273 10601516 6486729 2667602 -582267 -2470721 -3494407 -5616753 -8677295 -9111382
44265 -9111382 -4780005 1090683 3926241 4218645 6335013 11535929 15927018 15924264 12562266
44256 12562266 9149175 7281620 6823100 7533724 8364578 6687466 1162459 -5065675
44248 -5065675 -7069212 -4602487 -2814852 -4812804 -6602469 -3085883 2813863 2438110
44240 2438110 -6369464 -14596358 -12867196 -3100313 4865279 5601136 2117550 -709355
44232 -709355 -956763 1875937 7109060 10118032 5089957 -6463631 -14758568 -13155707
44224 -13155707 -6621249 -4393077 -7533212 -9197921 -5303839 1084285 5905066 9207144
44216 9207144 12797323 16868482 20607521 23278637 23747284 21752242 20094699 21942357
44208 21942357 25128071 23608757 16768040 12616620 17667213 27112270 30308769 24157928
44200 24157928 15415311 10188444 7169372 2899387 -1615130 -3070526 -1226100 1734264
44192 1734264 5151096 9502247 13291545 14083325 12461125 11629227 12647826 12976711 10531377
44183 10531377 6498874 2928439 -71835 -3121916 -5490175 -5975334 -4337239 -341193
44175 -341193 6616703 14566958 17515663 10731872 -2492839 -12779354 -14544272 -11419696
44167 -11419696 -10320993 -12538975 -13480275 -10118539 -5201272 -2963876 -3278917 -2751478
44159 -2751478 -721352 -709983 -4539270 -7951686 -5420873 1932635 7320248 7474689 6409728
44150 6409728 7926197 8654412 2912410 -7862441 -15598313 -15237413 -9743388 -5144391
44142 -5144391 -4272798 -6007420 -7077216 -3649757 5117621 13441953 12454768 39263
44134 39263 -15400214 -23404313 -21372843 -13893998 -5500638 1793641 5760972 4068663
44126 4068663 -2036145 -7580048 -8621957 -5084526 1457723 9974984 18580153 23302023
44118 23302023 20975559 13284761 6206966 4417488 6503511 6699797 1945265 -3843730
44110 -3843730 -4296803 1147028 6390672 6820176 4831056 4807395 5835540 3732289 -1407663
44101 -1407663 -4890355 -4706027 -4008292 -4839728 -4281012 25223 4475240 4211371 1124955
44092 1124955 2105440 9346035 16817391 17798903 12601436 6726338 3855504 3520612 4444018
44083 4444018 6783329 10247070 12182057 9310905 1100340 -9192753 -16512606 -17100646
44075 -17100646 -10966882 -2265525 3699151 5089467 4627576 5071547 4861151 704197
44067 704197 -5864159 -7859416 -556571 12116425 20941676 20310887 12461458 4036411
44059 4036411 145131 1054545 3004820 2437750 189014 484355 4867569 9024366 7788650
44050 7788650 1781817 -3759170 -5770839 -5691151 -5403822 -4641425 -3266605 -2816931 -4208043
44041 -4208043 -6391819 -8750020 -12452718 -17759068 -22085269 -22706488 -19885360 -15786272
44033 -15786272 -11827767 -8503723 -6113127 -4207591 -2101712 -1251486 -4708228 -12315563
44025 -12315563 -19164675 -21527330 -21684511 -23462032 -25655910 -24560168 -21042344 -19286568
44017 -19286568 -19108889 -15883484 -9045607 -4269195 -4708135 -6001957 -3695208 -200577
44009 -200577 639770 1323021 6569566 14310016 17690086 14846204 10059373 5676599 -55573
44000 -55573 -6415704 -8933083 -7230036 -7296403 -12138497 -16406982 -15212643 -12363523 -13310333
43991 -13310333 -14938400 -10788108 -3298432 -1089273 -4541490 -4228504 3890292 11172092
43983 11172092 9246672 2643732 1625908 7638297 13335517 13960282 11279112 7601446
43975 7601446 2974463 -1411171 -3081834 -2737550 -4046799 -7832605 -10785553 -11176941
43967 -11176941 -11639420 -14552081 -18290100 -19888272 -18426656 -14454002 -9210960 -5495352
43959 -5495352 -5560031 -6803141 -3837054 3206540 7267556 4249103 -810024 -2002777
43951 -2002777 -2118737 -7441565 -16479903 -21904950 -22468536 -24415495 -29818634 -31755149
43943 -31755149 -24823664 -13825770 -6822006 -4482473 -2324467 -26543 -1285596 -5228663
43935 -5228663 -5192824 1636818 8533663 7004645 -2450217 -11322644 -13857264 -12770671
43927 -12770671 -13249596 -14964892 -13655340 -9107909 -6404652 -7414474 -5688876 5304892
43919 5304892 21157877 29923730 26869776 19727557 17138349 18019672 16721616 13208743
43911 13208743 11271039 10012520 5391626 -518285 -370065 6524007 10948748 6419082
43903 6419082 -1432680 -3351973 852423 4426841 4670732 4526998 5005036 3458736 -396156
43894 -396156 -3293619 -4287282 -5834056 -7513843 -4780352 3311571 10789568 12866596
43886 12866596 12286400 13043505 12499338 5966939 -3826526 -8777646 -6169146 -1409058
43878 -1409058 120249 -1407932 -3480026 -4895159 -4931995 -3255061 -1895973 -3185203
43870 -3185203 -4877074 -2377608 2773382 2794641 -4671345 -10880410 -7406940 1594609
43862 1594609 5445801 2097617 -658556 1995891 6259552 8286646 10584377 15810473
43854 15810473 19922900 17037616 8420068 1882734 3002661 9784489 15158405 12943517
43846 12943517 3102197 -6914707 -8332690 -1187550 4179589 -713184 -11240016 -15550901
43838 -15550901 -10336944 -4402823 -5512136 -9936773 -8700641 122323 9838890 13390398
43830 13390398 9075382 -144783 -8711535 -10736875 -4657668 3940623 7508241 4798706
43822 4798706 850422 -871781 -1771439 -2881265 -1769712 2425885 5462930 3657073
43814 3657073 -378622 -2347537 -3636727 -8128755 -13324781 -11705745 -1755261 8843665
43806 8843665 13469813 14470293 17117319 20139719 17397212 7073011 -5204107 -12045299
43798 -12045299 -10420338 -2872694 4921997 8306449 7196425 5189172 4756433 5301297
43790 5301297 6514523 9969094 15091750 17299748 13801646 8197311 5271624 4283049
43782 4283049 2218760 448814 1662204 2580341 -2248618 -9936568 -11139869 -3832225
43774 -3832225 3234394 3695989 1890629 3418461 5243315 2020114 -3659660 -5210069
43766 -5210069 -2458111 -518867 -852518 -853394 -646767 -2809791 -5899679 -5396322 -1309817
43757 -1309817 1863165 3293982 6974903 13382099 17282220 16867364 18248472 25853839
43749 25853839 33385653 30631961 17359745 5212838 5630159 18601850 33237990 37916061
43741 37916061 30599823 20212704 16934629 21083773 23677106 17864376 6153366 -4691808
43733 -4691808 -11468964 -14479210 -13655983 -9225717 -4290322 -2528289 -3798489 -4882802
43725 -4882802 -3886015 -1364515 2072263 6572995 11561606 15182454 15084560 9469427 -585272
43716 -585272 -8980464 -8213451 2079237 12998487 16164945 13109927 11077569 12152016
43708 12152016 11990786 8152326 3711308 1900807 2112362 2532962 2640569 1684657 -1614288
43699 -1614288 -6301768 -9262750 -9283889 -8021569 -6133333 -2200537 3091628 5657322
43691 5657322 3248526 -1203302 -3836438 -4512465 -4917724 -5158128 -5136676 -6423789 -9278267
43682 -9278267 -10152116 -6071044 2513 2047123 -1596598 -7185259 -11250843 -13594549
43674 -13594549 -14791705 -14679843 -14199188 -15154426 -16430047 -13493682 -4430536 5257379
43666 5257379 7131287 -721749 -11008927 -15034603 -11734886 -7474578 -7772420 -11566047
43658 -11566047 -14142111 -13288229 -10546094 -7949859 -6262236 -5921077 -7008091 -8144927
43650 -8144927 -7773625 -6560594 -5998823 -4743362 329609 8852816 16315294 19765746
43642 19765746 20458882 19376673 14550136 5734574 -2263720 -4850849 -3199248 -692553
43634 -692553 2970684 9306304 15434401 16943529 15145262 15406849 18323588 18524651 13361311
43625 13361311 7217161 4869581 5057736 3608219 -217531 -3464692 -3679854 -1091521
43617 -1091521 2300008 4480171 4986050 4907217 4619229 3021073 1130271 3892668 13662772
43608 13662772 23345872 22629786 11853099 2862028 3477696 7784258 6294223 -311956
43600 -311956 -4222671 -3266459 -2957120 -7036115 -13082579 -18207118 -23053439 -28060843 -30357616
43591 -30357616 -27303033 -20408971 -13210128 -6979957 -870203 4542741 6077879 1193130
43583 1193130 -7921890 -14432563 -12520358 -3620593 4289484 4913218 162898 -2957531
43575 -2957531 -921654 3033018 3931182 1145385 -1381574 130378 5193097 9500823
43567 9500823 9274482 4966403 239945 -2325853 -3297858 -4349720 -6102433 -8526776
43559 -8526776 -11430568 -13487942 -12819108 -10016789 -8676057 -11020873 -14543955 -14932540
43551 -14932540 -11024353 -5067902 416691 3835154 3851701 128194 -5388072 -9317500
43543 -9317500 -8772717 -2588184 6995325 13320897 9852820 -1758244 -11606102 -12811809
43535 -12811809 -9458185 -9205058 -11883324 -11741831 -8531854 -8462045 -13910974 -19486854 -20118973
43526 -20118973 -16793018 -11898312 -4974820 3229571 7519557 3822158 -4867851 -11863598
43518 -11863598 -13855145 -11756931 -7306598 -2360383 451142 -61230 -1689906 -1410708
43510 -1410708 1304142 5302595 9506321 11654261 8086095 -1790472 -12509592 -17233151
43502 -17233151 -14322640 -7046065 869063 6126744 4988852 -3305846 -12937886 -16247453
43494 -16247453 -12493506 -7619639 -4825260 -421300 8641513 17601334 18636886 11048315
43486 11048315 2601236 520637 4046761 6937249 5238540 623261 -3216493 -5084379
43478 -5084379 -6105939 -6581629 -5196016 -1380979 3312254 6765376 7995616 7123945
43470 7123945 5257161 4677361 7029374 10524360 11260118 8615374 6826929 9145343
43462 9145343 12788335 12672649 8651117 5812458 8130035 14448791 20335849 21606680
43454 21606680 16725724 8293035 1754316 369179 2082492 3353463 4229212 6265863
43446 6265863 7453837 4568830 84701 490621 6157214 8833924 2514348 -8069521
43438 -8069521 -13877329 -12561581 -8584295 -5791272 -5207694 -7768813 -13157418 -16852836
43430 -16852836 -14300010 -8131628 -5526941 -7701813 -8140594 -3166090 2145872 2433241
43422 2433241 682338 2607470 6409884 5214679 -1777921 -7410885 -6234028 -363326
43414 -363326 5222067 7946341 6910313 2346860 -1931622 -709913 4954144 7093877
43406 7093877 1558466 -5445573 -6085494 -1224856 4010784 10094443 19859539 28370190
43398 28370190 26717467 16474190 9899676 12518804 15063497 8011058 -4444600 -12246640
43390 -12246640 -14359614 -16808776 -20332999 -19682846 -13471948 -5903411 873255 7951021
43382 7951021 13108228 11657596 5652676 4043975 10103320 15706132 12761144 4591181
43374 4591181 644415 4317226 11547055 18000951 21694496 20712595 14575639 7534461
43366 7534461 5423724 8861737 13435088 16466806 19367767 22883283 24398352 21632649
43358 21632649 15827084 9613540 4231283 85324 -2626182 -5292613 -10107348 -15934234
43350 -15934234 -17626196 -12189873 -3612242 1517703 1738776 768380 966031 941780 -43412
43341 -43412 370739 3625497 6917929 6734218 3896196 2251781 3198078 4123847 2327547
43332 2327547 -1402161 -3553263 -1449944 3801573 7651230 6473290 2030063 -282481
43324 -282481 1543911 3642310 2551610 346777 -80107 -1195869 -6410974 -11741250
43316 -11741250 -9315450 757296 9475400 11285266 9773954 8542661 4805892 -2797594
43308 -2797594 -7765249 -4732198 635089 -751164 -7550040 -10408603 -5946657 338721
43300 338721 3922816 5253404 4169411 -569656 -4868468 -1171379 10486192 20911927
43292 20911927 24178655 24100665 24833998 23094429 15454133 6675147 3629245 5330700
43284 5330700 5879374 4157528 3938310 6374173 8690063 9465798 9728421 9025217 5116529
43275 5116529 -2099534 -9852235 -15708548 -18765910 -18314566 -14363512 -9281628 -6442450
43267 -6442450 -7231365 -10547855 -14087617 -15229225 -13081225 -11010365 -13881806 -20801426
43259 -20801426 -24574542 -21289291 -15965427 -14595007 -15356447 -13498902 -10552267 -11026669
43251 -11026669 -12836108 -9820936 -2997815 -325340 -4097354 -6996838 -3580816 1587943
43243 1587943 1395040 -3813649 -8115153 -8056831 -5009941 -2290964 -2727901 -6506722 -9499637
43234 -9499637 -6704546 1069806 7433592 8828909 8413506 9285806 8603018 2393679 -7217894
43225 -7217894 -13939271 -14621586 -11466734 -8656623 -9247230 -13321534 -16836289 -14479716
43217 -14479716 -5973490 2558937 5216411 1676647 -5213864 -12886475 -17764978 -15631131
43209 -15631131 -7502566 -1019912 -1344287 -4388783 -3742469 99442 3362216 7257409
43201 7257409 14509644 20658621 18160824 8282134 -183931 -4066834 -8216122 -13798938
43193 -13798938 -14752387 -9272388 -4460447 -3970659 -858614 9413581 17660638 13216443
43185 13216443 1289100 -3969209 -419556 751975 -5781371 -12019698 -11395670 -8990041
43177 -8990041 -10693231 -11967606 -6280141 1842341 2278517 -5100013 -9841045 -5711602
43169 -5711602 2248572 7163293 9609490 13743206 19191264 21808643 20594359 19641970
43161 19641970 22867666 28942901 32312852 28904764 20558875 13150707 9843108 7627519
43153 7627519 2382845 -4083055 -5595375 -381867 5502795 5260445 -989778 -7745213
43145 -7745213 -10887610 -10303005 -7592464 -4376626 -2374634 -2523663 -3806881 -4641257 -5404651
43136 -5404651 -8104028 -13399952 -18930043 -20768168 -16713549 -9313079 -5533542 -10771878
43128 -10771878 -21777987 -28149935 -23177693 -10930450 -146890 5690638 7907212 5371565
43120 5371565 -5024650 -20141866 -29757906 -27304054 -17225910 -8726807 -5815986 -6403882
43112 -6403882 -7392524 -6586328 -2353983 4033464 7226519 3191204 -4974355 -10317222
43104 -10317222 -10418689 -8711364 -7975135 -7055198 -4825443 -3120751 -3652941 -5094088 -5499861
43095 -5499861 -5377118 -6194255 -7647241 -8396916 -7882707 -5515070 -16378 7841581 13563275
43086 13563275 13450629 9949830 8555322 9320746 6067978 -3991664 -14064528 -15132565
43078 -15132565 -7174773 1285214 3826282 1844585 -438129 -1808754 -2869330 -2855146
43070 -2855146 -928766 1342087 1611803 -408058 -3818206 -8534062 -14025174 -17832216
43062 -17832216 -18268989 -17054279 -15961855 -12531679 -3696241 7032057 11623212 8128891
43054 8128891 4019939 5973884 10537841 9267230 707274 -7548139 -8452613 -3245537
43046 -3245537 1477214 1852314 7532 -14594 2200441 3178876 597358 -3311890 -4808153
43037 -4808153 -3491176 -1619429 131299 2524795 3786417 483353 -6457000 -11402659
43029 -11402659 -12080097 -13150395 -17793677 -20202745 -12670065 1996590 11994730 10974675
43021 10974675 5230292 4464167 9849438 14451778 12974189 7663489 4836523 7665524
43013 7665524 13312617 16868887 16953200 15730421 13643003 7627341 -2971114 -11702760
43005 -11702760 -10956438 -2050155 5204387 4106504 -1370114 -2305578 4692898 14795033
42997 14795033 20760531 19349313 13036308 7207828 5541294 7337902 9247626 9031435
42989 9031435 6731824 3036985 -1408256 -5112241 -6402414 -5659268 -5110375 -5545590 -4663882
42980 -4663882 235026 8475424 15412344 15734074 8439930 -777094 -4026566 -93961
42972 -93961 3089073 -2070732 -12543889 -18227103 -15054557 -9279023 -7816321 -9746632
42964 -9746632 -10013583 -7065561 -3216468 -537838 138326 -1402755 -3171651 -1120959
42956 -1120959 5778053 12667897 14368530 11833230 9542452 8560846 6534796 3174570
42948 3174570 899127 401109 108053 -12792 1154530 1306572 -4103070 -14253216 -21502112
42939 -21502112 -20778780 -16539798 -16426480 -20897226 -23825779 -21913901 -18448366 -17134886
42931 -17134886 -16409246 -12131291 -3750938 4590847 8612209 7956726 5357666 2521968
42923 2521968 -1971237 -9709996 -17975093 -20561073 -14473680 -4150272 3167821 5184510
42915 5184510 5043870 4956782 3310172 -995135 -5475635 -8109898 -11228458 -17325419 -22950245
42906 -22950245 -21699362 -13062491 -3443127 2542582 6863500 11946215 14725902 11358408
42898 11358408 4706560 1572657 3450173 5176205 3018958 -669094 -2156971 -1564393
42890 -1564393 -1338629 -2726256 -5931668 -11017106 -16331349 -18586834 -17172217 -16195299
42882 -16195299 -19175686 -23400977 -22957545 -16348464 -7599801 -285239 5695437 10741932
42874 10741932 12603136 8899084 658045 -8451917 -15286421 -18402701 -17274033 -11975216
42866 -11975216 -3665270 5123669 10764148 10047133 3149663 -5000649 -8541403 -6694566
42858 -6694566 -4154666 -4718869 -6963107 -7799245 -7492769 -7997015 -8330763 -5915799 -1916638
42849 -1916638 -571438 -2415733 -2766664 1119669 5902021 8349092 11305325 18395895
42841 18395895 25972647 27032767 22073771 18774789 19935397 19195881 11991055 3762925
42833 3762925 1416151 1650623 -4637493 -18454046 -30542430 -33086785 -27310858 -18641931
42825 -18641931 -10335323 -3961078 -924309 -176357 2014371 6961254 10987243 10469213
42817 10469213 6626164 2653343 -912498 -4636072 -6768982 -5718893 -4180402 -5966290
42809 -5966290 -9295130 -8366123 -2497348 1414711 -1646512 -7038288 -6745866 -1330732
42801 -1330732 114651 -7286011 -16782956 -18712585 -12931982 -7441909 -6288498 -5201123
42793 -5201123 -349588 4913066 5848100 3920584 3284689 3241264 652137 -2161444 624378
42784 624378 8253107 12340093 7826881 -974730 -7543546 -10496475 -10767979 -7339962
42776 -7339962 -416871 5585659 7128780 6274914 5943853 4059036 -2378048 -10318136
42768 -10318136 -13504627 -10527428 -4878897 1237844 7563401 11524140 9479757 2573630
42760 2573630 -3568979 -5337390 -3277920 1486506 7822275 11812729 9176067 1458938
42752 1458938 -5163642 -8184483 -10822444 -14851787 -17071292 -15005570 -10888979 -7393820
42744 -7393820 -4166568 -1185292 -538477 -1732925 -404220 4308440 6266332 1447310
42736 1447310 -4070077 -1951006 5672280 8768061 3353508 -4568846 -9029798 -10422464
42728 -10422464 -9975186 -5336390 3831717 11208415 10625252 4888062 2317732 5501320
42720 5501320 8587774 6241758 866701 -911578 3993870 12794656 20019224 21224276
42712 21224276 15741936 8189896 5522304 9678524 14405620 12589201 5548491 713339
42704 713339 488822 -817329 -7257264 -14371542 -16066248 -13477288 -11503014 -10310485
42696 -10310485 -7169372 -4396657 -7197583 -13314513 -13108664 -2878343 8687552 11538122
42688 11538122 6377104 996007 -1035159 -2210614 -4376380 -6313794 -7411398 -8703556
42680 -8703556 -9845614 -8902762 -5804580 -3016031 -2124505 -2077218 -1184794 1075296 4237329
42671 4237329 6877927 6795321 3452652 -31600 -5817 2587330 3308400 1090154 396700
42662 396700 4337445 8806364 7520870 1699658 -53198 7024209 16577960 18582818
42654 18582818 12157255 6452985 8432029 14356746 16113447 12368604 8851450 9267369
42646 9267369 11465673 13181080 16032613 20788266 22811064 17041662 6024441 -1579274
42638 -1579274 -758663 5178393 10596769 14468577 18534883 21235263 18525818 11418545
42630 11418545 7741367 12420503 18916318 16137860 3515065 -7304346 -7827165 -3174172
42622 -3174172 -2584822 -5495613 -4614681 852586 4326509 3630919 4588131 11004580 18942827
42613 18942827 23954655 26981903 29287404 28014316 21632477 14499641 10896391 8927403
42605 8927403 5327385 2139141 3167459 7275820 10756069 13508966 17423251 21024509
42597 21024509 21091698 17765545 13477362 9098788 5532997 5835205 10297400 12837627
42589 12837627 9002053 4757284 9469286 21580194 29490724 26710215 18315441 11453435
42581 11453435 7018779 2949298 -610335 -2175027 -441731 6193301 16929045 25276832
42573 25276832 24536837 17197038 12398167 13174718 13528638 9771496 6414192 7203120 8299454
42564 8299454 5715402 2910267 4814488 9336589 10906346 8612820 5373429 2515930
42556 2515930 355091 959499 5446028 11356381 16691166 22750410 28880411 29535030
42548 29535030 22466434 15003498 14784671 18059559 15544231 7166477 1617920 2190893
42540 2190893 2888786 -16155 -1770670 2030570 7859850 10092828 9022033 8427310
42532 8427310 9006727 8497832 5807097 1693300 -2645413 -5272042 -4146225 -445215
42524 -445215 1078351 -2295642 -7116850 -7821871 -3540171 1709923 4853218 7342593
42516 7342593 12547896 20818183 27976481 29205705 24450945 18531043 14769383 10623634
42508 10623634 2574739 -6237714 -7878769 409519 12210223 19144496 18456855 12217988
42500 12217988 3396242 -4453235 -7201424 -3763487 1884740 4869374 3888819 -163914
42492 -163914 -6741519 -13608879 -15535502 -9828465 -1356822 2928564 3399939 6274727
42484 6274727 12971026 17055066 13493454 5360890 -1813628 -7682151 -14676229 -21339648
42476 -21339648 -23418486 -20471132 -16712510 -15234650 -15114131 -14441831 -12610609 -9049771
42468 -9049771 -3454424 1379925 739467 -5268161 -8960280 -2797420 11048566 22013030
42460 22013030 22133874 13489182 4544216 1345264 3296104 6113685 7133580 7084304
42452 7084304 7138341 5949430 1605278 -4071327 -6514841 -4971326 -4592144 -9073894 -14260878
42443 -14260878 -13632060 -8332709 -6027100 -9738884 -13807636 -12829983 -9041218 -7135338
42435 -7135338 -6234779 -2318650 3534259 4827691 -2107285 -13281511 -21395400 -22741431
42427 -22741431 -19214507 -15313945 -13959752 -14453667 -14194398 -12180340 -9606768 -6812756
42419 -6812756 -2127969 4378730 8063595 3624993 -8570766 -22115374 -30040057 -29274926
42411 -29274926 -21304330 -11292164 -5898015 -8681181 -16752839 -23653958 -25784275 -24553454
42403 -24553454 -22664591 -20751748 -18395649 -16513395 -17030703 -20098270 -22287915 -18908248
42395 -18908248 -9709492 -1463679 -1550064 -8295298 -11750614 -6278916 2066849 4739672
42387 4739672 2976546 4469715 10241751 12698081 7153515 -1873625 -7852222 -9572355
42379 -9572355 -8714174 -5866607 -2550113 -2273117 -5381002 -6860879 -3531700 301421
42371 301421 -884787 -5304505 -7260154 -6567939 -7967201 -11893128 -12790736 -8167995 -3431903
42362 -3431903 -4444385 -9193252 -10588606 -5409413 2842906 8942611 10878301 9955302
42354 9955302 8415735 7915944 9234780 12260941 15854525 17882524 16179092 10524415
42346 10524415 3783218 15595 708084 3409014 4754289 4196784 3535890 3085226 422197
42337 422197 -5758580 -12201885 -14203565 -12039863 -11326459 -15691037 -21645224 -22977968
42329 -22977968 -18320131 -11571869 -6280012 -3023902 -1717093 -2617706 -4458156 -4849555
42321 -4849555 -3470051 -2033069 -518391 3102901 8248188 10654154 8116003 3953467
42313 3953467 2129151 1982414 868156 -843369 -1106294 -320890 -307696 -1033581 -2197900
42304 -2197900 -5940930 -13036800 -17878155 -13339154 -1032635 8945683 9964445 5482716
42296 5482716 1924964 337092 -1458966 -3033300 -2548734 -1154143 -1511764 -3391539
42288 -3391539 -4814756 -6383205 -10185199 -14947411 -16783541 -15295955 -14748715 -17729616
42280 -17729616 -21220695 -21049859 -17361813 -13157603 -9608974 -5719884 -1346426 2376085
42272 2376085 5283298 8459429 12088312 14702887 14715120 11625690 6299012 1406446
42264 1406446 534349 4532193 9333294 10086164 7166196 4957155 4718536 2883949 -2269926
42255 -2269926 -6939186 -7874014 -8015640 -11405689 -15476470 -14308803 -8255215 -3865845
42247 -3865845 -3682758 -2484187 3832787 11086759 12470928 7545267 1290093 -3085967
42239 -3085967 -5888234 -7375425 -7455462 -8498230 -13556774 -20661735 -22905821 -16446807
42231 -16446807 -5814005 1155719 1984215 678645 1141455 2345222 792566 -4230305
42223 -4230305 -9497592 -11250041 -8377123 -2605016 2786415 4360476 932596 -4023823
42215 -4023823 -4246524 2753866 11998905 16283658 14410239 11481996 11366471 12241798 10402353
42206 10402353 5315216 -807716 -6091265 -9695231 -11078191 -10439470 -9052692 -8025196
42198 -8025196 -7328631 -6241730 -3759521 777259 5513809 5748404 -641055 -8065669
42190 -8065669 -8346450 -1391226 4809228 6213188 8016031 14394482 19845397 17032023
42182 17032023 8322647 2260696 1706727 2714811 2954894 3769825 4977838 4880207 5007213
42173 5007213 7894635 10432244 6808465 -1545057 -6519364 -4842048 -1336194 684841
42165 684841 3624248 7372872 6066031 -1680461 -7427962 -4694931 558085 -917261
42157 -917261 -7184259 -8505118 -2040051 5487590 8479347 7919576 6354126 4576806
42149 4576806 4165907 7354139 13145532 18200603 21974529 26240329 29431473 27026795
42141 27026795 18784706 10531797 6930036 6652270 6277249 4802219 2563174 -298827
42133 -298827 -2351921 -1600638 481073 -404153 -4669332 -7218055 -5571454 -5233337 -12331541
42124 -12331541 -23845674 -30330657 -27182560 -18711286 -11513262 -8061225 -7363359 -8286949
42116 -8286949 -10484585 -13716642 -17333675 -19845427 -19414099 -15955596 -12052298 -10166070
42108 -10166070 -9528579 -7486317 -3276376 1431370 5053574 6892935 5991074 1986727
42100 1986727 -2710028 -4302450 -1861503 2016271 5190814 7896083 9867259 8836150
42092 8836150 4147444 -570864 -1273480 1216533 2376046 -349981 -5347364 -9593217
42084 -9593217 -11222335 -9739439 -6094964 -2628344 -1064990 -908477 -1768622 -6087533
42076 -6087533 -15849474 -26737837 -30453081 -25004823 -18518648 -19190770 -24578471 -25611693
42068 -25611693 -19584324 -13582684 -14318585 -19452209 -21547916 -17498811 -11011291 -7416492
42060 -7416492 -8856389 -13931566 -19539210 -22732649 -22534413 -20680536 -19741218 -20092847 -19463908
42051 -19463908 -15904045 -10497533 -6300535 -4858990 -4852829 -4501457 -4094061 -4880885 -6166502
42042 -6166502 -5426979 -1604327 3378380 6940808 8078585 6788511 3576550 893698
42034 893698 2576956 9339794 16518443 18984308 16762705 12801669 7065583 -2488488
42026 -2488488 -13487955 -18969004 -15320753 -6579480 1049166 5690047 9060958 12581803
42018 12581803 16576820 20694591 23027824 21435019 17502622 15781413 16711441 14362569
42010 14362569 4989386 -6009880 -10821325 -9813547 -9010068 -8862140 -3429495 8319255
42002 8319255 17939034 17822719 10714100 4741579 3027459 3001671 3271883 5645320 10630329
41993 10630329 15286756 16549421 14161046 9800420 5455249 3002265 3134612 3869220
41985 3869220 2018565 -2758308 -6929570 -7320012 -4855203 -2401288 -303694 3109816
41977 3109816 6919562 7088821 2216030 -3059616 -3425444 -39325 1262048 -1690430
41969 -1690430 -4803022 -4089290 -757777 1734784 2285450 1576902 145458 -182416 3817029
41960 3817029 11521839 15832436 10832762 664397 -4615784 -1649169 3301577 4525328
41952 4525328 3833187 4950966 6488300 4790912 205901 -4120215 -7608305 -12015913
41944 -12015913 -16883680 -19384538 -18877639 -18253010 -19772290 -21731987 -20374156 -14178080
41936 -14178080 -5761862 225518 1522802 769181 2416796 6714901 8776255 4929260
41928 4929260 -2159391 -6766003 -6484445 -2683190 3298945 10420686 15375566 14433695
41920 14433695 8675770 3630559 2390000 2274105 -348014 -5286454 -10501722 -15578499
41912 -15578499 -20425570 -23006821 -21497191 -17003340 -11404220 -4455268 3738369 9501298
41904 9501298 9412733 6387739 6835401 11388037 13582204 9369797 3082221 1006801 2958961
41895 2958961 3976435 1711964 -1585991 -2630721 615361 8385048 17530726 22258059
41887 22258059 19909623 14403156 10598480 7748929 3075976 -1048773 -407485 1905801
41879 1905801 -1944448 -11587315 -16673605 -11811376 -5529162 -8341211 -17711385 -22129442
41871 -22129442 -16711542 -7731848 -3391929 -6256775 -13833338 -20935183 -21667781 -13960541
41863 -13960541 -2536112 5765726 8642226 7504755 3087029 -3059119 -5427899 208755
41855 208755 9369728 13362942 10781797 7484266 5220865 -1177126 -12946410 -21897303
41847 -21897303 -20497831 -11778146 -4553891 -3021616 -4971659 -6441298 -4570324 656756
41839 656756 4603801 1696666 -6598377 -12040815 -10360284 -6203482 -4212852 -1964686
41831 -1964686 3006032 5948114 2201763 -3452938 -3369762 679552 920452 -3021594 -3866023
41822 -3866023 532229 3676440 1285768 -2747054 -3898363 -3259837 -3013647 -1933477
41814 -1933477 835212 2437679 315225 -4251399 -9054558 -13344923 -15286268 -11992259
41806 -11992259 -5043405 -1145267 -3674781 -8025447 -9354283 -10337184 -15770249 -23064046
41798 -23064046 -24864220 -19831870 -14352885 -12950912 -12518320 -8172036 -889682 3734720
41790 3734720 2588582 -1785698 -4984290 -5826664 -6382944 -7434271 -6234873 -741482
41782 -741482 5490757 6308077 1093674 -3991892 -4386628 -2804126 -3783747 -6281538 -6092098
41773 -6092098 -3286802 -1961099 -3192202 -3524932 -1435316 -550248 -3983314 -8887124
41765 -8887124 -9686786 -4600862 3952756 13646879 23233750 29810740 29341428 21625411
41757 21625411 11964970 5586697 2305873 -738516 -2869068 -377627 6912929 13855852
41749 13855852 16311622 15819609 15767927 16034879 14372260 10543734 5793691 497980 -4034985
41740 -4034985 -3904774 2437109 9370556 9858987 5179829 2862992 5098953 6140762
41732 6140762 2483175 -1744140 -2503260 -1859911 -1850652 877424 7937837 12229261 6173034
41723 6173034 -6062029 -12659760 -9345175 -2937202 185356 1563084 4837275 9155861
41715 9155861 11903557 13435290 15274235 16289788 13935237 7992989 1021487 -4085353
41707 -4085353 -6006368 -5533770 -4743859 -4639633 -3887823 -1385839 761335 -566221 -4630405
41698 -4630405 -7136951 -5748691 -2480892 -75409 1107852 1658166 1383369 439535 -29496
41689 -29496 209469 -268103 -2238006 -4443609 -5592104 -6286112 -8034989 -11399350 -15416982
41680 -15416982 -17806437 -16349261 -12033014 -9948650 -13880055 -20169234 -20785939 -13359759
41672 -13359759 -4405141 -1048316 -3266940 -6690149 -9604277 -13513188 -18632896 -22545975
41664 -22545975 -23168266 -20772931 -17005532 -13148144 -9271470 -4665987 468410 4241428
41656 4241428 5431272 5898363 8084248 10505588 9189827 3923855 -795233 -2050946
41648 -2050946 -1691928 -1639812 -282400 3948786 9200595 13157962 15917293 17430923 16172300
41639 16172300 13333132 13737121 18529653 21502108 17607093 10691635 6928784 5045716
41631 5045716 602674 -3654909 -1106845 6333263 8747198 2185228 -6502149 -10842696
41623 -10842696 -12654726 -15594541 -18112213 -17278153 -14132619 -11034177 -8063672 -5370918
41615 -5370918 -4664159 -5376196 -4061124 -571187 339310 -3169825 -6392500 -6311914 -7105912
41606 -7105912 -11824707 -14917863 -10784501 -4693683 -5717639 -11593876 -10833545 182212
41598 182212 11767578 14570679 10489642 6794879 6255424 7384106 9407944 12403784
41590 12403784 15525096 18406880 21698194 23822130 20593846 11182545 1455673 -2314237
41582 -2314237 -979026 -67864 -1411860 -1460258 2132521 6192229 5960128 1116832 -4146569
41573 -4146569 -6257047 -5536227 -4035281 -1926218 1957583 6514070 8197427 5845010
41565 5845010 3391002 5351329 10981373 15481105 15960874 13368494 9258515 4082779
41557 4082779 -1016259 -3798635 -3395258 -1361491 70615 -758429 -4741149 -10561968
41549 -10561968 -13970213 -11426748 -4415684 2334599 6031918 6238037 2067382 -5803533
41541 -5803533 -11250249 -7467220 3357321 11549478 12835526 12815093 15903306 17844782
41533 17844782 14665914 11682318 15426611 21587774 20343455 11440006 4766591 5947798
41525 5947798 9698311 9226828 5325087 3199911 5141839 9160477 11806448 10726956
41517 10726956 6800558 3881631 3768035 2697502 -2966515 -9205430 -8784335 -2899780
41509 -2899780 -961248 -7096464 -14303289 -15318388 -12224923 -10396432 -9244516 -5489465
41501 -5489465 -799791 1379148 3611680 11001685 20833343 23704596 16618569 8369630
41493 8369630 8592472 15851993 20332141 15927335 6382339 384338 2875407 11026567
41485 11026567 17481348 17447676 12849551 9344872 9924425 12819384 15455095 18235166
41477 18235166 23110073 29710493 34877876 36269341 35121077 34415353 34766287 33580106
41469 33580106 28962702 23262749 21201301 24835416 31769685 38038024 41102589 40255559
41461 40255559 36309820 31462686 27610259 24233862 19668066 14569419 11691477 11854422
41453 11854422 13105013 14569027 17404107 20354178 18732840 11133866 3454441 1901957
41445 1901957 4712797 5465092 2351160 -1063968 -2566008 -2756729 -605722 5721885
41437 5721885 12824126 13656817 7648920 3169894 6291838 12401738 13694878 10594640
41429 10594640 9705805 12994707 15623195 14408512 12650791 14777324 20123033 24404629
41421 24404629 25150594 23490481 21510435 19582951 16669078 12818693 10589541 12926046
41413 12926046 19679033 27670095 34236208 38412869 38306084 31329969 19690379 11704191
41405 11704191 12755700 17268369 15511481 7372260 2577005 6406516 12529445 13384632
41397 13384632 10992547 11694455 15115422 15888760 14022198 15531372 22372019 28915659
41389 28915659 30628150 30118468 30955127 30425579 23534087 11555125 1534483 -2015263
41381 -2015263 -910318 1084050 2735957 4532311 6233719 7094012 7437844 8673457
41373 8673457 11695653 15508054 17677027 16905288 15265703 16446382 20856607 23861154
41365 23861154 20369200 10352133 -1293237 -9133256 -10212116 -4552184 4921155 13823081
41357 13823081 19664947 22854833 23005084 16957136 3934875 -9625955 -15568350 -13823729
41349 -13823729 -11573361 -12397618 -12055647 -6815257 -154591 2583865 1904152 2118177 4481811
41340 4481811 6663327 7159463 6299239 4123330 750412 -2088578 -2827127 -2310944 -1686564
41331 -1686564 267053 4579438 8693300 9621681 9277330 12111913 17688280 20236936
41323 20236936 16485041 9853993 5300413 3406595 1729371 -532740 -1786783 -910448
41315 -910448 937752 1181805 -2093180 -8545309 -15858796 -21660978 -24360837 -21992141
41307 -21992141 -12736415 1239580 12534369 14567554 8356329 572187 -4134616 -5703212
41299 -5703212 -4960969 -2175399 503317 46353 -2541383 -2561908 1241138 4003885 1790071
41290 1790071 -2514136 -3847295 -2372855 -1872849 -2733582 -1632899 1717849 2212771 -4052117
41281 -4052117 -13416712 -17592065 -12359406 -1491049 7936739 12275715 12495080 10576715
41273 10576715 7498660 4660030 4138910 5956209 7394228 6924561 6654826 8654153
41265 8654153 11184127 11571375 10652539 10631232 10337208 7066815 1977906 -1161840 -2028491
41256 -2028491 -3541148 -5782855 -5470341 -2012844 1189464 2340277 2821621 2378109 -1129997
41247 -1129997 -5550273 -4660488 2564504 9198992 10246125 8852217 8657356 7036554
41239 7036554 1860935 -1660345 1180074 4834685 545441 -9704131 -15320120 -12259398
41231 -12259398 -7719977 -9186121 -15907469 -22341692 -24019332 -19016324 -9251672 -1400206
41223 -1400206 -1213225 -5766429 -6346613 -128310 6163253 5776789 141521 -4711882 -5850686
41214 -5850686 -5090791 -5821377 -9907505 -15583910 -18048814 -14776914 -9769833 -8972923 -12228424
41205 -12228424 -14338243 -13334483 -11720763 -9441479 -2920208 6798769 12183598 9514796
41197 9514796 5071721 6170764 10920506 12285540 8489359 3569741 128005 -2761450
41189 -2761450 -5626468 -7469355 -8052668 -7567022 -4952507 -356238 1530469 -5188917
41181 -5188917 -20289882 -36174979 -44452736 -42179582 -32341969 -20648159 -11860671 -7280555
41173 -7280555 -5133577 -3485148 -1781610 324357 2936047 3766556 -491011 -8437837
41165 -8437837 -13172799 -10577710 -5119002 -3035764 -2725127 2239739 12106946 19664175
41157 19664175 20334691 17198242 14205850 10466833 4760797 774198 2830897 8999477
41149 8999477 13132036 12567034 9828153 7449309 5292037 3395238 3612750 6596062
41141 6596062 9553443 9014767 4671052 -729779 -4051692 -3234857 2287223 10670925
41133 10670925 17946022 21076526 20487488 18434678 16060494 13999792 14428380 19052122
41125 19052122 25292997 28167379 26528954 23786222 21765129 18606196 14599248 14422566
41117 14422566 19287009 21776082 14714656 2021750 -5998712 -6107695 -3605688 -1603509
41109 -1603509 2636599 9522860 13687500 12153526 9236729 9238404 9959215 7944253 5066851
41100 5066851 4660010 5086921 2763473 -1061756 -1879235 1235291 4874011 6491741 6678752
41091 6678752 6858360 7396449 7318699 4531705 -1751651 -7818186 -8175857 -3209182 239873
41082 239873 -1465089 -3643207 -1739913 754633 -1193773 -4540007 -2619199 3801526
41074 3801526 7838323 7174002 5664001 5182909 3849061 2600572 5638760 12705149
41066 12705149 17786599 17578497 15293790 14306676 14012869 13939243 15706726 18170563 16617602
41057 16617602 10364145 5850988 8095544 13451882 15009413 11498156 6748726 3453194
41049 3453194 1593019 760492 341784 -1036707 -3657039 -6158854 -8616208 -13176226
41041 -13176226 -19346904 -22225146 -18856303 -13292878 -11243842 -11985675 -10020435 -3499019
41033 -3499019 3369371 6252307 5590642 4928823 6435182 8588085 7538577 1336884
41025 1336884 -6793660 -11090157 -9985335 -7940453 -9160254 -12083130 -12351678 -8889461
41017 -8889461 -4123585 117922 3720194 6091843 5796673 2539534 -2200873 -6502195
41009 -6502195 -8987937 -9036100 -6883160 -3170322 1513021 5648264 6402956 2926330 -561135
41000 -561135 1270353 7688846 13019742 15326318 18286166 22668173 22727042 15521981 7975069
40991 7975069 8390507 14884097 18722234 16338700 11505661 7691980 5151901 4541350
40983 4541350 6517217 7614077 2817899 -6900733 -14941821 -17485440 -16326269 -13202419
40975 -13202419 -7712146 -2364740 -3101755 -11246908 -19703393 -20868543 -14899611 -7133138
40967 -7133138 -826598 4010524 7417625 9192223 10660974 13692650 18251637 22477028
40959 22477028 24417513 22791850 17462932 10209489 3675941 -1232173 -5544498 -9583672
40951 -9583672 -12130077 -12583904 -11624082 -9150207 -4128923 2575702 7626182 8574159 5951849
40942 5951849 1748848 -1750600 -1697320 3168858 9345445 11225924 8079728 4754009
40934 4754009 4504123 5746460 7557633 12722202 21669619 28482849 27982564 22921765
40926 22921765 18847642 15486301 9825211 5168159 9013988 21471316 32740288 34257451
40918 34257451 27353279 18981436 13507621 11111124 10301712 8965326 5406231 635597
40910 635597 -2364559 -2958449 -3766057 -5901182 -6691038 -4552805 -2922997 -5751881 -11117028
40901 -11117028 -13143219 -9438441 -3393471 330649 -476478 -5818805 -13740092 -19685234
40893 -19685234 -19085615 -12474803 -5894861 -4439163 -6976869 -8885808 -8356330 -7666922
40885 -7666922 -9019526 -11597830 -13037317 -12049872 -9061516 -5507944 -2984414 -2041222
40877 -2041222 -1332602 1149602 5554767 9672205 11263155 10048928 7199560 4090371
40869 4090371 2133952 2584397 5524334 9820641 14634565 19788308 23962017 24238531
40861 24238531 19049429 10584680 2962325 -959603 -55290 5502524 12870357 16817923
40853 16817923 14844068 11035680 11425495 16242556 20446822 21217074 20157155 17903727
40845 17903727 12246615 3723551 -2204161 -2185476 -53268 -737435 -2649590 -1066391
40837 -1066391 3597229 6710684 7377877 9316934 13304010 14570927 10073339 3869024
40829 3869024 1875993 4063166 5383752 3006811 -920313 -3650371 -5707278 -8682802
40821 -8682802 -11100499 -9486344 -3946159 166077 -1520542 -6290328 -7921269 -5528264
40813 -5528264 -4183278 -6008883 -6211498 -1144355 4745928 5325304 2623561 3833367
40805 3833367 10134254 15246439 15083490 12380695 10539873 8887537 6290328 4313325
40797 4313325 4053133 4114003 4141298 5977352 8791282 8011658 2704417 -780996 2702501
40788 2702501 8967289 10386370 6902769 5053206 7781834 11428591 12349915 10786993
40780 10786993 7828778 3708079 -23395 -1124922 -381045 -597683 -1252861 1386891
40772 1386891 7715479 12924749 13499572 11444312 10025186 9374028 8781839 9422303 11723762
40763 11723762 13494636 13998873 16577624 23121150 28557946 25675790 14481463 2833912
40755 2833912 -1756010 2033920 10438055 17833013 19484977 14828902 8346426 4691905
40747 4691905 3445414 1159242 -2852009 -6405125 -8842285 -10893735 -10699982 -5353613
40739 -5353613 2917172 7564126 6434421 4435010 5039649 4539287 -1210059 -8797622
40731 -8797622 -11194843 -6901940 -226343 5562758 10416155 14010935 14805730 12443307
40723 12443307 7760620 1416770 -4140022 -3393861 6500426 19701182 26811778 25866414
40715 25866414 23007521 22605467 23058051 22899549 23538964 23365849 16724021 3559475 -6331113
40706 -6331113 -4965844 2683949 5941273 2985487 613396 1994690 3257674 2252786
40698 2252786 2585770 6702594 11314335 12736545 12098420 12371746 13918870 15451225 16111719
40689 16111719 14439418 8591987 42402 -5848850 -5448748 -778031 3929231 6867838
40681 6867838 8080104 7478652 6072421 6436483 9219564 11538829 11277218 10280539 10685800
40672 10685800 11273674 10882607 12150919 17276259 22635813 22945368 19163658 16739704
40664 16739704 17003373 16345058 13987543 14151974 18799964 23889336 25493486 24902943 24663974
40655 24663974 23812839 20595326 16419029 13355289 10693376 7905199 8225709 14389768
40647 14389768 22413848 24867048 20258616 14536020 12607414 12845257 11766165 10189988
40639 10189988 11499000 15989734 20465880 22824979 23935479 24458926 22584500 16968510
40631 16968510 10651622 9402580 15502370 24768678 30751491 30744653 26672987 21618367
40623 21618367 17656488 16405347 18997819 24744060 31212917 35874736 36721804 32456872
40615 32456872 24655930 18983951 20493826 27085202 31136798 28608830 22892769 18569527
40607 18569527 16032872 14679954 16306649 20952799 23478954 19715083 13208059 10385229
40599 10385229 11511303 12507518 13456824 17735914 23472299 24327147 20273006 19570545 26761256
40590 26761256 35659339 38536553 36204771 33914658 32482276 29536705 25861603 24297228
40582 24297228 24639089 25083802 26600495 30268724 32101439 26834410 16475295 9163393
40574 9163393 8925260 11743252 12792539 12727758 15047882 21179692 30144295 40120638 48766201
40565 48766201 54419706 57905161 60782706 61751497 58120221 51053518 45150976 41844674
40557 41844674 37944667 32774942 31601183 37865421 45985649 47445510 42339042 39361293
40549 39361293 44119513 52119812 55087884 51159658 46404395 47480044 54773560 62907792
40541 62907792 66807143 66028613 62926149 58463120 52528198 48003366 50495888 61613120
40533 61613120 75195150 83715876 87186372 92065548 101559333 110847033 113267621 108271095
40525 108271095 101101948 96758364 97188602 103425966 116540715 134631304 151231810 160025378
40517 160025378 161405147 162063638 167313805 176061966 184791914 193826845 206179171 221346681
40509 221346681 234427802 242021096 245471163 247221384 247769087 248362696 252808722 262547622
40501 262547622 272236716 274947504 271217393 268585084 271594484 276319421 276630341 272749284
40493 272749284 270743195 274983922 283743262 291891991 295719000 294623163 289994063 284279771
40485 284279771 280833076 282561493 289171895 296573602 300917481 303098140 307021423 312903753
40477 312903753 315113178 308774921 296547104 286077627 281852915 282408925 284676041 287170991
40469 287170991 288190043 284666935 275524063 264473811 257096782 255539782 257213399 257778811
40461 257778811 254206922 246117968 236164679 228755239 226296219 226111193 222555682 213089232
40453 213089232 201264074 192650171 188499931 184896111 178153868 169439086 162986886 160702998
40445 160702998 160090462 157445711 151595844 143843713 135442068 126561183 117716440 111037946
40437 111037946 109066472 111970546 116435729 118189933 115841250 111410476 106847158 101561191
40429 101561191 94647957 88054944 85157207 86596457 89719069 91944168 92526456 91413476
40421 91413476 89309053 88963753 92891357 98775908 100628503 96281834 90567060 88901773
40413 88901773 90759916 92021173 90780234 87698158 83334845 78887875 77538435 81192613
40405 81192613 87222030 91628108 93615494 93846238 91041677 85031821 80537674 81710097
40397 81710097 84314788 80227489 69534739 60982439 59409125 60226455 58908072 58544269
40389 58544269 63404215 70908995 75436167 75782905 73704525 69108212 62573225 59297289
40381 59297289 63519529 70274598 69374648 58069698 44386395 37023100 36748145 39183827
40373 39183827 41479421 43377899 44579173 44233275 42238826 39218585 35510070 31081582
40365 31081582 26275816 22346533 21173811 23658567 27860809 29984569 28561797 26622692
40357 26622692 28011157 32343009 35487542 34496729 30256282 25892845 24592038 28343031
40349 28343031 36175858 43435112 45190056 41060010 34970285 29975026 25590601 20961565
40341 20961565 18182791 20395157 27448402 35110102 38708301 37109364 33280267 31017911
40333 31017911 30846593 29533347 24340607 16994794 11831139 10292372 9437044 6522306
40325 6522306 2959773 2234891 5373792 10297960 14706689 17469852 17572389 14247575
40317 14247575 8959833 5152569 4556751 5365208 5884582 8294231 15581620 25308101
40309 25308101 30538436 28421613 24296572 24635896 28794109 31295152 30093667 27953029
40301 27953029 26428502 23507498 18173755 13041839 10497285 9310756 7082812 3734791
40293 3734791 929988 22078 1743743 5753469 9473891 9761954 6707596 3328625
40285 3328625 1106163 -593717 -40164 6650573 18022674 25039994 21128624 11207487
40277 11207487 5748784 8112751 12749861 14315254 13154266 11924695 11466995 10867614
40269 10867614 8574072 3248339 -4037002 -9101981 -8872473 -5414704 -2949376 -2082550
40261 -2082550 -289758 3189307 6876465 10556810 15008653 18598395 18384505 14752817
40253 14752817 11072084 8653546 6035370 3478607 3804144 7601486 11219868 10895766
40245 10895766 6322649 -211648 -5412560 -5942860 -1424805 3361826 2918551 -2153761
40237 -2153761 -6373802 -7055617 -6207719 -4851399 -1135559 4472835 7662139 6578455
40229 6578455 5117755 7073203 10897944 13115352 13291369 12547172 10328619 6026959
40221 6026959 1643695 21049 1862130 6071493 11159564 15286422 17236148 17944938
40213 17944938 18290485 15557515 6510614 -5555670 -12281661 -10469573 -5497920 -2481945
40205 -2481945 -32014 4117434 7680782 8694473 10061535 13649238 15021015 10555520
40197 10555520 5439597 7149054 14038238 18169586 17581609 17621513 20355879 20608019 14346851
40188 14346851 4799954 -2385774 -5690353 -7051079 -7723792 -6825334 -2577428 5183443
40180 5183443 12440048 12665228 4086720 -6262872 -9664323 -5950555 -2618175 -4544589
40172 -4544589 -9176861 -11814340 -10829224 -6764932 -745770 4402270 4978266 627962
40164 627962 -4383134 -5827471 -4067624 -2858327 -4574058 -7467234 -7788313 -5028704
40156 -5028704 -4186460 -10051072 -19029389 -21066096 -12059828 -5483 4975335 2656635
40148 2656635 28692 607334 2810650 6216412 11979153 17731737 18864722 15158463
40140 15158463 10479240 6054944 -106158 -7190416 -11133226 -10790152 -9064278 -7707312
40132 -7707312 -6552891 -7463338 -12363999 -17365420 -16247921 -10467435 -7863679 -10249588
40124 -10249588 -10967897 -7106595 -4792595 -8100299 -11639680 -10035704 -6851597 -7232899
40116 -7232899 -8679868 -6880556 -4720159 -6791181 -9482760 -5854356 2318590 6612694
40108 6612694 5088622 4603503 9281338 14476894 14637419 11136791 8771134 8088327 4892256
40099 4892256 -3320044 -12486495 -14847736 -7522755 3047101 8123303 7282681 7143071
40091 7143071 9537290 8422844 1560912 -2861921 2303791 11599409 14913420 12019663
40083 12019663 10033073 10032742 6757512 390342 -2068131 1586204 5276511 5119208 4754384
40074 4754384 7055406 8649076 7092513 6375190 9775911 12828294 9403077 1012443
40066 1012443 -5437913 -6398367 -3288857 2089313 8424864 12438430 10756085 4810725
40058 4810725 359399 1136134 5004490 6940246 4445296 -355088 -3272270 -2600643
40050 -2600643 -1030724 -2283334 -6127806 -8408851 -6239484 -1259845 2857260 4210064
40042 4210064 3165813 1079783 -140776 1293238 5339142 9726108 11834732 10227299
40034 10227299 4617684 -3827669 -11965234 -16473126 -16714620 -14182463 -9367459 -1956463
40026 -1956463 5681027 8972744 6797761 3349905 2005483 508202 -4333046 -9814352
40018 -9814352 -10127148 -5348661 -2521339 -6157621 -11783787 -12188844 -7591509 -5265239
40010 -5265239 -9449727 -16194668 -20005653 -21479841 -24272892 -27168614 -25146830 -18293789
40002 -18293789 -13332887 -13961271 -15392326 -12533862 -8532463 -9417796 -13929456 -15564513
39994 -15564513 -12736824 -9683162 -8062861 -5279279 -1723193 -1765756 -5200519 -5233766 969914
39985 969914 6249848 3185300 -5282670 -10816365 -11351667 -11515313 -14000558 -17118474 -19992706
39976 -19992706 -23935307 -27932443 -27817938 -21675117 -12737575 -5460189 -1176226 1185081
39968 1185081 2206811 1335707 -1824812 -6575232 -11410026 -15226794 -18035507 -19638017
39960 -19638017 -18059316 -11533029 -2474005 3428926 3638582 1565244 978933 729868
39952 729868 -1903889 -5593956 -7200482 -7881760 -11723298 -18221988 -20921459 -14997374
39944 -14997374 -2898748 8822342 15426848 15659092 10785825 4293681 431166 387200
39936 387200 578830 -3367748 -11057140 -17055631 -16470624 -10141160 -3712676 -1451968 -1631067
39927 -1631067 823268 7215123 12597093 11572903 4809645 -2359286 -6656387 -9287907
39919 -9287907 -11567358 -11102165 -4363429 7885863 19590857 24475332 21562007 14853603
39911 14853603 7734843 -452054 -10805878 -19767621 -21293802 -14358014 -4871145 903173
39903 903173 1719075 -714677 -4883347 -8318120 -7717372 -3799020 -2157605 -5115474 -6755258
39894 -6755258 -1548049 5924300 7271738 3845617 5085667 13479142 20464012 19597984
39886 19597984 15112806 13166702 12293175 8428244 3267737 578402 -1594796 -7647370
39878 -7647370 -15609115 -18468059 -13466528 -4430676 4349944 10924056 12828274 7668508
39870 7668508 -2018677 -9299101 -10128704 -6826212 -3507292 -1794963 -1867278 -3467295 -4172372
39861 -4172372 -727705 5537189 8326672 4411000 -1078740 -938020 4851872 10033561
39853 10033561 10737244 8978688 7732188 6753739 4931645 3978918 7124656 14594467
39845 14594467 22227825 25562321 24962375 25267783 29126122 31920283 26378787 12652249
39837 12652249 192678 -2683095 1868088 5574874 5193645 4570847 6643648 8914380
39829 8914380 8177472 5337589 3286253 3191067 5090996 9361938 15088772 19105642 19012894
39820 19012894 15603194 10835155 5797449 2373217 3548567 8729421 11392389 5580818
39812 5580818 -6600103 -17570235 -22863375 -23297245 -20340084 -14570829 -8443143 -5234907
39804 -5234907 -4263856 -1663924 3045488 5756827 4584033 3118020 4543822 6912930
39796 6912930 7292720 6634904 6794892 6059525 2085099 -2869909 -4212412 -1660890 324576
39787 324576 -1245300 -4330932 -4974454 -1864114 2829724 6278447 8360398 11582907
39779 11582907 16280216 17146439 8625627 -5669902 -13972583 -9601495 980426 6715386
39771 6715386 4366691 -1859330 -8580417 -14563592 -16501627 -11124474 -1566784 4701148
39763 4701148 5099884 3785681 3816977 3392977 1462917 1211082 4693522 8276309 7085985
39754 7085985 1352494 -4710755 -8358205 -9918817 -10188640 -8564693 -3793087 4059846
39746 4059846 12301313 17215977 18279459 19434379 23964643 29601269 31731112 29829196
39738 29829196 26647346 22494334 15775982 8875650 7201124 10878222 13078287 9090387
39730 9090387 2285498 -1512520 -1077523 1662391 5888422 11328788 16633589 21074680
39722 21074680 24943023 26526451 22848130 15604577 11376586 12500616 12575567 5452642
39714 5452642 -5597643 -12666597 -13440619 -11322555 -8545127 -5057076 -2109445 -1130782
39706 -1130782 -215212 3268544 7764603 9820060 9714428 10012219 10280522 8673732 7287225
39697 7287225 9865525 14890105 17184076 16308000 16835162 19444499 18546612 11417814 4023844
39688 4023844 3856265 10448839 16434510 16005473 10035884 4295243 3934399 8630580 13067477
39679 13067477 13446182 12096137 13109896 15627765 15904231 14199278 13447697 11745306
39671 11745306 3825194 -8190610 -13090100 -3944473 12245800 22819844 23155642 18001430
39663 18001430 13569216 13532845 19442933 28941553 34794906 30895048 19204071 7401240
39655 7401240 508666 -2043470 -2676416 -3144230 -4941310 -8058207 -9348089 -5724081
39647 -5724081 975013 5811894 7605452 10174739 15781354 20960300 20923010 15569542
39639 15569542 8891424 4163288 2042312 2286756 4595662 7407436 8058456 5740512
39631 5740512 3570968 5954017 13369572 20992684 23430907 19951012 14003170 8851610
39623 8851610 5620749 4551089 5017262 4136369 -1280441 -10017190 -16409738 -16746890 -13439230
39614 -13439230 -11091901 -10894692 -11197696 -11275588 -11387163 -10649365 -8184851 -5610732 -5300745
39605 -5300745 -6586812 -6623385 -4827573 -3452467 -3496481 -2997793 -287494 3483963 6202855
39596 6202855 7307616 7369004 6622545 4867672 1805355 -2857366 -8389856 -12208970 -12060260
39587 -12060260 -9216708 -6899848 -4722805 1920742 14354227 25319027 25576952 15340486
39579 15340486 4989559 3423077 9155921 14630770 15760903 13644794 9115993 748225
39571 748225 -10933416 -21158846 -25002810 -21809221 -14278745 -5494957 1522005 4076124
39563 4076124 2698815 2147617 6101114 11609914 12246147 6729230 1074757 1387667 7197747
39554 7197747 12878471 13458024 8261158 1006895 -2778529 -407397 4974528 7556464
39546 7556464 5308545 1496944 74971 2267977 7542483 14186193 18089791 15025739
39538 15025739 6199104 -1687444 -3826555 -1644254 1712279 5797419 9960577 10711409
39530 10711409 6668846 2743905 4133221 8484350 9442970 6324960 4411422 6088760
39522 6088760 7412517 4301461 -2536996 -9989749 -15956124 -19331628 -19930606 -19325913
39514 -19325913 -19021041 -17725815 -13477995 -7913567 -4444687 -2534583 1508369 7854272
39506 7854272 12454215 13743886 14321707 14369086 9733443 -189750 -8587230 -9893861 -7573931
39497 -7573931 -8161313 -11708899 -13898583 -13983106 -13799922 -11444628 -3861512 4780106 5427979
39488 5427979 -3279500 -11672396 -11347328 -5043044 -533563 -63898 -1194425 -4076017
39480 -4076017 -10792602 -18542277 -20424922 -14773154 -8542838 -8477523 -12530411 -13561412
39472 -13561412 -8965987 -2338469 3242484 8558238 13821953 15432114 10469556 2088216
39464 2088216 -3203888 -2902750 -163349 1451071 1624122 1313697 392801 -1237105 -2575039
39455 -2575039 -3221440 -4152276 -5135999 -3551459 1809953 7542193 9355574 8115805 8698506
39446 8698506 12702116 15844738 14041248 9144955 6144851 6404662 6744133 5015283
39438 5015283 3728679 6719503 13579142 19181180 18897353 13322744 7180462 3816275
39430 3816275 1675759 -3092911 -11034220 -17833975 -19069914 -15359514 -11353787 -10338879
39422 -10338879 -11891925 -14690386 -18601422 -22545475 -23313365 -19776870 -16426511 -18404189
39414 -18404189 -23457570 -23799126 -17217375 -11131790 -12117387 -15732455 -12380730 -1248600
39406 -1248600 8023262 8229720 3484958 2490132 6918638 10441481 7608080 -59038
39398 -59038 -6998601 -9943609 -9975364 -9470820 -8995963 -8160336 -8378656 -12189711 -18879633
39389 -18879633 -23246301 -21319714 -15998896 -13914351 -17111082 -21039164 -20994215 -17210976
39381 -17210976 -12604938 -8734713 -5894246 -4556607 -4199616 -2267555 3341576 11489279
39373 11489279 19021249 23841476 25423468 23552777 18636704 12885067 9326502 9103813
39365 9103813 10417522 10530396 8885912 8088795 10803144 15051325 14448150 5597300 -5897902
39356 -5897902 -10471100 -5868681 298066 273203 -5387456 -10987257 -13533522 -14151242 -14265516
39347 -14265516 -14109315 -13983627 -14205692 -14470890 -15048977 -17283393 -21168732 -24175840 -24365248
39338 -24365248 -22674836 -20286376 -16616586 -12659880 -12889005 -19339640 -26339628 -26616429
39330 -26616429 -21396330 -18648039 -21490916 -24412215 -22228276 -17074022 -13869713 -13529970
39322 -13529970 -14083847 -15071073 -17126313 -19389018 -20648805 -21629582 -23284317 -23899670 -20588258
39313 -20588258 -13246489 -5020136 903726 3598107 4127239 4399762 5807209 7850670
39305 7850670 8663499 7793313 7476260 9786065 13252425 13870104 9271728 801252 -8132972
39296 -8132972 -14413189 -16077254 -12466180 -4519922 5305225 13841784 18276298 17230359
39288 17230359 11734421 5183034 1396245 1783998 4245305 5333749 3861704 2006397
39280 2006397 2306255 4027131 3800018 93074 -4450116 -6178863 -4807612 -3098766
39272 -3098766 -2816969 -2916941 -2056897 -1201370 -2389404 -5451067 -7421741 -5979325 -2734067
39263 -2734067 -1597061 -3569666 -4872860 -1574778 5455484 12183523 16367863 17814430
39255 17814430 15114714 6963647 -2888391 -7168590 -3706215 1640400 2880044 447457
39247 447457 -2461246 -4864575 -5636302 -1823478 5185074 7083834 -528950 -9176828
39239 -9176828 -8257680 -1686851 -3138014 -15302616 -25429899 -23978252 -16709784 -13117019
39231 -13117019 -12520476 -9212479 -4205588 -3073603 -6269157 -9747275 -12810424 -17830783
39223 -17830783 -23258930 -23886950 -18651356 -12798864 -11137539 -13062723 -15343023 -16717780
39215 -16717780 -18373765 -21572394 -25663746 -28006114 -26433118 -22339296 -20060438 -22420811
39207 -22420811 -28093137 -33353329 -34386074 -28539196 -17294301 -8168328 -8451275 -15581159
39199 -15581159 -19397670 -16262977 -14306922 -20580532 -30045658 -33813267 -32204569 -31259333
39191 -31259333 -30871206 -26239012 -18723197 -14898915 -14889891 -11568654 -3103183 2837301 691511
39182 691511 -4998536 -7404947 -6796140 -7453133 -10325812 -13529398 -16359987 -18492819 -18114573
39173 -18114573 -14475612 -9647028 -4757590 2287770 11711775 17573892 13519344 1873091
39165 1873091 -7281902 -6806602 96696 3897246 -1087966 -11243870 -18352762 -19090279
39157 -19090279 -17894387 -19457443 -21641350 -19654775 -14751381 -12696364 -13923052 -11983797
39149 -11983797 -3714426 5146646 7739204 4464116 -54683 -3844094 -7094404 -8575231
39141 -8575231 -7435488 -6099157 -6844779 -7359974 -3928110 2340032 6402337 5625817 2100767
39132 2100767 -570208 -312233 2423961 4642617 3481532 629955 1308959 6726679
39124 6726679 11336212 10841396 8567820 9031746 9464987 4534959 -3555905 -7826165 -8076985
39115 -8076985 -10900478 -17475266 -20422128 -15995141 -11244636 -13639662 -19665436 -20226292
39107 -20226292 -13567117 -6349689 -3877243 -5179413 -7098340 -7931853 -6639043 -2954481
39099 -2954481 483318 -346745 -5496755 -9669420 -7897383 -1026473 5808275 8864423
39091 8864423 8594467 7700863 7798333 7776316 4756942 -2773794 -11957966 -16431744 -11863605
39082 -11863605 -993793 7980578 8700127 1892412 -6405965 -10353510 -7751822 -420171
39074 -420171 6768976 8685033 4518392 -783706 -1956369 214021 646324 -2471604
39066 -2471604 -5631583 -5929477 -4823302 -4372523 -3807330 -2396837 -2096969 -4307288 -7389505
39057 -7389505 -10668697 -16915065 -26193672 -31157921 -25217464 -13350091 -7398062 -10916719
39049 -10916719 -15984293 -15801917 -12672343 -10727510 -8172561 -1968122 4893271 6608525
39041 6608525 2260941 -4381131 -10404411 -14696512 -15393148 -11126666 -4215934 959062
39033 959062 2370711 809660 -2411759 -5310989 -4694714 506294 6556335 9050998
39025 9050998 8424707 7698647 6485074 2092937 -4401273 -8842196 -10915539 -14455505
39017 -14455505 -19479654 -20025113 -13139459 -4945068 -3322912 -8031711 -12568849 -13194011
39009 -13194011 -11337553 -8806028 -5805884 -3604999 -4554598 -8335635 -11409301 -11413365 -9774460
39000 -9774460 -9018258 -9407024 -9040376 -5907834 264134 6711046 8799701 5051415 719867
38991 719867 2995537 11885057 19203803 18146470 10684764 3347304 -1121576 -4451548
38983 -4451548 -7386795 -7871559 -4715681 -75882 2271117 -379660 -7984535 -16656994
38975 -16656994 -20093131 -15017206 -5449567 652069 -841546 -7459791 -14079193 -16686860
38967 -16686860 -13004941 -3768376 5485877 7772033 1973848 -5870862 -10273575 -12200376
38959 -12200376 -15105057 -18535180 -19491219 -17962146 -16759358 -16603712 -15445727 -12855501
38951 -12855501 -11350808 -12170166 -12680392 -9942819 -5159512 -2537232 -4222190 -7958386
38943 -7958386 -10227316 -10807802 -12859775 -18002537 -22838860 -22442051 -16613990 -9739106
38935 -9739106 -4281352 1634555 8337491 10463673 2945472 -10839976 -21195234 -21796441
38927 -21796441 -14022155 -2734555 8033458 15131720 16267441 11710746 4177019 -3340007
38919 -3340007 -8050354 -7041549 -39708 7888414 10470605 7762877 5982838 9023788
38911 9023788 13728473 14711290 10364018 2797158 -4591350 -7941701 -5087096 929024
38903 929024 3784538 1546754 -733897 1830001 7817407 13020184 16125240 17383699
38895 17383699 15536828 10879586 8406905 12218231 18242711 18167575 10458028 2528365
38887 2528365 1439441 6658096 12744225 15320194 13328016 8825146 5963633 7620562
38879 7620562 12009016 14617460 13540486 10328032 5983245 -24280 -6255988 -9123320
38871 -9123320 -8001706 -6770543 -7845990 -8063845 -3679595 3210260 7137526 6820664
38863 6820664 6467112 9649406 14984221 18494474 17998807 14302145 9559406 5379536
38855 5379536 1892066 -1626380 -4801584 -5347016 -1522171 4464260 6999217 2346429
38847 2346429 -6631927 -11922202 -7500759 4444141 14797269 15884676 8694441 1115336
38839 1115336 -775719 1806190 3861222 3306684 2124348 2243842 3424624 5375347
38831 5375347 8727645 12287164 12133353 6541806 275872 127531 6114658 10802929
38823 10802929 8433783 1125236 -5839128 -10829313 -14292569 -13957513 -7630066 375071
38815 375071 2097671 -3681568 -9659909 -10655937 -10311829 -13646298 -18255153 -18371162 -14048164
38806 -14048164 -10072071 -7688282 -3805413 2022447 5993042 6395754 6288784 8220773
38798 8220773 10801344 12436747 14212126 16393805 15634069 9063606 -877225 -8558696
38790 -8558696 -10867498 -8848927 -5162018 -2003282 -552058 -560143 -666917 281853 2848258
38781 2848258 7556432 13863308 18600435 18145235 12861359 6823618 2567336 -726002
38773 -726002 -3070579 -1989646 2742029 6708269 6570864 4892549 5522086 7155935 5868535
38764 5868535 1658176 -2354630 -5487633 -9047942 -11381312 -8993586 -2834483 1694369
38756 1694369 1985317 1130999 2759214 7226034 13658942 20952381 25377338 22358880
38748 22358880 13127895 5076083 2773811 3097761 2195776 1989848 5086588 8144082
38740 8144082 6891942 4543951 7817823 16040646 21730301 21880370 20955978 21430179 19509153
38731 19509153 13880260 11145832 16308563 23162283 21677055 12136666 4222400 2849655
38723 2849655 2757992 -1149842 -5145491 -2602904 5878115 13267384 15048691 13041891
38715 13041891 10935428 9817845 8841214 7589087 6240555 4505864 1651803 -2372903
38707 -2372903 -6085539 -7038018 -4017966 920989 3513044 1332676 -3545006 -6613051
38699 -6613051 -5329685 -1101438 2283816 1604850 -3245340 -8514419 -9488823 -5739315
38691 -5739315 -2645829 -5782729 -14286905 -21884288 -24185645 -22494623 -20294650 -19021231
38683 -19021231 -18623958 -19572481 -21895084 -23761599 -23318271 -20966683 -17875734 -13512177
38675 -13512177 -7387775 -2543016 -3737919 -11099429 -18097804 -17498010 -8142734 4631052
38667 4631052 13218412 11757655 -494636 -16560690 -24760970 -18938110 -5754423 2031616
38659 2031616 159983 -3326400 -385401 5692352 5513189 -2880732 -11404916 -12419462
38651 -12419462 -6489026 1435822 8573241 14160670 16563066 14763228 11176599 9291336
38643 9291336 9041659 7576991 4290058 1843030 1715324 1815452 -31376 -2658088 -3755154
38634 -3755154 -3873826 -5472807 -8321921 -8807566 -5086021 -649467 -158155 -2720515 -2714932
38625 -2714932 2129036 7112712 7287172 4464215 3509897 3984176 1183507 -4663790 -6426685
38616 -6426685 375761 10767214 16120559 13340233 5789759 -1125306 -2470091 3870588
38608 3870588 13395529 17170761 11882519 3958959 -486793 -4540488 -12703853 -19397917
38600 -19397917 -15127028 -1939669 7810280 8258346 5221029 3327392 -573509 -6946352
38592 -6946352 -7728265 1290893 10656979 8895448 -1687790 -9624136 -10301413 -8327435
38584 -8327435 -7065512 -5617666 -5382667 -10030820 -17164035 -17778631 -7400756 7275661
38576 7275661 15670191 13654205 4867967 -4586638 -10341898 -11034436 -7826988 -2607285
38568 -2607285 3137355 7270633 7060449 2644904 -1545662 -1973413 -815739 -2029572
38560 -2029572 -4530285 -3952073 -59468 2707259 1870471 -722513 -3155275 -5134393
38552 -5134393 -5248235 -1985926 1444957 -1120022 -9934775 -17000971 -15512738 -7911665
38544 -7911665 -1640021 -27185 -480046 409666 2716467 3262132 -1109730 -9087659 -14258466
38535 -14258466 -11859163 -5656329 -3765844 -7409877 -9247066 -4460301 2346333 4592524
38527 4592524 2746662 1294336 957590 -393637 -1650951 788841 6756359 11502639
38519 11502639 11507716 7887729 3945079 1923676 2159866 3426680 4274707 5124486 7768141
38510 7768141 11711003 13497048 11943520 11502369 17012892 26680976 33631760 33371965
38502 33371965 26826226 17591610 9855069 7744806 12239972 18584798 20521775 17402790
38494 17402790 13678175 11349372 7341941 -295116 -7893777 -10891526 -10392716 -11612570
38486 -11612570 -16753795 -22219374 -22939538 -17570635 -9039709 -1318699 3485474 5360892
38478 5360892 4733552 1311850 -5128802 -12942251 -18107064 -16529477 -8071210 1659427
38470 1659427 5386992 1581985 -3515549 -3384422 592823 1693917 -2228473 -6216275
38462 -6216275 -6685094 -7252527 -12679008 -20914242 -25815729 -25506780 -23282131 -21447714 -19164176
38453 -19164176 -16393491 -15316021 -16431052 -16675294 -13311514 -7690855 -3788965 -4272991
38445 -4272991 -8540101 -13233455 -14374987 -10416395 -3489158 3304196 9113746 14134649
38437 14134649 16309631 12653648 4486781 -1813022 -1238693 4414640 9266531 10101071
38429 10101071 8369983 6206636 3077395 -2327648 -8147268 -9495507 -3429556 7285548
38421 7285548 16558042 20514150 19555003 15991921 11944759 9235940 8616456 8601236 7406009
38412 7406009 6168867 7287754 9429049 8323120 3670264 553078 1609888 2607258
38404 2607258 -657779 -5699409 -8264502 -9624144 -13023172 -16318452 -15234069 -11847863
38396 -11847863 -12095931 -15320334 -14184008 -6298780 1257219 1779652 -2505592 -5029473
38388 -5029473 -3540207 -724139 784280 1116983 2635351 7861088 16029044 21929787
38380 21929787 21301159 16774485 14214250 13809784 10591059 4064818 293440 2099651
38372 2099651 3989837 616100 -5609209 -9825642 -12278949 -15126574 -15942542 -10491733
38364 -10491733 388120 11688245 20016674 24336236 23548223 18072216 11753301 7659136
38356 7659136 4023270 -1190187 -4401833 -1006067 5839752 7719623 2404543 -3277944
38348 -3277944 -3137328 1301950 5322228 7603407 9137339 9186403 6293007 1898698 -343139
38339 -343139 1010556 3431626 3757688 2273213 2265989 5431929 9298480 10824446 11291719
38330 11291719 14500326 20217755 23362017 21031965 16453615 13644847 12007691 9549213
38322 9549213 7950774 9979372 14265631 17254483 18551953 19629356 18736588 12590509
38314 12590509 3000056 -3312888 -2449411 3012880 8593894 12001440 11678460 5596267
38306 5596267 -5798883 -17578687 -23442897 -20384076 -10337094 1321778 9223219 11940111
38298 11940111 12554465 14014501 14932777 12024025 5557453 -390141 -2756994 -2491527
38290 -2491527 -3388625 -9350389 -20736824 -31340665 -32116549 -21623725 -9786459 -6446315
38282 -6446315 -8887109 -6774721 2593099 11412636 13379048 10889831 8869580 8303481
38274 8303481 8308676 8862716 8954227 6845899 3894107 3108330 2847178 -1809663 -9645400
38265 -9645400 -12280034 -5780648 3171363 6482184 3955687 -380689 -4769578 -7890792
38257 -7890792 -6924358 -2932082 -2267499 -6888745 -9359539 -3972004 3439396 4419719 373162
38248 373162 -2953809 -7358970 -16975204 -25475076 -22093442 -9498071 -2154448 -5301756
38240 -5301756 -8449670 -3305340 4314060 6358433 5188788 6376216 7766198 4871353
38232 4871353 859805 2104503 8047957 13561163 17641927 21780486 22987843 17186912
38224 17186912 7793403 2393390 1451361 -1472961 -7958099 -11470195 -7779395 -1142864
38216 -1142864 2996328 5014083 6914458 6707856 1967005 -4734209 -8859357 -10100035
38208 -10100035 -11337702 -13191284 -13527403 -11258587 -7242042 -2433345 1759536 2604538
38200 2604538 -849636 -4733590 -4407534 -1185278 -774550 -4768178 -8333595 -7652410 -4855358
38191 -4855358 -2935983 -327759 5185710 10627875 11429690 9141177 9578132 13322936
38183 13322936 14058994 7994827 -558729 -6015338 -8984110 -12418661 -14232352 -10059862
38175 -10059862 -1963746 2151700 -1187632 -6765440 -8771665 -8360565 -9749055 -12616353
38167 -12616353 -13158628 -10828931 -8977904 -8750590 -6779288 -401227 8045766 14031638
38159 14031638 15677338 14017603 10456736 6098814 2112116 -1466183 -6156986 -12134866
38151 -12134866 -16275108 -16036375 -14315415 -16539081 -22562395 -25400629 -19688767 -8345023
38143 -8345023 966426 3153612 -2174461 -12072141 -20551222 -21009379 -13022640 -4637670
38135 -4637670 -3300485 -6413385 -6097513 -1339486 1693854 966398 1681186 5834669 7123356
38126 7123356 1326212 -5210916 -4320245 1788416 4730057 2978255 2415914 5356841
38118 5356841 7479368 6311314 5015742 5554454 4793220 706756 -3025118 -2619908 -268754
38109 -268754 -467393 -3315696 -5678607 -6986681 -9501611 -13196785 -13974927 -8170681 2591678
38100 2591678 12058346 15184510 13402523 12896414 16437039 18840899 13591256 2403007
38092 2403007 -6624867 -10147700 -12909056 -18242174 -21497917 -17154649 -7761053 -521563
38084 -521563 1977121 2377606 2083402 -259817 -4480568 -7777439 -7957078 -4481760 2780596
38075 2780596 12208046 18993929 19408929 16043291 14744433 16821565 18446848 17176687
38067 17176687 14364232 11486433 9355642 10976554 18982649 28880712 31122732 22717717
38059 22717717 11513030 5948008 5698479 5899724 5191172 4590148 2752996 -1776602
38051 -1776602 -6162754 -6185841 -1547907 5742494 15197529 25285327 30589069 27988663
38043 27988663 23247246 24314104 29543654 30256462 24504749 19792696 20788487 22766759
38035 22766759 20448757 15848788 12959768 11111704 8749304 8265735 11259012 13425823
38027 13425823 10322991 4779595 2409967 2625204 733689 -3009617 -3638619 -389141
38019 -389141 1381287 -1827073 -7425840 -11908256 -15216139 -17992977 -18707431 -15951394
38011 -15951394 -10863235 -5672939 -2019724 -1153705 -3040228 -5086754 -4890630 -4083291
38003 -4083291 -5621722 -7696899 -5611780 -138595 2376419 181904 -468634 4230180
37995 4230180 8681515 7266601 4543409 7763360 13185749 9976833 -2642783 -11979471
37987 -11979471 -8424273 2384987 8375258 6080910 1454262 -355382 97383 478403
37979 478403 186682 -552999 -1567303 -1872756 -319547 2285948 3672584 3333982 3470090
37970 3470090 5786423 8856413 10039176 9135407 8495103 9590641 11178645 11722966 12242412
37961 12242412 14751912 18147373 18247877 13369187 7762810 6680809 8903940 7986895
37953 7986895 2015345 -1783768 4134879 16205909 22294273 16561026 6982532 4660417
37945 4660417 9156733 9999862 1795458 -8573784 -11816893 -7641877 -2130176 1911643
37937 1911643 5990794 9666499 10146890 8192521 7991040 9725688 8359676 2385964
37929 2385964 -2160219 -556861 2903750 1646165 -2500794 -1886124 5505381 13614967
37921 13614967 16990385 15992387 12799254 7981129 2967418 1073104 3161669 5652120
37913 5652120 5587424 4861444 6342584 7998880 4854310 -3334715 -9790037 -8034839 -222576
37904 -222576 4315522 -304741 -9338927 -13440362 -10848357 -9297335 -14703125 -22809187
37896 -22809187 -25666313 -22464389 -18649518 -16734996 -14205967 -9990658 -6986948 -7178258
37888 -7178258 -9006245 -10562059 -11164639 -9372899 -4322869 172563 -1787576 -9874312
37880 -9874312 -16868990 -18125542 -16414933 -15209680 -13146245 -8759191 -5106266 -4886590
37872 -4886590 -5459622 -3733124 -2091352 -4187528 -8195127 -9680065 -8329139 -6437852
37864 -6437852 -3633506 795453 2793000 -2210226 -10988178 -15349127 -13228334 -10473414
37856 -10473414 -11057351 -12019824 -9759921 -5505327 -2175594 -684986 -1642830 -6031027
37848 -6031027 -11432754 -11865714 -4826082 4561786 9466148 8679514 5118354 -70067
37840 -70067 -7627334 -15457515 -17948895 -11439415 1061788 11600136 13915488 8811570
37832 8811570 2971098 2080738 5767830 10057015 13123203 16060741 18853302 19044000
37824 19044000 15128432 8833511 3356856 1178438 3418238 8775369 13055164 12559764
37816 12559764 8255961 3984547 825623 -3252329 -8184349 -10696978 -9522823 -7500414
37808 -7500414 -6857327 -6539911 -6152767 -8020334 -12279162 -13964147 -8929858 79088 6719486
37799 6719486 7922815 4573397 -1374231 -6595101 -6363690 234247 6974105 7163158
37791 7163158 2351379 -57420 3415043 9639063 14886866 18274032 19379807 17627979
37783 17627979 14761227 13491706 13030164 10210450 5414748 2427717 1514254 -1752305
37775 -1752305 -8588691 -13432131 -11819805 -7238180 -5760491 -7484663 -8180475 -6771096
37767 -6771096 -5769597 -5593095 -3891349 -759695 84949 -3300013 -7868558 -9322496
37759 -9322496 -6791707 -2623636 575899 1548601 470753 -1474603 -3201466 -4535331
37751 -4535331 -5347220 -4753216 -2745002 -1727727 -4035435 -8249474 -10657945 -10422321 -10315602
37742 -10315602 -11772592 -12499078 -10470207 -7281272 -5360611 -4311200 -2456384 6062
37734 6062 1934365 3536446 5041100 4680132 990417 -4015900 -6880105 -6878555 -5473100
37725 -5473100 -3181543 -514224 -393747 -4887872 -10197439 -10119890 -4663595 285838 2522752
37716 2522752 6232024 12989156 17120875 14635719 10672266 11640216 14393406 10664167
37708 10664167 -290905 -11121368 -17401427 -21527762 -25033650 -24455750 -17542403 -7914882
37700 -7914882 -189433 5613153 11840733 18491848 23436517 25210694 23671494 19557585
37692 19557585 14312463 8558921 966804 -8593775 -15618686 -15151175 -9243103 -4780509
37684 -4780509 -3265393 606385 8122404 11952111 7202039 405510 594421 6145328
37676 6145328 8231381 4392199 644356 1318597 4490594 7665152 10982079 13673107
37668 13673107 13502029 11200969 9930250 9041498 4374200 -3210602 -6063434 -444869
37660 -444869 6421786 5282084 -2806337 -8772834 -8210669 -5932393 -7705542 -12248324
37652 -12248324 -13411590 -7882017 1137067 7175528 6539895 1229365 -3933963 -6474584
37644 -6474584 -7560926 -8680513 -9386212 -9163730 -9229564 -10745558 -12873828 -14261519 -14748001
37635 -14748001 -13665234 -8527356 1283612 10583826 12226523 5741656 -1067946 -873466
37627 -873466 5120513 9823430 9121546 5410375 3014734 3118958 4205323 5371732 7184051
37618 7184051 9752296 11645214 11180570 8125403 3940499 795406 181247 1743309
37610 1743309 3519086 4061561 3994974 4222340 3108957 -1891867 -8910346 -11042292 -4080138
37601 -4080138 6731521 11361819 6375614 -1631841 -4507779 -1015757 4682467 9578060
37593 9578060 13562103 16453741 17131380 15798083 14379315 14038013 14278897 14909251 16587297
37584 16587297 18420817 17372179 12181684 6493391 5542298 10000450 15217012 16611434
37576 16611434 13831681 9359090 5289219 2434044 587446 -1589216 -5076844 -7524868
37568 -7524868 -4118089 6122622 16835140 20413904 16600967 11615753 9470601 8248423
37560 8248423 5282100 1662585 -156308 70563 1150434 2211287 2152861 -46993 -3112259
37551 -3112259 -4429414 -4520807 -7058029 -12694690 -16942928 -16664129 -14261951 -12134924 -8003216
37542 -8003216 -801570 3637671 34783 -6362711 -5619976 2213727 6870402 2915753
37534 2915753 -3448139 -4955391 -2613406 -332987 2889497 9695110 17958376 23465062
37526 23465062 25990198 27623464 27513857 23348040 16369462 10061635 4916189 -752266
37518 -752266 -5379987 -4716789 1172913 5885831 3984207 -2505648 -7381335 -8090473 -7236560
37509 -7236560 -6962627 -5558728 -1552013 1537021 -1352549 -8805860 -13052007 -10301811
37501 -10301811 -6687198 -9663030 -16785478 -19037713 -13842780 -7982632 -7125002 -9164799
37493 -9164799 -9967262 -9450292 -8677653 -6321657 -2048628 1003599 1183363 1721669 5124864
37484 5124864 8389452 8539333 8779156 13282603 19202262 20473189 17254257 14547274
37476 14547274 12744170 7170222 -2557554 -10070212 -11302684 -10041489 -11582338 -15601006
37468 -15601006 -18400988 -18426333 -16287278 -12082945 -5812836 1194956 7469471 12638925
37460 12638925 16066825 16017535 11784665 5265453 -819663 -4927548 -6073600 -3127972
37452 -3127972 3651136 11465935 16726652 17557244 14324766 8849934 3555195 135006
37444 135006 -1725940 -3652284 -6325185 -8617242 -9036729 -7494351 -5929096 -7399602
37436 -7399602 -13112847 -19397313 -19781092 -12394688 -3516507 -686081 -3690304 -6059595
37428 -6059595 -4370550 -1243919 964150 3865334 8168932 9797767 4849674 -4011807
37420 -4011807 -9961236 -9983367 -7586764 -7728403 -11174934 -14385107 -13945418 -10457969 -7720398
37411 -7720398 -8075336 -9896040 -10891592 -12151654 -15933995 -20287505 -19957766 -13466610 -5467444
37402 -5467444 -247471 3616855 9333886 15438277 17031136 12371435 4968509 -526151
37394 -526151 -1729328 1837058 8996891 15461519 15084185 5794286 -6294331 -11731456
37386 -11731456 -7722151 -1038829 701757 -1658984 -1437499 3687165 9183143 11708375
37378 11708375 13715350 17217994 18584021 14713477 10220294 11724646 17138137 17780134
37370 17780134 10810482 2670363 -800149 -1179689 -2324385 -4258633 -5365236 -6041038
37362 -6041038 -6552341 -4576843 1578044 9236024 13334793 10987024 3354677 -4947651
37354 -4947651 -8251166 -4752688 723780 2269142 845710 2114034 6698367 9108522
37346 9108522 7560692 7511751 12107886 16064974 13988542 8922633 6871343 7697519 7766849
37337 7766849 7688597 10539031 14816501 15731214 12351087 8059754 4976319 2758146 1850671
37328 1850671 3328973 6264624 8876766 10882067 11564248 8264989 775718 -6027847
37320 -6027847 -8791143 -11268918 -17076162 -20451004 -12818195 2694811 12400180 9023312
37312 9023312 -310116 -5497938 -5815415 -6883218 -10624161 -13427742 -12267483 -8690076
37304 -8690076 -6427336 -6426294 -5348268 -574103 3598718 -1061693 -15226665 -28076234
37296 -28076234 -29163129 -20123003 -9511632 -796303 7172607 11939349 9521757 3253474
37288 3253474 950187 3373691 4615494 3877852 6729741 13369442 16140846 11628950
37280 11628950 5357064 1038356 -4721604 -12578465 -15852344 -12244492 -10555028 -17704463
37272 -17704463 -27035162 -28037224 -20935480 -12937017 -6129361 1471618 7693938 8743295
37264 8743295 6800242 6488273 6706374 4055671 971296 1588714 2622771 -1695339 -7372335
37255 -7372335 -3840316 10253675 23811232 27200458 21477107 12734942 5302692 2199050
37247 2199050 4539795 7711099 4451532 -5686291 -15120168 -17813920 -14621632 -8527633
37239 -8527633 -1386681 3105420 482924 -7522602 -13374942 -13979030 -14324937 -17862900
37231 -17862900 -20043893 -16057896 -9058907 -5030732 -3902859 -1499098 2935870 6662310
37223 6662310 8648305 9886741 10015355 7915646 4720782 2787612 2489694 2569800 2413639
37214 2413639 1808477 228411 -1376662 -81523 5228847 11343624 14261260 13463069
37206 13463069 10797485 7471737 4256104 1987773 -599478 -6664735 -15963752 -22741746
37198 -22741746 -22474217 -17983274 -14815996 -13132291 -9146492 -2931323 804260 -342061
37190 -342061 -3594300 -5762645 -6812254 -7572722 -7226307 -4592138 70814 5293726 9086132
37181 9086132 9843906 8334313 7753507 9519222 10457479 7306651 2486707 1171086 3678145
37172 3678145 6010722 7759617 12968278 21134549 23920216 15618316 2474225 -4174843
37164 -4174843 -1667676 2800904 3689251 3610958 6991969 12406750 14713287 12305783 8817723
37155 8817723 8164043 10175289 11263405 8117399 728046 -7330102 -11731596 -11312328
37147 -11312328 -8997582 -8203469 -8936205 -8641676 -6285131 -3594712 -2215875 -1999135 -2871972
37138 -2871972 -5674878 -9244368 -9405985 -4321024 890466 -684471 -8245068 -13704093
37130 -13704093 -12724857 -10480670 -13529165 -19975968 -22130549 -16797439 -8412472 -2660043
37122 -2660043 -1004216 -1722932 -2869210 -3251947 -2895166 -3370664 -6047559 -9933015 -13012229
37113 -13012229 -15281601 -17940190 -19833155 -17975970 -12313249 -6722876 -3853130 -1921025
37105 -1921025 1424942 4965700 6532567 7494474 10759058 15115918 15603773 10245008
37097 10245008 3060379 -1284694 -3119053 -5460645 -7912173 -6635395 -755580 4702947
37089 4702947 4617375 609528 -873374 3177232 8980254 11459866 10244486 8488113
37081 8488113 7891519 7348108 5459312 2105452 -1946029 -5117631 -5467077 -3197549 -1905103
37072 -1905103 -4514300 -8299267 -7319679 -422635 6647533 8681120 7195994 6465036
37064 6465036 6061291 1502431 -8318936 -18279543 -22674541 -21150031 -17533043 -14492767
37056 -14492767 -11275183 -6258083 -138028 4126105 4306513 1437376 -1098835 -1319431
37048 -1319431 -1099352 -4127571 -11345417 -19203516 -22965047 -21316393 -17164696 -14208950
37040 -14208950 -13534267 -13595907 -12501081 -9532783 -5089410 -362028 2852729 3039717 86357
37031 86357 -4948432 -10954261 -16613920 -19498370 -17516034 -12116074 -7892897 -7294475 -7598196
37022 -7598196 -5523327 -3178487 -5828729 -13978236 -21333728 -21767064 -15608565 -7852936
37014 -7852936 -2731591 -1665963 -4027458 -7242821 -7404659 -2337122 5994360 13259650
37006 13259650 16271375 14006577 6982624 -2347892 -9810572 -12616310 -12002860 -10987327
36998 -10987327 -10155202 -7971105 -4880732 -4150404 -7609250 -12565078 -14272239 -10464346
36990 -10464346 -2896635 4306284 7281391 5049781 779998 -531222 3226789 9421439
36982 9421439 13974298 15258594 13941819 10878224 7390665 6497749 10621597 17448525
36974 17448525 20814992 17468816 11233986 8471970 10595326 13427660 13413528 11692646
36966 11692646 11424884 13396509 15497814 14916974 9836073 894090 -7434283 -8836813
36958 -8836813 -1091529 10808529 19480362 22058613 20172118 15009575 6768282 -1266749
36950 -1266749 -3355563 1590789 7189070 6923273 1863338 -1910218 -1457394 1033558
36942 1033558 3215570 5525488 8587085 10609617 8924331 3190229 -3460860 -6264640
36934 -6264640 -2701865 4497201 9326575 8796833 5976661 5212780 6267670 6091759 4870703
36925 4870703 5980554 9570404 10387575 4303508 -5226071 -9529217 -3061330 11243446
36917 11243446 24164348 27880003 22991659 17818553 19142990 24403233 25698581 20720965
36909 20720965 15276391 14014259 13658820 8844522 1015641 -3263698 -1355357 2708295
36901 2708295 4581195 4813049 6437578 9987375 12793835 12350748 9104558 5700560
36893 5700560 3625869 1311897 -3134707 -7659462 -7398744 -1217670 5775266 8648761
36885 8648761 8981759 11324636 15468388 16938076 14333247 10888208 8149775 3536304
36877 3536304 -3640192 -8643647 -7398840 -2511152 698655 1276559 1529339 1413129 -773702
36868 -773702 -3560542 -3903054 -3361025 -6632425 -12777769 -13997557 -5961807 5985796
36860 5985796 14668780 20107761 25694192 29851718 28522211 23516476 20741762 20752072
36852 20752072 18799344 14841872 14946512 19858378 20669835 11467879 -688643 -5659250
36844 -5659250 -4581563 -5653915 -9403274 -8623135 -2352692 781310 -4049565 -10156526
36836 -10156526 -9684510 -4504597 -903203 1135098 6293369 14330796 18856509 15580486
36828 15580486 7264434 21220 -2511789 -1292428 -82122 -1288955 -2988831 -1736610
36820 -1736610 1510748 2023586 -769578 -997813 4445002 9307629 6309131 -1362269
36812 -1362269 -3691126 2516740 10233854 12142787 7797838 563056 -6453401 -10026332
36804 -10026332 -7886150 -2415304 767394 -470562 -3065616 -4466302 -5655349 -7514487
36796 -7514487 -8918023 -9782561 -11181180 -11117035 -5874461 2273343 5008345 -671264 -6835907
36787 -6835907 -5094383 2466150 8156254 9635660 9466630 7717012 2830237 -2103862
36779 -2103862 -1784984 2796428 5185843 3221561 1452428 2715086 3697760 1244499
36771 1244499 -2465623 -4286631 -5319164 -8036984 -11091548 -10628945 -5491318 1369159
36763 1369159 5897081 5992647 2521382 -1827306 -5391667 -9037389 -13534757 -16622995
36755 -16622995 -15533912 -11598011 -8381178 -5346455 1674305 12317596 19165042 16596811
36747 16596811 8233410 1796012 -318058 -1198474 -2693206 -3320512 -1767243 1977149
36739 1977149 8511106 17710429 25326559 25323567 17273027 8238139 5336809 8573389 12500958
36730 12500958 12616117 8062047 184614 -8331448 -13502081 -12633942 -8157160 -6707922
36722 -6707922 -12183601 -20190310 -21335332 -10757944 6505984 20258824 24466518 21092064
36714 21092064 15612624 10888917 6384032 1756796 -1492472 -2730228 -4356044 -8628869
36706 -8628869 -12833244 -11140088 -3041568 3237371 -413553 -11365094 -19240098 -19191244
36698 -19191244 -16546430 -16990954 -18721949 -18269763 -17856326 -20285473 -21061803 -14297960 -4556937
36689 -4556937 -3326006 -12742359 -21672258 -20908653 -14343199 -10635995 -10849363 -10505909 -8800382
36680 -8800382 -8789146 -11006912 -12785727 -12530790 -10406596 -6769837 -3902663 -6557791 -15861828
36671 -15861828 -24952083 -26060059 -20443269 -16102724 -16940594 -19479281 -19270565 -15013806
36663 -15013806 -6998762 2740513 8825323 6930991 361629 -3099037 -1359087 389437
36655 389437 -1446508 -4626337 -6765310 -8579137 -9381215 -6099542 10527 2130699
36647 2130699 -2362398 -6682387 -4287819 1191267 1494453 -4577336 -11041355 -13650048
36639 -13650048 -12990047 -10237121 -5382305 541703 5355873 7452594 5327510 -2213336
36631 -2213336 -12297971 -17670486 -14612259 -8580373 -7314792 -11077707 -14866127 -17062015
36623 -17062015 -19102248 -19131619 -14366457 -9066800 -11324497 -20637920 -26875858 -24022052
36615 -24022052 -17400603 -14137766 -13794120 -12707009 -10985690 -9986412 -8256928 -5188950
36607 -5188950 -3786640 -4643603 -2374961 5763053 12624576 10129849 1778019 -2180081
36599 -2180081 327880 2195075 222522 -576797 2632889 5135011 3668624 3066385
36591 3066385 8306243 15597605 17610004 13934921 10281613 9427875 8758261 6080469
36583 6080469 2822190 999868 827771 2047619 4661409 7582584 8886182 8080122
36575 8080122 6376518 4534722 2372251 583302 749161 2622889 3175848 -426915
36567 -426915 -7869547 -16364900 -23136493 -26506461 -25961270 -22790224 -20120853 -20484404 -22791187
36558 -22791187 -22987196 -18884015 -13746330 -13425076 -19439941 -26381041 -27502848 -21985260
36550 -21985260 -15043861 -11638498 -12409813 -15589747 -19731008 -23259959 -24102571 -21972825
36542 -21972825 -19100668 -16502984 -11625332 -2753813 5856645 7327004 554685 -8293234
36534 -8293234 -13093085 -13163628 -10729439 -7081460 -3590749 -3319032 -8044511 -14806655 -18186997
36525 -18186997 -15839371 -10285059 -5901777 -5286106 -7354661 -7560983 -1372869 10515678
36517 10515678 21449768 25124551 21543818 14909847 7565228 -468870 -6950839 -7158305
36509 -7158305 294813 10600349 17709713 19953756 19010056 15647375 9390227 1551452
36501 1551452 -4154089 -4704143 -473578 5267364 8993269 9402683 7915421 6530228
36493 6530228 5205375 2393204 -1640938 -3908575 -2424478 780714 2404904 2388411
36485 2388411 2935518 3598423 945857 -5743514 -11741817 -12375858 -9007668 -6162712 -4051995
36476 -4051995 1496132 10893903 17207011 14010524 4062226 -3998351 -6281035 -6389124
36468 -6389124 -7698622 -8389237 -6508568 -5125719 -7868891 -12275629 -13107459 -11238952
36460 -11238952 -13355183 -21739099 -29694327 -29998073 -23960241 -18299708 -15595278 -12247354
36452 -12247354 -5214735 3181655 7981966 6666650 813123 -5403867 -7718332 -4666044
36444 -4666044 745488 3352668 1159163 -2067834 -671128 6393454 14009946 16520943
36436 16520943 14023920 11547778 12200433 13687293 13092170 12472817 16105354 23205370
36428 23205370 27736888 26016473 20345479 13853854 6463854 -1292681 -5277980 -3446903
36420 -3446903 -1154699 -4857145 -12338603 -15503670 -12339034 -9460662 -11788523 -16197642
36412 -16197642 -17908456 -17244014 -16262698 -13783374 -8765271 -4954193 -6520421 -11040846
36404 -11040846 -12159144 -8422562 -4758266 -5368445 -9265326 -12708328 -12095522 -4731710
36396 -4731710 8473715 20277186 21944649 13023487 2569377 -1442751 -116533 1465921
36388 1465921 2908905 7281814 13928921 18240729 18252783 16494849 14579042 10538038
36380 10538038 3417454 -3219174 -5039666 -1725691 4237066 10836652 15577573 13953123
36372 13953123 3887283 -8707552 -13937821 -9281361 -3162504 -4757717 -13362053 -21080059
36364 -21080059 -23449860 -22810330 -22079611 -20485249 -17034008 -14041538 -14138413 -16104552 -16726077
36355 -16726077 -15363231 -13642341 -11484762 -6901304 -99577 5339074 6771025 5716084
36347 5716084 5126899 5270717 4411931 2303259 414926 -1009899 -3556881 -7602609 -10645917
36338 -10645917 -9868323 -5132540 1540321 8158480 13135567 14882253 13226531 10756277
36330 10756277 10472096 11993508 12318578 10684082 9819982 10862031 9915983 2969234 -7172152
36321 -7172152 -12741320 -10172074 -4155084 -1356509 -2854543 -4739670 -4058909 -1495673
36313 -1495673 877047 1927800 1648914 1074611 2192421 6071668 10609980 11900833
36305 11900833 8799630 4771765 3982969 6538738 9038571 9229114 8314465 8461388 9643813
36296 9643813 9880645 7634056 3016823 -2643204 -7384869 -9418605 -8727003 -7523100
36288 -7523100 -7664367 -8006708 -6412232 -4315945 -6165741 -12800362 -18393057 -17090468
36280 -17090468 -10848245 -6868958 -7929314 -9375836 -6358611 -127547 4743751 6360245
36272 6360245 6275575 6372241 7519265 10004082 12973640 14251637 12533999 8956939 5089503
36263 5089503 920513 -3036604 -3277918 3631182 15579420 25423123 27715660 23020254
36255 23020254 15443323 8523344 4485550 4796227 8846303 12937497 12928524 8485641 3652829
36246 3652829 2504329 4577091 5305539 1173118 -6276537 -12367836 -14627636 -14557154 -14052465
36237 -14052465 -12388493 -8139271 -2178888 3396873 8105996 12359411 14568939 11807736
36229 11807736 3907662 -5072265 -10307733 -10239608 -7218282 -5198716 -6340708 -8511292
36221 -8511292 -6743469 1151700 11062921 16557353 15525102 10429178 3090730 -6704406
36213 -6704406 -16998718 -22508142 -20191955 -13318376 -7490216 -4349299 -1291124 4075742
36205 4075742 11284168 17901733 21445542 20984684 17684377 13063455 6924955 -970005
36197 -970005 -7439975 -7882326 -3211853 -837102 -5577010 -12724072 -14159787 -9137655
36189 -9137655 -4317281 -4168177 -6320128 -6777159 -5124235 -2932108 -572662 2103071
36181 2103071 4186323 4797608 4154038 2041347 -3063264 -11366510 -19347139 -22177708
36173 -22177708 -18618804 -12107507 -6731510 -3202110 591378 5799951 10632586 12474330
36165 12474330 10993517 8171886 5868307 4632718 4386494 4395607 2790681 -1405850 -5459891
36156 -5459891 -5193653 -1306520 -96128 -5412017 -12800609 -14982676 -10890606 -5424574
36148 -5424574 -1928774 684978 4071077 8116146 12451929 16257970 16508982 10819524
36140 10819524 2690952 -683476 2534908 6178709 4643596 197769 -1235508 1550465
36132 1550465 4389557 3513821 -1184792 -7364449 -11822768 -11567416 -5831228 2730658
36124 2730658 9933826 13095763 12266355 9720920 8222462 8001500 5667462 -1292248
36116 -1292248 -9130500 -10687949 -4304092 4204518 9624284 12634586 15082696 15622575
36108 15622575 13824277 13287025 15552265 15753846 10552861 5873945 8727851 14598244
36100 14598244 12616831 2331279 -4865150 -2368888 3563322 5773627 6630015 10513213
36092 10513213 13788205 10332921 2254991 -2867178 -2829714 -1972243 -3251376 -5467381
36084 -5467381 -7261162 -8059109 -6010299 -819094 2127593 -3159291 -13837402 -20200896
36076 -20200896 -18046706 -12721730 -9217918 -5403090 965791 4918914 212807 -11133161
36068 -11133161 -21395543 -26949477 -29533735 -29351259 -23975969 -15089247 -10007422 -13346736
36060 -13346736 -21111206 -26180699 -26753836 -26071340 -25868121 -23980943 -18350744 -10692506
36052 -10692506 -5382215 -5580448 -10344296 -15137112 -16177284 -14857372 -16023363 -20582580
36044 -20582580 -22510067 -16594407 -7481217 -6022565 -15806800 -27806225 -30864503 -24095393
$$ [...]
##END NTUPLES=NMR SPECTRUM
##END=
