##TITLE=31Pdec_DE-30_DMSO
 DMSO-d6, 64 sc
 29.7.2024
##JCAMPDX= 6.0         $$ Bruker NMR JCAMP-DX V2.0
##DATA TYPE= NMR SPECTRUM
##DATA CLASS= NTUPLES
##ORIGIN= UXNMR, Bruker Analytische Messtechnik GmbH
##OWNER= root
$$ XWIN-NMR		Version 3.5
$$ Mon Jul 29 14:04:51 2024 Russian Standard Time (UT+4h)  she@DPX200
##.OBSERVE FREQUENCY= 81.013821
##.OBSERVE NUCLEUS= ^31P
##.ACQUISITION MODE= SIMULTANEOUS
##.ACQUISITION SCHEME= undefined
##.AVERAGES= 64
##.DIGITISER RES= 17
##SPECTROMETER/DATA SYSTEM= spect
##.PULSE SEQUENCE= zgpg30
##.SOLVENT NAME= D2O
##.SHIFT REFERENCE= (INTERNAL, D2O, 0, 198.062)
##AUDIT TRAIL= $$ (NUMBER, WHEN, WHO, WHERE, WHAT)
$$ ##TITLE= Audit trail, XWIN-NMR		Version 3.5
$$ ##JCAMPDX= 5.01
$$ ##ORIGIN= Bruker BioSpin GmbH
$$ ##OWNER= she
$$ F:/spectra/data/she/nmr/P31/2/pdata/1/auditp.txt
$$ ##AUDIT TRAIL=  $$ (NUMBER, WHEN, WHO, WHERE, WHAT)
(   1,<2024-07-29 14:03:01.67 +0400>,<she>,<DPX200>,
      <created by zg, POWCHK disabled, PULCHK disabled
       configuration hash MD5:
       00 E9 B6 7A A2 85 ED C7 34 08 36 98 17 FE 4E 26
       data hash MD5: 32K
       FF 30 80 14 8D 1B 04 5C CA F7 72 15 ED C4 F4 52>)
(   2,<2024-07-29 14:04:03.35 +0400>,<she>,<DPX200>,
      <Start of raw data processing
       efp BC_mod = 2 LB = 1.5 FT_mod = 6 PKNL = 1 PHC0 = 2613.457 PHC1 = 186.4869 SI = 64K 
       data hash MD5: 64K
       B5 39 0A D1 82 CE C0 CF E2 78 9F 6C F9 67 89 FF>)
(   3,<2024-07-29 14:04:20.31 +0400>,<she>,<DPX200>,
      <pk PHC0 = 2.274519 PHC1 = 0 
       data hash MD5: 64K
       4C AC 16 09 4A 81 04 DA CC A1 EB 00 8E 8A A3 70>)
(   4,<2024-07-29 14:04:24.73 +0400>,<she>,<DPX200>,
      <abs ABSG = 5 
       data hash MD5: 64K
       65 B3 5F D3 9C 5E 2D 8E F6 A2 90 9A A0 31 05 D8>)
$$ ##END=
$$ 
$$ hash MD5
$$ 46 B6 D2 54 CE 0A 6B C0 B4 58 5C 2F A8 60 2A 5E
##$RELAX= 
##$RELAX= 
##$RELAX= 
##$RELAX= 
##$RELAX= 
##$RELAX= 
##$RELAX= 
##$RELAX= 
$$ Bruker specific parameters
$$ --------------------------
##$DU= <F:/spectra>
##$EXPNO= 2
##$NAME= <P31>
##$PROCNO= 1
##$TYPE= <nmr>
##$USER= <she>
##$AMP= (0..31)
100 100 100 100 100 100 100 100 100 100 100 100 100 100 100 100 100 100 
100 100 100 100 100 100 100 100 100 100 100 100 100 100 
##$AQSEQ= 0
##$AQ_mod= 1
##$AUNM= <au_zg>
##$AUTOPOS= <>
##$BF1= 81.014009
##$BF2= 200.13
##$BF3= 200.13
##$BF4= 200.13
##$BF5= 200.13
##$BF6= 200.13
##$BF7= 200.13
##$BF8= 200.13
##$BYTORDA= 1
##$CFDGTYP= 0
##$CFRGTYP= 5
##$CHEMSTR= <none>
##$CNST= (0..31)
1 1 145 1 1 1 1 1 1 1 1 1 1 1 1 1 1 1 1 1 1 1 1 1 1 1 1 1 1 1 1 1 
##$CPDPRG= <waltz16>
##$CPDPRG1= <>
##$CPDPRG2= <waltz16>
##$CPDPRG3= <>
##$CPDPRG4= <mlev>
##$CPDPRG5= <mlev>
##$CPDPRG6= <mlev>
##$CPDPRG7= <mlev>
##$CPDPRG8= <mlev>
##$CPDPRGB= <>
##$CPDPRGT= <>
##$D= (0..31)
0 1 0 0 0 0 0 0 0 0.06 0 0.03 2e-05 3e-06 0 0 0.0002 0 0 0 0 0 0 0 0 0 
0 0 0 0 0 0 
##$DATE= 1722247381
##$DBL= (0..7)
120 120 120 11 120 120 24 19 
##$DBP= (0..7)
150 150 150 150 150 150 150 150 
##$DBP07= 0
##$DBPNAM0= <>
##$DBPNAM1= <>
$$ [...]
##$SUBNAM3= <"">
##$SUBNAM4= <"">
##$SUBNAM5= <"">
##$SUBNAM6= <"">
##$SUBNAM7= <"">
##$SUBNAM8= <"">
##$SUBNAM9= <"">
##$SW= 400.765351723535
##$SWIBOX= (0..15)
0 1 3 0 0 0 0 0 0 0 0 0 0 0 0 0 
##$SW_h= 32467.5324675325
##$TD= 32768
##$TD0= 1
##$TE= 0
##$TE2= 300
##$TE3= 300
##$TEG= 300
##$TL= (0..7)
0 120 53 12 22 120 120 120 
##$TP= (0..7)
150 150 150 150 150 150 150 150 
##$TP07= 0
##$TPNAME0= <>
##$TPNAME1= <>
##$TPNAME2= <>
##$TPNAME3= <>
##$TPNAME4= <>
##$TPNAME5= <>
##$TPNAME6= <>
##$TPNAME7= <>
##$TPOAL= (0..7)
0.5 0.5 0.5 0.5 0.5 0.5 0.5 0.5 
##$TPOFFS= (0..7)
0 0 0 0 0 0 0 0 
##$TUNHIN= 0
##$TUNHOUT= 0
##$TUNXOUT= 0
##$USERA1= <user>
##$USERA2= <user>
##$USERA3= <user>
##$USERA4= <user>
##$USERA5= <user>
##$V9= 5
##$VALIST= <valist>
##$VCLIST= <CCCCCCCCCCCCCCC>
##$VD= 0
##$VDLIST= <DDDDDDDDDDDDDDD>
##$VPLIST= <PPPPPPPPPPPPPPP>
##$VTLIST= <TTTTTTTTTTTTTTT>
##$WBST= 1024
##$WBSW= 4
##$XGAIN= (0..3)
0 0 0 0 
##$XL= 0
##$YL= 0
##$YMAX_a= 7099
##$YMIN_a= -5713
##$ZGOPTNS= <>
##$ZL1= 120
##$ZL2= 120
##$ZL3= 120
##$ZL4= 120
##$ABSF1= 198.0616
##$ABSF2= -202.7028
##$ABSG= 5
##$ABSL= 3
##$ALPHA= 0
##$AQORDER= 0
##$ASSFAC= 0
##$ASSFACI= 0
##$ASSFACX= 0
##$ASSWID= 0
##$AUNMP= <proc_1d>
##$AZFE= 0.1
##$AZFW= 0.5
##$BCFW= 0
##$BC_mod= 2
##$BYTORDP= 0
##$COROFFS= 0
##$CY= -3
##$DATMOD= 1
##$DC= 0
##$DFILT= <>
##$DTYPP= 0
##$F1P= 0
##$F2P= 0
##$FCOR= 1
##$FTSIZE= 65536
##$FT_mod= 6
##$GAMMA= 0
##$GB= 0
##$INTBC= 1
##$INTSCL= 9.790993e-09
##$ISEN= 30
##$LB= 1.5
##$LEV0= 0
##$LPBIN= 0
##$MAXI= 10000
##$MC2= 0
##$MEAN= 0
##$ME_mod= 0
##$MI= 50
##$NCOEF= 0
##$NC_proc= -9
##$NLEV= 6
##$NOISF1= 182.463
##$NOISF2= 159.3651
##$NSP= 0
##$NTH_PI= 0
##$NZP= 0
##$OFFSET= 198.0616
##$PC= 4
##$PHC0= 2615.731
##$PHC1= 186.4869
##$PH_mod= 1
##$PKNL= yes
##$PPARMOD= 0
##$PSCAL= 0
##$PSIGN= 0
##$REVERSE= no
##$SF= 81.0140089999434
##$SI= 65536
##$SIGF1= 159.3651
##$SIGF2= -187.1042
##$SINO= 113.3802
##$SIOLD= 16384
##$SREGLST= <1H.CDCl3>
##$SSB= 0
##$STSI= 65536
##$STSR= 0
##$SW_p= 32467.5324675325
##$SYMM= 0
##$S_DEV= 0
##$TDeff= 32768
##$TDoff= 0
##$TI= <>
##$TILT= no
##$TM1= 0
##$TM2= 0
##$TOPLEV= 0
##$USERP1= <user>
##$USERP2= <user>
##$USERP3= <user>
##$USERP4= <user>
##$USERP5= <user>
##$WDW= 1
##$XDIM= 65536
##$YMAX_p= 328431125
##$YMIN_p= -65335164
$$ End of Bruker specific parameters
$$ ---------------------------------
##NTUPLES= NMR SPECTRUM
##VAR_NAME=  FREQUENCY,     SPECTRUM/REAL,   SPECTRUM/IMAG
##SYMBOL=    X,             R,               I
##VAR_TYPE=  INDEPENDENT,   DEPENDENT,       DEPENDENT
##VAR_FORM=  AFFN,          ASDF,            ASDF
##VAR_DIM=   65536,         65536,           65536
##UNITS=     HZ,            ARBITRARY UNITS, ARBITRARY UNITS
##FACTOR=    0.49542278885378, 1,            1
##FIRST=     16045.7642231865, 0,            0
##LAST=      -16421.768244346, 0,            0
##MIN=       -16421.768244346, -65335164,    0
##MAX=       16045.7642231865, 328431125,    0
$$ Real data points
##PAGE= N=1
##DATA TABLE= (X++(R..R)), XYDATA
$$ [...]
42844a3264465k255743K187871M065466K301211j954185o192129o579015p40428
42836b2431417P320211R219712K639882m298046l704385J193178K028467j563900
42828i596298k979126p46802j07490k228574j547441L678283P268246N488601
42820g70601L059947L757142L270907j720214m860625N40468Q907929R218098
42812B1403051J392589m259614k817139J64181P8120j55557J849788J883674l535241
42803A6003852r687633r392952k964858K544998K384863j386956l634708j826215
42795g959609J782716K717498l11652l093963j159058L483575M650531J048675
42787A158713j788709j0839L143033L143129O70030j384385l119345n087718m233700
$$ y = [-13264465, -15520208, -13332337, -9266871, -6965660, -8919845, -15111974, -21690989, -22431417, -15111206, -5891494, -3251612, -7549658, -11254043, -10060865, -8032398, -9596298, -12575424, -13322226, -13429716, -15658290, -17205731, -13527448, -6259202, -770601, 2289346, 6046488, 9317395, 7597181, 2736556, 3277024, 12184953, 21403051, 22795640, 18536026, 15718887, 15883068, 15961188, 15805631, 17655419, 19539093, 16003852, 6316219, -3076733, -6041591, -3496593, -1111730, -2498686, -6133394, -7959609, -6176893, -3459395, -3771047, -6865010, -8024068, -4540493, 110038, 1158713, -629996, -640835, 2502198, 5645327, 6315357, 4930972, 1811627, -3276091, -7509791]
42778g509791J640334P638837O746498M87834k250280J777190N073706O17027
42770A4221355p450155r667871m500986L83649o30716m319037m604920q93493
42762a7462174K623845L358679K481739J647760Q61044o8644m44634J44057J320631
42753e537697L019656N096066N472050J594496m769748p357937l075050K529482
42745c028682J592670n268666r056687l821351O075431J1645576Q948699J207824
42737H294814n910204q716527p141272m294032l278876l128970K13981P356371
42729a6604715J2589265J0576535L861820l12802K56381Q73967j607907l603007
42721F029537j101560K815056J933017l168728n177540j237207J792201k583807
$$ y = [-7509791, -5869457, 1769380, 8515878, 9003712, 6753432, 8530622, 13604328, 14221355, 6771200, -2896671, -7397657, -7014008, -7644724, -11963761, -16568681, -17462174, -14838329, -11479650, -8997911, -7350151, -6489107, -6557751, -7002385, -6858328, -5537697, -2518041, 2578025, 8050075, 9644571, 4874823, -2483114, -5558164, -3028682, -1436012, -6704678, -15761365, -19582716, -13507285, -1861709, 7086990, 8294814, 2384610, -6331917, -13473189, -17767221, -21046097, -24175067, -23961086, -16604715, -4015450, 6561085, 10422905, 10110103, 10366484, 11240451, 9632544, 6029537, 4927977, 7743033, 9676050, 6507322, 1329782, 92575, 1884776, -699031]
42713f99031r520061q575498J051170Q592044O590665N76513k37095M026473O269118
42704H074298L697267l55864l608345o390073o802210j935608N220418P186463
42696E086346K191294l410320m868980m398878m121283j237767M919004P934661
42688B094077L120719l869354m477658N52817L903447L584945L820541N448948
42680A4178482M057212j519227o283395o556417m312914k137618M92402L472757
42672A391282L725984k31980n032295o527471m406857r84850J745052K498689
42664g822446J271023O28363K957157N613469L365671k902896n505301r77880
42656c372840L944716K310965k142271r83263N292696Q027325M234131Q80909
$$ y = [-699031, -10219092, -18794590, -17743420, -9151376, -2560711, -1984198, -2221293, 1805180, 8074298, 11771565, 11415701, 7807356, 1417283, -5384927, -7320535, -2100117, 5086346, 7277640, 3867320, -1001660, -5400538, -9521821, -10759588, -5840584, 2094077, 5214796, 1345442, -3132216, -2579399, 1324048, 4908993, 8729534, 14178482, 18235694, 16716467, 10433072, 3876655, -436259, -2573877, -2081475, 1391282, 5117266, 4885286, -147009, -6674480, -11081337, -12066187, -10321135, -7822446, -6551423, -5923060, -2965903, 2647566, 6013237, 3110341, -2394960, -3372840, 571876, 2882841, 740570, -242693, 5050003, 13077328, 17311459, 18192368]
42648A8192368K725259L824669k806749j2288974j2902058k987614N418968K695287
42640A871156n214561n563933L163459R718429O289128j644378m670591j972946
42632A975763R53791K253808M209986O159206M474941m51388l967907m717473
42624A0890727n966504p952974n868012J370639O836770M910792k59435j188675
42616B773328K019790L344399P61765k093748l192278m719387p691016r008139
42608a7805286n679543J004235O653641P378137K649599l240590l841815K208223
42600a0673399P883722N672820k271682o818535m437471j210324k823128o466253
42592b1144250o127246j238868M441580R198148J3470200J5505576J2320709N023924
$$ y = [18192368, 20917627, 24742296, 21935547, 9646573, -3255485, -6243099, -824131, 1871156, -3343405, -8907338, -5743879, 3974550, 10263678, 8619300, 3948709, 1975763, 2929554, 5183362, 9393348, 15552554, 20027495, 19576107, 15608200, 10890727, 4924223, -3028751, -8896763, -7526124, -689354, 4221438, 3962003, 2773328, 4793118, 8137517, 8899282, 6805534, 3613256, -1106131, -8797147, -17805286, -23484829, -22480594, -15826953, -8448816, -5799217, -9039807, -12881622, -10673399, -2789677, 2883143, 611461, -6207074, -10644545, -11854869, -14677997, -21144250, -27271496, -28510364, -24068784, -14870636, -1400436, 14105140, 26425849, 31449773]
42584C1449773j255025l599158l926745m466798m285048k257727k57206k21105
42576A1180961p9049L571957R208387J0607786M440449n196717j1472984j1815362
42568A0445428q311462l399139J677313N148229N081928K072481r78363k389368
42560I347047k787704k369544o3427L334165M176409M91599m459599n614524j939059
42551A15363L099836N674913M394694M00996l143470k895333R78659L899033J960952
42542A4485643l018625n925943m749488j690652J206159L905353N789243M934894
42534A4936584J287957k163956k894966j593693l15677K01460J96334l10578q48573
42525H494892K628K723296N051050L609906k225133q534081r673217l934762L519066
$$ y = [31449773, 30194748, 26595590, 22668845, 18202047, 13916999, 11659272, 11402066, 11180961, 11101912, 14673869, 23882256, 34490042, 38930491, 33733774, 22260790, 10445428, 2133966, -1265173, 412140, 5560369, 10642297, 12714778, 11736415, 9347047, 6559343, 4189799, 4126372, 7460537, 11636946, 12128545, 7668946, 2054422, 115363, 3215199, 8890112, 13284806, 13685802, 10542332, 7646999, 8625658, 12524691, 14485643, 11467018, 5541075, 791587, -899065, 307094, 4212447, 10001690, 14936584, 16224541, 14060585, 11165619, 9571926, 9256249, 9457709, 9654043, 9343465, 8494892, 8497520, 11220816, 16271866, 19881772, 17656639, 9122558, -550659, -4485421, -966355]
42516i66355N136537m70712o355336n629208n7660K955645N47972k810614k657252
42507a0306983K5404K166754L163219L436460J781153k349128n873875n052650
42499a3009646q78854J558195m51921l650693k902364K254496O868243O812861
42491c399683M078869L459644M644454K051574n442520r667276l543288P026114
42483g92112R338962J238070o216532n111838r17992j766301n394508m288598
42475a3910849J321567M235927J856468j062777j038473k57017j278059l030282
42467a3163495l795063l769097k988706l63778L568154N903591M935175K230085
42459g443134J36485q26070j393511k084506k775628k661181j034574J031974
$$ y = [-966355, 4170182, 3699470, -2655866, -8285074, -8342734, -5387089, -4839117, -7649731, -10306983, -10281579, -8114825, -4951606, -1515146, 266007, -2083121, -7956996, -13009646, -13888500, -12330305, -12782226, -16432919, -19335283, -17080787, -10212544, -3399683, 679186, 4138830, 8783284, 10834858, 5392338, -4274938, -7818226, -792112, 8546850, 9784920, 3568388, -1543450, -2461442, -4227743, -9622251, -13910849, -12589282, -8353355, -6496887, -7559664, -8598137, -8855154, -10133213, -13163495, -16958558, -20727655, -23716361, -24080139, -20511985, -14608394, -9673219, -7443134, -7306649, -8132719, -9526230, -11610736, -14386364, -17047545, -18082119, -17050145]
42451a7050145J436610P99559K576818O878682P926740K252552m020801k566776
42443a766761M613418P553279K532014m008276o275998n528882l772130L48100
42435f305236N602206O057611J45895m725724k336246L188870M155844N4482m433245
42426A404457p109292p436609k997380N696280J1081052P503206R42781J050000
42418A0134495O252674O550765l34423o105575n555558k774924j777658p25901
42410E663895J306329R56531j852348j438266L493202N135791j772213j0300299
42402A192622j0260980j660402P371227J1558704J0833492N943210j104158n217094
42394A8656621l660856r81557k436739n453712m322922l78138M42618j859967
$$ y = [-17050145, -15613535, -14813976, -12237158, -5358476, 2568264, 4820816, 800015, -1766761, 2846657, 10399936, 12931950, 8923674, 2647676, -2881206, -6653336, -6305236, -703030, 5354581, 5500476, 774752, -1561494, 1627376, 5783220, 5837702, 1404457, -5704835, -13141444, -16138824, -10442544, 638508, 8141714, 9084495, 10134495, 16387169, 22937934, 22603511, 16497936, 10942378, 8167454, 6389796, 5663895, 6970224, 7926755, 6074407, 4636141, 8129343, 13265134, 11492921, 1192622, -9068358, -10728760, -3357533, 8201171, 19034663, 24977873, 23873715, 18656621, 14995765, 14014208, 11577469, 6123757, 1800835, 1422697, 1865315, 5348]
42386E348j942110N22555J93066l475004m212826K01172L520025J195452k651838
42377f644160l262522l461718p543401j1890358q957279J433369J0867909J2115854
42369a7342306O102559n49024k021238K064283O326413M863473j732127o512538
42361h800505m893411l84798R52186j175801k239216o6832L113574M903055N172111
42352c419637M456512L098648K129016K512133L410979L069353J111048j587810
42344A4780242m369382o383903o063924l250733n87334m23212j669029k182011
42336a0149286k407727l320022k680164J900366O966959N860485j525971o694696
42328a2050056k972383N596607R100055L534097n252276q616671l948356L481611
$$ y = [5348, -1936762, -1414207, -1221141, -4696145, -8908971, -8707799, -5187774, -3992322, -6644160, -9906682, -13368400, -20911801, -32802159, -41759438, -40326069, -29458160, -17342306, -11239747, -11788771, -13810009, -11745726, -5419313, -555840, -2287967, -8800505, -13693916, -14078714, -13126528, -14302329, -16541545, -16608377, -13494803, -8591748, -3419637, 1036875, 4135523, 6264539, 8776672, 12187651, 15257004, 16368052, 14780242, 10410860, 4026957, -2036967, -5287700, -5875034, -6298246, -7967275, -10149286, -12557013, -15877035, -18557199, -16656833, -9689874, -3829389, -5355360, -12050056, -15022439, -9425832, -325777, 3208320, -2043956, -10660627, -14608983, -11127372]
42320a1127372O325840K694377k115834j904531L130245P048365N790151J660858
42312A1502099n85455J39559Q36555j099103m922770q077789r313851r274934
42304b0795689q182376m513798K302269Q672588R392091M264587q73144j413537
42296a1147009Q81344K229957K467430K615395Q23689l565897n064984J365888
42288i394187J0175223J0159464K15549q470307q359628m837856m920348n231515
42280b0663605Q52067R849618J1492227L509153n183919o367351j129060M341040
42272c299830O161732M315828Q86029j313602q28969N73527m9208k690862m307894
42263e53249k912122K09070K427001K324264N55984m76951J492884N714851Q518276
$$ y = [-11127372, -4801532, -2107155, -4222989, -6127520, -2997275, 4051090, 9841241, 11502099, 10916644, 11056203, 11892758, 10793655, 5870885, -2206904, -11520755, -20795689, -28978065, -33491863, -31189594, -22517006, -13124915, -8860328, -9733472, -11147009, -10265665, -8035708, -5568278, -2952883, -2129194, -5695091, -10760075, -9394187, 781036, 10940500, 11156049, 2685742, -5673886, -10511742, -15432090, -20663605, -19811538, -9961920, 1530307, 5039460, -144459, -6511810, -7640870, -3299830, 2861902, 7177730, 8063759, 6750157, 5921188, 6494715, 6445507, 3754645, -553249, -3465371, -3256301, -829300, 1494964, 2050948, 1573997, 3066881, 8781732, 17300008]
42254A7300008P619437M654329J893491j074189m901243p392121o378160l587489
42246H134063j839283l81472K599197M683434J819145m602001q797163q622058
42238g006138p018158n252922j023873N186016Q280377O193588L817119N285166
42230H461175P155062M252055j467513l782003j769125l21840j548122j733227
42222I246462J615193M946033M216769J661157K438200N994034N909218n82132
42214C5444934p536659q000642l464044r10205k335040l265047j691689j471704
42206F769904m324182n227930n31066N057629N598467L165582K838119K786081
42198A6132604j727664p302760n775838J878415N757184K567278J04439K838780
$$ y = [17300008, 24919445, 29573774, 31467265, 30393076, 25491833, 18099712, 11721552, 8134063, 6294780, 5913308, 8512505, 13195939, 15015084, 10413083, 1615920, -7006138, -14024296, -19277218, -20301091, -15115075, -6834698, -641110, 3176009, 8461175, 15616237, 19868292, 18400779, 14618776, 12849651, 12527811, 10979689, 9246462, 10861655, 15807688, 20024457, 21685614, 24123814, 30117848, 36027066, 35444934, 27908275, 19907633, 16443589, 15533384, 13198344, 9933297, 8241608, 6769904, 2445722, -2782208, -3313274, 1744355, 7342822, 10508404, 13346523, 16132604, 14404940, 7102180, 1326342, 3204757, 8961941, 11529219, 11633658, 14472438]
42190A4472438L964000k034438q465821o421642J414378N790246M474038J937701
42182A5130900m73581m654685q295678o609397j126229J449625k86571n82992
42174e448608L456642O818016M226920k244251o309540n104775j352675M52324
42166e505947r21212j433164L929188J3267405J7129801R467199l467034j0227337
42158B2238899q095975l880306k299143j072519J794033L408836J568809r67484
42150A2695150j273064p84766j695614k663151j491666J000992K899869M296483
42142A2984233N580239N046140J205785m143620p545741p308326l923447Q81379
42134B776642M032950K608272k324560n450004l223247J408199K597602j259164
$$ y = [14472438, 18436438, 16402000, 7936179, 1514537, 2928915, 8719161, 13193199, 15130900, 14657319, 10002634, 1706956, -4902441, -6028670, -4579045, -4865616, -5448608, -1991966, 4826050, 9052970, 6808719, 499179, -4605596, -5958271, -5505947, -6427159, -7860323, -3931135, 9336270, 26466071, 35933270, 32466236, 22238899, 14142924, 10262618, 7963475, 6890956, 8684989, 12093825, 13662634, 12695150, 11422086, 10637320, 8941706, 6278555, 4786889, 5787881, 8687750, 12984233, 18564472, 23610612, 24816397, 20672777, 13127036, 5818710, 1895263, 2776642, 6809592, 9417864, 7093304, 1643300, -1579947, -171748, 2425854, 1166690]
42126A166690o050318o787048k266709M290739P840914N556684l14648m101260
42118f64956k291708K752743N263963K096900l858180o313667k204321M337466
42110h81760O155496J606411l616039m350480k053531m26083O91713K309390J322245
42101G57362m378858q623284l550691P224566J1437315N317220j651675j838002
42093D693953N42852o08764k793129j522702N07342p11963j806337J646402N118336
42084E065990J486488n867792o684047O81000P222564P005025L779402K380189
42076A5068819J732064p69957m278662o685684p103039m715955K08888L645684
42068b897842J586085k884306k316376M174449R042976P116004J789654k000644
$$ y = [1166690, -4883628, -11670676, -13937385, -9646646, -1805732, 3750952, 3436304, -664956, -2956664, -203921, 5060042, 7156942, 3298762, -3014905, -5219226, -881760, 5273736, 6880147, 3264108, -1086372, -3139903, -3565986, -2874273, -564883, 757362, -3621496, -12244780, -15795471, -8570905, 2866410, 8183630, 6531955, 4693953, 5236805, 4628041, 1834912, 312210, 819552, 107589, -1698748, -52346, 5065990, 6552478, 684686, -5999361, -5318361, 1904203, 8909228, 12688630, 15068819, 16800883, 16030926, 11752264, 5066580, -2036459, -6752414, -6543526, -2897842, -1311757, -4196063, -6512439, -2337990, 6704986, 13820990, 15610644, 13610000]
42060A3610000m424081o835665p258810m295690q78040O5154l82516q44490k583535
42051a3827673m942700l311978L292876P901758N176277O01943K306208P259223
42043D455934N150528m815999j0859236m777045O907171J2226458Q325202J750100
42035A8363113j782949k362019k211896j980914j339160n04797j57114q31205
42027G193059k505161m121565l991246j674230Q51805J048549j058767k737212
42019f994768k171759j216514k861274o065330n637725R20343Q471283R559221
42011e996523M118193k10145J589546N477566M856197j14611l709520k970741
42003C039962l82591J024722J065487O79918L59709Q79600K588835L400438M72432
$$ y = [13610000, 9185919, 2350254, -4908556, -9204246, -10082286, -10017132, -10399648, -11244138, -13827673, -18770373, -22082351, -18789475, -10887717, -5711440, -5109497, -2803289, 4455934, 9606462, 4790463, -6068773, -10845818, -3938647, 8287811, 16613013, 18363113, 16580164, 14218145, 12006249, 10025335, 8686175, 8181378, 8024264, 7193059, 4687898, 566333, -3424913, -5099143, -4247338, -3198789, -4257556, -6994768, -9166527, -10383041, -13244315, -19309645, -24947370, -24027027, -15555744, -5996523, -1878330, -2088475, -498929, 4978637, 9834834, 9720223, 6010703, 3039962, 2657371, 3682093, 4747580, 5427498, 5787207, 6666807, 9255642, 12656080, 13128512]
41994A3128512n233749q891957p503177l262214j53877M53773l11228r24632j08614
41985a2807163K288994L759940J166892m065938o016672k202050J799699k18966
41977a6295264n495703n582144J538273Q585679R401507O502935N230335N317587
41969I203205L201350m40130j502254j4621r09216n864460r439395o346797R44516
41960a1167802N582315N195876L462673L644933M446221K958345j106008n254177
41952G762376o541124l546831K126679N990280M620558K64178j094302K290821
41944A1872635M702168M56230p545208j0712896n683038J746954M551137K652889
41936B040871Q04656J073037J202156k34077r15856J500107N153905N846464K365031
$$ y = [13128512, 7894763, -997194, -8500371, -11762585, -11916462, -11462689, -11773917, -12698549, -12807163, -10518169, -6758229, -5591337, -9657275, -15673947, -17875997, -16076298, -16295264, -21790967, -27373111, -25834838, -17249159, -7847652, -1344717, 3885618, 9203205, 12404555, 11964425, 10462171, 10447550, 9538334, 3673874, -5765521, -12112318, -11167802, -5585487, -389611, 3073062, 6717995, 11164216, 14122561, 13016553, 7762376, 1221252, -2325579, -198900, 5791380, 10411938, 10676116, 9581814, 11872635, 16574803, 17031033, 9485825, -1227071, -6910109, -5163155, -612018, 2040871, 2845527, 3918564, 5120720, 4886643, 3970787, 5470894, 10624799, 16471263, 18836294]
41927A8836294k117644m032445l124882j700151j631054l046163m923022n869488
41919g608555m999315k979968j498930q57488O95778L874010O093496M688371
41911b592601J320477l2267P44189m96013n391620r599706q232335j879313N177553
41902b0981636J0047268J1639756Q630680J125205o798067j0096724q116937m080162
41894a8630617j66521L437923N550925M508237J757803N36463N03577j527570
41886d029780m639623l464508K606991N963025J368767n099169m432492J479744
41878a0247045K646741l401038p692796l601412L512321N084868J538625o42640
41870a2802376L7288o65470l819890m846468j014699M366033P295556P813825
$$ y = [18836294, 16718650, 12686205, 9561323, 7861172, 6230118, 3183955, -1739067, -7608555, -12607870, -15587838, -17086768, -17944256, -17248478, -13374468, -7280972, -2592601, -1272124, -1304391, -560202, -1056215, -6447835, -16047541, -24279876, -26159189, -20981636, -10934368, 705388, 9336068, 10461273, 3663206, -6433518, -14550455, -18630617, -18797138, -15359215, -9808290, -5300053, -3542250, -3005787, -2502210, -4029780, -8669403, -12133911, -9526920, -3563895, -2195128, -7294297, -11726789, -10247045, -7600304, -11001342, -18694138, -22295550, -18783229, -13698361, -12159736, -12802376, -12765088, -13430558, -17250448, -22096916, -23111615, -18745582, -11450026, -3636201]
41862c636201O843069K955417l709570p884388m755878K529553O048991L343398
41854A734391m01678o62993J099526J904976J928076J836694j6285l684722m627963
41845h89978L05693O479920O724337J449044k539257k495217k013467k374782
41837D646293L04745O233380Q103674J707204n986765o508540k623077k885237
41829B991677p077348p270177k243681L01955k277437k474274L779625Q632537
41821e637123M921714j161068K56327O383194O321469j194791o422489m661632
41813a194399k125253l536068m660241j768718Q98938n68257j832324J745861
41805a3040461N447092K229339m627690n207159K233978Q764625P469132J285493
$$ y = [-3636201, 3206868, 6162285, 2452715, -5431673, -10187551, -7657998, -1609007, 1734391, 1332713, 669720, 1769246, 3674222, 5602298, 7438992, 7422707, 3737985, -889978, -584285, 5895635, 12619972, 14069016, 11529759, 9034542, 7021075, 4646293, 4951038, 11184418, 19288092, 20995296, 15008531, 8499991, 5876914, 2991677, -4085671, -11355848, -13599529, -13297574, -15575011, -18049285, -14269660, -5637123, -715409, -1876477, -1620150, 4763044, 11084513, 9889722, 3467233, -1194399, -3319652, -6855720, -11515961, -13284679, -12385741, -12953998, -14786322, -13040461, -7593369, -5364030, -9991720, -15198879, -12964901, -4200276, 3268856, 4554349]
41797D554349l258086l998947k716074j401791j051126j139594L32241L437415
41789e241613M032246o98119n701245l403662M444846P639669J948937m841235
41781a820176m724080k35426J560136k01901j582659j393096r52828L18273K863961
41772f167796L414553k35469l358740o5119O706494Q240982K614312l078962l755119
41763D315136k497863l580800n544193m570214m84656L626215M948306K560359
41755a227710j440764j944344L798051J0183522Q142234k173005r585510o197688
41747d45214K146951M504776q68091o810976q290200o308587k641309K236572
41739a6476078N822412M560208j80893k004987K525721R482699J2869120J0841966
$$ y = [4554349, 1296263, -2702684, -5418758, -6820549, -7871675, -9011269, -8679028, -5241613, -1209367, -1907486, -7608731, -11012393, -6567547, 1072122, 3021059, -1820176, -6544256, -6779682, -5219546, -5421447, -7004106, -8397202, -9350030, -9031757, -6167796, -2753243, -2988712, -6347452, -6412571, 293923, 8534905, 11149217, 8070255, 4315136, 1817273, -1763527, -7307720, -11877934, -12362590, -8736375, -3788069, -1227710, -2668474, -4612818, -814767, 9368755, 17510989, 15337984, 5752474, -445214, 1701737, 6206513, 5338422, -1472554, -9762754, -16071341, -18712650, -16476078, -10653666, -6093458, -6274351, -8279338, -5753617, 3729082, 16598202, 27440168]
41731B7440168M995213k551010q426943p959475l25624P861177Q593451J946073
41723C1573030m313630m860719k438003j967892l380290l677898k832725k713374
41715E388499j827796K940507R011566Q873619J002724n547537k390893O271312
41707B3722001R056460K611514n196556p011301m308270k404902k902296m097066
41699I469584m734589m080408j167380L202456N975757N445749K897694q47522
41691A6161341o850398j3395823j4072535n361682O101392R236814J477744q135397
41683a4838544r624059k734376M347888M903538N45685j696723J748169O583089
41675a0765333O466916J691653j555624m34308R24477j093552l465275j847819
$$ y = [27440168, 32435381, 29884371, 21457428, 13497953, 13172329, 21033506, 29626957, 31573030, 27259400, 22398681, 19960678, 17992786, 14612496, 10934598, 8101873, 5388499, 3560703, 6501210, 15512776, 24386395, 25389119, 19841582, 17450689, 23722001, 32778461, 35389975, 30193419, 23182118, 18873848, 16468946, 13566650, 9469584, 4734995, 654587, -512793, 2689663, 8665420, 14111169, 17008863, 16161341, 9310943, -4084880, -18157415, -23519097, -17417705, -8180891, -6703147, -14838544, -24462603, -27196979, -22849091, -17945553, -17399868, -19096591, -17348422, -10765333, -4298417, -2606764, -4162388, -4596696, -3672219, -4765771, -8231046, -10078865]
41667a0078865J819251K140770j463759m347193l460289j73628L018161M563106
41659g982446L314502m1513j662617J132449M698161K815990m261271r252385
41651a1239130p248083j219348L349635N125038N900331O298844N412104K855581
41643I234972r74652n260374p821209n583529J734252R147982J0034971L223253
41635A3735666m673869n861468n63640K938951m56689m684254j174161O536137
41627E796673N782373n797116j3886616o830258P339707J2427818N958021j499374
41619I291228m030579m645752m239433j4958M668356K324081m549442m586438
41611e782937L587395P204848r8320p120073l153939M977883N070819j147625
$$ y = [-10078865, -8259614, -6118844, -7582603, -11929796, -15390085, -15563713, -12545552, -7982446, -4667944, -4709457, -6372074, -5239625, -541464, 2274526, -1986745, -11239130, -18487213, -19706561, -16356926, -11231888, -5331557, 967287, 6379391, 9234972, 8260320, 2999946, -4821263, -10404792, -8670540, 477442, 10512413, 13735666, 9061797, 3200329, 2636689, 5575640, 5118951, 434697, -739464, 5796673, 11579046, 5781930, -8104686, -14934944, -7595237, 4832581, 10790602, 9291228, 5260649, 614897, -3624536, -3639494, 1028862, 3352943, -1196499, -5782937, -2195542, 5009306, 4910986, -2209087, -5363026, -385143, 4685676, 3538051]
41603C538051l389461k90487J331849r6958n27556k41138k819538o250101n366025
41594a4111364j226729J559186M134184R503935J2239540M597076p999446j0922899
41586b226517j390451P140478M957401j563114k847964n51955j658229n949774
41578d090125p185201k420173N454808J1308219J0669364K948317n849551p949232
41570B886426l043521K006309L210070K690223J304545l368089r194809q780339
41562a2289185r86917N268174L903235J93651N33539K044815p5516k447103J85345
41553c669962M435333L658388m41689j129173J537442J728578j045714j126493
41545C946710L022254N749437K607604l998039q390980o872988j02145O290709
$$ y = [3538051, 148590, -141897, 1189952, 1092994, 565438, 324300, -2495238, -8745339, -14111364, -15338093, -13778907, -9644723, -140788, 12098752, 16695828, 8696382, -2226517, -3616968, 3523510, 8480911, 6917797, 4069833, 3517878, 1859649, -4090125, -11275326, -13695499, -8240691, 3067528, 13736892, 16685209, 10835658, 2886426, -157095, 1849214, 5059284, 7749507, 9054052, 5685963, -3508846, -12289185, -13276102, -8007928, -4104693, -3911042, -3377503, -1332688, -1408204, -3855307, -3669962, 765371, 4423759, 3982070, 2852897, 4390339, 6118917, 5073203, 3946710, 6968964, 12718401, 15326005, 11327966, 2936986, -3936002, -4038147, 2252562]
41537B252562N609179j708015p085253m995150k84119R37980J395489N648113
41529A770786R207910N527886n57849R76328P920975Q159843m65761o561987m052457
41520B1925674j029354m592700r166876p205750j472397J398990J557236K251427
41512C666250K205816o33372l255260k511505q56733q10067Q56058O507658J0542949
41503A5711794O687004j705435o283623n261296l037329j491213O80360K330934
41495G631196J066823j484852k148757j981090l215194l148384J446336O144170
41487D310248L650446m236830q029952l968858K209801N454082O900932P649560
41479A3939429N410749M13637k520919j355379k43661k253020m360718l164181
$$ y = [2252562, 7861741, 6153726, -931527, -5926677, -6210796, -5272816, -3877327, 1770786, 10978696, 16506582, 15948733, 16925061, 24846036, 33005879, 32540118, 25978131, 21925674, 20896320, 16303620, 7136744, -69006, -1541403, -142413, 1414823, 3666250, 5872066, 5238694, 1983434, -528071, -1384804, -2194871, -1338813, 5168845, 15711794, 22398798, 20693363, 14409740, 9148444, 6111115, 4619902, 5300262, 7631196, 8698019, 7213167, 5064410, 3083320, -131874, -3280258, -1833922, 4310248, 7960694, 3723864, -4306088, -8274946, -6065145, -611063, 6289869, 13939429, 19350178, 19763815, 17242896, 15887517, 15643856, 13390836, 9030118, 5865937]
41471E865937l23794J224500J624134J270404j401824n495316n859904k41077
41463c336940N856472O120781J789385j515474j978548j537770l42638L054583
41455H109851P096768P818424M019090j575235n793611o889739m344769q5807
41447H354972J506588j546508n092078l753840J418776M419816K917672P48037
41439H973435J166292K199527P47699k219444l389206k003630l48117k53634j323399
41430C549523k416320k989104k443670L06423N042568Q544709O980476R69490
41422A7544095l959830m129363k773316m718605p762304n098308L379408Q946734
41414A428511O087451L51373o40720J508743L95178l571762m209477l99945K583096
$$ y = [5865937, 5542143, 6766643, 8390777, 9661181, 8259357, 2764041, -3095863, -3336940, 2519532, 8640313, 10429698, 8914224, 6935676, 5397906, 5055268, 8109851, 15206619, 23025043, 27044133, 25468898, 19675287, 12785548, 8440779, 8354972, 9861560, 8315052, 3222974, -530866, 887910, 5307726, 8225398, 8973435, 10139727, 12339254, 13086953, 10867509, 7478303, 5474673, 5126556, 4872922, 3549523, 1133203, -1855901, -4299571, -3993148, 1049420, 9594129, 16574605, 17544095, 13584265, 9454902, 6681586, 1962981, -5799323, -10897631, -7518223, 1428511, 7515962, 7867335, 7226615, 8735358, 9130536, 5558774, 1349297, 949352, 3532448]
41405C532448K565793L004385M724683L508119j078054k580389J691608M259411
41397A9628004j380040r069891q227040l13788K887701k786032p633359l027481
41389i921926N755077P771959K077069k386343m45271L346693L442338J513357
41381A1152953K265825N224266N696099K395803p93652j054642l67744j358214
41373B3160694l012206l297830l343835n350568p811649o826871k002482K684917
41365e799830M563555N350901P106850Q115443N270924j016506o595195p796775
41357I199367m607789l5002K870691L517182L297446K486636p09705o053698q266671
41348A698457k583075O996435J0518482M860081j822686j778908J616904K81554
$$ y = [3532448, 6098241, 9102626, 13827309, 17335428, 16257374, 13676985, 15368593, 19628004, 18247964, 9178073, 951033, 637245, 3524946, 738914, -6894445, -9921926, -4166849, 3605110, 5682179, 3295836, 2850565, 6197258, 9639596, 11152953, 13418778, 18643044, 24339143, 26734946, 25941294, 24886652, 24518908, 23160694, 20148488, 16850658, 13506823, 8156255, 344606, -6482265, -8484747, -5799830, -1236275, 4114626, 11221476, 19336919, 24607843, 23591337, 16996142, 9199367, 4591578, 4556576, 7427267, 10944449, 14241895, 16728531, 16018826, 9965128, 1698457, -884618, 6111817, 16630299, 21490380, 19667694, 17888786, 19505690, 19787244]
41340A9787244n686111q755995n590362l33718L443317O444552P991974M374747
41332B1675648l666688q364312m769957J732242L027713o56718l063768k002288
41324C911872n21243j3682P58308M38722l687715q389637n942258M343048J2734171
41315C631586J1274270L573142k416515n727018r662708j2206659q172577L43126
41307a9363353M846871L193520L029833R059405J4408782J0416565l91585p901211
41299A7298827p771539m370939k037037m48263R93526O02959j745549l106134
41291e84149k233780j967170m273178o305531m414406N52785N140735Q400273
41283e684421J1517820J3434390J0744217K746731n923257r237231n765936j96004
$$ y = [19787244, 14101133, 5345138, -245224, -578942, 2864375, 9308927, 17300901, 21675648, 18008960, 9644648, 4874691, 6606933, 9634646, 8977928, 5914160, 3911872, 3390629, 3376947, 4135255, 4573977, 886262, -7503375, -13445633, -9102585, 3631586, 14905856, 18478998, 16062483, 10335465, 672757, -11533902, -19706479, -19363353, -14516482, -11322962, -8293129, 766276, 15175058, 25591623, 25200038, 17298827, 9527288, 5156349, 3119312, 2671049, 3664575, 4267534, 2521985, -584149, -2817929, -4785099, -9058277, -15363808, -19778214, -19225429, -14084694, -5684421, 5833399, 19267789, 30012006, 32758737, 26835480, 17598249, 11832313, 11636309]
41275A1636309J195356l021197p628635o538826l56374L913737J568436l905194
41267c136388n747733k601441Q91218J086062o36423j043531R10421M168344P070912
41258I61441P450220L618106k649850n773046j745140O380236J0737805P033268
41250B6013040j115268p243967r495543j0428203j0367497n418128N507212J5223587
41242B675233J4882610N362073l115003l794456o81299m37405k295281j299608
41234A1296864J984785K053175j936146m020147n57938M127909M175379M6959
41226A7170840l409551l696714k040640l00609J38333j900483n444889o460321
41218e944034k267134L894559O072559L062347o81491j688004j428889k525641
$$ y = [11636309, 12831665, 9810468, 2181833, -4356993, -4713367, -799630, 768806, -3136388, -8884121, -11485562, -10594344, -9508282, -10144705, -11188236, -10277815, -6109471, 961441, 8411661, 12029767, 9379917, 3606871, 1861731, 8241967, 18979772, 26013040, 24897772, 17653805, 8158262, -2269941, -12637438, -18055566, -12548354, 2675233, 17557843, 22919916, 19804913, 16010457, 15329158, 14891753, 12596472, 11296864, 13281649, 15334824, 13398678, 9378531, 8820593, 12948502, 17123881, 17170840, 13761289, 10064575, 8023935, 7723326, 7861659, 5961176, 516287, -5944034, -8211168, -4316609, 1755950, 4818297, 4136806, 2448802, 1019913, -1505728]
41210a505728m228030l815619n06377M068952P913786R426424P449110K637764
41202B1440282j981545l779156l401220l197533l473974k540922j48772J827471
41194D744631K500935K933321K966596J97502n626144r816532p721863j071839
41186a0893393M135271N300657N038146N494542N124179K390200r99502k626602
41178A2963498k425053j377004K28744J396550J61310k925983l876689o77977
41170C467396L025607K942560K78131j022504q90488k298011n249150o587326
41162f333785n225526k867615m779L769988N705001K036716m773108o760773o67566
41153a5121447P489637J0413450P391779J729436m429381q910218p849839m13269
$$ y = [-1505728, -5733758, -9549377, -10055754, -5986802, 1926984, 11353408, 18802518, 21440282, 19458737, 15679581, 12278361, 9080828, 5606854, 3065932, 2917160, 4744631, 7245566, 10178887, 13145483, 13342985, 7716841, -2099691, -9821554, -10893393, -6758122, -1457465, 3580681, 9075223, 14199402, 16589602, 15590100, 12963498, 10538445, 9161441, 9390185, 10786735, 10948045, 8022062, 4145373, 3467396, 6493003, 9435563, 9713694, 8691190, 7800702, 5502691, 253541, -6333785, -11559311, -14426926, -14431705, -10661717, -4956716, -2920000, -7693108, -14453881, -15121447, -7631810, 2781640, 10173419, 11902855, 7473474, -1436744, -9286583, -9699852]
41145i699852P533613R088175M031873k366396n947825n754606k304237K079045
41137c340210L328887J83301l045448k051821J144373J624383p90078k202208
41129e148821j380114n66620m06942O28878K021779J604405L45103J571616M768597
41120C437881N234533J253782k953115l102416J95985L737728N306149L812987
41112A6923514l64090m033379l917727j600871j613470l926151l620598L99878
41104a752894K339167j678784p149334p717969l608466R21422M212622O185518
41096h248718M741186n58552m155203q12627N257978M832182k791412p849203
41088i584369l424780N574534R787715O777796J271333k301666l168753k085638
$$ y = [-9699852, -2166239, 6921936, 10953809, 8587413, 2639588, -3115018, -5419255, -3340210, -11323, 171978, -2873470, -4925291, -3780918, -2156535, -2946613, -5148821, -6528935, -7095555, -7502497, -6873619, -4851840, -3247435, -2902332, -1330716, 3437881, 8672414, 9926196, 6973081, 3870665, 4066650, 7804378, 13110527, 16923514, 16559424, 12526045, 8608318, 7007447, 5393977, 1467826, -2152772, -1752894, 586273, -1092511, -8241845, -15959814, -19568280, -18646858, -14434236, -8248718, -3507532, -4066084, -8221287, -9033914, -3775936, 1056246, -1735166, -9584369, -13009149, -7434615, 2353100, 9130896, 10402229, 8100563, 4931810, 2846172]
41080B846172j9113J270953K37991k459208m554393m697742l093829q6671M057913
41071f497927P781780Q522872N556540J554156j33888M81615J00538l404979p871982
41062F088725r129198n623424J98745M480630M923136J926846j849131l489281
41054b472952k550897j198856p24417L57846K806324L522622k97007n283347n100952
41045a0941636M86450M932840M216299J453919M63708M63098J48760J234349L598483
41036F056270K499356l567168p167430j437950Q243651J0471233L862455j976564
41028A6983853j460490J50711k830984p593143q614536o141642l959552l013806
41020a6479589j782617P2680K140661M686918O694410N455635J083741j758733
$$ y = [2846172, 2827059, 4098012, 4336003, 1876795, -2677598, -7375340, -10469169, -10555840, -6497927, 1283853, 9806725, 15363265, 16917421, 16783533, 17265148, 17365686, 13960707, 6088725, -3040473, -8663897, -8465152, -3984522, 938614, 2865460, 1016329, -2472952, -5023849, -6222705, -6947122, -6589276, -3782952, -260330, -557337, -5840684, -10941636, -10455186, -5522346, -1306047, 147872, 611580, 1074678, 1223438, 2457787, 6056270, 8555626, 4988458, -2178972, -3616922, 4626729, 15097962, 18960417, 16983853, 15523363, 15674074, 12843090, 5249947, -3364589, -9506231, -13465783, -16479589, -18262206, -18189526, -16048865, -11361947, -4667537, 788098, 1871839, 113106]
41012A13106l296L016809K663418K1692n76599J179025J736952K1039j245438
41003F926708n35606M38718L81506N79561K265204M401638N223740M247559K123072
40994B6052100j57486j825084l313297n986359r233504r165138l235458M508567
40986b355659O748335K172597k510007j727961J584668J308733j975959j739630
40978A505117M028596Q583751N403042k422575o167279l121043P43790q857l510147
40969E034395n234475m751196l766852j098192M551120Q659411M836650m469712
40961C761149q168956q27961Q734635Q217416k317309j1115104r787529k017141
40953a3520800L354229L097345R85655J191061L505083M968134M013236J523094
$$ y = [113106, 109810, 3126619, 5790037, 5811729, 5235130, 6414155, 8151107, 8172146, 6926708, 6391102, 6829820, 7211326, 7790887, 10056091, 14457729, 19681469, 23929028, 26052100, 25894614, 24069530, 20756233, 14769874, 5536370, -3628768, -6864226, -2355659, 4392676, 6565273, 4055266, 2327305, 3911973, 5220706, 3244747, 1505117, 5533713, 14117464, 19520506, 17097931, 10930652, 7809609, 8553399, 8544542, 5034395, -200080, -4951276, -8718128, -9816320, -5265200, 3394211, 8230861, 3761149, -4407807, -5235768, 3498867, 11716283, 9398974, -1716130, -11503659, -13520800, -10166571, -7069226, -6083571, -4892510, -1387427, 3580707, 7593943, 9117037]
40945I117037j515283n095114p939275o701156l63258O177882O936683K593247
40937C210763j077334k110507l713621n959175l718115L506507P163004J425164
40929a273314o497699n755156K493575P502515M582269p39667l222844l267623
40921f177944j273720L921195Q784591O397936k121260n880464P53931Q703599
40913A3107864O533675l439453r158747n346239J897782N449441M683446K319401
40905A6047170J7611j062343L07418L145510L928955M33371n177281q134360n800088
40896C705963p03176J471284j796870n888576l938836M028923J0357874R445340
40888A6681926M272988Q93775M05111N9112j028538j821654k692371m237043m417113
$$ y = [9117037, 7601754, 2506640, -5432635, -12133791, -12497049, -6319167, 617516, 3210763, 2133429, 22922, -3690699, -9649874, -13367989, -9861482, -2698478, -1273314, -7771013, -13526169, -11032594, -3530079, 1052190, 312523, -2910321, -6177944, -7451664, -3530469, 5254122, 11652058, 9530798, 3650334, 4404265, 13107864, 19641539, 16202086, 7043339, 1697100, 3594882, 9044323, 13727769, 16047170, 16064781, 15002438, 15309856, 18455366, 22384321, 22817692, 17640411, 9506051, 3705963, 3002787, 4474071, 2677201, -3211375, -7150211, -3121288, 7236586, 16681926, 20954914, 21848689, 22253800, 22312912, 21284374, 19462720, 16770349, 12533306, 8116193]
40879H116193j285393K741435L594130J396934m60119p14623l81385Q81654L533736
40870A7422562M700054J730988j753230Q4582N422456O252547O43453m354098
40862C0149314m492058m768732r462837j3366855r953125k686180m9263k635316
40854a7265052l505712Q9338L590961M074298M634530P666698J0091093Q553864
40846A7930018M679426J723587k93873k656545m266789l691425k622825l360498
40838G441076m346276k289084J978809M006540K362650O35504J530221K892226
40830A4211666K028775N47953J170609K070464p88324o203423p687229k338681
40822C011810M404505N585659J347103k455143k296107j92317K90182j875110
$$ y = [8116193, 6830800, 9572235, 13166365, 14563299, 14103180, 13388557, 13007172, 13888826, 17422562, 22122616, 23853604, 22100374, 22184956, 27607412, 33859959, 34503412, 30149314, 25657256, 20888524, 11425687, -1941168, -11894293, -14580473, -14629736, -17265052, -20770764, -20681426, -17090465, -13016167, -8381637, -714939, 9376154, 17930018, 22609444, 24333031, 24039158, 21382613, 17115824, 13424399, 10801574, 7441076, 3094800, 805716, 2784525, 6791065, 9153715, 9789219, 11319440, 14211666, 16240441, 16788394, 17959003, 20029467, 19241143, 13037720, 5350491, 3011810, 7416315, 13001974, 14349077, 11893934, 9597827, 9405510, 9695692, 7820582]
40814G820582m999643o253537l552550K168718P004264Q240301P448793P125257
40806B5002185N942057J296601m380867n214655p32819K282341n04334m288399
40798A9402110k492866K805335L645941j936947o887141n213564j84775O93306
40790I831399l959879q034969o531202j907831M8861j367524r72495M211311R461817
40781G79488P972524K84276n867743n278219r28084J571072J520033J975582L323839
40772E352768K147667l239088r066706r552830l387883M171927O178172J203190
40764f192783m883378n248948M35951O418691Q064975O067518L428448J421511
40756I511985j10623j031358j360660j841887k751485l440735l419766k087170
$$ y = [7820582, 2820939, -3432598, -6985148, -4816430, 2187834, 10428135, 17876928, 25002185, 30944242, 32240843, 27859976, 22645321, 21912502, 24194843, 23690509, 19402110, 16909244, 19714579, 23360520, 21423573, 14536432, 9322868, 9138093, 9831399, 5871520, -2163449, -8694651, -10602482, -10553621, -11921145, -12893640, -8682329, 779488, 8752012, 9036288, 3168545, -2109674, -3037758, -1466686, 53347, 2028929, 5352768, 7500435, 4261347, -4805359, -14358189, -17746072, -13574145, -7395973, -6192783, -11076161, -16325109, -15889158, -9470467, -1405492, 4662026, 8090474, 9511985, 9401362, 8370004, 7009344, 5167457, 2415972, -1024763, -4444529, -6531699]
40748f531699K048642Q493800J1691320O280332l576866o727016O3546O620531
40740A8362590L936006k525971j921577M790649O840748O20139n869700o242646
40732A7990238l771893l448145m168757l015482j156764j059355k090944k399354
40724c120456j749126j92190K464302M282044K495024j516923l420174l099844
40716c857343m430708o405860k531285P256397J2642131P220175q67728p79335
40708H246444M818283N206449j120414n635335m308742j890882j372671K48668
40700D191800L462455L228825j663778m595949j299537L133045K876544O22168
40692I955573J701745M168797K356193k945426n809980n179717n532755p274692
$$ y = [-6531699, -4483057, 4010743, 15702063, 21982395, 18405529, 11678513, 11742059, 18362590, 22298596, 19772625, 17851048, 22641697, 29482445, 30102584, 24232884, 17990238, 14218345, 10770200, 6601443, 3585961, 2429197, 1369842, -721102, -3120456, -4869582, -5061772, -2597470, 1684574, 4179598, 2662675, -757499, -3857343, -8288051, -14693911, -17225196, -9968799, 2673332, 9893507, 9025779, 8246444, 13064727, 18271176, 17150762, 11515427, 7206685, 5315803, 3943132, 4191800, 7654255, 10883080, 9219302, 4623353, 3323816, 6456861, 9333405, 9955573, 11657318, 15826115, 18182308, 15236882, 9426902, 4247185, -1285570, -8560262]
40684h560262m648535L803756R849109O238811j974749l989093Q81283K161981
40676C762301n325843j2047361o752722O387419J2363374N831660k219438q17099
40668A182291O486911R240498N635517K130040J175095j234676o091039q421887
40660A0102750o043027l727332n007245o125917k903448J396000Q41214l621808
40652a5088813n309058j312008M192587O167712M304537J781415J217675K566303
40644a479650L505025J965086q85481j540471P15770K007083k56266k416327J49406
40635A764175M583315L401871l702075p282960p24608R483375J1345785K820810
40627B1689688o175763p156434k681523j23771n81574P31672M729812N345399
$$ y = [-8560262, -13208797, -9405041, 444068, 6682879, 4708130, 719037, 1600320, 3762301, -1563542, -13610903, -20363625, -13976206, -1612832, 4218828, 1999390, 1182291, 7669202, 16909700, 22545217, 24675257, 25850352, 24615676, 18524637, 10102750, 4059723, 332391, -4674854, -10800771, -13704219, -12308219, -11467005, -15088813, -20397871, -21709879, -17517292, -11349580, -7045043, -5263628, -4045953, -1479650, 2025375, 3990461, 3104980, 1564509, 2280279, 4287362, 4031096, 1614769, 1764175, 6347490, 9749361, 6047286, -1235674, -1960282, 7523093, 18868878, 21689688, 15513925, 8357491, 5675968, 5552197, 4970623, 5702295, 10432107, 15777506]
40619A5777506j603797j0834291j3110036o497211K082416N890773M524873O29097
40611c140670m361343q409847p183423R07075R949053J1920571O590382J407541
40603G679339J009784J828733o98952m343967l971512l02282R37980j760607l068724
40594b690208N69996M571783K652603l255390m927835O64058P000972O869855
40586A1455834J363004k987845l027665j069964J33831L93018M11049P61911K669322
40577A0102495O373163Q391947M339644m191842r479885o954711j384341k96633
40569F899837l575238m105501J670848Q281883Q052000Q27497n617257m515928
40561G918141K290479O747648M237233r41147j316725L816304P510762M597577
$$ y = [15777506, 14173709, 3339418, -9770618, -16267829, -14185413, -8294640, -3769767, -3140670, -7502013, -15911860, -23095283, -22188208, -12239155, -318584, 6271798, 7679339, 8689123, 10517856, 9818904, 5474937, 1503425, 1201143, 2139123, 378516, -2690208, -2120212, 2451571, 5104174, 1848784, -3079051, -2414993, 4585979, 11455834, 12818838, 9830993, 6803328, 5733364, 5867195, 6260213, 6671262, 7433173, 10102495, 16475658, 24867605, 29207249, 25015407, 15535522, 8580811, 7196470, 6899837, 3324599, -780902, 889946, 9171829, 17223829, 18051326, 12434069, 7918141, 10208620, 16956268, 21193501, 20252354, 18935629, 22751933, 30262695, 34860272]
40553C4860272j877137n917745o749001p596614q418541n293791K386462Q803007
40545A0196912Q196776J798667m071807n177988k517183O05481K444793L734670
40537A5210321O030971R376657J1258231Q478357R53025o745332q889649m142982
40529C1529599K916677O191986L624628j890830o302860p821463o734110l846560
40521A7667067m61382J457805J116971K82608Q41220J513175m16817m128455n153977
40512A2718215j301810M071108O326669M803889K124288M17796J60327Q53261
40504C0173743R64760r46271l356150k440988K223772N418355K880253k243893
40496C2673581l310788J217879O969947R963752R516440N952054k6178n861005
$$ y = [34860272, 32983135, 27065390, 20316389, 12719775, 4301234, -992557, 1393905, 10196912, 18393688, 20192355, 16120548, 10942560, 8425377, 9030858, 11475651, 15210321, 21241292, 30617949, 41876180, 50354537, 51307562, 44562230, 35672581, 31529599, 34446276, 40638262, 44262890, 42372060, 36069200, 28247737, 21513627, 17667067, 17205685, 18663490, 19780461, 20063069, 20904289, 22417464, 22000647, 17872192, 12718215, 11416405, 15487513, 21814182, 26618071, 28742359, 29160155, 29320482, 30173743, 31138503, 30192232, 26836082, 24395094, 26618866, 32037221, 34917474, 32673581, 29362793, 30580672, 37550619, 47514371, 57030811, 62982865, 62956687, 57095682]
40488E7095682r014005j0110559j0694472r087323l301863K914399L197162j687932
40480A9311089l633951J271373P002829O529602J283219k242781j282448J936873
40472C0175805M689006N667316M569315K735245K213598K325381K02879l452279
40464D9126266l511813J667930O165846M735620Q92904J244969N122061O294053
40456G1737836L034442j55316k66759Q80682J274875J249946P46568j042230k444331
40447G5015713m02072M012275N540298J882015k762732l087582J296589O643246
40439H8137750R216512P430377K318931k792368m680383k832691J277876O101193
40431A04177197R048753O276853j976848p728587l197491P832108J3370060Q903778
$$ y = [57095682, 48081677, 37971118, 27276646, 18189323, 14887460, 17801859, 20999021, 19311089, 15677138, 16948511, 23951340, 30480942, 31764161, 29521380, 28238932, 30175805, 34864811, 40532127, 45101442, 47836687, 50050285, 52375666, 52578545, 49126266, 45614453, 47282383, 53448229, 58183849, 59076753, 60321722, 65443783, 71737836, 74772278, 74616962, 74350203, 75230885, 76505760, 77755706, 78502274, 77460044, 75015713, 74613641, 78625916, 84166214, 86048229, 83285497, 80197915, 81494504, 88137750, 97354262, 104784639, 107103570, 104311202, 99630819, 96798128, 98076004, 104177197, 113225950, 119502803, 117525955, 109797368, 106599877, 114431985, 127802045, 136705823]
40423A36705823K468480J737076L981961L746529L215497P339931J3368800J3972899
40415A86536996R012349N955839Q301754J0964033R141137N545443N340016Q258691
40407B49056258R882432Q306512N525017L050084j61712m602183p657012o237177
40399B57162219j090832L664926N553483O133390P292805P603152N074668J782020
40391B93175831J795192M948998O915732N883377M606666M598585L330270j75581
40383C25079070j907369Q34018L663905P61501o265537j0366073q450217m000987
40375B99348311j165836p75439j940263l607154m494909m509179n567192q334131
40367B68954208r992074q722441p837411j0572334j3290559j0376688m343276
$$ y = [136705823, 139174303, 140911379, 144893340, 148639869, 151855366, 159195297, 172564097, 186536996, 195549345, 201505184, 209806938, 220770971, 229912108, 235457551, 240797567, 249056258, 258938690, 267245202, 272770219, 275820303, 275658591, 271056408, 263399396, 257162219, 256071387, 259736313, 265289796, 271423186, 278715991, 286319143, 291393811, 293175831, 294971023, 299920021, 306835753, 312719130, 317325796, 321924381, 325254651, 325079070, 323171701, 324005719, 327669624, 328431125, 322165588, 311799515, 303349298, 299348311, 298182475, 297407036, 295466773, 291859619, 287364710, 282855531, 277288339, 268954208, 258962134, 250239693, 242402282, 231829948, 218539389, 208162701, 203819425]
40360B03819425l286346q153661j0868460p198326l394458n960455j1669270j3141980
40352A40146469r362017n082369l186339k673997j987695m10601J961598L111372
40344A22516421P41617l016387k786253J520409K624993l542864j0490767r878430
40336I7688739k938713L033986N338042N887214M379073j86637l643223j265716
40328A08292765K911031M93004p687767j1789872p787666k376195o30630J160736
40320H2585406N640617O890570J46219q166635q622754k429828J463842m452j468462
40311G6034523R29039M643238O239765N497408K846154j863874o236064n669622
40303H2420567L58705N501801L157109n486281j2417141j1427640m106482K864121
$$ y = [203819425, 200533079, 192379418, 181510958, 174312632, 170918174, 164957719, 153288449, 140146469, 130784452, 125702083, 122515744, 119841747, 117854052, 117443451, 119405049, 122516421, 123258038, 120241651, 117455398, 118975807, 121600800, 118057936, 107567169, 97688739, 94750026, 97784012, 103122054, 109009268, 113388341, 113201704, 109558481, 108292765, 111203796, 111696800, 104009033, 92219161, 84431495, 82055300, 81424670, 82585406, 88226023, 95116593, 95262812, 87096177, 78473423, 76043595, 77507437, 77502985, 76034523, 76963562, 81606800, 87846565, 93343973, 96190127, 94326253, 88090189, 82420567, 82779272, 88281073, 91438182, 85951901, 73534760, 62107120, 58000638, 60864759]
40295F0864759M912630K886759j22803k755126m770800m781784j882123J335281
40287E5686793J173221j650039k755654j019278m34210l444651o639694n716341
40279C5200147j372353K360414K819081j80431m556000n595274J72389Q470624
40271C7318597R985893K902471l277769j197468L551424J996635l817776n253458
40263D2208549j790037p53703m130897o327198n043301l929064l249242J416619
40255A8401726Q366188Q323298j187353r414961o846637J708698N736108M039663
40247B9126730K813599L572252K198238j962371m332005k639859j3677M48903
40239B9211810j84106Q31740L779340N559458K496459m671026r000698m388766
$$ y = [60864759, 65777389, 68664148, 68541345, 65786219, 61015419, 56233635, 54351512, 55686793, 56860014, 55209975, 52454321, 51435043, 51000833, 47556182, 40916488, 35200147, 33827794, 36188208, 39007289, 38826858, 34270858, 28675584, 28847973, 37318597, 47304490, 50206961, 46929192, 45731724, 49283148, 51279783, 47462007, 42208549, 40418512, 39664809, 35533912, 29206714, 24163413, 20234349, 16985107, 18401726, 26767914, 35091212, 33903859, 24488898, 17642261, 19350959, 25087067, 29126730, 31940329, 35512581, 37710819, 35748448, 31416443, 28776584, 28762907, 29211810, 29027704, 29859444, 33638784, 39198242, 41694701, 37023675, 28022977, 23634211]
40231B3634211N071017Q358703K235425m047058k801387P78196j645620p082007
40223B4501480o323244L80139L723495L44855l324777l169765k970277m933920
40215H227986m369516J063430M965896J843806k944972o76418O987995R813381
40207B4911588L464375n206425q366954o466254m415099l202048j02309M493751
40199E110625N656407Q92891m916891m841575J153088O015241M366840j804762
40191A1631864o848062p418733l397497L529139R748034J1254555Q148567M971373
40183C1619240M065336K108422l363876q138594p280877l555571l361777o283270
40175E809033n854612j65266N446273O854330N521342L201880r43381n650444
$$ y = [23634211, 28705228, 37063931, 39299356, 35252298, 32450911, 33229107, 31583487, 24501480, 18178236, 18558375, 22281870, 22626725, 19301948, 16132183, 13161906, 8227986, 3858470, 4921900, 9887796, 11731602, 8786630, 8110212, 15098207, 24911588, 28375963, 23169538, 14802584, 8336330, 3921231, 719183, 616874, 5110625, 10767032, 11659923, 6743032, 1901457, 3054545, 9069786, 13436626, 11631864, 4783802, -2634931, -6032428, -2503289, 7244745, 18499300, 26647867, 31619240, 35684576, 37792998, 34429122, 26290528, 19009651, 15454080, 12092303, 5809033, -45579, -210845, 5235428, 12089758, 17611100, 20812980, 19869599, 14219155]
40167A4219155o284084j600460L346289M400107L799861N010833O374140M090408
40159C3356249j464946o230468p295385m663392m01423J983200J12274l311030
40151A2085079k389183L713874P958195M249261l863743p396329l305994K156888
40143A3208048J434559n460519j0869049q022116O92916N897756L074743j062569
40135a106231J744404Q551853R387321K660385k692797j417287J391588R68585
40127A9487821N02872K772205L191512j714634o698316o513362n116564p437768
40119a526234q792497k856519N437798O609700K105088N49420J326237m005140
40111a152147j3871840j5022789k682332J0409465J1410855L607351j843806j846648
$$ y = [14219155, 7935071, 6334611, 9680900, 14081007, 17880868, 22891701, 29265841, 33356249, 31891303, 25660835, 18365450, 13702058, 13300635, 15283835, 15396109, 12085079, 9695896, 13409770, 21367965, 25617226, 21753483, 14357154, 11051160, 13208048, 14642607, 9182088, -1686961, -9709077, -9016161, -3118405, -43662, -1106231, 638173, 9190026, 18577347, 21237732, 18544935, 17127648, 18519236, 19487821, 19990693, 22762898, 25954410, 24239776, 17541460, 11028098, 5911534, -1526234, -10318731, -13175250, -7737452, -1127752, 977336, 1526756, 2852993, -1152147, -15023987, -30046776, -32729108, -22319643, -10908788, -7301437, -9145243, -10991891]
40103a0991891q56970n68347J283721M719189O911610O448140L771798q56861
40095I860389o277503r283404p626582k433697M104968J0477076J3655246R625510
40087B2102003n18207q747039q432865k039233K877329K880327N13911q59246
40079G776980o36186n17274k528360o163648p020835j563544O111805P354242
40071B813180Q60184m437868k100608K522684J611010k309769j178335M636441
40063B416919O739904K110618l226653m894807n638000p317842n691322J847668
40055a3653515R625067J0741843O428308K426515m60232n337631j0588624r947918
40047a0766187k283456N140550N919989K114219o99081j631462l184040m842741
$$ y = [-10991891, -11848861, -12417208, -11133487, -6414298, 497312, 6945452, 10717250, 9860389, 3582886, -5700518, -13327100, -15760797, -11655829, -1178753, 12476493, 22102003, 21583796, 12836757, 4403892, 2364659, 5241988, 8122315, 8636226, 7776980, 7140794, 6623520, 4095160, -2068488, -9089323, -10652867, -4541062, 2813180, 3673364, -764504, -2865112, -342428, 1268582, -1041187, -2219522, 2416919, 9156823, 11267441, 8040788, 3145981, -2492019, -9809861, -15501183, -13653515, -4028448, 6713395, 13141703, 15568218, 15107986, 9770355, -818269, -10766187, -13049643, -7909093, -1989104, 125115, -573966, -2205428, -5389468, -10232209]
40039a0232209l624958K4927K265730J920950J550172J868827L70045k974805
40031h831321m123614j677552K63690m68132M62452N829012R634045N183785l576977
40022B695388p091826m091496j593353k233337j226836L371433O822085O175865
40014B827923L842477M21334o642634j3949914j2038332j13138Q876609N527062
40006a1248613k422922k849079K495704L739159O18616J195525N954423O803203
39998D286016J906596j228132M67100N69601m182244o828504j596020O199539
39990d06048Q297542M911517J276929j806594o661733j1459970j1457103o135918
39982b3441378M72863N583762Q926149R309400N223669q69499l593197j480002
$$ y = [-10232209, -13857167, -13832240, -11566510, -9645560, -8095388, -6226561, -5856516, -8831321, -12954935, -14632487, -14368797, -14836929, -14374477, -8545465, 1088580, 6272365, 2695388, -4396438, -8487934, -10081287, -12314624, -13541460, -10170027, -3347942, 2827923, 6670400, 7091734, 449100, -13500814, -25539146, -25652284, -16775675, -11248613, -13671535, -16520614, -14024910, -10285751, -9667135, -8471610, -2517187, 4286016, 6192612, 4964480, 5431580, 6001181, 1818937, -5009567, -6605587, -406048, 7891494, 12803011, 14079940, 12273346, 5611613, -5848357, -17305460, -23441378, -22968515, -17384753, -8458604, 850796, 6074465, 5204966, 1611769, 131767]
39974A31767O98797j735267p135455r690674o413146P5525N233296P068227O356324
39965e410606M058752M32079l471736n434639m249297j103393K138894M821305
39957h218641O650634O596150M434035K102414J339280Q92118j520498n006097
39949G269395n858887k377812K674479M955716K798376j358575l062781j85200
39941D854711M057571L969532j567835p060135p221831l261348K38439J828889
39933d162007K790293K784587Q32633q95760N16096L278499K994178k12060k020495
39924E905964j282545j241632k723825k175418J686555M791084L766813M73534
39916I200530j775110k226448j083122J472469K816300l18249n272115m498031
$$ y = [131767, 830564, -904703, -8040158, -17730832, -24143978, -24068453, -18835157, -11766930, -5410606, -1351854, -919775, -4391511, -9826150, -14075447, -15178840, -13039946, -8218641, -1568007, 5028143, 9462178, 11564592, 12903872, 13795990, 12275492, 7269395, 1410508, -967304, 1707175, 6662891, 9461267, 8102692, 5039911, 4854711, 8912282, 12881814, 11313979, 4253844, -2967987, -6229335, -5990896, -4162007, -1371714, 1412873, 2245506, 1349746, 1865842, 5144341, 8138519, 7926459, 5905964, 4623419, 3381787, 657962, -1517456, 169099, 4960183, 8726996, 9200530, 7425420, 5198972, 4115850, 5588319, 8404619, 8086370, 2814255, -1683776]
39908a683776L449588R755091O734698j722795o309321m396603k89699K646599
39900H183782L739353J927074k316184l965999Q10769O886263M969079n499882
39892A4734255j4345980j2788950k660223P607904J1535792P683464j251026r591819
39884I23417j1587950n870203L393189J0122329J0504620N002177j606786l590523
39876G290270n67136J060138l342589q457760n094664N799090J2164972O449790
39868A5302111m075344p448048k717733J258334M87576J124718Q082734J5277860
39860B7292208J2979882J765207p453634p430944k550530n30114j847444k271398
39852A9953233j716216l594779o971292o891719l096856j086860k514086j909383
$$ y = [-1683776, 1765812, 11520903, 18255601, 16532806, 10223485, 5826882, 5537183, 8183782, 11923135, 13850209, 11534025, 7568026, 8378795, 15265058, 20234137, 14734255, 388275, -12400675, -15060898, -7452994, 4082798, 11766262, 10515236, 923417, -10664533, -16534736, -13141547, -3019218, 7485402, 12487579, 10880793, 7290270, 6723134, 7783272, 4440683, -4017077, -9111741, -3312651, 8852321, 15302111, 11226767, 3778719, 1060986, 2319320, 2806896, 3931614, 12014348, 27292208, 40272090, 42037297, 34583663, 27152719, 24602189, 24072075, 22224631, 19953233, 18237017, 14642238, 7670946, 779227, -2317629, -3404489, -5918575, -7827958]
39844g827958L306967O697189K422964m877677o890036l975367k897020m945165
39836a8986103m666835K11931N269692O617341N365655L780161K386096J978251
39828A956189L620415N613535M872146J968534M44754Q03949l7091k823916m472742
39819A1945773l347908j293711L43229J934305K317072l49501l756582l226019
39811D566658N89889J886480r61248k897929j261418l05860l167271o078503n171267
39802a2800469l051740l479334m696125l256612J52163L546913P300781J0001365
39794f283058O557249l093950r170123m120511N116068O148282j007233n283593
39786a1136869j875445K873482M264965N726047R329616R722076K970261n693551
$$ y = [-7827958, -4520991, 2176198, 4599162, -278515, -7168551, -11143918, -14040938, -18986103, -23652938, -23441007, -18171315, -11553974, -6188319, -2408158, -22062, 1956189, 5576604, 11190139, 16062285, 18030819, 18475573, 19279522, 19242431, 16418515, 11945773, 8597865, 7304154, 7647383, 9581688, 11898760, 11549259, 7792677, 4566658, 5156547, 7043027, 6081779, 3183850, 1922432, 1616572, -1550699, -7629202, -12800469, -15852209, -19331543, -24027668, -27284280, -27132117, -23585204, -16284423, -6283058, 274191, -2819759, -11989882, -16110393, -10994325, -4846043, -5853276, -11136869, -13012314, -10138832, -5873867, -147820, 9181796, 18903872, 21874133, 16180582]
39778A6180582q681591n533579p96349K911171M840012L289824j708263n728999
39770D772808n106146k688755l588919o803412o286952m597P006741R455867P574610
39761D331245M533566J640304j189331k520166o48339K508122K286839k380250
39753H561990o176186l880960J969998M049153O83754j838148O02873L011911
39745F984385p37508p172060p520353j151335L069329L0581m186267j642132O049219
39736f276141J0366875O901733o01249n697705n407824j780138M53747j387020
39728c427722m405300l190765K512137O219017L030325l510528o212878l469927
39720a2455641L13725J933797K484260L458338L999161L113161J585580M00260
$$ y = [16180582, 7498991, 1965412, 1169063, 4080234, 8920246, 12210070, 10501807, 4772808, -333338, -3022093, -6611012, -13414424, -19701376, -19705973, -12699232, -3243365, 4331245, 8864811, 10505115, 9315784, 6795618, 6147279, 8655401, 10942240, 8561990, 2385804, -1495156, 474842, 4523995, 5207749, 3369601, 3972474, 6984385, 6246877, -925183, -8445536, -9596871, -6527542, -6496961, -10683228, -12325360, -6276141, 4090734, 10992467, 10391218, 4693513, -714311, -2494449, -2040702, -3427722, -7833022, -11023787, -8511650, -2292633, 737692, -2772836, -8985714, -12455641, -12141916, -10208119, -7723859, -4265521, -266360, 2846801, 4432381, 4832641]
39712D832641o39169j724874k263897k165264k368658l169577l220699j166977
39704a1886474K361308N029181M861609K031002j126010k233962j383737q03261
39696c150344j565991j944886k08951K397552L477349L200299L532543M142757
39688I880328K300039k248389n300789l315230J374669L231039P21468k081490
39680D561645j681873n6411j076099l850497l419424J500769N352516K955799
39672D286425k862870m849637j259309K397419J699274j404912l188641l304341
39664h486592k423238J007827P162254J0886730O751019k818292r185758p457530
39656d563580j082449L501583L167811j072200n644100o036040m95658O629386
$$ y = [4832641, 4193472, 2468598, 204701, -1960563, -4329221, -7498798, -10719497, -11886474, -9525166, -4495985, 365624, 2396626, 1270616, -963346, -2347083, -3150344, -4716335, -6661221, -6870172, -4472620, -995271, 2205028, 5737571, 9880328, 12180367, 9931978, 4631189, 1315959, 2690628, 5921667, 6643135, 4561645, 2879772, 2823361, 1747262, -2103235, -5522659, -4021890, 1330626, 4286425, 1423555, -3426082, -4685391, -2287972, -588698, -1993610, -5182251, -8486592, -10909830, -9902003, -2739749, 8146981, 14898000, 12079708, 2893950, -4563580, -5646029, -2144446, 1023365, -48835, -5692935, -11728975, -12224633, -5595247]
39648e595247Q379974L292799k902366m814301l266647j912799j493334m77052
39640h788973J004684J350474O00738M24970J184348J138852j170708m865636
39632i121251p099367n230061N63586O546385Q577124O526914M221698M525273
39624I510301O166108O171266L632296n5253l198472m970701n669404o294251
39616E291890o776112n210541j056353J933364j22147m510277m606498l103K445636
39607a2614141N3949o25495M885004R911518O739247m1398n38629L707588K179863
39598A3657506n837555q171656O93225R212551N641000m206810o294423N32746
39590E226584M236281j602466r560875j0587934n709787j722136j154888j118557
$$ y = [-5595247, 2784727, 6077526, 3175160, -1639141, -4905788, -6818587, -8311921, -8788973, -7784289, -6433815, -5833077, -5408107, -4223759, -3084907, -4255615, -9121251, -16220618, -21450679, -20887093, -14340708, -5763584, 763330, 4985028, 9510301, 15676409, 21847675, 25479971, 25424718, 22226246, 17255545, 11586141, 5291890, -1484222, -6694763, -7751116, -5817752, -5939899, -10450176, -15056674, -15059777, -12614141, -12560192, -13185687, -8300683, 1610835, 8350082, 8308684, 7770055, 11477643, 13657506, 7819951, -351705, 341520, 9554071, 15195071, 10988261, 4693838, 5226584, 9462865, 7860399, -1700476, -12288410, -17998197, -19720333, -20875221, -21993778]
39582b1993778J032922M751179P625170P378039L687962o30426j800342L57860
39574D08586J895061K11755k091884j241750J546435J395335k945753o695884
39566g518099n285600k00149L748421M966679N639697O627671N819493K549505
39558A6347618k8284N37213J749276l34721m964650p512373n628523j216361L212938
39549B162133O342053O148180P03132p420059j1384172p530034q5044M154957
39541f908854L686167K022195J411031N01150j889921l812935k304623K716857
39533d578933P622267Q166531L543903k647843n826704m483483l50430M195842
39525E641150P120681O408331J929889k552186k676991O71347K124636q40928
$$ y = [-21993778, -20960856, -16209677, -8584507, -1206468, 2481494, 1851068, 50726, 408586, 2303647, 2515402, 423518, -818232, 728203, 2123538, -822215, -7518099, -12803699, -13003848, -9255427, -4288748, 1350949, 7978620, 13798113, 16347618, 16319334, 16856547, 18605823, 18271102, 13306452, 5794079, 165556, -1050805, 2162133, 8504186, 14652366, 15355498, 7935439, -3448733, -10978767, -11063811, -6908854, -3222687, -1200492, 210539, 711689, -1178232, -4991167, -7295790, -4578933, 3043334, 11209865, 14753768, 12105925, 6279221, 1795738, 1445308, 5641150, 12761831, 19170162, 21100051, 18547865, 15870874, 16542221, 18666857, 17825929]
39517A7825929m888214o149070m725768k400078J71044K112944K159768J623528
39509E730083L058344M292743p8250q241734r766759n49590Q044833L738482q268673
39500b040521j2012707l064402P121053Q792703M637415R13989j680092m029016
39492a361578m111709j793039j414429m401365n009853J175902R250580J0992445
39484C326954N381479j728024n471882n108922k018322J131154J315801j081342
39476d253104j485650K748707P850614Q526110M862120Q18344j872463m328798
39468A2865880o481294o229456k483958L089576O933703N503368j668068r783187
39460A746564j2247979p655531p96447L923901O448319P671665O821420M080186
$$ y = [17825929, 12937715, 6788645, 2062877, -337201, -166157, 1946787, 4106555, 5730083, 8788427, 13081170, 13002920, 4761186, -5005573, -5555163, 2489670, 6228152, -2040521, -14053228, -17117630, -9996577, -1203874, 3433541, 4347530, 2667438, -1361578, -5473287, -7266326, -8680755, -13082120, -18091973, -16916071, -7665491, 3326954, 8708433, 6980409, 1508527, -3600395, -5618717, -4487563, -3171762, -4253104, -5738754, -2990047, 4860567, 13386677, 18248797, 19067141, 17194678, 12865880, 6384586, 155130, -2328828, 760748, 7694451, 13197819, 11529751, 1746564, -10501415, -18156946, -18953393, -15029492, -8581173, -909508, 5911912, 9992098]
39452I992098J349277j208525m478783n482361l33637O286218M221894n502054
39444D844127q273244K245908J1384365M657414q174977o662925Q453682J5779634
39436B4253984N289221q827735j1587051o538212l697635k462838K298397P119313
39428E847444M920385k451678o885544n778394k911795n51171J815000L128416
39420b867337J925707J98231M20492O52084j992699n106433l980735O78168L660395
39411f412127K942691J203632K81065p28500j790363j044853J597320L473470
39403d77665K593402j97513k450588j919324J640564M783425K819684l603275
39395C188710p372971l885484K103601L372261P97975N24127K676633J173759
$$ y = [9992098, 11341375, 10132850, 5654067, 171706, -161931, 6124287, 10346181, 4844127, -3429117, -1183209, 10201156, 14858570, 6683593, 20668, 8474350, 24253984, 29543205, 20715470, 9128419, 2590207, -1107428, -3570266, -1271869, 5847444, 10767829, 8316151, 1430607, -4347787, -7259582, -7810753, -5995753, -2867337, -941630, -743399, -322907, 329177, -1663522, -6769955, -10750690, -10072522, -6412127, -3469436, -2265804, -1984739, -2713239, -4503602, -5548455, -3951135, -477665, 2115737, 1918224, -532364, -2451688, -811124, 3972301, 6791985, 3188710, -4184261, -8069745, -5966144, -2593883, -1795908, -1271781, 1404852, 2578611]
39387B578611m645491o657133J73720R121825J0167765L061759l516857l759360
39379F524839n17469N07045j882400m407128m520927l467748l937662n763857
39371a7465307n607854j654131L049929M044926J337422q51086j9853J859962
39363a5305992K062540O80551p25347j512127j404270K67841K945725M251998
39355h739081K948801R60249M45514L32523j724563m884216n530411k232647K268073
39346a6155758M749493N058617M837471M524881L482920K165446J972000K721374
39338A3356444K136972r75083m187260l992601r27558m1686m579664j0392737
39330i603173r591008n88923Q327603Q281310J082010k960644J129525O311290
$$ y = [2578611, -2066880, -8724013, -8550293, 571532, 10739297, 13801056, 10284199, 6524839, 6007370, 6514415, 4632015, 224887, -4296040, -7763788, -11701450, -17465307, -23073161, -24727292, -21677363, -17632437, -16295015, -17146101, -17165954, -15305992, -13243452, -12562901, -13288248, -14800375, -16204645, -15936804, -12991079, -8739081, -5790280, -4830031, -4384517, -4051994, -5776557, -10660773, -16191184, -18423831, -16155758, -11406265, -6347648, -1510177, 3014704, 6497624, 8663070, 10635070, 13356444, 15493416, 14518333, 10331073, 6338472, 5410914, 5369228, 789564, -9603173, -19194181, -19783104, -11455501, -3174191, -2092181, -5052825, -3923300, 2387990]
39322B387990L860053l829091o715291j638399L936289L934752K056804L876542
39314G869649O722772M359125j716184l623966P85102M580973K100893l419117
39306A7659247n292274j976343K645621M326184J519798l780087o623874l551103
39298D927169K268133L945543J95372k816879r50993K002085J521602K8920J767469
39289A2888421M320769K362293k447628l027980J711985M341261r6231o469859
39281A3583031o661868o02219L974537J573902m645887p205247l336991K039005
39273a281737K718331j200082m469370m409612l366431k835666l21133M859411
39265a0306289P425258L029338l781652m540672J574963O995129O258313J711353
$$ y = [2387990, 6248043, 2418952, -4296339, -5934738, -1998449, 1936303, 3993107, 7869649, 14592421, 18951546, 17235362, 13611396, 14396498, 18977471, 21078364, 17659247, 12366973, 10390630, 13036251, 17362435, 18882233, 15102146, 8478272, 4927169, 7195302, 11140845, 11336217, 8519338, 7568345, 9570430, 11092032, 11120952, 12888421, 17209190, 19571483, 17123855, 14095875, 15807860, 20149121, 20052890, 13583031, 6921163, 6318944, 10293481, 11867383, 7221496, 16249, -3320742, -1281737, 1436594, 236512, -4232858, -8642470, -12008901, -14844567, -15165700, -10306289, -2881031, 148307, -3633345, -8174017, -6599054, 396075, 6654388, 8365741]
39257H365741j796953k700218j797804K2390J252728K84418j951315k579841j074612
39248a975466k26631j845914m090737m142548j503177J949000L432192J004918
39240g398363m076361p355383n873512j819210J145593L309299O782170R882750
39232e403017Q976411N052885K770903L079762K604965N65781j8901J122234M31464
39223A9182487k354263k801897K4212Q41816k904678n969213l567332J215938
39215C667070L107010K253912J039994j316800n098477n977581j284241L629798
39207B0685K300840k824187m453211j843563n06705k260001l386531k196512j077025
39198a6226210q18690L19920J549187K48786j766566K81180N297950O394929J946968
$$ y = [8365741, 6568788, 3868570, 2070766, 2093156, 3345884, 3630302, 1678987, -900854, -1975466, -2202097, -4048011, -8138748, -12281296, -13784473, -11835473, -8403281, -7398363, -11474724, -18830107, -24703619, -26522829, -25377236, -22067937, -15285767, -5403017, 3573394, 8626279, 11397182, 14476944, 17081909, 17647690, 17628789, 18751023, 19182487, 16828224, 14026327, 14050539, 14892355, 11987677, 6018464, 2451132, 3667070, 6774080, 9027992, 10067986, 8751186, 3652709, -2324872, -3609113, 20685, 2321525, -502662, -4955873, -6799436, -7306141, -9566142, -12952673, -15149185, -16226210, -17044900, -16724980, -15175793, -14927007, -16693573, -16412393, -11114443, -4719514, -2772546]
39189b772546j124948J198588K915534j784025p506180m867556M784302J0446665
39181A289834O639769m04474l292055l119560m636972p034698n541195j42605
39173a6241956L392394J906609o77817M07442L852515M986905K888102O94300
39165A208494O8160l79345j266022j085397O54666K345710K959330K680439Q63078
39156H049113k754084m975672k459833J558807L40355n111215n682619J477597
39148i557551O779169K705338l496507p96422Q019602J0781831M464379k484697
39140A6415142n157236p453867j1055958j0853860n231698p27023j149864q50280
39132b6064644M816569R924002O683799j630318m851288l78935M141802K232992
$$ y = [-2772546, -3897494, -2698906, 216628, -1567397, -9073577, -13941133, -9156831, 1289834, 7929603, 7525129, 4233074, 1113514, -3523458, -10558156, -16099351, -16241956, -12849562, -10942953, -11620770, -11213328, -7360813, -2373908, 514194, 1208494, 1276654, 897309, -368713, -1454110, -799444, 1546266, 4505596, 7186035, 8049113, 5295029, 319357, -2140476, -581669, -241314, -5352529, -11035148, -9557551, -2778382, -73044, -3569551, -4365973, 3653629, 14435460, 18899839, 16415142, 11257906, 3804039, -7251919, -18105779, -23337477, -24064500, -25214364, -26064644, -21248075, -11324073, -4640274, -6270592, -11121880, -11500815, -7359013, -5126021]
39124e126021l242489m567793J301335Q817979Q968589q62090j2616872j5946011
39116b3273373j0338010m192320j815858J446507Q472712J2897208Q744559J383163
39108f675412N85682O126436Q807560M495053r93456j543533J657707L902587
39100A6362624L094361K56830k290284k190652M08943J728389o89622l016815
39092A3663774l30316L985913J182453q971054j4884244q271505L507360O765893
39084c351726m87335p192910m913933K365726N885721L655995L24136j060659
39076d774985k034258l911917m513824j657161K692489M458648K607136k41764
39068g375636j928011k760935l138729k171014q3079P15035p04804j148356K628860
$$ y = [-5126021, -8368510, -12936303, -11634968, -2816989, 6151600, 5289510, -7327362, -23273373, -33611383, -37803703, -39619561, -38173054, -29700342, -16803134, -8058575, -6675412, -6089730, 36706, 8844266, 13339319, 12345863, 10802330, 12460037, 16362624, 19456985, 19713815, 17423531, 15232879, 15641822, 17370211, 16680589, 13663774, 13333458, 17319371, 18501824, 9530770, -5353474, -13624979, -10117619, -3351726, -3839061, -11031971, -15945904, -13580178, -7694457, -4038462, -3714326, -4774985, -6809243, -10721160, -15234984, -16892145, -14199656, -9741008, -7133872, -7375636, -9303647, -12064582, -15203311, -17374325, -17457404, -16742369, -17447173, -18595529, -15966669]
39059a5966669Q357932J0095429N614412q77333l889148k134834J751018M648623
39051G599430M910227K671995k92080j962315k298789l150964n099843n597031
39043c219370j873225M643977Q527119N813450j351054o460564n178900M57543
39035A358976M631178L825355m11261m070466m599806k269482P88738K338728
39027A591960J931688J390313K325817L337410J667700k180349m300054l037468
39019B727017j702376l203472m756842j688304N018013R151516P053247J209750
39011A3808549m229617p706296q874245o765352j969047J831811J627417p02176
39003a2978956p31294K318545M489432K833374j71649J33919M039180O520492
$$ y = [-15966669, -7608737, 2486692, 8101104, 7223771, 3334623, 1199789, 2950807, 7599430, 12509657, 15181652, 14889572, 12927257, 10628468, 7477504, 2377661, -3219370, -5092595, -448618, 8078501, 13891951, 12540897, 6080333, 901433, 1358976, 5990154, 9815509, 9404248, 5333782, 733976, -1535506, -746768, 1591960, 3523648, 4913961, 7239778, 10577188, 12244888, 10064539, 5764485, 2727017, 1024641, -2178831, -6935673, -8623977, -3605964, 5545552, 12598799, 13808549, 9578932, 1872636, -7001609, -13766961, -15736008, -13904197, -12276780, -12978956, -13710250, -11391705, -6902273, -4068899, -4240548, -4106629, -67449, 6453043]
38995F453043L312511l747732q534557o825978K53706P792213J0662202O805394
38987A6170802p44182n733671n045746k662126m333272q845588q957914j842972
38979b1994669O303762Q493917N206958R70509k738021n936632n172481K650839
38971a2215818J2425846J4068886N193645n027675p067060j730594L050806K502767
38963A1200803j261726l601364k196849J708288M671910L796148o19209n095088
38955H602913o011438k642296K272949M464427J759977l052668m343927k64373
38947G85564M432508M509160J216748l08507J014742J515786l82530j558147N54670
38938A1779994M152374N859730M247917m0679m500547n184568r19143L146684
$$ y = [6453043, 9765554, 6017822, -2516735, -9342713, -9089007, -1296794, 9365408, 16170802, 15426620, 9692949, 4647203, 1985077, -2348195, -11193783, -20151697, -21994669, -15690907, -7196990, -1990032, -1019523, -3757544, -9694176, -14866657, -12215818, 210028, 14278914, 19472559, 14444884, 7377824, 5647230, 8698036, 11200803, 9939077, 6337713, 4140864, 5849152, 10521062, 14317210, 13698001, 8602913, 2591475, -50821, 2222128, 6686555, 8446532, 5393864, 1049937, 785564, 5218072, 9727232, 10943980, 10635473, 11650215, 13166001, 12783471, 11225324, 11779994, 15932368, 21792098, 26040015, 25999336, 21498789, 16314221, 15395078, 18541762]
38930A8541762J243060l824710l663063K513919N525910K75250o039889n549959
38922I022280k118028l822511q578555p570743n65836L176882K46100q99425O456882
38913d652954J5504939J4448825K850848p422358p172879l89770K380165j987715
38905A3559101o065504l225982K203716P37518p970792j3290358q010744J818020
38897b0245025N990404L762428J885988K844672L034022J141516R5087K51627
38889a239281j531711m363562k506381M696518R138935N048282j976635l034432
38881D231733J160156K432775j759972m788453j419423M089469L876357k769496
38873E053146q608680p910365l163264n88437j318558p85476L254924O748197
$$ y = [18541762, 19784822, 15960112, 12297049, 14810968, 20336878, 20612128, 14572239, 9022280, 6904252, 3081741, -5496814, -13067557, -13633393, -10456511, -10210411, -11109836, -4652954, 10851985, 25300810, 28151658, 20729300, 13556421, 13166651, 15546816, 13559101, 7493597, 4267615, 6471331, 7208849, -761943, -14052301, -22063045, -20245025, -14254621, -10492193, -8606205, -5761533, -2727511, -1585995, -1490908, -1239281, -2770992, -7134554, -9640935, -4944417, 4194518, 9242800, 7266165, 4231733, 5391889, 7824664, 6064692, 1276239, -143184, 3946285, 7822642, 5053146, -3555534, -11465899, -14629163, -15217600, -16536158, -17321634, -14066710, -7318513]
38865g318513N843469L136826K925514L538907O44747l670082k791187L146415
38857E456096N922154J625948l229215k149274J657911J643954j785754l883820
38849E258000l844282l370882q18901N225089R235518M529028n263521r611881
38841A338168o320968l804588o034642n456885L538837J2935632J1561404J822876
38833I579834l732068m60427L372486N45875m916941n493612j655692L86423r29797
38824c303919r49943K676387N733108L859453q73261l161044j704950N88434K071436
38815D935701L374027L277831q81536o924291p522466j96672P010854N551871
38807H625319j356101l665395K18042K007049j795130l631670J967009P607536
$$ y = [-7318513, -1475044, 1661782, 4587296, 8126203, 8770950, 5100868, 2309681, 5456096, 11378250, 13004198, 9774983, 7625709, 9283620, 10927574, 9141820, 5258000, 1413718, -1957164, -2776065, 2449024, 11684542, 16213570, 10950049, 1338168, -4982800, -8787388, -14822030, -20278915, -16740078, -3804446, 7756958, 9579834, 5847766, 5387339, 8759825, 9305700, 4388759, -1104853, -2760545, -2374122, -3303919, -4253862, -1577475, 4155633, 8015086, 7141825, 3980781, 2275831, 2864265, 4935701, 8309728, 11587559, 10706023, 3781732, -3740734, -3937406, 3073448, 8625319, 7269218, 3603823, 3821865, 5828914, 4033784, 402114, 2369123, 9976659]
38799I976659L662510n823178p939408J51121P302495N063014j002140j456385
38791I934688K629381K667611l625508r121492p977633l067213m29909p18681
38783i708756J70824L935889P082145N640407L39342m154843m298735r78743K033871
38774F1401K153171J55650j430728j503063j385137k637319m661039n398092m209223
38765a8854379k735276k226454j199178K673298Q612161J2381300J0562922M265621
38757A3480015j984060m371752k594504M04225R80563j848951m925816m007397
38749d867677Q61693M579451L166991p62857j333194K399087M844681J479445
38741A0367620m711705o661429j808996N065035P469841L837309k056280n985305
$$ y = [9976659, 13639169, 7815991, -123417, 27704, 7330199, 12393213, 11391073, 9934688, 12564069, 15231680, 11606172, 2484680, -5492953, -8560166, -8990075, -9708756, -9537932, -5602043, 1480102, 7120509, 7459851, 3305008, -993727, -1972470, 61401, 2214572, 2370222, 939494, -563569, -1948706, -4586025, -9247064, -14645156, -18854379, -21589655, -23816109, -25015287, -22341989, -13729828, -1348528, 9214394, 13480015, 11495955, 7124203, 4529699, 4933924, 5914487, 4065536, -860280, -4867677, -4005984, 573467, 3740458, 2977601, 1644407, 4043494, 8888175, 10367620, 5655915, -1005514, -2814510, 2250525, 9720366, 13557675, 11501395, 5516090]
38733E516090p109421o770519m976405k98864O187455R414001N671812j477181
38725F156968m393911j193383J479279k194072q616375r663664m022589J623984
38717b0823763K589294J831527L589192O145126M944251J68847l347489k940547
38709g843562q73371j08719p86605j819672l052668m273321m232358k411021k90559
38700b5691856P20626J351917K859740M549543M834101L925944L338815L181164
38692i30006K327147J239807J817326L544896K748944k063596o440750n055613
38684b811845L85274K431917k066903p165606n642896J363108O364962N597884
38676a544105K595011J677610K461479K562974J924050J610557J031873n73966
$$ y = [5516090, -1593331, -8363850, -13340255, -13639119, -7451664, 1962337, 7634149, 6156968, 1763057, 569674, 2048953, -145119, -8761494, -18425158, -22447747, -20823763, -18234469, -16402942, -12813750, -6668624, -1724373, -1555526, -4903015, -7843562, -8716933, -8825652, -9612257, -11431929, -14484597, -18757918, -22990276, -25401297, -25691856, -24971230, -23619313, -20759573, -16210030, -11375929, -7449985, -4111170, -930006, 1397141, 2636948, 4454274, 7999170, 10748114, 8684518, 2243768, -2811845, -2426571, 5346, -2061557, -9227163, -14870059, -13506951, -7141989, -1544105, 1050906, 2728516, 5189995, 7752969, 9677019, 11287576, 12319449, 11745483]
38668A1745483j937159k013742k334941l713636l010082K032340O522207L361877
38660A0652347n433918r168699k372014P856269J1701897Q196987K687559j786523
38652B2333905m684450l877396J434347O090610M343461j381442l830103j981758
38644A8447174j384740l758977m598389k487768k187460n175675n361780N99010
38636e908605N818607K667907n518014r353083o344766j965714m18628j074119
38628b2096415k280895k303458J998199J0835479J6914631J2222437m82912r509448
38620E297618q236465j192587M434178O545462N686801J845108k713119k887611
38612H779385K730740Q472266Q167404K124371m816634q667581p556809j853931
$$ y = [11745483, 9808324, 7794582, 5459641, 1746005, -1264077, 768263, 7290470, 10652347, 5218429, -3950270, -6322284, 1533985, 13235882, 21432869, 24120428, 22333905, 17649455, 13772059, 15206406, 21297016, 25640477, 24259035, 20428932, 18447174, 17062434, 13303457, 8705068, 6217300, 4029840, -1145835, -6507615, -5908605, -89998, 2577909, -2940105, -12293188, -18637954, -20603668, -21022296, -22096415, -24377310, -26680768, -24682569, -13847090, 3067541, 15289978, 14807066, 5297618, -2938847, -4131434, 302744, 6848206, 12535007, 14380115, 11666996, 8779385, 11510125, 19982391, 28149795, 30274166, 25457532, 16789951, 9233142, 7379211]
38604G379211M066850M308913j004660m587890j718370L248345M120628J918933
38596A7731960J165576J228859j674172o356337q026966o850490p682938j0754046
38588b1218554r866652k123652O677115R629327O963000L253305M65187j997075
38580h217999l176135j413804J511499J480357j950775l954212p51142M628691
38572a1843520N821829J869349j041160J739216O153371N000030j128078m217212
38564B353825o28055L806747L247855L43290M36999K426084J853070n41997o22867
38555A2674951J164269J228544O40969L090104N623242J021154r028865j2960222
38547C454146n434445M514154O852301L791851K569834K430726j675711p247167
$$ y = [7379211, 11446061, 15754974, 14750314, 10162424, 8444054, 11692399, 15813027, 17731960, 18897536, 20126395, 18452223, 12095886, 4068920, -2781570, -10464508, -21218554, -31085206, -33208858, -26531743, -16902416, -9939416, -6686111, -6220924, -8217999, -11394134, -12807938, -11296439, -9816082, -11766857, -15721069, -16472211, -11843520, -6021691, -4152342, -5193502, -3454286, 2699085, 7699115, 6571037, 2353825, 1725770, 5532517, 8780372, 9123662, 9560661, 11986745, 13839815, 13297818, 12674951, 13839220, 15067764, 15708733, 18798837, 24422079, 25443233, 16414368, 3454146, -1980299, 2533855, 9386156, 13178007, 15747841, 18178567, 16502856, 9255689]
38539I255689o747532l90594L522163J601785k22205K560746N883329M544617
38531B0007998N42251r72629J11539k00049l188653o084086o616512n242556l025505
38522d668202k68850K350596L529019K941655J635278K82565j521484l387881
38514H92696l056642R33174O034563P455050L696598j777879n444382p697105
38506A036073r731697r315451m004287K852210M725979Q77453k631092k123419
38498a8314231p11027r65117M80938O016447J0040668N911287k991610o566036
38490g098681j573379M795147N342359Q82401l344818m108824j424383K426079
38482d104099L757577J094026j503861R47220O018988N770272j435204p208263
$$ y = [9255689, 2508157, 2117563, 5639726, 7241511, 7019306, 9580052, 15463381, 20007998, 20550249, 19577620, 19689159, 19489110, 16300457, 10216371, 3599859, -1642697, -4668202, -4937052, -2586456, 942563, 3884218, 5519496, 5802061, 4280577, 892696, -2163946, -1230772, 4803791, 12258841, 15955439, 14177560, 8733178, 1036073, -8695624, -18011075, -22015362, -19163152, -14437173, -13559720, -16190812, -18314231, -19025258, -19990375, -19509437, -13492990, -3452322, 2458965, -532645, -7098681, -8672060, -3876913, 1465446, 2347847, -996971, -5105795, -6530178, -4104099, -346522, 747504, -756357, 190863, 6209851, 11980123, 10544919, 3336656]
38474C336656m662483J923639L853445K2400l663390l955949k932371k047482
38466h125535K48990M052538O080915M144945L02029k232172k944892l200057
38458a673239l410761k718461n02922K929553O438224Q127528O303492J407989
38450A6901403l524875n432107m208955k286216j201527P1969K377410L348479
38442F045581j13521o103796p833485j812897O573668R016931M229899j817369
38434H185011m412308m166483k859107o91861J059029k6132k651765j890798L068908
38425d385506O488819N017413L293481N261193N711872j525272j1185586j2312563
38417c636149m721779R58212L42904J059845P739338J2216602O142327m912112
$$ y = [3336656, -1325827, 597812, 4451257, 4473657, 810267, -3145682, -6078053, -8125535, -7876545, -3824007, 2256908, 6401853, 6703882, 4471710, 1526818, -1673239, -5084000, -7802461, -8305383, -5375830, 1062394, 9189922, 15493414, 16901403, 13376528, 7944421, 3735466, 1449250, 247723, 319692, 2697102, 6045581, 5932060, -171736, -8005221, -9818118, -3244450, 5772481, 10002380, 8185011, 3772703, -393780, -3252887, -3944748, -2885719, -2911851, -5563616, -7454414, -4385506, 2103313, 7120726, 10414207, 15675400, 21387272, 19862000, 8676414, -3636149, -8357928, -7399716, -7056812, -5996967, 1742371, 13958973, 20101300, 15189188]
38409A5189188r146380m965360l79995M43047L00783L18603j905101n040471m042361
38400i228047O97830K534163m47535j780850K204638N546116K566315k400131
38392c07501k217570J769114L593862L389088N365556P961436N668180j90947
38384B5031218k219352O01787O26828n686975j1476021j0094676m500946r91638
38376h709775N275J287007K409117J736299P41234R55813O44316p37716K93739
38367a374691M257095M740598j449077o171368j422255O108056L727951o788210
38359A628099j0707488k498050P022916Q569393O234816N973738M562239j618852
38351A9166811o807957m730857J88919L89394k114704q27704K367646O61482m322453
$$ y = [15189188, 6042808, 1077448, 697453, 1140500, 1441283, 1759886, -145215, -5185686, -9228047, -8530217, -5996054, -6443589, -8224439, -6019801, -473685, 2092630, -307501, -2525071, -755957, 2837905, 6226993, 11592549, 19553985, 25222165, 25031218, 22811866, 23413653, 24040481, 18353506, 6877485, -3217191, -7718137, -8709775, -8704500, -7417493, -5008376, -3272077, -2530843, -1575030, -930714, -1668430, -1374691, 2882404, 7623002, 6173925, 2557, -1419698, 4688358, 8416309, 1628099, -9079389, -11577439, -4554523, 4014870, 10249686, 16223424, 20785663, 19166811, 12358854, 7627997, 7816916, 8206310, 6091606, 5263902, 7631548, 8293030, 3970577]
38342C970577m167986J928409N255153J330722m126289n357195m122203l831574
38334i120386l514053j572085L53832J006073K018295L650495K994569l16082
38326d499342j652556J451745M325799J971143k886536l635352P58601M939850
38318G73352M524126L51035l742655m368034q39039L568933M158019Q37120q41885
38309D420972K363532N462175J971421n619599q286986l237997K079508P85668
38301f1306l994278m376145J035260N811831M526710j155481n746220o353344
38293a0312973m374086k413116j358713l95028J295643L439494M896931M509588
38285d712260K024537j074491j807157J803239P569387R780040N025197k873502
$$ y = [3970577, -197409, 1731000, 6986153, 8316875, 4190586, -1166609, -5288812, -9120386, -12634439, -14206524, -13852692, -12846619, -10828324, -7177829, -4183260, -4499342, -6151898, -4700153, -374354, 1596789, -1289747, -4925099, -4166498, 773352, 5297478, 5648513, 1905858, -2462176, -3301215, 267718, 4425737, 5262857, 4420972, 6784504, 12246679, 14218100, 8598501, 311515, -2926482, -846974, -61306, -4055584, -8431729, -7396469, -1584638, 2942072, 1786591, -3959629, -10312973, -14687059, -17100175, -18458888, -18853916, -17558273, -14118779, -9221848, -4712260, -2687723, -3762214, -5569371, -3766132, 3803255, 13583295, 18608492, 15734990]
38277A5734990o130956k057828L417216L267585j423625l178303J258064O155765
38269A7042908M707650j561214n028702k149376K835976M536459K674516J17438
38261B3175655j858113l437703l585625r76355K828476L949047N82102m602502
38253A6074982o964285m310645R98925M193988L055244N06360N63313K134479
38245A6252361M17413m649577o316939r62315M583993J849464o069527q092539
38237b987666j636508L191727j268995q760681q431415j07334O875659P330577
38229e794636N389923O095429Q120303P047719K039871l273620m882382k073976
38221A2668631J919220K687440p76651m583905m468202r91496J808222J902297
$$ y = [15734990, 9604034, 7546206, 10963422, 14231007, 12807382, 9629079, 10887143, 17042908, 21750558, 20189344, 15160642, 13011266, 15847242, 20383701, 23058217, 23175655, 21317542, 17879839, 14294214, 13317859, 16146335, 20095382, 20677484, 16074982, 9110697, 4800052, 5798977, 9992965, 13048209, 13554569, 14117882, 16252361, 16669774, 12020197, 5703258, 4740943, 9324936, 11174400, 5104873, -2987666, -4624174, -1432447, -2701442, -11462123, -19893538, -20000872, -13125213, -5794636, -404713, 5690716, 13811019, 20858738, 22898609, 19624989, 14742607, 12668631, 14587851, 17275291, 16498640, 11914735, 7446533, 6455037, 8263259, 10165556]
38213A0165556L79021k103619n694070p856475m667000K154994M602384j009996
38205d029205p092224m571834L212666M516443k987055p549113m10271J0511388
38197h399205J1444634K299463l916307L5972O658652N859982j601126p355153
38189E026912o973387l059877L91326K018655K635241M006374P095270R436922
38181B0577436O345021k643034j0846906j1380885n332884L58960J600662K1920
38173a299710j502378k027880j622473j005674k054668n463250q187769o455692
38165b9619494r94690L955661O306237P226625P169538N071714J797168J86322
38157A099081O98148N43549j848972m590823n281009l410366L23440M155498N144041
$$ y = [10165556, 10544577, 8440958, 2746888, -5109587, -9776587, -7621593, -3019209, -4029205, -11121429, -15693263, -12480597, -7964154, -10951209, -18500322, -18910593, -8399205, 3045429, 5344892, 1428585, 1464557, 8123209, 13983191, 12382065, 5026912, -1946475, -5006352, -4615026, -2596371, 38870, 4045244, 11140514, 20577436, 26922457, 24279423, 13432517, 2051632, -3281252, -2922292, -1321630, -1299710, -2802088, -4829968, -6452441, -7458115, -9512783, -14976033, -23163802, -29619494, -30614184, -26658523, -20352286, -13125661, -5956123, -884409, 912759, 1099081, 1797229, 2340778, 491806, -4099017, -9380026, -12790392, -12466952, -8311454, -3167413]
38148c167413K504894L76118K867655P026784O161955J9237m719900m842167m356974
38139A870189n711262m756325J364411P801360Q775097N709580L258370J625130
38131A9936550j495626m927733n778071m624336l768997k679404k7005K154016
38123a210606J337041o45214n30741P21443K37722r05386M14805L157146L390741
38114E966951Q63160r82626r21012q19374j086771k30588J227759J144036K5016
38105E186551L66746J662703N70651l439121o533512n243722J83062O829026J0637196
38096A0219580Q146703K82788o805628q248730o021355m308671k451089J871753
38088g314649N440493L105422k796267m759333j608430O85465J58621J529533
$$ y = [-3167413, -662519, -286401, 2581254, 9608038, 15769993, 15789230, 11069330, 6227163, 1870189, -3841073, -8597398, -7232987, 568373, 9343470, 15053050, 18311420, 19936550, 18440924, 13513191, 7735120, 3110784, -658213, -3337617, -3364622, -1210606, 126435, -518779, -1049520, -328077, -90355, -995741, -580936, 2576210, 5966951, 6830111, 5847485, 4926473, 4107099, 3020328, 2789740, 4017499, 5161535, 5186551, 5553297, 7216000, 7786651, 4347530, -2185982, -7429704, -7246642, -417616, 10219580, 18366283, 18649071, 11843443, 3594713, -2426642, -6735313, -9186402, -7314649, -1874156, 1231266, -1565001, -6324334, -7932764, -7247299, -7088678, -5559145]
38080e559145N521975N221339k112191q078369m642652L795003P140701L804241
38072E090902N16820P03082P98497j968346m520979k620902K965320P073625N763402
38063A3801421L63143m143353m733392l285029k811342k781534j254537J59528
38055d685095j658072m938433m345796N97816M106071K730688j16577l46103J373844
38046g281657K748317L359881K732354J10971j756566J254236O332512M973128
38038A2473176l599085q418899k304730O348690N585650k538239o175807j421573
38030e0817M383571N232627K739742P0429k060046k811165j596880j135516l781779
38021I90166n698493j816768M463632N010139K45157q15453M640636Q294638M285814
$$ y = [-5559145, -37170, 5184169, 3071978, -5006391, -9649043, -5854040, 1286661, 5090902, 5607722, 6310804, 7109301, 5140955, 619976, -2000926, 964394, 8038019, 13801421, 14164564, 10021211, 5287819, 2002790, -808552, -3590086, -4844623, -4685095, -6343167, -11281600, -15627396, -15029580, -10923509, -8192821, -8309398, -8655501, -7281657, -4533340, -1173459, 1558895, 1669866, -86700, 1167536, 7500048, 12473176, 8874091, 455192, -1849538, 4499152, 10084802, 7546563, 1370756, -50817, 4332754, 9565381, 12305123, 12375552, 10315506, 7504341, 5907461, 4771945, 990166, -4708327, -6525095, -2061463, 2948676, 3193833, 2378380, 7019016, 15313654, 19599468]
38012A9599468j583938j958777P10799J74349k421195j767525R68865m45363o369265
38003F907418r758229o646971j634817l59660j415926M47994N788822R302763
37995B631394O980953J214446k602905k611579j405105j231056j198061k3119
37987A754968J169290P32277p75192j964024l129818m998344o311391n170162
37979a8692396j715147K623786O882121R356253P319941J416142k403962J4560
37971D801298M304871L420228j877794m965277m223709l880909m246226n94412
37963g261930O041894O822902j129101p593948l047287P105613J0277213L928023
37955A5143379l474384n661529m174776k146195m63194j39522j744903k259893
$$ y = [19599468, 18015530, 16056753, 16767552, 16941901, 14520706, 12753181, 13722046, 13276683, 6907418, -2850811, -9497782, -11132599, -11492259, -12908185, -12460191, -6671369, 2631394, 9612347, 10826793, 8223888, 5612309, 4207204, 2976148, 1778087, 1754968, 2924258, 3656535, 2881343, 917319, -2212499, -7210843, -13522234, -18692396, -20407543, -17783757, -10901636, -1545383, 5774558, 7190700, 4786738, 4801298, 9106169, 12526397, 10648603, 5683326, 1459617, -2421292, -6667518, -7261930, -1220036, 5602866, 4473765, -3120183, -6167470, 938143, 11215356, 15143379, 11668995, 6007466, 1832690, -313505, -776699, -916221, -2661124, -4921017]
37947d921017J426930O033182N311535O694k677867m29567R58606k045353m826004
37938a162861l054570j6885j61079j299452K64056J673806j739016o807954o021666
37929a8325621L91992M213760J895427m34932K696745P707987Q165216M140917
37921A0451491M62824o19306j00422J495369L333245J947112m665928j1575826
$$ y = [-4921017, -3494087, 2539095, 7850630, 7857324, 5179457, 4749890, 5708496, 3663143, -1162861, -4217431, -4234316, -4395395, -5694847, -5430791, -3756985, -5496001, -12303955, -18325621, -17933629, -13719869, -11824442, -12259374, -9562629, -1854642, 6310574, 10451491, 10914315, 10295009, 10194587, 11689956, 15023201, 16970313, 12304385, 728559]
$$ [...]
##END NTUPLES=NMR SPECTRUM
##END=
