##TITLE=31Pdec_DE_30_Aciw
 Acetond-d6, 64 sc
 31.7.2024
##JCAMPDX= 6.0         $$ Bruker NMR JCAMP-DX V2.0
##DATA TYPE= NMR SPECTRUM
##DATA CLASS= NTUPLES
##ORIGIN= UXNMR, Bruker Analytische Messtechnik GmbH
##OWNER= root
$$ XWIN-NMR		Version 3.5
$$ Wed Jul 31 16:29:49 2024 Russian Standard Time (UT+4h)  she@DPX200
##.OBSERVE FREQUENCY= 81.013821
##.OBSERVE NUCLEUS= ^31P
##.ACQUISITION MODE= SIMULTANEOUS
##.ACQUISITION SCHEME= undefined
##.AVERAGES= 64
##.DIGITISER RES= 17
##SPECTROMETER/DATA SYSTEM= spect
##.PULSE SEQUENCE= zgpg30
##.SOLVENT NAME= D2O
##.SHIFT REFERENCE= (INTERNAL, D2O, 0, 198.062)
##AUDIT TRAIL= $$ (NUMBER, WHEN, WHO, WHERE, WHAT)
$$ ##TITLE= Audit trail, XWIN-NMR		Version 3.5
$$ ##JCAMPDX= 5.01
$$ ##ORIGIN= Bruker BioSpin GmbH
$$ ##OWNER= she
$$ F:/spectra/data/she/nmr/P31/2/pdata/1/auditp.txt
$$ ##AUDIT TRAIL=  $$ (NUMBER, WHEN, WHO, WHERE, WHAT)
(   1,<2024-07-31 16:28:55.92 +0400>,<she>,<DPX200>,
      <created by zg, POWCHK disabled, PULCHK disabled
       configuration hash MD5:
       00 E9 B6 7A A2 85 ED C7 34 08 36 98 17 FE 4E 26
       data hash MD5: 32K
       AB 3A 7D 85 0B 89 6E 73 03 EE 49 79 5C 3B F4 6A>)
(   2,<2024-07-31 16:28:58.18 +0400>,<she>,<DPX200>,
      <Start of raw data processing
       efp BC_mod = 2 LB = 1.5 FT_mod = 6 PKNL = 1 PHC0 = 2754.853 PHC1 = -107.5131 SI = 64K 
       data hash MD5: 64K
       42 B0 A6 1C D2 93 33 84 0E E7 4B DB FF A2 A6 3C>)
(   3,<2024-07-31 16:29:14.04 +0400>,<she>,<DPX200>,
      <pk PHC0 = 5.926131 PHC1 = 0 
       data hash MD5: 64K
       02 29 31 CA CA 2B 38 58 5C 37 39 F4 36 C6 27 66>)
$$ ##END=
$$ 
$$ hash MD5
$$ 6A A7 15 46 4D 1B BC 7D 7D 91 A5 55 1D 71 36 61
##$RELAX= 
##$RELAX= 
##$RELAX= 
##$RELAX= 
##$RELAX= 
##$RELAX= 
##$RELAX= 
##$RELAX= 
$$ Bruker specific parameters
$$ --------------------------
##$DU= <F:/spectra>
##$EXPNO= 2
##$NAME= <P31>
##$PROCNO= 1
##$TYPE= <nmr>
##$USER= <she>
##$AMP= (0..31)
100 100 100 100 100 100 100 100 100 100 100 100 100 100 100 100 100 100 
100 100 100 100 100 100 100 100 100 100 100 100 100 100 
##$AQSEQ= 0
##$AQ_mod= 1
##$AUNM= <au_zg>
##$AUTOPOS= <>
##$BF1= 81.014009
##$BF2= 200.13
##$BF3= 200.13
##$BF4= 200.13
##$BF5= 200.13
##$BF6= 200.13
##$BF7= 200.13
##$BF8= 200.13
##$BYTORDA= 1
##$CFDGTYP= 0
##$CFRGTYP= 5
##$CHEMSTR= <none>
##$CNST= (0..31)
1 1 145 1 1 1 1 1 1 1 1 1 1 1 1 1 1 1 1 1 1 1 1 1 1 1 1 1 1 1 1 1 
##$CPDPRG= <waltz16>
##$CPDPRG1= <>
##$CPDPRG2= <waltz16>
##$CPDPRG3= <>
##$CPDPRG4= <mlev>
##$CPDPRG5= <mlev>
##$CPDPRG6= <mlev>
##$CPDPRG7= <mlev>
##$CPDPRG8= <mlev>
##$CPDPRGB= <>
##$CPDPRGT= <>
##$D= (0..31)
0 1 0 0 0 0 0 0 0 0.06 0 0.03 2e-05 3e-06 0 0 0.0002 0 0 0 0 0 0 0 0 0 
0 0 0 0 0 0 
##$DATE= 1722428935
##$DBL= (0..7)
120 120 120 11 120 120 24 19 
##$DBP= (0..7)
150 150 150 150 150 150 150 150 
##$DBP07= 0
##$DBPNAM0= <>
##$DBPNAM1= <>
##$DBPNAM2= <>
##$DBPNAM3= <>
##$DBPNAM4= <>
##$DBPNAM5= <>
##$DBPNAM6= <>
##$DBPNAM7= <>
##$DBPOAL= (0..7)
0.5 0.5 0.5 0.5 0.5 0.5 0.5 0.5 
##$DBPOFFS= (0..7)
$$ [...]
##$SUBNAM3= <"">
##$SUBNAM4= <"">
##$SUBNAM5= <"">
##$SUBNAM6= <"">
##$SUBNAM7= <"">
##$SUBNAM8= <"">
##$SUBNAM9= <"">
##$SW= 400.765351723535
##$SWIBOX= (0..15)
0 1 3 0 0 0 0 0 0 0 0 0 0 0 0 0 
##$SW_h= 32467.5324675325
##$TD= 32768
##$TD0= 1
##$TE= 0
##$TE2= 300
##$TE3= 300
##$TEG= 300
##$TL= (0..7)
0 120 53 12 22 120 120 120 
##$TP= (0..7)
150 150 150 150 150 150 150 150 
##$TP07= 0
##$TPNAME0= <>
##$TPNAME1= <>
##$TPNAME2= <>
##$TPNAME3= <>
##$TPNAME4= <>
##$TPNAME5= <>
##$TPNAME6= <>
##$TPNAME7= <>
##$TPOAL= (0..7)
0.5 0.5 0.5 0.5 0.5 0.5 0.5 0.5 
##$TPOFFS= (0..7)
0 0 0 0 0 0 0 0 
##$TUNHIN= 0
##$TUNHOUT= 0
##$TUNXOUT= 0
##$USERA1= <user>
##$USERA2= <user>
##$USERA3= <user>
##$USERA4= <user>
##$USERA5= <user>
##$V9= 5
##$VALIST= <valist>
##$VCLIST= <CCCCCCCCCCCCCCC>
##$VD= 0
##$VDLIST= <DDDDDDDDDDDDDDD>
##$VPLIST= <PPPPPPPPPPPPPPP>
##$VTLIST= <TTTTTTTTTTTTTTT>
##$WBST= 1024
##$WBSW= 4
##$XGAIN= (0..3)
0 0 0 0 
##$XL= 0
##$YL= 0
##$YMAX_a= 5431
##$YMIN_a= -13362
##$ZGOPTNS= <>
##$ZL1= 120
##$ZL2= 120
##$ZL3= 120
##$ZL4= 120
##$ABSF1= 0
##$ABSF2= 0
##$ABSG= 0
##$ABSL= 0
##$ALPHA= 0
##$AQORDER= 0
##$ASSFAC= 0
##$ASSFACI= 0
##$ASSFACX= 0
##$ASSWID= 0
##$AUNMP= <proc_1d>
##$AZFE= 0.1
##$AZFW= 0.5
##$BCFW= 0
##$BC_mod= 2
##$BYTORDP= 0
##$COROFFS= 0
##$CY= -3
##$DATMOD= 1
##$DC= 0
##$DFILT= <>
##$DTYPP= 0
##$F1P= 0
##$F2P= 0
##$FCOR= 1
##$FTSIZE= 65536
##$FT_mod= 6
##$GAMMA= 0
##$GB= 0
##$INTBC= 1
##$INTSCL= 9.790993e-09
##$ISEN= 30
##$LB= 1.5
##$LEV0= 0
##$LPBIN= 0
##$MAXI= 10000
##$MC2= 0
##$MEAN= 0
##$ME_mod= 0
##$MI= 50
##$NCOEF= 0
##$NC_proc= -10
##$NLEV= 6
##$NOISF1= 182.463
##$NOISF2= 159.3651
##$NSP= 0
##$NTH_PI= 0
##$NZP= 0
##$OFFSET= 198.0616
##$PC= 4
##$PHC0= 2760.779
##$PHC1= -107.5131
##$PH_mod= 1
##$PKNL= yes
##$PPARMOD= 0
##$PSCAL= 0
##$PSIGN= 0
##$REVERSE= no
##$SF= 81.0140089999434
##$SI= 65536
##$SIGF1= 159.3651
##$SIGF2= -187.1042
##$SINO= 113.3802
##$SIOLD= 16384
##$SREGLST= <1H.CDCl3>
##$SSB= 0
##$STSI= 65536
##$STSR= 0
##$SW_p= 32467.5324675325
##$SYMM= 0
##$S_DEV= 0
##$TDeff= 32768
##$TDoff= 0
##$TI= <>
##$TILT= no
##$TM1= 0
##$TM2= 0
##$TOPLEV= 0
##$USERP1= <user>
##$USERP2= <user>
##$USERP3= <user>
##$USERP4= <user>
##$USERP5= <user>
##$WDW= 1
##$XDIM= 65536
##$YMAX_p= 461309701
##$YMIN_p= -222665755
$$ End of Bruker specific parameters
$$ ---------------------------------
##NTUPLES= NMR SPECTRUM
##VAR_NAME=  FREQUENCY,     SPECTRUM/REAL,   SPECTRUM/IMAG
##SYMBOL=    X,             R,               I
##VAR_TYPE=  INDEPENDENT,   DEPENDENT,       DEPENDENT
##VAR_FORM=  AFFN,          ASDF,            ASDF
##VAR_DIM=   65536,         65536,           65536
##UNITS=     HZ,            ARBITRARY UNITS, ARBITRARY UNITS
##FACTOR=    0.49542278885378, 1,            1
##FIRST=     16045.7642231865, 0,            0
##LAST=      -16421.768244346, 0,            0
##MIN=       -16421.768244346, -222665755,   0
##MAX=       16045.7642231865, 461309701,    0
$$ Real data points
##PAGE= N=1
##DATA TABLE= (X++(R..R)), XYDATA
$$ [...]
45119 -27635554 -14663609 -2465907 -2653867 -13828428 -23715734 -24437511 -17968332 -8541388
45111 -8541388 1637389 9343566 10776644 6047151 -1981439 -12422770 -24661235 -34355775
45103 -34355775 -38066696 -39597570 -43763577 -46115389 -38827514 -26019045 -21591333 -29565037
45095 -29565037 -37828255 -36172965 -30312666 -30794709 -35983913 -34998906 -23313939 -7563166
45087 -7563166 3119131 4488371 -2363702 -12413150 -19212847 -20314387 -19916530 -23100529
45079 -23100529 -28431411 -29547883 -23474740 -14060910 -6922184 -3780749 -2937752 -3209671
45071 -3209671 -4740024 -5726151 -1369785 10390869 22742370 24390239 12320521 -3542308
45063 -3542308 -11248590 -8780865 -1983692 4662608 9717512 11178284 8257798 4649474
45055 4649474 3457974 1220782 -5608794 -10690794 -3915157 12881176 26456781 29981485
45047 29981485 30186731 33353604 34297102 25901106 12279388 4551889 7132079 14680915
45039 14680915 21150633 26998085 36822006 51217619 61885151 58188961 41507806 28263781
45031 28263781 31582304 43630856 45927346 34793796 24044566 22142310 21374305 14566338
45023 14566338 8598022 12289367 21181636 24378527 19542443 12436090 7333094 5373219
45015 5373219 7090768 10168864 10108140 7933285 9690046 13301481 6353599 -14637183
45007 -14637183 -32980272 -31182715 -13628353 1998936 8921040 13724157 20077418 24481906
44999 24481906 26182557 28398264 30280421 28523003 25842895 27437451 30460853 27550482
44991 27550482 19363556 12824653 8303879 112763 -10701896 -16047128 -14406854 -13730146
44983 -13730146 -18703837 -24815646 -26962514 -25304339 -21516022 -17650520 -18747195 -27338376
44975 -27338376 -35535141 -32643308 -20875008 -13152435 -15119755 -20352868 -23522668 -25615568
44967 -25615568 -24543618 -14247857 2760004 14172277 13620144 6374334 -3845571 -20178917
44959 -20178917 -39418433 -47797215 -38838776 -23987977 -16673926 -16355637 -17153250 -21084243
44951 -21084243 -31252303 -40509652 -38849852 -26551185 -10712269 4938574 17918262
44944 17918262 22153135 15831089 8078304 7511281 9739500 6282813 -476963 -2896473
44936 -2896473 -2791596 -7057697 -12260145 -7959280 5365136 15292408 15751351 14170171
44928 14170171 17323349 20412142 14739913 -895442 -19943624 -33922994 -36837571 -28931926
44920 -28931926 -17155811 -7958688 -916812 5761492 7248088 -1575293 -13817240 -15509486
44912 -15509486 -4327969 6412669 5641814 -2049232 -4948039 904702 9973198 14902226
44904 14902226 11617640 894454 -11475672 -18778301 -19314964 -15451774 -7491195 5649344
44896 5649344 19365368 24645626 19433463 12166655 10282959 11225313 9106904 4276346
44888 4276346 471019 -2847223 -8798492 -16774397 -24034643 -31307849 -40273467 -46741172
44880 -46741172 -43646150 -32031514 -22537075 -22572430 -26597403 -23626041 -11670060 437635
44872 437635 4812051 2475187 -2008059 -8247137 -17635627 -26850803 -30478731 -29346256
44864 -29346256 -29244177 -30287275 -24987598 -10309785 5349748 12517258 11824309 8212483
44856 8212483 1505 -16519869 -34899988 -42318569 -36397351 -28446286 -27462900 -29623991
44848 -29623991 -27439824 -21249323 -15676134 -10294388 -450562 15175242 32489713 45342895
44840 45342895 47557349 34790261 9519675 -16581831 -29429469 -23076505 -3333043
44833 -3333043 17492045 28737156 27466327 19710644 15024312 17849987 24285657 27440121
44825 27440121 24377723 17313664 9912887 3458432 -4324441 -16484073 -31490157 -41937562
44817 -41937562 -41466577 -31858210 -19648170 -7348543 6332600 18521842 22590111 18692884
44809 18692884 15728223 17985427 17193682 5171310 -11018714 -15774580 -4765886 10717218
44801 10717218 19153291 20038840 17818705 13056293 5503360 799055 6170616 19308539
44793 19308539 27192240 18831177 -2961942 -24438423 -33947012 -30094068 -18776892 -6474289
44785 -6474289 2493505 6180589 6015388 5761025 6574509 4877401 -1974382 -10547420 -16138072
44776 -16138072 -19873156 -24660595 -26235597 -17419990 -2237476 4334298 -4633044 -17973595
44768 -17973595 -22119702 -19315231 -21148879 -29268921 -33295396 -26002662 -10424898 7939666
44760 7939666 25927255 38250246 38801007 31352760 30316241 43397603 58961658 58650723
44752 58650723 39737960 17066878 3548557 -3171839 -12148284 -23915713 -29754536
44745 -29754536 -24221909 -13025503 -6824603 -9849983 -16951273 -21172325 -21986909 -24859409
44737 -24859409 -33269585 -42567025 -42937745 -29126990 -6974872 10788241 15915307 11251179
44729 11251179 5742038 4524302 5483763 3810920 -3243736 -15324377 -28293340 -33791008
44721 -33791008 -24496152 -3413695 15256972 18992042 9596514 -302040 -1931568 2474667
44713 2474667 6170189 6196606 3842135 1327428 1039293 5335279 13692651 21006831 21487535
44704 21487535 14389390 4472200 -2789506 -4938486 -2215146 3727935 9803794 12640349
44696 12640349 12431966 14626358 24105939 36696292 40406050 28965128 12117774 7153466
44688 7153466 19451399 36105545 41024393 32182490 20540391 15820072 19042442 27338762
44680 27338762 38843130 50256806 54557201 46045679 27103127 7324535 -4239023
44673 -4239023 -5110303 1219395 9837877 18030940 25815190 34092436 42302870 47413083
44665 47413083 45327639 34339540 18008595 3803185 -2749206 -2630147 -795207 534475
44657 534475 3797265 11156502 20744484 29354207 35945174 39966235 38815661 30676960
44649 30676960 18608551 8189347 1576488 -3102262 -7418127 -11385968 -15717804 -20662932
44641 -20662932 -22397725 -15811713 -2691120 7598228 8337838 2404394 -3710135 -8111197
44633 -8111197 -11346735 -10590269 -3042653 6615301 9543321 4042911 -2959997 -6934748
44625 -6934748 -11131015 -17697903 -20564980 -13706427 -1932752 4399023 3395158 2118412
44617 2118412 3085781 -595729 -12679554 -23801620 -21181235 -4982795 11875274 19399788
44609 19399788 19919938 21030505 24673314 26410254 22636462 14975543 7898623 4138821
44601 4138821 3000334 2168581 82961 -3639785 -8658407 -12896948 -11891311 -2424543
44593 -2424543 12417039 25071857 31582405 33929416 32750877 24002617 7903130 -5000883
44585 -5000883 -5643446 -800376 -4666322 -16556394 -19350499 -3854874 16899182 24958616
44577 24958616 19705491 13530691 12642333 13790080 16125494 23527735 34377888 39623456
44569 39623456 34183288 22727542 11543973 1886823 -5598330 -7573472 -4670225 -5509664
44561 -5509664 -16793455 -32256157 -38605925 -32002912 -22350314 -19852190 -22749520 -22000414
44553 -22000414 -14855723 -8782251 -11930751 -23802707 -37053332 -45273373 -45968919 -38464595
44545 -38464595 -23939439 -7538329 4333739 10342573 14212594 17364447 16201200 8821230
44537 8821230 -607535 -7653116 -13158481 -18866882 -22303931 -21210338 -18251172 -14841514
44529 -14841514 -5350523 13529883 31421792 33794438 22407058 14629264 20452900 31386810
44521 31386810 35672558 32832987 26900260 16573382 2015182 -7138589 -2478337 9348389
44513 9348389 14805513 12105060 10249947 11996488 11307162 8560332 13463425 26339651
44505 26339651 28975506 5625674 -33053938 -58575759 -55551906 -34868073 -16443714
44498 -16443714 -8687726 -8300724 -11699484 -18411856 -25831796 -28479435 -24562793 -18996803
44490 -18996803 -17091921 -17553111 -14759963 -7050751 554235 2711011 180993 -2357182
44482 -2357182 -3538021 -6939886 -14441697 -20828748 -18392773 -6522317 6681006 13551979
44474 13551979 14536133 14322216 13455732 8671271 468360 -5624427 -6822397 -6744740 -8531773
44465 -8531773 -9621653 -8045646 -9218461 -19291570 -33687222 -39767395 -31384961 -14378777
44457 -14378777 3261562 19475056 33227918 38367741 29111821 9484355 -8197412
44450 -8197412 -14598918 -10640414 -4227451 -2157289 -4923486 -7607059 -5672899 -302388
44442 -302388 2832135 319358 -5054661 -7808290 -5655496 -1097837 1534344 6646
44434 6646 -3817313 -5947422 -5227443 -4980513 -7709824 -10608583 -10452870 -10425026 -15255778
44425 -15255778 -20641855 -16742836 -4349683 2475429 -4228115 -13369409 -10474391 414181
44417 414181 2656923 -7646564 -15288398 -7595125 8285594 15822704 9948037 433491
44409 433491 -2133840 2958902 9366398 11553105 7564262 -2777093 -17932860 -31831309
44401 -31831309 -34668581 -21377963 659948 17147264 21898087 21797874 24262718 25689877
44393 25689877 18118075 2569051 -12426845 -23115493 -32001991 -37329821 -31717683 -15281236
44385 -15281236 -1148072 -735735 -8959107 -11838526 -6047412 -2813624 -11866168 -28321760
44377 -28321760 -38951193 -37632549 -30113024 -24311882 -20523003 -13981328 -4715456 260392
44369 260392 -3788014 -11669828 -13396388 -5133879 8028455 18384267 21154210 15804780
44361 15804780 6827877 2360227 6619355 13403634 12203482 1412331 -9584618 -11831947
44353 -11831947 -4047385 12441792 37361293 65094306 81739081 76489392 53313437
44346 53313437 25932563 4488541 -7577809 -8712431 -1005947 5080283 -1139225 -14857958
44338 -14857958 -17292008 1733705 29253198 43503169 37995294 23973219 12195235
44331 12195235 2151577 -8964985 -15894437 -11290163 1554727 9787719 5812005 -4259281
44323 -4259281 -9062323 -4627306 4525581 13029017 18058129 16710115 6573212 -8901917
44315 -8901917 -19966444 -19047500 -8162627 3942733 10355923 10297963 7329266 5817039
44307 5817039 7798666 11131613 11766924 9342513 8574418 12951279 19432628 22926145
44299 22926145 24257454 28894322 37767548 44208080 41700093 30859918 16514235 1516602
44291 1516602 -12826868 -22551641 -22291045 -11569259 3125282 13751607 16626263 12961369
44283 12961369 6572500 2733968 6487350 18225891 31056992 35656913 28858367 15623161
44275 15623161 2155179 -10008209 -21445047 -29773163 -31325430 -26968555 -22092956 -20253823
44267 -20253823 -20311350 -20681700 -22297952 -24989746 -24812761 -19236251 -12673740 -11690013 -15253792
44258 -15253792 -15224853 -7848873 438047 1833267 -2493703 -5576918 -5157215 -4923260 -6524834
44249 -6524834 -7779210 -10431347 -21868460 -43461612 -62416481 -62876340 -43563488 -18101444
44241 -18101444 786263 10367899 12340694 8067338 2561848 4235258 14134192 21448977
44233 21448977 16568439 3713342 -6795754 -14121949 -24830450 -37294932 -39674003
44226 -39674003 -26193595 -6432109 6455273 10592815 13586557 20537533 29163881 34479517
44218 34479517 33942431 28719585 22320103 17373018 12999769 6947790 154808 -4122496
44210 -4122496 -6294318 -11388416 -21930099 -33155025 -37805992 -33735858 -25519062 -20606044
44202 -20606044 -23808652 -31922804 -33655592 -19800631 5222705 26717031 35616187 35343033
44194 35343033 31829844 25274286 16390331 12433767 18616534 28398124 30768877 24369034
44186 24369034 16707750 11785132 6849714 690609 -3057561 -2090858 1559904 6160119
44178 6160119 12388634 19147888 21979456 17832765 8496701 -1702099 -9261162 -12862240
44170 -12862240 -14132541 -16236064 -18875785 -16638691 -6524829 4720580 6396045 -3272608
44162 -3272608 -15022144 -19486936 -15939955 -10439957 -9807391 -17131424 -28522825 -34377760
44154 -34377760 -28420522 -15512890 -6572488 -6742585 -12729294 -19321316 -22215376 -16370639
44146 -16370639 448723 22372281 40348921 51688737 57984205 56418449 43741508
44139 43741508 27766896 21927169 26403418 27754567 20820543 16585759 21828414 26141920
44131 26141920 20133981 13062636 17542375 26542633 22545855 4224081 -12564931 -18020042
44123 -18020042 -16928900 -14205656 -7085240 5614792 19196293 31282787 43162904
44116 43162904 50272102 43301355 23380625 5054891 -1894030 -3941986 -10772865 -20045912
44108 -20045912 -23292709 -19635869 -14870867 -12125752 -11602647 -15222510 -23212560 -29150913
44100 -29150913 -26417493 -17696073 -10991355 -8156384 -4816395 -250672 1058081 -1683417
44092 -1683417 -3124184 -675619 770090 -3359150 -9953271 -12967599 -11936138 -11080809
44084 -11080809 -11780899 -10383344 -3425763 8176061 20523134 29579685 31714026 24268958
44076 24268958 8808212 -6519362 -11404624 -3089047 9033685 11457553 438582
44069 438582 -13855162 -18641432 -12849925 -7973124 -14501968 -29614573 -39984809 -35973506
44061 -35973506 -20657179 -4026394 8899561 20377794 31190178 35526616 28557819
44054 28557819 15661107 8275440 10782591 16368602 16802613 11926973 7540248 7505696
44046 7505696 10610215 12858014 10493832 2538138 -7532233 -13728816 -12496363 -4897474
44038 -4897474 5756530 15761577 20703929 17836074 10596365 6454720 7334695 6047342
44030 6047342 -4100455 -19573187 -30604261 -31788525 -24043787 -9283365 10253889
44023 10253889 28503782 38204598 38168315 33200846 26445273 17103853 6644057 1058711
44015 1058711 3507259 9030212 10762729 8997519 10101891 17207391 25250150 26264045
44007 26264045 18555276 9521975 8409702 16422241 26202500 31894570 35862975 42196120
43999 42196120 47904775 47264766 42590509 42074360 46439980 46829775 38966425 30424963
43991 30424963 28068483 26161635 15516075 -669239 -9834781 -7021750 163926 3518050
43983 3518050 2830948 779600 -3256703 -10159672 -16331132 -16088546 -7225125 7224818
43975 7224818 20695371 26276184 21683362 12349512 6454795 5400547 2060173 -9936732
43967 -9936732 -27721744 -41411979 -42577248 -29914198 -10131643 4937378 5855555 -6040752
43959 -6040752 -19280814 -23976735 -21604247 -20914992 -26161322 -32973343 -35088688 -31018382
43951 -31018382 -22933453 -12477922 -906240 7749317 7566718 -2885422 -16545840 -23392963
43943 -23392963 -20563310 -14301347 -10622707 -7395345 897912 12901118 20103225 17213694
43935 17213694 8553864 2387384 1584954 1503244 -4397681 -17232208 -29451443 -29894526
43927 -29894526 -15047249 5597603 19063648 22437560 21706123 18827254 9263959 -5190807
43919 -5190807 -11443714 -892573 16348906 22631934 14997471 6440037 5588282 5329908
43911 5329908 -4557923 -20755063 -28733120 -19510830 664865 17901751 25518971 29347728
43903 29347728 37793044 48888382 51174218 37737879 14594691 -7060556 -21958956
43896 -21958956 -30706709 -34455501 -35784773 -40249129 -49176902 -54016415 -46547886 -32650614
43888 -32650614 -25885399 -27747264 -25620240 -12944430 -116124 602953 -8243010 -15444683
43880 -15444683 -16946260 -16852430 -17266881 -16193484 -13791530 -12858760 -12911215 -9539323 -328001
43871 -328001 12285701 23748095 30021638 28957522 22597053 16915069 16074206 18312136
43863 18312136 20167154 21992398 25265520 27086389 22638623 11999487 -55844 -9878322
43855 -9878322 -16202199 -17358288 -12914630 -7554349 -7636617 -13344126 -18881363 -20502336
43847 -20502336 -19415216 -16814525 -11987826 -6575496 -4960253 -8127107 -11852061 -13127172
43839 -13127172 -13840135 -16009784 -18314780 -20095360 -23885943 -30555478 -36674451 -40646407
43831 -40646407 -46360235 -55219543 -59208200 -49732950 -31238562 -17557943 -14189425 -12135794
43823 -12135794 -2130565 11868377 18381532 13253213 3178095 -3676605 -5469650 -5408149
43815 -5408149 -6878281 -10606688 -13784734 -11528189 -2010893 9264345 13465277 8097849
43807 8097849 -314739 -5147511 -7826089 -13303365 -19982039 -19912028 -9413624 5604510
43799 5604510 17002595 23065148 26797698 28625649 25042780 14150191 -287363 -10909001
43791 -10909001 -12213972 -4899398 4210736 7550900 3021589 -5868440 -15214529 -22910979
43783 -22910979 -25871871 -20832359 -11109056 -7202083 -14613180 -24014271 -20322746 -882188
43775 -882188 21258243 32035110 28737684 17742028 6349399 -1309316 -5504855 -10129173
43767 -10129173 -16448880 -17165580 -3357728 20325178 35021656 27819287 7034069 -9082374
43759 -9082374 -14371083 -17592028 -25839612 -34432926 -34759830 -24940082 -9516899 6425953
43751 6425953 19171075 25581621 24104414 15710106 2429857 -13468308 -27801852 -34387684
43743 -34387684 -29128862 -13751691 5383875 21241405 28854908 27060197 19814087 14097569
43735 14097569 13632148 15053642 12624498 6430740 2999746 6795037 13686358 15354679
43727 15354679 9281167 1716589 16599 3875366 6044586 1635827 -5011862 -4383602
43719 -4383602 7037583 20997283 24577107 13177570 -5153073 -18859360 -24218940
43712 -24218940 -25756698 -27429991 -27329206 -21607048 -10456650 1383474 8121651 5993432
43704 5993432 -4626813 -18528309 -29153475 -34571733 -38297741 -42985745 -45884066 -42331975
43696 -42331975 -30919811 -13044307 9002873 30088401 42324279 42428429 36360600
43689 36360600 31124843 25073369 13976733 4263124 9022228 28476386 45048714 44030504
43681 44030504 31221430 22594565 22876029 23662952 18823140 11121960 3858922 -4011682
43673 -4011682 -11388511 -11570129 -604470 15188655 24700900 22654301 11531493 -4017935
43665 -4017935 -19807896 -30253682 -29401660 -16504208 1293898 14016597 16893368 13510158
43657 13510158 11735411 16249225 23756828 25638031 17113200 3867260 -3395387 -2458071
43649 -2458071 -3925741 -17818750 -38122877 -46831431 -33890344 -7633481 15784125
43642 15784125 27166970 26228531 16599037 5286788 1453175 7202828 12070862 4724576
43634 4724576 -10853067 -18453163 -8855764 11025499 28345591 36494020 36262449 32192457
43626 32192457 29983838 31874271 33174652 28532421 21267452 19533709 23619449 25755144
43618 25755144 22814812 18876492 13750646 1318727 -16515237 -27061990 -24958291 -20803869
43610 -20803869 -22952550 -23040622 -11536859 3383335 7512761 3199485 4118644 12630520
43602 12630520 18763609 18734359 17669851 14722797 2784456 -14548573 -21821850 -12563239
43594 -12563239 2050456 10255957 12657803 12685779 7223916 -4988795 -16197657 -19939356
43586 -19939356 -20645572 -25069116 -31328616 -34102983 -34046682 -34290649 -33446370 -29807756 -27544337
43577 -27544337 -31303864 -38621257 -43766361 -44608216 -40273671 -28546610 -13260124 -7779847
43569 -7779847 -20351394 -39139457 -42882042 -26402334 -6030258 1944656 -129827 2111750
43561 2111750 15629011 32285848 39059946 32355286 20588898 13199834 10352870 6811374
43553 6811374 3002169 4683094 11236855 13298164 6005933 -3448210 -7090191 -7289747
43545 -7289747 -9401159 -10720724 -6619253 -2184890 -6063794 -15056480 -16451389 -5906016
43537 -5906016 7394094 14739089 17084119 17411361 13391563 3164070 -8070313 -13181078
43529 -13181078 -11305571 -6720443 -2588699 320191 1122864 -709006 -2732309 -548549
43521 -548549 7036727 14659872 14507510 5985035 -325101 6459830 21752001 27257749
43513 27257749 12770557 -9890860 -21227557 -17128286 -9204999 -6328946 -6910423 -8466361
43505 -8466361 -12702527 -18013299 -17325638 -8983035 -2183731 -5501467 -15335099 -21288952
43497 -21288952 -18828432 -11521538 -4261897 656585 3196587 5933690 13194364 26028094
43489 26028094 39046479 45236979 43275723 38139464 35290858 35484533 34383549 26943566
43481 26943566 13490823 718235 -5876697 -9148431 -15429164 -23391105 -24415247 -15677698
43473 -15677698 -6008618 -4509624 -8454128 -7645378 2398799 16286831 25518342 25416240
43465 25416240 17253281 7210969 1907967 2140076 2495750 -1038024 -6114076 -9238626
43457 -9238626 -11952885 -17036389 -21331685 -18521105 -8854589 -658251 -402736 -4819061
43449 -4819061 -5412617 428564 4904767 -2384327 -21382143 -37442250 -33295579 -6397535
43441 -6397535 27616686 49487827 51933571 40838047 26288965 15940468 13125727
43434 13125727 15853131 18316625 16989361 14524406 15034370 17444611 17274042 13568217
43426 13568217 9678098 7566975 5677573 2967266 1104503 1242731 1707019 820816
43418 820816 26607 2147352 7313732 12222479 13827755 13312654 15491259 23269257 33171106
43409 33171106 38296532 36027613 30673013 27972557 29752082 34830986 41009861 43278833
43401 43278833 34415734 13197792 -9570870 -19304352 -12643510 431797 10232774 17597909
43393 17597909 27520444 37467471 38371824 26804840 10679097 369141 -2459733 -3505296
43385 -3505296 -5365529 -4074308 2654794 9533975 10857166 9593161 12271440 16477809
43377 16477809 12483826 -559539 -9170968 -2584476 11081450 13882672 -59634 -20142312
43369 -20142312 -35346826 -45507829 -54572960 -60756405 -58787964 -47919927 -32808233
43362 -32808233 -18227892 -6460051 1472760 5599777 8028029 11478661 16041225 18918339
43354 18918339 18009603 14505572 11054805 8370700 5213259 1561533 -126921 2112608
43346 2112608 6824821 10554939 11214284 8775894 4239986 92039 58679 4897571 9192528
43337 9192528 6213975 -3977023 -14762305 -20903904 -22038634 -18827758 -11588236 -3854512
43329 -3854512 -1046658 -2923055 -2677020 3849977 13463080 22442600 31307169 39278655
43321 39278655 41791930 39152265 40008135 48570495 55286905 49636515 36505114 28965989
43313 28965989 29000994 27662678 22207202 19533379 21377546 19004905 7133459 -6934030
43305 -6934030 -13434657 -11792157 -7307332 -2494386 3773300 13075100 26035522 39425535
43297 39425535 43863587 31277695 6544781 -15246987 -25090136 -26453151 -24396707 -18307571
43289 -18307571 -9067181 -2918988 -1698277 1986134 12640061 22928395 24533869 20444257
43281 20444257 17921206 16391104 12094364 8423342 10316046 12815241 7149873 -4131198
43273 -4131198 -9583284 -5344331 1719071 6621220 10287864 10190330 -260448 -18262036
43265 -18262036 -28083150 -18044200 5347976 25755290 34040008 32015318 24696051 15530620
43257 15530620 7217428 2068641 1351997 5473643 13019347 19380413 20081735 16487037
43249 16487037 13943589 13024613 7966568 -3562782 -14683644 -17699035 -14119272 -11559968
43241 -11559968 -13947770 -19747947 -27040180 -34400832 -37862859 -32822855 -19960067 -5781429
43233 -5781429 2995713 3054091 -5862918 -19959502 -30153893 -27654097 -13563427 594210
43225 594210 4528476 -1418851 -10504844 -18977951 -26547167 -30293670 -25137642 -11663426
43217 -11663426 1885649 8210935 7786087 4495515 -1037481 -8974454 -14730848 -13133214
43209 -13133214 -7537400 -7480523 -15435913 -22528268 -20790274 -13473187 -7831149 -2858755
43201 -2858755 7940971 23595127 33761579 31297965 20634365 11097961 6687185 5812683
43193 5812683 7450471 12658945 20718871 27951167 32020570 35290310 41379600 48612857
43185 48612857 49743912 40132752 24165728 10339508 1422993 -5722979 -11074444 -9376570
43177 -9376570 -161201 6983953 3306383 -7148263 -12742311 -8123584 3487887 18190595
43169 18190595 32944754 41162838 36844512 24386059 15585455 14871178 15684415 13426528
43161 13426528 12096765 13670126 11195657 624361 -8344463 -3287317 13753151 29800762
43153 29800762 38220867 42029690 41819712 32605933 15485210 2081850 1311091 8091986
43145 8091986 11129009 7539133 4041554 6622858 14823210 24906682 33215533 36193386
43137 36193386 31812170 22497007 13288938 5478232 -4737607 -18557654 -28253964 -23413514
43129 -23413514 -4081309 16233559 23007200 13952409 -2143178 -16767831 -27376959
43122 -27376959 -33011323 -30649019 -19276484 -4333140 5805875 7007233 978945 -8541520
43114 -8541520 -17900098 -22561638 -18257160 -5306132 9960708 20419594 24784733 27539618
43106 27539618 31626645 32659606 23041319 2718089 -17004310 -24132097 -20133663 -19283284
43098 -19283284 -32030238 -52258071 -64181676 -59775577 -45350473 -31480523 -21179941
43091 -21179941 -10345254 3286817 16072515 23734076 27152661 30030292 32161961 28948690
43083 28948690 18773693 7574024 3277050 7588329 15933775 23072182 24670908 16013407
43075 16013407 -3304852 -22539512 -25887901 -10564638 6606104 6986214 -8746538
43068 -8746538 -23664172 -26132151 -19910818 -12601112 -3755651 9699974 22404919 23743350
43060 23743350 11590118 -4358311 -15344814 -23776693 -35623469 -46323916 -42390318
43053 -42390318 -18819770 11430642 29779687 29940369 19039815 5310856 -7376720
43046 -7376720 -14318500 -9535290 5392595 19019301 22106253 17784346 14930159 15636013
43038 15636013 15361998 12849672 12926221 19389131 30502333 42531664 53608225 62634170
43030 62634170 67238044 64586852 53569774 36334498 18097635 3673000 -7071001
43023 -7071001 -17975986 -29262555 -35000599 -31064751 -21899287 -14505906 -8661459 763513
43015 763513 13460968 22629083 24522344 22720958 21431887 19864765 15129197 6358028
43007 6358028 -5532402 -18005300 -25732459 -24058400 -15390958 -7500385 -3497560 1510300
42999 1510300 11079677 20124525 21600822 16642780 12495510 12229610 12015365 8806051
42991 8806051 6134266 9827173 19533830 26925189 23676277 11034393 -632859 -3238771
42983 -3238771 456084 2625775 2055168 4300428 10628146 13581238 6352997 -7988917
42975 -7988917 -19504775 -20371949 -9492183 7276953 19223359 17996155 6228254 -4737415
42967 -4737415 -8418321 -10004946 -16619142 -26434588 -32613932 -33233673 -30943995 -26408606
42959 -26408606 -19183741 -13017618 -13153517 -18755601 -23646895 -23977241 -20091268 -12271739
42951 -12271739 -962533 9237522 12310729 8288302 2706554 -1222285 -3794552 -2474324
42943 -2474324 7309613 22218294 29325446 19641963 -1088625 -19410173 -28098344 -28968641
42935 -28968641 -25888214 -21161037 -17662106 -18827908 -24627253 -29887998 -28438408 -19178183
42927 -19178183 -7893835 -1902777 -1921732 -1396187 3481580 6256469 -1248848 -14419413
42919 -14419413 -18521696 -7816043 6843356 14110777 17022776 23802459 31339703 29923514
42911 29923514 21628131 20907697 34495622 51382052 57712174 53405104 47634145 43835249
42903 43835249 36711414 21352911 -932849 -24442772 -41693435 -45796149 -35819457
42896 -35819457 -19759983 -7679481 -1890905 1978255 5205236 3756953 -2719592 -6606779
42888 -6606779 -1843494 6583919 8214187 -334990 -13839385 -27449267 -40113717 -48625189
42880 -48625189 -45952620 -29832283 -8166312 9206439 20957492 31112238 37987985
42873 37987985 34007133 18100607 1556942 -3627224 623022 557262 -12889767 -33439405
42865 -33439405 -46132757 -41787034 -23371464 -670429 17768546 27298543 25864280
42858 25864280 14534139 95887 -6490315 1486710 18787000 31450082 29825562
42851 29825562 17905224 8512331 9784261 17853801 22604895 18542876 8907682 816602
42843 816602 -1149445 3174699 10849728 16938137 16277888 7724370 -2896273 -6860507
42835 -6860507 -1184013 8363646 14111632 14566121 13878442 15123375 17096138 16978552 12655917
42826 12655917 1989285 -16289859 -38353054 -54386169 -55763605 -43399241 -26778040
42819 -26778040 -14590874 -8653568 -7278813 -10537083 -18406429 -25913604 -26102214 -19397671
42811 -19397671 -14852309 -18384857 -24179789 -23565411 -19032277 -20683898 -28999814 -31536286
42803 -31536286 -21074314 -7567872 -3993642 -7539129 -5646214 3576313 9976271 10148105
42795 10148105 13908292 27140875 39628303 38422660 25894179 15494784 14289334
42788 14289334 18282977 21654608 21492861 14872477 580601 -15059321 -21800756 -17327009
42780 -17327009 -9815399 -7045782 -8783987 -11652201 -14480159 -14902621 -7425762 8291330
42772 8291330 21303236 19504529 5273585 -5838313 -3412335 6289798 9673707 2525521
42764 2525521 -6581601 -7764559 -790568 5833562 4256808 -5394392 -15867934 -19703656
42756 -19703656 -15623580 -9103911 -7044037 -11565097 -18806103 -23811642 -26091699 -29193132
42748 -29193132 -34457752 -37055348 -30741539 -16641557 -4486369 -2816603 -9083437 -12284334
42740 -12284334 -5727326 5684943 12555364 12470363 10264212 8027336 1475675 -10289083
42732 -10289083 -17172800 -8281128 11477737 23963281 19995594 10970382 12058309 20387656
42724 20387656 20001759 5992655 -8144401 -10045390 -5063529 -6524820 -16291103 -23648002
42716 -23648002 -20379129 -8606202 5553210 18117981 25544191 24020053 14509188 4288346
42708 4288346 -576288 -1795475 -4543328 -8803807 -9248297 -3372608 4096096 6351925
42700 6351925 1866320 -5226003 -10967763 -15454171 -20344412 -24647149 -25426047 -22257668
42692 -22257668 -18171012 -15397881 -13086954 -10904919 -11671353 -17097491 -23311863 -24761981
42684 -24761981 -21043169 -15702515 -10103181 -3790919 791218 1105174 1338081 7513427
42676 7513427 14791077 10754204 -3902841 -9855118 5698558 27543660 29661220 9133784
42668 9133784 -11493945 -14345450 -4203241 5240819 8477212 5690570 -4368125 -19794732
42660 -19794732 -31462416 -31918170 -23481661 -11948114 1286587 14516820 20514531 15261485
42652 15261485 7292809 9028644 21233272 33886022 39787306 39110169 32691377 20061445
42644 20061445 4441444 -7871778 -14234591 -16622824 -16598969 -14609751 -12540723 -10867184
42636 -10867184 -5453009 5742325 15164540 13404117 2876098 -5333631 -6925750 -6428206
42628 -6428206 -5014303 690505 6149879 -182241 -17819510 -29386907 -23334184 -10235227
42620 -10235227 -6231748 -10022588 -8852275 -403251 5507317 4376225 2630763 4667964
42612 4667964 5386252 -403934 -8255452 -8307731 3441619 20054475 29311696 25993213
42604 25993213 19389866 24325037 41991012 55314380 48467003 25621728 3695532
42597 3695532 -8295049 -13806408 -16570983 -14651376 -6543918 5904179 21560958 39148935
42589 39148935 51697958 50347992 36296488 22085811 17721714 20282600 19548531 9964417
42581 9964417 -4265559 -12558209 -6737449 9388752 20516460 15462398 1294227 -4306199
42573 -4306199 6014088 22493339 31341420 27135805 13117497 -2008275 -7290321 1266697
42565 1266697 13615688 16704692 12923293 16595404 31056079 43131347 45023717 46619904
42557 46619904 56429289 63484415 52220117 27285891 9142986 8789566 19094507 28568575
42549 28568575 32170070 29719763 24425830 23402900 30903679 40641210 42012583 33148322
42541 33148322 20776087 9254489 -1676496 -9968911 -12014311 -10154171 -9718313 -8285669
42533 -8285669 1542571 17016802 24146273 15915874 1556230 -7683531 -12448710 -17943563
42525 -17943563 -21403431 -16633817 -5967020 1838319 3206461 1358131 -1618345 -6321752
42517 -6321752 -10499435 -9894573 -5662919 -4339546 -8793675 -15177910 -21016181 -30140020
42509 -30140020 -45161856 -59397077 -62190917 -51351192 -36003982 -27080898 -28026331 -34523618
42501 -34523618 -39537406 -37586875 -27673790 -14763085 -6578651 -6292483 -9140811 -8149341
42493 -8149341 -2115079 4260843 6861355 5434885 608583 -8535698 -21991631 -35791012
42485 -35791012 -43236931 -39414212 -25647791 -10844214 -6113105 -14043303 -24159291 -23625846
42477 -23625846 -12233433 -1336234 2372086 4738791 12959301 23834242 28857614 25632127
42469 25632127 17816889 8185438 -623788 -1519480 11541164 32534210 45053793 37842915
42461 37842915 15077390 -9569364 -25419034 -30894000 -30873233 -29361700 -23879489 -9032352
42453 -9032352 12600676 27983876 28028206 21271087 25142476 44189157 64848770 72602148
42445 72602148 66471236 54418492 42266169 31764445 24073067 19900076 18766796 21042027
42437 21042027 27939274 37559564 44375569 44811559 40436627 34570266 29542036 28039158
42429 28039158 31815460 37099376 36908591 30822678 26648979 28359029 28345681 17872718
42421 17872718 854789 -10343728 -11196863 -9936166 -15499500 -26096648 -31856976 -25670382
42413 -25670382 -9676730 7097119 16348345 17066685 15712253 19646219 29883417 40019374
42405 40019374 42187045 34550963 23216459 15951073 13962037 11735075 5123699 -4124529
42397 -4124529 -13292395 -22763812 -31303992 -33110585 -26136865 -18213420 -16543408 -16187335
42389 -16187335 -9986537 -5198766 -14798379 -33394788 -40147685 -29568293 -20515712 -25908373
42381 -25908373 -32300928 -23939885 -10550138 -10957224 -20111658 -16102209 3657429 16624687
42373 16624687 8571241 -6952981 -9752964 1677145 14615900 20389568 18921387 12819276
42365 12819276 5562069 1436737 1543291 2772370 3424460 5734113 11112910 17799705
42357 17799705 24265436 29101041 27193098 14182143 -3324297 -11141966 -5468868 750244
42349 750244 -5003976 -18599098 -26904227 -25607026 -21526261 -20769579 -22190595 -21549770
42341 -21549770 -16612289 -8163539 875978 7690095 11804726 13132037 8630743 -3643975
42333 -3643975 -16866180 -19822895 -12304682 -8007897 -16335640 -28631256 -30225252 -20207246
42325 -20207246 -9846686 -5075518 -761692 8168527 18897705 25649795 26264335 22521517
42317 22521517 18544346 19192620 25643885 32548729 33395573 27641409 18368716 5406479
42309 5406479 -12227689 -27769983 -29068965 -12866992 8459455 17887697 8874773 -11315294
42301 -11315294 -29146488 -33879459 -23416394 -4892127 11423903 20132469 22113862
42294 22113862 19118203 9948676 -7623818 -32971224 -59898412 -76403613 -70862390
42287 -70862390 -43807162 -11698914 7322431 11189698 12067087 18528207 27552494 33641131
42279 33641131 35373758 30276976 14279085 -7671671 -20599190 -17849258 -11886725 -16092091
42271 -16092091 -23425341 -17518281 -634590 6966033 -2573611 -12145353 -5483497 8370946
42263 8370946 8937779 -5882827 -18103971 -14990064 -2996267 5040846 5772869 3953956
42255 3953956 3035599 3480943 6610536 14184409 24553368 32484943 33164606 25483418
42247 25483418 12411473 -781533 -9639799 -12906252 -11613254 -6516115 1788106 10839501
42239 10839501 17556576 22053196 27075460 32794383 36131575 37229182 41755396 52084899
42231 52084899 59747634 53482774 34105483 14509740 3717480 -2010120 -8785363 -13263677
42223 -13263677 -8976501 -206966 1055050 -7171876 -12526832 -6734613 479278 -5214703
42215 -5214703 -21471751 -33277564 -36015329 -40492651 -52025738 -58983177 -51173263 -37842879
42207 -37842879 -33787809 -35032015 -24629495 -285780 20705012 26438906 24431842 24641470
42199 24641470 23142992 13260793 2196888 3543023 18295393 34143227 40814254 37721470
42191 37721470 29415635 21426096 18197531 18458317 15616071 8346982 5406143 12679798
42183 12679798 21882842 21825635 15019842 11618127 12243561 10630242 9426450 17201593
42175 17201593 30391626 34714047 26577689 17334749 13068957 6527741 -5375849 -12419948
42167 -12419948 -7809280 325050 3199901 3439993 3412346 -3532648 -17526239 -22312220
42159 -22312220 -7373561 11603748 13057097 1866479 968142 15500839 27056004
42152 27056004 24242708 18656590 24869067 40318526 52096817 52151051 40041577 20610602
42144 20610602 4021819 -501744 4944897 10369129 12981491 18453842 24965306 19325727
42136 19325727 -3897019 -30371449 -42511741 -40481097 -37751540 -41612198 -47329180 -48072873
42128 -48072873 -41995992 -30738355 -17692325 -7809250 -4816074 -8325649 -14801998 -19058215
42120 -19058215 -14561934 1946567 23140615 34205156 28073435 13255871 2225491
42113 2225491 -2736891 -6469829 -9346719 -7565555 -2494499 -268584 -1094335 3120558
42105 3120558 17194941 34055551 41594169 35319811 21153304 7736518 -630359 -4038910
42097 -4038910 -3941595 -2904512 -6196785 -19317740 -40888626 -59894657 -64398105 -53855156
42089 -53855156 -39559161 -31510986 -27903783 -20039435 -5437222 7654543 9452173 237029
42081 237029 -9379351 -10299061 -4954564 -2290483 -3439835 1670085 19917828 42161769
42073 42161769 51114694 40017517 17909594 -1730874 -11439477 -10899725 -5629565 -4578248
42065 -4578248 -11427902 -17665200 -11968741 2840802 11162560 5022280 -6254189 -10307900
42057 -10307900 -6052269 1408220 10154820 17758057 16653340 3417445 -12505148 -18901223
42049 -18901223 -15949365 -12757702 -12682412 -11540859 -7528404 -2813066 3367163 13182263
42041 13182263 21981702 21495436 12430653 4589122 2553597 622600 -4892578 -7967214
42033 -7967214 -3111211 4825133 8538221 9795089 14321222 19237099 16082788 6329845
42025 6329845 3517075 15371831 31316922 35072434 25674202 17353674 19126408 23860738
42017 23860738 21145862 12402496 5501022 337534 -9386222 -21855439 -26604923 -21048108
42009 -21048108 -16936036 -24255145 -36564981 -39669988 -29404542 -13592937 -587559
42002 -587559 6788441 8923587 8326113 9221460 12318861 11962391 4120974 -5601891 -8822591
41993 -8822591 -6980401 -9136767 -17916781 -25741394 -25998368 -20682288 -15016181 -10800736
41985 -10800736 -7639677 -5607492 -4057174 -1783973 -382483 -3690372 -11964845 -19804133
41977 -19804133 -21497701 -16017521 -6427571 2287119 4599848 -1902974 -12509162 -18373660
41969 -18373660 -15352959 -7519609 -1066514 2254863 4199546 5402884 4284220 -55622
41961 -55622 -5268736 -6743679 -1958626 6075989 11314879 10969740 7032515 1330597 -6886822
41952 -6886822 -16843985 -24477276 -27921909 -30380642 -33800875 -34091955 -27004967 -14650201
41944 -14650201 -1935490 8696029 14590485 11294290 -141435 -10623448 -14815478
41937 -14815478 -18211313 -24068754 -22731953 -7174303 9027638 6995826 -8243827 -13261278
41929 -13261278 -566838 12788783 14297788 12970730 19072584 25857341 24015769 19322208
41921 19322208 21450496 26234967 23733658 16170119 13620033 16584182 15628580 6106883
41913 6106883 -6890036 -16941691 -22344827 -25449422 -30415654 -37851700 -39314957 -25412004
41905 -25412004 -3234589 6218023 -3817048 -12872231 -810603 22884302 33401019
41898 33401019 25540383 15541563 12829643 10446515 3948420 217847 2534912 3120664
41890 3120664 -2629427 -7642866 -6043731 -3405138 -6808046 -13923448 -18822698 -20261737
41882 -20261737 -17806458 -8557436 4429794 8617842 -3218886 -20194345 -25636062 -18958424
41874 -18958424 -14655229 -20320980 -26791334 -23549916 -14562961 -11191566 -14359008 -13486880
41866 -13486880 -3724659 4908348 1353391 -9415943 -11964563 -1311437 11068295 13434956
41858 13434956 6778355 -1808405 -9374468 -14591512 -13600759 -7082644 -4851969 -13631673
41850 -13631673 -25427115 -28510112 -25443183 -27977680 -36644585 -38909441 -28001271 -10688663
41842 -10688663 5827906 22208654 38037564 46356883 43706033 36714927 32245764 28379498
41834 28379498 21101055 12650117 6567195 846033 -6566855 -10364446 -3805492 10403278
41826 10403278 21437281 21249267 10055935 -6476061 -20897569 -26861914 -23295316 -15781887
41818 -15781887 -11286175 -11717812 -13493933 -11933936 -5677039 1220563 2013240 -4889184
41810 -4889184 -11999673 -11441333 -6465059 -7533704 -16541531 -22768270 -17077552 -2912338
41802 -2912338 10377564 18437215 21804008 20931902 16416162 9975670 1636593 -9409564
41794 -9409564 -18426559 -16232755 -1433215 14276415 18528225 11446515 1939529 -3619222
41786 -3619222 -3566965 2665689 13268042 22165788 23991915 18747085 8917815 -2595290
41778 -2595290 -8238989 2349963 28811628 54698725 64297024 60312235 56816227 59730338
41770 59730338 63970722 65729734 66153304 64362874 57967938 51043852 51570887 59005660
41762 59005660 62771128 55476050 40972335 27765995 20794546 20874859 25739633 29896402
41754 29896402 29066023 25951393 26433768 30052693 30624299 26590059 23502448 24857420
41746 24857420 27622062 28905326 29908605 30384939 26248762 16884496 8838686 7416426
41738 7416426 9378141 8838366 6289980 6326320 9249280 10828303 9742938 10243953 16134493
41729 16134493 25177139 31695211 33823063 35708274 41029992 46190885 43926538 33865008
41721 33865008 24254637 20766342 19293024 14519764 9849855 11361974 16196590 16265422
41713 16265422 11346198 8463530 8679808 5250914 -3117750 -7680494 -2791671 4972440
41705 4972440 6357735 1514206 -2740057 -2436685 1222627 4223542 1039289 -10713402
41697 -10713402 -23625221 -25556456 -16025026 -10025690 -18900567 -34380206 -40116533 -33341662
41689 -33341662 -24774443 -20470197 -15441539 -5718097 4014509 8774709 11621684 18029804
41681 18029804 25861467 26358669 14880513 -2166878 -12258376 -8495733 4264853 16093500
41673 16093500 23692153 31897062 43210380 51353954 49084990 38355831 27324851 19452749
41665 19452749 11151697 -424243 -12574459 -20867570 -23846313 -22754348 -19368523 -15324290
41657 -15324290 -12020992 -10390361 -10784640 -11823955 -9157004 1188092 15727272 23221355
41649 23221355 16135175 1035041 -7118914 -1226087 10881361 15775288 7693578 -7881321
41641 -7881321 -20783682 -24751101 -20869182 -14096690 -7709927 -2533563 -213206 -2650082
41633 -2650082 -6758832 -4573547 7908628 25512729 40930846 52905953 62854909 67723356
41625 67723356 63051492 50771989 37059647 24031656 10726518 950410 1445991 11472704
41617 11472704 22689273 31388920 42103412 55319467 60762360 50373992 31870393
41610 31870393 20562777 20345307 20903734 13257317 668470 -7652133 -8250272 -5856793
41602 -5856793 -6923367 -13061689 -19685322 -20147634 -12206395 -557218 8250338 12979836
41594 12979836 17658134 24320644 28726841 25168490 13888327 1464046 -5652062 -6034114
41586 -6034114 -1964452 4356898 12013213 20092634 26800735 29948204 28403434 24067700
41578 24067700 21823517 24343004 26022794 16866314 -3470462 -19893562 -17533646 -1196180
41570 -1196180 10065345 8240456 5084650 11238173 18794689 15295447 6245272 8540766
41562 8540766 24041244 35144215 29507390 15856968 8996785 10051858 10730313 9684143
41554 9684143 13421731 23119833 30229121 27106456 16520329 8515364 10558466 21430856
41546 21430856 32594602 35188152 27352184 15024878 5047623 -1480602 -8121256 -16976897
41538 -16976897 -25582619 -29574027 -27329242 -21898289 -18321266 -18752731 -21047351 -22630201
41530 -22630201 -23262394 -21823268 -14024784 1166381 14886869 15608141 3691443 -8416364
41522 -8416364 -12426157 -13375281 -19254848 -28711212 -34389462 -32890870 -25775420 -15429482
41514 -15429482 -5557470 -1186190 -2148024 -916207 6717159 13492577 10959355 3836939
41506 3836939 4855059 17405148 32432280 41103359 40929873 30239410 8363524 -15671774
41498 -15671774 -25126952 -12455566 11530065 29404815 32958924 24998026 12234610
41491 12234610 713714 -6771343 -12530085 -19550637 -24378418 -21010121 -12996566 -11841573
41483 -11841573 -18764925 -18469044 299940 26240184 38543570 33274653 25042712 24908189
41475 24908189 28638748 27627751 20640219 11271811 1953857 -4992703 -5924598 -174808
41467 -174808 6797574 7471624 -1187595 -14913958 -24333602 -22172131 -11483847 -4054351
41459 -4054351 -6530303 -11852990 -10300770 -4234423 -2367353 -2903914 4425609 18916631
41451 18916631 25558007 15940960 -118010 -10748164 -17700163 -26199491 -30251325 -21573278
41443 -21573278 -6078751 2928376 3998685 5721178 8076578 1510648 -13666669 -22294549
41435 -22294549 -14533908 1256225 12587835 18637831 23398737 23098112 12364136 -2865047
41427 -2865047 -10917765 -10762800 -11778120 -17447836 -20104775 -14321936 -5757792 -1398759
41419 -1398759 1671954 10687423 24713747 35614718 40572144 46365385 58890538 73536401
41411 73536401 79948440 73672411 58961665 41715835 25045635 12408685 8922209
41404 8922209 15066596 22672607 22766967 16040999 10271162 8318849 5289553 -1341968
41396 -1341968 -5796661 -2016455 7491501 15366913 18047789 15935945 8391217 -5214456
41388 -5214456 -20357819 -28583641 -24876934 -11827983 2358085 8472506 2862096 -6584875
41380 -6584875 -5174323 11578398 28896270 28633609 12283660 -1241593 -462840 7115936
41372 7115936 10900284 12502192 17638844 22555857 19591384 10940820 5566904 4695443
41364 4695443 1312884 -5994471 -9569000 -5793741 -2113234 -5781488 -12803142 -14232863
41356 -14232863 -8141063 1404831 13140562 28091593 41577658 44550287 35503395 24309803
41348 24309803 19558581 16900157 6635954 -9083960 -14944235 -1446297 20940541
41341 20940541 32977021 29385118 22885595 24930973 30575988 27758793 15814359 6284745
41333 6284745 6757630 12468751 15874426 16918272 19066958 20955188 18898483 14875260
41325 14875260 14521781 17274246 15640160 6778682 -885769 3048804 18310750 34726922
41317 34726922 43354539 42661971 35712336 26968009 21858152 23290025 26142678 20649171
41309 20649171 5594538 -6182690 -1874505 13683837 22047285 13922357 494461
41302 494461 -2300762 5184052 8669702 1229712 -6805353 -2506367 11552424 20634449
41294 20634449 17461305 11259706 14394138 24912411 28377346 16435691 -2329853 -12759780
41286 -12759780 -10093012 -2071959 3445484 6926905 12861522 22818378 35451080 48914667
41278 48914667 59373988 60313224 48328881 28854753 12306951 4490034 3144672 2901896
41270 2901896 663551 -2938451 -3960626 2486298 16881619 32767438 43189199 49014987
41262 49014987 56194036 64761550 66553503 56188349 39014366 24146089 13483645
41255 13483645 2606102 -9487665 -16962807 -14459728 -4923796 1630897 -2659687 -15298977
41247 -15298977 -25217772 -24317748 -16068736 -9793003 -8393542 -7595179 -6427576 -9113524
41239 -9113524 -13366690 -7356505 12903265 30997814 27437030 6608670 -6145906 5147958
41231 5147958 31247387 54125194 66865444 71259346 66717083 52410640 35541683
41224 35541683 27436945 31789030 42455811 51531190 54636506 50281020 40119009 29891660
41216 29891660 25431576 26902102 29447964 28830119 24067079 16298765 8396494 4377677
41208 4377677 5770061 9240463 10179712 7083318 392760 -9686989 -20596344 -26258011
41200 -26258011 -23927676 -19650978 -20647275 -23877311 -19370459 -5183190 7949350 9177483
41192 9177483 -219766 -9501753 -10013068 -2745613 2913824 -1921809 -14800535 -21188148
41184 -21188148 -9355828 14644928 32186908 31922550 19152742 6617903 3154509
41177 3154509 11019883 25499322 35300475 31846094 20757646 15651497 18227736 15381303
41169 15381303 1006115 -11487842 -7874463 5680337 12428388 9353780 8175169 15284471
41161 15284471 23954990 26656577 24013158 20040701 17378986 18348185 22698803 23738937
41153 23738937 14884555 819452 -6134456 -1964292 4763006 5812414 2082092 -2366661
41145 -2366661 -6554657 -9895790 -10801711 -10775600 -12834426 -14100747 -8487847 1099767 3586155
41136 3586155 -3032262 -6212870 2481890 13510731 13380836 3956907 -3072137 -4242200
41128 -4242200 -4649667 -4661304 670241 10074674 15960888 16761852 18754737 23494873 23383206
41119 23383206 13800935 1781219 -2352203 3322015 12914957 20405165 22862929 19568489
41111 19568489 11835591 2440549 -6092263 -11040201 -8341003 3516299 18182510 25556920
41103 25556920 23106618 18180122 17155809 18201380 18188075 20194860 27584693 35327206
41095 35327206 35926176 32439861 36221616 49707573 60098219 55622226 41686681 32836600
41087 32836600 31990547 27494203 11635430 -7879399 -20039135 -25706072 -31791706 -35664306
41079 -35664306 -27299767 -6620825 13141230 22928284 28218726 35843606 40062570 31587515
41071 31587515 14345198 1865106 -752406 -380248 -1232319 2515129 15433362 29962288
41063 29962288 32957630 20399733 2228990 -6147941 3127240 22617953 34334131
41056 34334131 25922264 3348523 -15105269 -17178941 -5667256 9264546 20467975
41049 20467975 25585615 24832101 20422840 14674702 6757561 -5173498 -17799273 -23605507
41041 -23605507 -19884718 -11755155 -3953286 4934915 16782964 27879064 33278749 33276030
41033 33276030 31059439 27419032 22250637 17929165 16281063 15191862 13487653 16427733
41025 16427733 29834207 49595901 63215299 62774697 52063202 40340614 33381989
41018 33381989 31898707 34681188 40179865 46191448 50262021 51340280 51163652 52946598
41010 52946598 56742141 56678386 46448495 28494641 13526457 8595221 9901880 10721768
41002 10721768 11588197 16832816 24419496 26614454 20355501 10959862 5422966 7349850
40994 7349850 18111276 36065413 52739518 56449099 44418743 27906999 21180057
40987 21180057 27191073 37214648 42915624 45014608 49703360 59336775 69066133 72812885
40979 72812885 70428020 66347213 62023331 54409155 43749992 37409607 40730122 48017003
40971 48017003 49867853 47513272 51136545 63101132 71997247 67742337 55444252 47924541
40963 47924541 48912905 50270672 43723712 29555202 14623173 6707536 10326555 23299586
40955 23299586 36679845 41779306 38405493 33692636 32569773 32693450 30139239 26923783
40947 26923783 29490446 40124907 52689706 58589313 56096024 51631627 51352380 54070157
40939 54070157 54894458 53542352 54024669 55911345 52009629 38806116 25457052 26456111
40931 26456111 45214710 68889352 80781445 75911363 63772871 57510341 61581941
40924 61581941 69747132 74186034 74463059 75355624 77845667 77934088 75403536 76688053 84139513
40915 84139513 88789588 82387163 73011682 77515377 97537469 114101121 111106711 95469944
40907 95469944 86769621 93457400 108044523 121602231 132683447 142164492 148933300 154226656
40899 154226656 163828689 181158278 200894678 212813217 211264616 200424459 191960014
40892 191960014 196946745 216578279 240326975 256449852 264411446 272979359 286012833
40885 286012833 296000037 294255667 282628969 271561763 270229708 281494002 301846451
40878 301846451 321801952 330694271 327388507 323889129 332168374 348864358 359242034
40871 359242034 355611057 345324722 340232020 344996728 357629628 374570466 390462202
40864 390462202 397363843 390472623 374510797 360727428 356424789 358810000 359963593 357176697
40856 357176697 356568601 364881006 379298352 389746523 391735934 391209153 394150722 398444056
40848 398444056 401690076 409679434 427061335 444445558 447413754 437105328 429072575
40841 429072575 431131405 436064755 438842046 445385786 457038088 461309701 449847802 433863129
40833 433863129 427736918 426169262 413368981 389524224 371450619 368131081 371116130
40826 371116130 371125867 370458516 374082953 378388946 374222149 355681551 324426771 291011197
40818 291011197 270990443 271431573 281382755 284181553 278352114 276011234 281299000 283954734
40810 283954734 277172950 268027234 264066985 261967266 257255300 253760941 253683660 248544571
40802 248544571 231978513 213951760 209371246 217174156 223049943 220019116 214188508 211262124
40794 211262124 209405697 206909880 206380240 207970403 206456228 198673969 188081858 179372923
40786 179372923 173785038 171672365 174032261 178569536 179217114 173390849 166379142 164713170
40778 164713170 167031038 165069044 153717637 137782101 127201780 125612696 125716888 118567038
40770 118567038 105989624 98422036 99475766 99642097 89843959 74866596 65946759 64589874
40762 64589874 63045205 58685519 57509428 62409414 67796399 69328932 70654093 75504452
40754 75504452 79839560 78055584 72483060 70294272 73302757 76418577 75418428 72027497
40746 72027497 71334312 76515934 85167239 89174565 80792371 62117840 46504345 46300692
40738 46300692 59696872 73457064 78413251 78022524 80743536 88550962 96272249 99511140
40730 99511140 98942831 97404139 96790700 98599871 103714756 109446451 110001372 103329596
40722 103329596 95294116 92927934 95204575 95722111 93794240 96024277 105083333 113906994
40714 113906994 115561998 113442715 115608588 122438743 126473156 123182477 116128471 111467033
40706 111467033 111581089 114082094 114002622 107909936 98568245 93498174 95983226 100701400
40698 100701400 101953157 101594338 103056326 102693229 95921575 88322570 89735417 98497457
40690 98497457 103050413 99856735 97567104 100482780 100245729 89852614 75322624 66326011
40682 66326011 64292453 66913569 74971240 85700266 88039067 75686978 59090206 53791459
40674 53791459 61543921 72729300 81533048 86762586 83190982 67444157 50621197 49084707
40666 49084707 61036941 67049420 57255758 43400290 38220461 37344286 31070926 22275195
40658 22275195 20716249 27318480 35619064 43477497 52404608 58867276 56749214 46917333
40650 46917333 35848861 26413632 17789218 12275225 13553724 19404254 24498071 29506091
40642 29506091 38999682 51062115 58119978 58221467 56131273 52718887 43931571 32652467
40634 32652467 30221123 40862387 54362160 60569367 62279578 66476092 71523410 72490707
40626 72490707 72137185 75683922 79260671 74544794 62152337 50056238 40915979 31825971
40618 31825971 25262665 28080254 38171532 43457737 37445697 26279280 17535655 12299512
40610 12299512 12186990 22584995 41267547 53557772 49087349 37201748 35470364 46746868
40602 46746868 57528998 56993039 47826990 37793024 29363696 21186097 14826829 16073601
40594 16073601 29558476 51644650 68770221 66938781 46057592 21935479 10990591
40587 10990591 15999230 28978484 41910168 49301966 46417906 33840000 21035791
40580 21035791 17215692 20050110 20427505 16268818 13666775 15669775 18326998 17923299
40572 17923299 14990884 11590788 11355539 20181708 38132179 52388724 49051742 32256407
40564 32256407 20585473 23017415 29642448 28606101 20195803 9865569 -463510 -7502128
40556 -7502128 -4068271 10239687 24622457 30981898 33876898 39529860 44705456 45529957
40548 45529957 47512991 55287171 60550384 52944771 36521194 22546016 12194319 1101344
40540 1101344 -4064387 8415712 32950521 47492081 40569365 23569143 12057799
40533 12057799 8321478 7983455 10991791 17513650 22457265 22776137 23366085 28234687
40525 28234687 31846015 26579498 14279502 4176108 3020374 11595215 25815207 36482557
40517 36482557 33801728 18380542 3154123 -1328322 1383431 2411881 1813413 5460581
40509 5460581 12135826 13919534 8105438 -372919 -8195973 -16753556 -25212790 -28773685
40501 -28773685 -26164149 -22040943 -19405585 -15806311 -9697607 -4294024 -1425171 2740253
40493 2740253 11176416 19901604 23682722 24176893 26475962 29832210 28121046 19234132
40485 19234132 8800110 4056594 7915599 18697218 30960652 36581973 30996598 20445232
40477 20445232 17565690 26451861 36897926 37726866 31240963 28388387 32834766 37459247
40469 37459247 36052150 31052918 28143373 29263734 33201899 37905540 39907090 36359706
40461 36359706 29938163 26576468 25927144 20248228 6550929 -6784896 -11236670 -9900839
40453 -9900839 -10783246 -13736012 -13181393 -9945110 -9732299 -11481489 -8438680 -1220958 1577223
40444 1577223 -1898261 -2971309 2142589 4506387 -2663473 -11483511 -11725963 -7679840
40436 -7679840 -10632859 -19415316 -21655501 -13192670 -3458766 194612 1711530 5687920
40428 5687920 8281973 6087767 6139380 17602790 37066290 50615952 49629740 37918540
40420 37918540 23872419 12377209 5467266 4388673 7494241 9956225 9041057 7685151
40412 7685151 10638713 18960412 30005779 40577027 48169988 51473469 51879243 52260756
40404 52260756 52115298 46904184 35258923 23424868 17889337 16457312 12623065 6786637
40396 6786637 5766184 11641897 19355176 26742336 37906547 52352399 59025802 48472220
40388 48472220 26250915 7636210 2029296 7616218 17230400 23157398 19679212 8303923
40380 8303923 -902652 796489 10825440 19843569 23240796 22346856 18044193 11302764
40372 11302764 7860151 13841968 27630614 43449506 60237692 77064151 82553403
40365 82553403 63551880 27285685 1076575 2733427 21179684 33514820 31691644
40358 31691644 23488677 15657814 8200935 1753344 -573480 765337 1070622 -2532984
40350 -2532984 -8764157 -14992764 -18436359 -16502915 -10441199 -6809447 -10349940 -16260654
40342 -16260654 -14082942 463444 20267535 33263088 32683249 22294851 12575422 9885270
40334 9885270 9485517 2892323 -8450586 -13695976 -8571572 -2532835 -4602660 -9140856
40326 -9140856 -3496257 14382554 33562936 42949298 40236902 30418783 21447778 19613710
40318 19613710 23749199 25327071 18312211 6457868 -2665451 -6587737 -6425978 -2078682
40310 -2078682 4483773 6483995 1149878 -3150946 2144448 11294126 11149058 480137
40302 480137 -8731005 -9158634 -6213243 -6467989 -8209900 -7165757 -3695115 -529268 781316
40293 781316 -1043374 -5915774 -9462519 -7351345 -2688791 -1879793 -3321703 555973
40285 555973 8903230 10801411 1817415 -7900345 -7944390 -1362487 2996517 4370229 7624879
40276 7624879 11633588 9139785 -2723326 -17949266 -27818154 -28326011 -22395127 -16696584
40268 -16696584 -14627334 -11630837 -706583 16584536 29019365 27445012 13805245
40261 13805245 -2460992 -12242886 -10437545 1363806 13300122 14730932 6661385 1209518
40253 1209518 6187786 16697220 24772562 29507800 33199903 35379117 36523929 40414944
40245 40414944 46445337 47064984 40330785 37235892 46700582 59615095 59595026 46020930
40237 46020930 34321275 34452144 40608439 43348650 41449487 38476188 35635819 32137236
40229 32137236 27594891 21319603 12960321 5087486 1456635 2032429 2986673 1470921
40221 1470921 -2564402 -7826093 -11440041 -9655427 -3175103 1151706 -789472 -3510879
40213 -3510879 -840913 2412676 -2424810 -11524550 -11611079 -916478 4922067 -6851778
40205 -6851778 -28907922 -42902923 -39230027 -22656306 -4444288 5646551 4540086
40198 4540086 -1455419 -2352872 3930146 10056748 11480823 12977167 18437885 21954166
40190 21954166 16715002 6843575 1341360 364490 -2557488 -6902562 -4729737 5082757
40182 5082757 12163162 8131212 -2446551 -8988353 -7409660 -1470427 3805556 5317758
40174 5317758 1816444 -4484007 -8166794 -6699000 -4677812 -7931891 -14872206 -18439565
40166 -18439565 -15914401 -11358131 -7778721 -3009625 3729086 6777778 1084485 -8595482
40158 -8595482 -11334655 -1900895 15787983 35521333 52469905 59999380 51398422 29454727
40150 29454727 8301922 -695146 -1679289 -6772641 -17915021 -23370134 -13379135 6228213
40142 6228213 19030787 14542502 -1621828 -13040247 -8216069 7564716 17087624 9475842
40134 9475842 -8424130 -21168502 -21843813 -15481665 -8600873 -3021402 108183 -1371783
40126 -1371783 -4752899 -1371346 13042783 30102866 35861614 25465527 8030579 -2527398
40118 -2527398 -354281 7551449 9262506 2235956 -2008407 8129388 27310168 37911071
40110 37911071 32752292 23866470 24143605 30095336 31817578 31824145 40163668 53743878
40102 53743878 56023934 40964530 24481642 24383445 37600959 46232843 40719624 27894196
40094 27894196 19022241 19099804 27676101 41442583 53135388 54344467 44141370 32065365
40086 32065365 28915606 35711859 43793215 44669964 38105852 31273727 31165464 37507185
40078 37507185 42976234 41056704 32975738 25267110 21542133 19617674 16218158 10571348
40070 10571348 3017848 -5456802 -11164439 -10156719 -4709632 -1905430 -2920862 -341528
40062 -341528 8957030 15505206 9975066 -1621064 -5960816 -1754823 1110898 -178858
40054 -178858 1804506 8304089 9962396 4243458 2824563 12570749 21602931 15892430
40046 15892430 -356806 -13735872 -22175498 -31235618 -36363432 -26909276 -6634994 6875619
40038 6875619 5644881 -559494 -2531135 -3228638 -5767011 -4371994 3756330 9211270
40030 9211270 3495546 -7359961 -12867858 -14559766 -20685773 -29139794 -28309734 -14669557
40022 -14669557 765020 5703259 -512074 -9175811 -12444783 -9530980 -5751772 -6431913
40014 -6431913 -10741468 -13117505 -11721651 -11237525 -14140066 -14225156 -4625098 11339094
40006 11339094 23861526 28438308 26956914 19904470 7088140 -4038694 -1640025 14372594
39998 14372594 27455483 22077834 1646472 -16782292 -22039931 -17273929 -11675599 -11009185
39990 -11009185 -16463977 -25958726 -33181272 -29898552 -14534810 2661543 7983837 -777622
39982 -777622 -11441380 -12182922 -6024834 -5746098 -15629951 -25174660 -23835337 -16109347
39974 -16109347 -15467285 -25670342 -35739283 -35071368 -27202043 -24044238 -30140366 -38465914
39966 -38465914 -41185934 -38736355 -35970416 -33840592 -29501633 -22538725 -15545248 -8220461
39958 -8220461 3474481 19623508 32598196 35559854 31696230 29785105 32378785 34209481
39950 34209481 31877138 28858233 29326706 32327191 34807789 36431522 38315822 39745780
39942 39745780 38925820 35383624 30028946 24346170 19975138 16763926 11243413 424188
39934 424188 -12552341 -20499829 -20768902 -17894396 -17116451 -19577099 -23996745 -27219380
39926 -27219380 -22581720 -5665737 15484004 24115390 13843665 -3057591 -11853218
39919 -11853218 -12186913 -11614310 -10538100 -4813257 1442736 -1678567 -15063832 -28652466
39911 -28652466 -34802803 -34312686 -28689038 -16691864 -1456582 8145442 8117337 4758399
39903 4758399 5111288 7589424 6451260 687493 -6293436 -12200094 -16517124 -18113410
39895 -18113410 -16294282 -13013117 -11169823 -11396629 -11798834 -9460545 -1684685 11546440
39887 11546440 25069390 31500339 29219063 25697103 30365812 44456964 59168137 63842039
39879 63842039 55682282 41753801 31765035 29672590 33280024 39957834 48045112 52651843
39871 52651843 47293327 33860715 24829154 29160868 40658251 47528902 49021238 52979094
39863 52979094 59446841 58117695 43416036 22390316 4743965 -7171923 -15879100
39856 -15879100 -23667794 -32542390 -42344868 -46774338 -38534436 -20630318 -4894023 2911827
39848 2911827 8112162 15157206 21027500 24408841 29681764 35077964 28942989 8217931
39840 8217931 -9643529 -6582789 11055392 21340768 16151003 7241089 4873583 5634978
39832 5634978 3858339 1962902 4078933 8625668 12351815 15133281 17310673 18479725
39824 18479725 21309789 29512808 39227615 40133800 29541935 18419784 17794964 24739384
39816 24739384 27968277 23048527 15490013 11233010 10184679 8483615 2861014 -6582585
39808 -6582585 -14833913 -14713050 -4414769 9221638 17913607 20072100 18131006 11065904
39800 11065904 -3601233 -20625361 -27231260 -16233829 4705202 20320891 22394742
39793 22394742 15119751 8030147 6237694 6735512 2604750 -8400204 -18999984 -18712464
39785 -18712464 -6717418 4952983 4958666 -2902288 -3912176 9781987 31390095 49839380
39777 49839380 60993780 65571439 62809567 52819325 41486778 35654943 34308807 30590927
39769 30590927 22085591 12894573 5203895 -4338113 -17458356 -29496128 -35637242 -37381900
39761 -37381900 -38450412 -37735300 -31445123 -20559493 -11139375 -6981318 -5493912 -1684119
39753 -1684119 6050871 14759672 19730518 17621119 8280673 -4817654 -15769565 -19337920
39745 -19337920 -14851231 -7441497 -3717163 -5172175 -7299917 -5895900 -1570385 3602156
39737 3602156 10196233 18394254 23846041 21849403 14318084 7615192 4448388 2718431
39729 2718431 971528 -621190 -3345780 -7657607 -9157842 -4088471 2707910 4356950
39721 4356950 5361385 16749266 36525161 48241527 43760016 34368258 32017163 32424843
39713 32424843 27109900 20317394 20347391 22990042 18650881 9622456 4578226 546460
39705 546460 -12193719 -28677697 -30958760 -14276096 4543319 9865174 3931142 -5247443
39697 -5247443 -17679437 -33004741 -40821129 -32981934 -18448827 -12894317 -17433324 -19797065
39689 -19797065 -14680406 -10426551 -13726053 -18744137 -16956830 -10443815 -8451486 -14281568
39681 -14281568 -22084393 -25552864 -23832173 -18126469 -8472731 2714873 8919517 7419300
39673 7419300 6186251 15282360 31583512 40434682 34755925 23937424 19194936 18810112
39665 18810112 15497575 10626125 10180386 11454645 6507052 -2377882 -3414826 6698755
39657 6698755 17335207 20630594 22822864 32075635 43695062 46869949 41430168 38106016
39649 38106016 42637254 47753145 43548828 30468047 17604732 10601606 6812063 3280514
39641 3280514 3204281 9082365 14320082 11262022 6091781 13451679 33701803 49258623
39633 49258623 50152135 48324264 54641755 56611961 38061989 10400114 158388 9470202
39625 9470202 14799747 6816031 4649160 21265557 39331456 37628760 22878751 16447841
39617 16447841 22269525 27336997 26177566 26178615 31462237 36547754 35476748 26693929
39609 26693929 11164943 -5029892 -10193122 595776 16045310 21735857 18950211
39602 18950211 19574685 25627525 26526926 16287039 1818464 -7207397 -7120882 2227731
39594 2227731 19076941 35910135 41550584 31200208 11104607 -7563263 -16698097
39587 -16698097 -15301025 -10402225 -12065589 -22303804 -30765463 -26201038 -9530704 9461338
39579 9461338 24572335 35924996 44049663 48779412 51467880 51422206 43273652 25232530
39571 25232530 6540825 -1444325 1278948 6478505 10225007 13413849 14343655 11857770
39563 11857770 12592375 23046455 36421733 39573140 31584789 22764521 16743356 8388489
39555 8388489 -311004 1039874 12790577 21283032 19636043 18168906 26286008 37280957
39547 37280957 40910187 39603832 40916340 42829375 38549136 30023332 25422364 26295274
39539 26295274 26211785 20251564 9524410 -1174030 -5476274 843267 13809719 23565265
39531 23565265 26609989 29322944 34719379 34249530 20952059 3712751 -1875087 7039403
39523 7039403 19518456 26159185 26419709 22923806 17763780 14131751 13790521 12786081
39515 12786081 6357089 -2030489 -3148584 5960887 18097457 24644217 23228010 16296013
39507 16296013 7135066 -1177996 -6248892 -7180170 -3796925 3533163 11349993 13339534
39499 13339534 7446872 1177921 5200038 21764091 42510429 56763234 58840592 48716449
39491 48716449 30235081 9820046 -5632799 -11409774 -6714798 4266877 13480401
39484 13480401 15088328 11773214 11396744 16343461 20974296 21496002 22466677 29543341
39476 29543341 40428189 47164312 43818335 29446273 8897986 -6536732 -6685435 4435683
39468 4435683 10573862 3991597 -4401226 -3420608 91282 -5873948 -15306639 -10972742
39460 -10972742 7838562 21498992 16536946 1357383 -9081654 -11370600 -9985867
39453 -9985867 -6562325 -1327350 1966281 423609 -2863015 -3157612 614089 8204722
39445 8204722 19921004 32262176 37943829 35283383 31876305 33515664 35086501 29119636
39437 29119636 18604202 13098460 14419849 14581985 8706296 3359030 8900110 26370450
39429 26370450 44632820 50808743 43509950 34893411 37806117 51598786 63810001 65328174
39421 65328174 58941399 52175276 47930219 45327475 44057037 42972424 38542068 29833224
39413 29833224 21907065 19579643 20893478 21241447 19970806 17282500 9275193 -5416668
39405 -5416668 -17028424 -13313699 2935066 15696641 17832870 20460679 33788083 48343851
39397 48343851 46330114 26876489 7959078 3319509 8369230 12104665 13217580 17209306
39389 17209306 23485728 24659458 18391227 12722680 16410772 26855275 30706952 17109120
39381 17109120 -9666954 -31463497 -32162967 -13046965 9868786 23743560 29209453
39374 29209453 30999287 26377783 11369217 -6223024 -12013658 -4189647 3085176 -1275595
39366 -1275595 -12319827 -19785958 -22198961 -22945936 -20707577 -13882254 -9149666 -14603182
39358 -14603182 -26370475 -31713244 -24910840 -12139654 -1600610 3307834 2419592 -640754
39350 -640754 2820721 17406896 32973600 33810363 20112492 8966736 10560758 15536407
39342 15536407 12310174 5134091 5008422 11972677 18507540 24125246 33233633 41740704
39334 41740704 39766072 28391612 21129232 25267367 32384502 32430354 27872283 26682313
39326 26682313 28559219 27422785 23949596 25883943 35506728 44651247 44819169 36745728
39318 36745728 26817840 18679690 12821735 11049509 15015417 20498378 19178470 8854856
39310 8854856 -1946915 -3162449 5105532 13594817 15388177 12503436 10767148 11865478
39302 11865478 12687222 10815329 8216364 9110187 15025363 22515193 25865383 21896530
39294 21896530 12156207 1359129 -5502753 -5852702 -1474332 2939951 5345179 8923115
39286 8923115 15605393 19340505 12702635 -60994 -5625997 -149141 4342518 -1890796
39278 -1890796 -11163448 -10854131 -3348740 -1196203 -6984692 -11467815 -9929248 -6908355
39270 -6908355 -4358094 1456091 9108423 11123279 7392750 6644133 10151545 7875505
39262 7875505 -2282641 -5849672 6504224 20897825 18189825 1528715 -9469495
39255 -9469495 -7075940 -2095786 -3304509 -5321033 -126997 10817759 20752730 26298413
39247 26298413 27929541 26926514 24571328 21018352 14577983 5460076 -1352091 -1560859
39239 -1560859 2431453 6597935 12987794 23990731 31470151 23277198 2568824 -10202405
39231 -10202405 104055 26399602 50205781 62269136 65777159 64970765 59945031 52048128
39223 52048128 46838541 48625757 54912964 58516651 54761555 45786459 37466156 32431743
39215 32431743 27730202 20390748 13040354 10999837 15062799 20890800 25287539 29000360
39207 29000360 32474397 32986210 28863760 24501547 27773049 41321269 57299355 62785091
39199 62785091 52437269 35063204 24594820 24745849 27050613 24538549 20300705 18789261
39191 18789261 16267929 7673060 -2377875 -5173616 -1878206 -1843122 -7641738 -11948162
39183 -11948162 -10335105 -6899618 -4179711 2384148 14147586 21587817 14670679 -3563393
39175 -3563393 -20321359 -27128413 -25411435 -20742418 -16966431 -15172157 -14453420 -13442066
39167 -13442066 -12376341 -12345516 -12040791 -8387329 -1813853 2410133 90619 -7178599
39159 -7178599 -14170027 -15673339 -7857363 8658383 25432470 31832115 27323225 22810915
39151 22810915 25959381 30808306 27222431 15478920 4377120 -1937439 -7386160 -14648891
39143 -14648891 -19234806 -14927390 -1977362 11267209 14162142 3105042 -13396787
39136 -13396787 -22207229 -20300102 -17310918 -19776401 -19588117 -6346883 13720146 23050469
39128 23050469 16732117 9140403 12653744 20324495 17402819 3052506 -8585195 -5966627
39120 -5966627 9012217 26144272 35573133 31713244 15859781 -3172098 -16200370
39113 -16200370 -23099598 -30597144 -40375410 -46424339 -46607348 -48193614 -55383462 -59011456
39105 -59011456 -49096515 -32927549 -27339578 -33206223 -31982800 -12671266 10572624 16923613
39097 16923613 5488375 -7701175 -12833338 -14054047 -17089228 -21484391 -25588978 -29022576
39089 -29022576 -28641598 -20814135 -9619404 -4912984 -9934079 -17505083 -20172771 -17582175
39081 -17582175 -12695088 -7879898 -6244737 -9684175 -14124522 -13793381 -10617229 -10540769
39073 -10540769 -10160218 1004076 21445037 33676913 26497853 10363793 1963552 3247776
39065 3247776 5717311 6569938 8310968 8534374 3081627 -3779871 -4114589 394683 450623
39056 450623 -6553152 -13925007 -16734252 -16228173 -13464448 -7637944 -1401674 458708
39048 458708 -1198222 -713138 2805795 3593827 -2115138 -11766688 -21493281 -29514903 -34059172
39039 -34059172 -33539270 -29238605 -23146843 -14275885 -2516543 5958225 4171217 -6088782
39031 -6088782 -17124122 -25893777 -33813599 -38222318 -34254947 -25230970 -21075073 -25008502
39023 -25008502 -30745467 -33390206 -32978200 -26572331 -9407899 12358637 22494501 15143103
39015 15143103 4604802 7322719 22123727 35301524 37756759 29766102 15567902
39008 15567902 1218516 -6853537 -7449922 -4530438 1894947 16866512 37329287 48100387
39000 48100387 40550413 27191033 26136014 36750683 42803194 35804996 22413124 10316788
38992 10316788 -243273 -9343500 -12710229 -7761408 2610046 13808266 21173962 18993905
38984 18993905 6299391 -6541956 -6520923 5343048 15255949 16282068 16169316 21606094
38976 21606094 25735913 19266230 5740858 -3839092 -6441562 -7526238 -9448885 -9246969
38968 -9246969 -7077607 -7005460 -7517137 -214599 17145415 32757565 32723958 18050380
38960 18050380 3243084 -1349141 491955 -130789 -4458414 -6880132 -4594741 -243081
38952 -243081 3863139 7568973 8282642 1854926 -8369605 -10283678 2210103 17537917
38944 17537917 18364243 3612035 -10989524 -15280443 -16671383 -24230247 -30807641 -22281626
38936 -22281626 -83542 18379015 22729975 21253598 24646324 28504832 21316914 3582187
38928 3582187 -12410912 -19973500 -23843891 -27287214 -24735031 -13106862 -1800256 -2800369
38920 -2800369 -15226994 -27453913 -31763180 -29490124 -23612853 -14488053 -3755053 3949350
38912 3949350 5162929 265796 -7275931 -10777654 -2423490 18117704 39161330 48293592
38904 48293592 46348815 42032042 35588853 20236506 -248007 -10668734 -6346016 -1670465
38896 -1670465 -8213176 -17327081 -16185709 -9732709 -11465986 -20075460 -22256303 -15360769
38888 -15360769 -10373140 -12234922 -13100966 -8080741 -3146986 -2030596 2049854 14094075
38880 14094075 26484243 28321386 18616036 3737721 -11479089 -23579988 -28205993
38873 -28205993 -25755838 -24236276 -28659810 -31683977 -22847665 -4214156 11301972 15565638
38865 15565638 11505037 5016151 -880117 -3076976 1833016 11129342 15389623 8747305
38857 8747305 -3995784 -13707910 -16458594 -13186358 -4388320 8609038 19215319 19848116
38849 19848116 12046429 6380887 9263958 14656890 13307043 6596157 5055491 14046941
38841 14046941 26936958 33732677 31698813 25271886 19325414 15419768 12372556 8136627
38833 8136627 2413823 -1940301 -2481594 -2118495 -6173015 -13386375 -15219581 -7163069
38825 -7163069 4102389 8762039 4814453 -2891084 -9353084 -9744123 1460736 23437417
38817 23437417 44090559 50796408 45035047 38624675 36542262 32386309 21423451 8719171
38809 8719171 878371 -3035623 -8175175 -16727500 -27592938 -38929067 -47838590 -50756693
38801 -50756693 -46362713 -35804309 -20338895 -2916930 8823341 7769778 -3342271
38794 -3342271 -13874082 -17598626 -16677538 -12765161 -2933063 12164013 24376838 27754966
38786 27754966 26060683 25864377 27988478 30230439 32133630 32004427 26103421 17090072
38778 17090072 16224842 28658680 41781305 37812750 15507898 -8908603 -20587915
38771 -20587915 -18355516 -10037391 -3501431 -2407767 -4677886 -4772169 -1124302 878699
38763 878699 -2786834 -7955981 -9816929 -12165018 -20396905 -29397712 -29393140 -21998187 -18405629
38754 -18405629 -20949117 -18722818 -4997674 12210882 22554669 26804125 30838264 33845999
38746 33845999 31002659 23429317 17446070 15540128 13924919 8489169 -400865 -8085591
38738 -8085591 -8828329 -1443749 6776722 5962904 -3925567 -11341081 -7606534 1680700
38730 1680700 5092402 1348501 151859 8803268 24312443 38423355 44868264 41446553
38722 41446553 30460411 18838603 13876055 16847494 22993241 27998898 31207693 32055347
38714 32055347 27879997 18127674 8038139 4883522 11237111 23611301 36498704 45969696
38706 45969696 50706137 52221513 53897413 57507741 60443541 58417173 51273812 43742768
38698 43742768 39335097 35916185 29331252 19255984 8471379 -2081711 -13575597
38691 -13575597 -25219709 -34553154 -42440298 -52451397 -62592774 -62825293 -46282489 -20537729
38683 -20537729 -2038434 395249 -7931079 -17334750 -24757513 -32921372 -42254612 -47466597
38675 -47466597 -42176651 -25621216 -4437272 12238175 19475238 18377884 12775621 6715189
38667 6715189 4426631 7993960 13698964 15836631 16489827 24664310 40520198 48067213
38659 48067213 33456511 6019675 -10763500 -7753466 2756493 8531693 11354977
38652 11354977 15059247 14565674 6856952 1173281 5112291 8436936 -4383408 -29140506
38644 -29140506 -44388551 -39223990 -24878636 -15735741 -11680487 -5652858 1814319 5069734
38636 5069734 4505861 5912882 10595199 13251709 9483835 577830 -8843632 -14125700
38628 -14125700 -12397365 -5041273 2239676 5741660 9590327 20591437 36828942 46652763
38620 46652763 41529393 25731123 9994235 -403955 -6087188 -5217578 6989183 28432781
38612 28432781 46689159 50825007 43667718 37349767 38121923 40381586 35525461 22168318
38604 22168318 6433766 -4511561 -7674501 -5291981 -2028815 -121552 2243144 6175965
38596 6175965 7825529 2966317 -5403774 -9651371 -7883824 -5486517 -4935795 -1365410
38588 -1365410 7938786 16571974 17570481 13635352 11986637 13356469 13776479 13713450 16292216
38579 16292216 18497913 14589517 8525339 11780333 25370593 34639177 28410895 14636445
38571 14636445 8360330 10749202 11023524 6282684 7334446 22281054 43237567 54381163
38563 54381163 48311152 30474159 11397786 -1156560 -5330014 -5730642 -10450904 -23545716
38555 -23545716 -39766959 -49243988 -47786121 -40217602 -33019394 -26603708 -17182824 -4679639
38547 -4679639 4641471 4605080 -3467316 -11505551 -12576198 -6589242 2031553 10182917
38539 10182917 17115755 20382768 15071952 428517 -14734576 -18249346 -7651280 6606253
38531 6606253 13557504 14441986 19191170 31880508 44725107 47559301 39372216 28298447
38523 28298447 22896970 25902567 34432795 42785492 45069894 38194665 24595966 11973537
38515 11973537 8596363 16496819 28331536 33000905 26810822 17750572 15643310 19614958
38507 19614958 20585013 16054583 14978319 24284939 37438733 43359941 42034564 42208398
38499 42208398 45552373 43843527 34142627 26589596 30488228 39440598 38774919 24700578
38491 24700578 8108120 259350 2171757 8790371 16135619 21137309 20411717 14187514
38483 14187514 8168060 7319051 10437516 14466546 20452099 29578477 36336026 33670645
38475 33670645 24702088 20761094 25364514 28553512 22393751 14763296 19391531 36129520
38467 36129520 50090576 49644284 37675946 24642763 17397911 16227168 16748771 12593395
38459 12593395 1202022 -11091491 -14088456 -5031493 9573520 23520046 35718540
38452 35718540 44319497 44390723 35861715 26828717 23363597 21794174 17029001 12881531
38444 12881531 16473749 26161108 33033978 32686567 28671407 25540908 24653586 25899116
38436 25899116 28045883 28414835 26893870 27964002 33488341 36803325 30906411 19497237
38428 19497237 11617923 7783796 1315053 -7555923 -10142859 -3501686 4558449 8009565
38420 8009565 10034441 13141693 11547476 592288 -13457619 -20644342 -19418929 -15080215
38412 -15080215 -10899403 -7528638 -7202721 -11097054 -14357674 -9910960 3408300 20207416
38404 20207416 33960365 39841867 35540582 23701826 11072275 1719360 -5590123 -10392949
38396 -10392949 -7151247 4853036 13937994 7724768 -9998523 -23495033 -25668714 -25046856
38388 -25046856 -30447146 -37597276 -36186427 -25029212 -14432414 -14284086 -22410066 -25218933
38380 -25218933 -10911004 16512354 38445032 40035214 25450346 10799280 4456524
38373 4456524 1437094 -3042007 -3530367 6837743 22595523 28195819 14830229 -8253930
38365 -8253930 -21337886 -13528213 6127837 18335021 14178133 2825308 -2189852 1284040
38357 1284040 6221320 8362566 7572221 874097 -14524398 -30220062 -29631100 -7243904
38349 -7243904 22460936 40238443 40144536 28427857 12434427 -1948214 -8000135 -3165094
38341 -3165094 5710693 10227170 12253157 20074968 33271655 40132528 32463191 15930469
38333 15930469 2327734 -2540353 830191 11744123 28741529 44936899 51060046
38326 51060046 45180898 35437840 30674097 30869341 29517308 23581475 16892907 13145982
38318 13145982 9908247 3103050 -5021099 -7408771 -1634016 7175746 14353902 21371247
38310 21371247 29743814 33956324 27184915 12706037 2737977 4563662 13095487 19053824
38302 19053824 19289029 15986993 10880212 5516839 3707022 7095634 9746589 4292760
38294 4292760 -5786833 -7379064 5217598 20465680 22440586 9537884 -6373825
38287 -6373825 -17194914 -26510095 -38726405 -48210369 -45132672 -28910232 -10434316 -1253835
38279 -1253835 -3521029 -10094191 -12155773 -7099591 -546025 122031 -5003091 -7906525
38271 -7906525 -3134733 4708844 7768793 6248652 7132459 12977203 18985500 22087287
38263 22087287 25419377 30101836 29414295 18117352 3848022 945479 12648629 26207158
38255 26207158 27987487 18263131 7643581 3057890 2648566 3061450 5665359 13055052
38247 13055052 23037504 30334988 33820962 38286133 47077021 55156906 52916607 37586554
38239 37586554 18483173 8680372 11919833 19735306 21843985 17187978 12945533 14251387
38231 14251387 18286318 19086218 15030411 9480872 6302139 7514093 13504199 21641775
38223 21641775 25319584 18959627 5287837 -5916918 -8087541 -3982008 33859 2338666
38215 2338666 5791348 11760570 18149119 22537224 24526066 25093859 25031758 23570731 18518603
38206 18518603 9917144 3629783 7206137 20172416 32205472 33667173 24717072 12105886
38198 12105886 2052727 -540635 7477590 21379828 28221519 20602092 6902856 -237045
38190 -237045 -1239840 -5238404 -12500536 -15021371 -14172345 -22155745 -41174132 -55108370
38182 -55108370 -50224844 -33536372 -21508675 -19195957 -20127827 -19450484 -16522911 -9792703
38174 -9792703 156363 5966440 2070752 -4730255 -3243905 5522893 10226331 6971770
38166 6971770 4166119 7879170 12880011 12573003 9368209 9361123 12717014 15513991 17172707
38157 17172707 19635781 20764737 14846017 1426808 -10347965 -10326939 -194802 6205930
38149 6205930 -1519906 -16885144 -23693645 -15423310 -465214 12527702 25119221 40191553
38141 40191553 51512801 50633641 38350716 20969063 877625 -19499124 -30276408
38134 -30276408 -23957790 -10424174 -8305135 -20760800 -32650294 -33214197 -27817317 -23367721
38126 -23367721 -16281422 -2706223 10743148 15817472 13965853 10663750 6260539 909675
38118 909675 1000360 10724861 22699864 26452357 21779099 15023039 7363807 -2750502
38110 -2750502 -9539275 -4262286 10883336 23288065 24715428 17244369 5184513 -9246633
38102 -9246633 -21057050 -22722992 -13081559 -251669 6553896 3927473 -6272679 -17950380
38094 -17950380 -21765184 -12871115 1287984 7917478 4281117 -1166051 -3072132 -5066294
38086 -5066294 -9532055 -11985033 -9915927 -7369266 -5047967 4437456 23811739 42357674
38078 42357674 49130145 47558902 46556224 43857872 31305485 13004752 3857330 9515505
38070 9515505 20356472 27255978 31196924 33802501 30901318 22402011 17882932 22875561
38062 22875561 27283426 18128701 -733794 -12224056 -7472531 5725679 15181340 16085583
38054 16085583 10005320 973213 -4695335 -1701013 7694913 15371720 17471423 17210853
38046 17210853 16207954 10901065 1600839 -2953511 3005343 12581759 16153759 16059717
38038 16059717 21601200 32515063 38805723 36994911 34814549 36434988 33892233 19943876
38030 19943876 1478624 -8210414 -5900327 621971 5286580 9739066 17083804 25969876
38022 25969876 32379079 33949047 31643771 28456205 25666818 20168950 8935760 -3038071
38014 -3038071 -5391589 3438975 11658693 10130209 5992300 10477360 18882396 16620141
38006 16620141 3773168 -2214960 7594416 19770009 19077375 11091537 12409803 25825016
37998 25825016 38215386 40010836 34934497 30680641 29910975 31713824 33729610 31063931
37990 31063931 20135194 5538868 -3105200 -2934406 -584427 -1567997 -3439800 -2199593
37982 -2199593 1017766 3646546 6255736 8385289 4880470 -7129392 -20599100 -24612709
37974 -24612709 -17195939 -6742635 -1358948 -2225306 -7543710 -16863695 -28659697 -37671784
37966 -37671784 -38494781 -30656400 -17992057 -3924142 10724012 25386476 36738533
37959 36738533 39330720 30409952 14485089 1473771 -1700445 2711568 6988824 6858820
37951 6858820 4248897 1821580 -1291861 -6646164 -12238315 -13725276 -8609094 2720593
37943 2720593 18766022 37240461 54060504 64494848 66102934 59634062 47381165
37936 47381165 32369167 19163207 12784229 14391742 18494954 16769177 5991965 -8516321
37928 -8516321 -18461871 -21027225 -20067601 -18947883 -15127803 -4298858 11784020 25184032
37920 25184032 29636304 25478108 16408115 5308793 -4706240 -9191470 -6916973 -3704944
37912 -3704944 -6438033 -12594786 -10408448 7599291 33356937 48546278 41532150 18322084
37904 18322084 -3010045 -8499150 269494 9851636 9546744 1746195 -2387254 3966417
37896 3966417 16257638 24103274 21886468 13572786 8284685 11338816 19139710 23797332
37888 23797332 23351343 24595753 32811254 41771503 40301015 28538559 20147891 25015433
37880 25015433 36031489 38645934 29218380 17174723 11386913 11792362 14320840 16980046
37872 16980046 19075149 20016477 21501608 26215163 31748224 30761233 21106459 11238869
37864 11238869 9933418 13703504 11332528 -14098 -10627978 -11867161 -7113572 -5014846
37856 -5014846 -6977066 -7373622 -3532721 1055578 3397439 5138917 8758901 14295320
37848 14295320 21321339 29109786 32345665 22625275 -62857 -21256471 -24787042 -10812046
37840 -10812046 5257773 11532273 10402737 9747473 11628212 14005220 17050632 21309997
37832 21309997 23370453 19604754 12155079 6008441 2229821 -656705 -965907 3760858
37824 3760858 9702716 9383553 2152958 -4582278 -6161026 -6194797 -8746564 -11361097 -9957430
37815 -9957430 -5389027 -307671 6184788 15201984 22354200 21097619 10565878 -4108130
37807 -4108130 -17269139 -24039977 -18921612 -180564 24084460 40420056 42559818 35813463
37799 35813463 28695699 24932366 24273081 25242270 24648629 19632024 13263480 13019956 19945367
37790 19945367 24733091 20030542 11728373 10676499 16837829 20889807 19956039 20656595
37782 20656595 24522337 22092748 8543833 -4012019 -542039 15175330 24290042 17771301
37774 17771301 6593537 4055361 7573149 5071881 -6041033 -14725681 -10585123 3950430
37766 3950430 17687545 23363446 23309538 23385416 24578914 23400652 19941024 20952394 31416011
37757 31416011 45756392 52732331 48655620 40511188 35336030 32241372 27337609 21257761
37749 21257761 17696021 17882698 20286113 23198806 24519761 21872115 16274267 12916874
37741 12916874 14922326 19147094 21533234 23233013 27115227 31247788 30848389 24711211
37733 24711211 15458424 5694389 -2309112 -6620067 -9885380 -19076410 -34882563 -46081516
37725 -46081516 -42488111 -29410197 -19752152 -15318821 -7542969 5162982 14253348 16196618
37717 16196618 17253304 19990940 18498979 12394597 12436692 24118376 36873947 38703378
37709 38703378 31681829 23384731 12683044 -4037576 -19987490 -24044035 -15263104 -742560
37701 -742560 15933111 33361770 45190681 47017734 46185833 51641249 57805923 52772464
37693 52772464 39404222 31821117 31711381 26191447 11781943 1974033 4455912 8304740
37685 8304740 3837176 -396022 6245825 15811107 13221264 916199 -4185959 4328271
37677 4328271 14623471 14437416 5487176 -2187356 -2442378 2767061 6709283 4590533
37669 4590533 -508190 -577564 5886264 10566255 8230374 6212980 12608607 20853481
37661 20853481 17704704 3770595 -6677967 -6559676 -3779165 -5042482 -4103825 7008386
37653 7008386 23730936 33578434 29851246 15322806 -2442498 -14314987 -13899499 -4922791
37645 -4922791 255560 -4573726 -11314945 -11054061 -9499279 -18061730 -33019227 -37427302
37637 -37427302 -25667531 -12742149 -12745715 -19579077 -19554164 -14852245 -19983066 -37016887
37629 -37016887 -49245998 -43649457 -27848661 -17419626 -15568287 -15317114 -15325435 -20415259
37621 -20415259 -27453084 -23954037 -5368533 15756875 24420495 20530047 14933798 13290964
37613 13290964 12107926 8430718 4975174 4631923 6183612 7678301 9761480 13186109
37605 13186109 15397078 11518494 -1565683 -21204188 -37861520 -40641851 -27474531
37598 -27474531 -8074800 6833233 16528021 25324072 30344922 24219088 10248892 3363767
37590 3363767 10667543 20746197 20442217 14136950 15027207 22315096 21315253 6879484
37582 6879484 -6891094 -5883405 5596865 13791839 15315148 17692098 23676313 26054267
37574 26054267 19365089 8308112 959808 -646238 609712 2987554 6152752 7825782
37566 7825782 4684176 -3697834 -14223562 -22703629 -25272262 -19862517 -9643536 -3020726
37558 -3020726 -5584356 -12587501 -14130338 -7981915 -1951882 -2155645 -4889132 -3904799
37550 -3904799 -556550 -681616 -4303130 -5273995 -805672 4633081 5731980 1570435
37542 1570435 -6312732 -15289706 -19197679 -11124012 6573938 19981786 17662533 4208210
37534 4208210 -6325527 -7947445 -5880122 -3346533 4265555 18129392 28308219 25766521
37526 25766521 16727196 15456165 24832739 34013081 35976435 36925943 43830097 51914839
37518 51914839 52811137 49220316 51189100 59558795 63252735 54704390 39268420 25490474
37510 25490474 13621259 72856 -12140709 -15852871 -11228771 -6951350 -8141803 -8873056
37502 -8873056 -220750 17516266 34389178 41422067 38752138 33354874 31161989 32616963
37494 32616963 34852409 36251793 37622825 39265994 38726487 33009517 22661062 12130758
37486 12130758 5570629 3129314 1930744 -25978 -1841930 -1280047 2855076 10419440
37478 10419440 20787120 32115514 39846956 38809468 29261952 19498605 19028659 28438558
37470 28438558 38373804 39572842 32019970 23298497 20054512 22496424 25433467 23215994
37462 23215994 15464634 9301305 13316863 27013703 39116536 40021306 33227755 28991614
37454 28991614 28487125 22507739 7962713 -2941387 2887134 20654846 32270729 28773258
37446 28773258 19275976 15449591 15839087 11681364 1984308 -5964826 -8448487 -8379750
37438 -8379750 -6373246 1720643 14932990 23110075 18700594 6886839 -2083461 -5575285
37430 -5575285 -6981962 -6792405 -4178926 -3878544 -11083153 -20693160 -21950062 -13668471
37422 -13668471 -4515430 1600330 7489392 8327595 -8533385 -41455417 -66501316 -63847426
37414 -63847426 -42143317 -24003839 -16516177 -11209750 -5971156 -8143002 -16833653 -19597631
37406 -19597631 -10354094 2352953 8388735 6470187 -359161 -8275383 -9718688 748347
37398 748347 14538424 15688118 3473420 -4901564 517253 9195310 10258274 10860756
37390 10860756 21564805 35307784 36379020 22795969 5134956 -10865014 -25579049
37383 -25579049 -34002478 -29182646 -16195271 -8249618 -8291333 -7147660 -89102 7968884
37375 7968884 14627979 23429911 32607445 34391466 29670446 29278164 34665359 31696925
37367 31696925 13011920 -6584446 -9601637 -397410 4309670 1967613 4409190 14424166
37359 14424166 19708271 13348610 5481438 7203025 13461211 11251422 -1131310 -11920187
37351 -11920187 -10450441 3095314 21064609 34784726 37655999 28658299 15778563
37344 15778563 11282235 19242530 30072905 31511401 23369272 16372874 16844364 19037183
37336 19037183 15148122 6555429 -431728 -5215426 -11392468 -16739747 -13873049 -2245534
37328 -2245534 8646419 11266541 8425039 6061806 4808793 4023627 7119326 15047441
37320 15047441 20103223 15970344 10141952 14716726 26057216 27090600 12853034 -7384
37312 -7384 2915177 12464439 10915846 -335653 -4785814 262135 -2177913 -20502663
37304 -20502663 -37544043 -34292805 -18901914 -15538730 -29376778 -40088866 -31108728
37297 -31108728 -9095560 11161088 26288686 38526792 42230782 30938706 12388631
37290 12388631 1705355 623797 -3270311 -15422415 -25401153 -23345740 -13901332 -7068071
37282 -7068071 -4353882 -1987008 -430046 -1370625 -417332 7339528 17466228 21580696
37274 21580696 21076958 25416591 36256021 43475366 40264700 33088437 30927738 31606605
37266 31606605 26383693 14217247 3527850 687000 3705110 8408740 14784621 23731901
37258 23731901 31299981 30973634 21359412 8210679 -2141842 -9001294 -15237586 -20786126
37250 -20786126 -21483537 -15173242 -6602481 -4022730 -11113397 -23165118 -30920705 -28085374
37242 -28085374 -16741000 -6521658 -6549831 -15818217 -22804521 -17672209 -4329402 3388518
37234 3388518 -1708057 -11441046 -12668086 -2985743 8512837 14615723 17991580 23731867
37226 23731867 29261965 27511533 18597977 11857380 14099668 20592441 21336533 12927552
37218 12927552 -30035 -12245850 -20645355 -21871865 -14432892 -3996788 904218 558434
37210 558434 3759654 12493375 16148812 8000383 -1323498 1935050 12811563 13973696
37202 13973696 2102690 -7236963 -3553308 4704438 6753559 6166945 10264271 13795900
37194 13795900 7347084 -4355606 -7660118 -1248367 2672380 -423017 545819 13695745
37186 13695745 29926662 35906690 32892534 32421873 37611419 39042889 29313197 13806033
37178 13806033 4340594 6490304 15948091 25161538 30504597 32488194 31313420 26091995
37170 26091995 19699619 19620670 28365371 35580867 27626676 5619342 -13996002 -19143270
37162 -19143270 -14155361 -8471869 -3003208 4430105 8179832 509375 -15641090 -30043654
37154 -30043654 -38603615 -42926141 -39226901 -21115760 5375254 22842843 23286492 17021972
37146 17021972 15796404 17780036 16183877 12441093 11291009 10644498 6584927 2303873
37138 2303873 1599127 -1026992 -11804395 -22959091 -19916995 -2711868 12624214 15577779
37130 15577779 11695990 8389387 2965121 -8083597 -18306331 -19667612 -15181785 -13226379
37122 -13226379 -13184683 -7008833 5875059 15171917 13954789 8798535 10420911 18131281
37114 18131281 19912550 8404579 -8040096 -13829557 -3831565 11838065 20995399 21928920
37106 21928920 19562369 14580394 3838080 -9966863 -16962976 -10383070 6895949 27052630
37098 27052630 43246640 50083519 44873977 31419253 17520620 6576383 -2940946
37091 -2940946 -8388065 -1736106 17947840 38326192 46270893 40512689 26706206 8442360
37083 8442360 -8503253 -12241744 1090403 14359273 6552224 -17583964 -30766434
37076 -30766434 -19029591 959809 6973091 -754399 -7365542 -7751603 -8294918 -10054566
37068 -10054566 -5978221 4383138 9929431 2130151 -13524194 -23878654 -20738830 -5304664
37060 -5304664 14025614 25552313 21712006 6874643 -5713610 -7580917 -1894991 5136111
37052 5136111 13020107 21774818 24525937 15040063 149101 -6006869 -1113659 2153757
37044 2153757 -4585049 -13208690 -12705536 -5880534 -2693491 -3503136 -1028450 4272020
37036 4272020 3917399 -3348815 -8769286 -8511078 -8746253 -10943655 -5059581 13482477
37028 13482477 30558604 29219181 12549142 -1168388 -2179013 3249325 6365932 5154908
37020 5154908 599148 -5002682 -5006905 5757252 20003218 22673117 9886120 -5554655
37012 -5554655 -11186614 -8914224 -7562247 -9720626 -12485713 -15154325 -18944456 -22218885
37004 -22218885 -21642883 -16447610 -8293758 930035 9149741 14879449 19251037 23676388
36996 23676388 25224306 19796564 10468242 5495260 6180463 4736235 -2604922 -8834115
36988 -8834115 -7180786 -765741 4064936 5847290 3810496 -4751562 -15081343 -13156844
36980 -13156844 5584626 24450862 25783039 16268944 17028451 33110146 49279270 54177652
36972 54177652 51404197 45597234 35228241 24222392 24623806 39287093 54186868 56448513
36964 56448513 49971025 45369404 44141657 41364447 35651771 27928189 17979882 10328598
36956 10328598 15252337 34390741 52739715 55372927 45630842 35941934 27579673 13397156
36948 13397156 -3806118 -11648298 -7198304 -1455452 -2173001 -4702840 -4004003 -4280037
36940 -4280037 -10369515 -18305779 -21254511 -18729373 -14283030 -9377226 -4533688 -1314626
36932 -1314626 2014690 11628934 28709492 42823271 41842837 26995875 11930615 6958274
36924 6958274 9344032 10195507 6748191 4782978 9698785 17900343 19886296 12592638
36916 12592638 5060205 7768153 18626713 25554358 22332888 14762646 10000689 7899279
36908 7899279 6513162 8315010 14786253 20800757 21149676 17877106 14593465 9030073
36900 9030073 -180139 -4375771 5925620 24626595 35239497 33521805 32579282 41639229
36892 41639229 52173363 53025036 48952749 52260716 61618666 62588944 49280989 33623520
36884 33623520 28427436 29683637 23565283 7580865 -3981046 1921538 19557903 30881323
36876 30881323 27726914 20374307 21803162 30651738 36190284 34700772 30843113 24752972
36868 24752972 10196443 -11263139 -25811472 -24315263 -15094521 -11377948 -13310586 -12545035
36860 -12545035 -8699667 -8300134 -9657433 -2701563 13887912 27330361 27209666 17787011
36852 17787011 8567846 1238485 -6987808 -13830838 -14194337 -8494798 -1802910 2899640
36844 2899640 4906582 2330666 -4740340 -9667999 -5443336 4381462 7697262 -1667219
36836 -1667219 -16918460 -27643155 -31088556 -31283717 -31389884 -31390105 -31195012 -31440706 -31017323
36827 -31017323 -27041467 -18599387 -8720317 -823399 6348452 18114858 36511928 54352244
36819 54352244 59596520 47638841 27859271 15342806 16054211 22362152 23461780 17331289
36811 17331289 10383132 7549217 6723139 3652926 -1080321 -2791992 706060 5819203
36803 5819203 6731876 1056029 -7538226 -11228896 -4499747 8498697 15145180 7782518
36795 7782518 -5380297 -9719848 -4403625 -3131213 -11123891 -13701629 1552301 20960113
36787 20960113 19490116 -4005773 -23997374 -22976990 -11942309 -9327509 -14997936 -16918282
36779 -16918282 -11987780 -5539599 2982589 18134969 34031333 36101391 20102706 -594772
36771 -594772 -10408249 -7814571 -3893979 -9662350 -26181040 -43037764 -46439361 -32942960
36763 -32942960 -14559365 -6146729 -9623040 -15649211 -17705291 -16592350 -12937399 -5269393
36755 -5269393 3191168 5081486 -799018 -7596441 -11752322 -17773629 -27022117 -30361866
36747 -30361866 -20267871 -5103257 -1784535 -14871008 -30641995 -33946971 -25444901
36740 -25444901 -17974673 -18270132 -18195022 -6975870 12129036 24660479 24430797 21079615
36732 21079615 23672074 26075885 18214780 4889274 94218 5463559 8796600 4623358
36724 4623358 1549149 5326481 8809447 5635021 1262650 1411077 625375 -6566187
36716 -6566187 -12039625 -4504053 11708247 20547632 14339156 -401083 -14952116 -25913585
36708 -25913585 -31702159 -31195960 -26682099 -21056254 -12494148 1173146 13922001 15538602
36700 15538602 4725738 -8801060 -16016956 -15958241 -10933012 -1589764 10404265 19609484
36692 19609484 20240038 11584276 218745 -2908557 8426241 26692083 35368279 26983167
36684 26983167 11022344 -1236354 -11869334 -26896252 -39245337 -35722522 -18665913
36677 -18665913 -5832849 -7402380 -16205257 -22801746 -26574957 -27756253 -22163996 -10917699
36669 -10917699 -3550860 -3089188 1545792 18594490 37715378 42059962 29926557 13987306
36661 13987306 3950469 599350 3145366 10584319 16268933 11944248 -465246 -8927084
36653 -8927084 -6051777 1775156 2790910 -6318086 -17278324 -18850524 -7374373 10069290
36645 10069290 22389495 24196103 18135461 9379560 1789547 -1365278 632046 2037418
36637 2037418 -3891673 -12718697 -10757249 5348124 19792021 17009313 2718724 -5005401
36629 -5005401 -207433 7821912 12980937 20254933 33917946 49364968 59674596 61424233
36621 61424233 52314681 32649235 11622828 2225937 5954634 11275937 10547749 8434698
36613 8434698 9078226 6660323 -2719456 -9714206 -3541926 11335316 21396764 21898269
36605 21898269 17258876 8268155 -7197433 -21918220 -22739992 -9902648 -457908 -6256310
36597 -6256310 -18495659 -21420257 -12976189 -3021129 2685953 6411612 9695327 11308200
36589 11308200 13874671 22779938 35907983 42746247 38392388 31995559 34741070 43484463
36581 43484463 44318682 31862638 17023489 12330839 15605148 14344623 3620061 -7735365
36573 -7735365 -9759741 -3480268 3494319 8078129 11626413 11557845 2163537 -14197112
36565 -14197112 -24710392 -20538639 -8743001 -3330838 -7364087 -11181339 -7413242 116531
36557 116531 4322306 4732538 5197170 6373205 5617570 2271794 -1221572 -2757666 -2355342
36548 -2355342 -1438408 -2468417 -7726357 -15934705 -21603392 -20520630 -14557047 -8144693
36540 -8144693 -1625904 7880771 19653669 28016989 28944076 24373081 18034959 9820953
36532 9820953 -2697146 -17869336 -27839006 -24750187 -9464529 7407340 15587728 16099562
36524 16099562 18647475 26779567 30568084 19021086 -3080542 -17529162 -12494288 5305377
$$ [...]
##END NTUPLES=NMR SPECTRUM
##END=
