##TITLE=31Pdec_DE-30H_k
 D2O, 64 sc
 9.10.2024
##JCAMPDX= 6.0         $$ Bruker NMR JCAMP-DX V2.0
##DATA TYPE= NMR SPECTRUM
##DATA CLASS= NTUPLES
##ORIGIN= UXNMR, Bruker Analytische Messtechnik GmbH
##OWNER= root
$$ XWIN-NMR		Version 3.5
$$ Wed Oct  9 14:46:49 2024 Russian Standard Time (UT+4h)  she@DPX200
##.OBSERVE FREQUENCY= 81.013821
##.OBSERVE NUCLEUS= ^31P
##.ACQUISITION MODE= SIMULTANEOUS
##.ACQUISITION SCHEME= undefined
##.AVERAGES= 64
##.DIGITISER RES= 17
##SPECTROMETER/DATA SYSTEM= spect
##.PULSE SEQUENCE= zgpg30
##.SOLVENT NAME= CDCl3
##.SHIFT REFERENCE= (INTERNAL, CDCl3, 0, 198.062)
##AUDIT TRAIL= $$ (NUMBER, WHEN, WHO, WHERE, WHAT)
$$ ##TITLE= Audit trail, XWIN-NMR		Version 3.5
$$ ##JCAMPDX= 5.01
$$ ##ORIGIN= Bruker BioSpin GmbH
$$ ##OWNER= she
$$ F:/spectra/data/she/nmr/P31/2/pdata/1/auditp.txt
$$ ##AUDIT TRAIL=  $$ (NUMBER, WHEN, WHO, WHERE, WHAT)
(   1,<2024-10-09 14:45:00.03 +0400>,<she>,<DPX200>,
      <created by zg, POWCHK disabled, PULCHK disabled
       configuration hash MD5:
       00 E9 B6 7A A2 85 ED C7 34 08 36 98 17 FE 4E 26
       data hash MD5: 32K
       6F 23 53 61 25 A9 82 82 55 13 03 2B 8A 90 98 25>)
(   2,<2024-10-09 14:45:50.37 +0400>,<she>,<DPX200>,
      <Start of raw data processing
       efp BC_mod = 2 LB = 1.5 FT_mod = 6 PKNL = 1 PHC0 = 2631.197 PHC1 = 63.8875 SI = 64K 
       data hash MD5: 64K
       D6 B9 E6 81 15 D5 E0 C6 1E 2E 3F 34 00 78 C3 26>)
(   3,<2024-10-09 14:46:09.18 +0400>,<she>,<DPX200>,
      <pk PHC0 = -20.26307 PHC1 = 53.59999 
       data hash MD5: 64K
       39 17 3C 7F 8B 79 AA BF D1 37 E1 D6 A9 B3 61 D1>)
$$ ##END=
$$ 
$$ hash MD5
$$ 28 E4 C6 E5 90 03 D7 50 76 19 BB E3 25 82 8F 11
##$RELAX= 
##$RELAX= 
##$RELAX= 
##$RELAX= 
##$RELAX= 
##$RELAX= 
##$RELAX= 
##$RELAX= 
$$ Bruker specific parameters
$$ --------------------------
##$DU= <F:/spectra>
##$EXPNO= 2
##$NAME= <P31>
##$PROCNO= 1
##$TYPE= <nmr>
##$USER= <she>
##$AMP= (0..31)
100 100 100 100 100 100 100 100 100 100 100 100 100 100 100 100 100 100 
100 100 100 100 100 100 100 100 100 100 100 100 100 100 
##$AQSEQ= 0
##$AQ_mod= 1
##$AUNM= <au_zg>
##$AUTOPOS= <>
##$BF1= 81.014009
##$BF2= 200.13
##$BF3= 200.13
##$BF4= 200.13
##$BF5= 200.13
##$BF6= 200.13
##$BF7= 200.13
##$BF8= 200.13
##$BYTORDA= 1
##$CFDGTYP= 0
##$CFRGTYP= 5
##$CHEMSTR= <none>
##$CNST= (0..31)
1 1 145 1 1 1 1 1 1 1 1 1 1 1 1 1 1 1 1 1 1 1 1 1 1 1 1 1 1 1 1 1 
##$CPDPRG= <waltz16>
##$CPDPRG1= <>
##$CPDPRG2= <waltz16>
##$CPDPRG3= <>
##$CPDPRG4= <mlev>
##$CPDPRG5= <mlev>
##$CPDPRG6= <mlev>
##$CPDPRG7= <mlev>
##$CPDPRG8= <mlev>
##$CPDPRGB= <>
##$CPDPRGT= <>
##$D= (0..31)
0 1 0 0 0 0 0 0 0 0.06 0 0.03 2e-05 3e-06 0 0 0.0002 0 0 0 0 0 0 0 0 0 
0 0 0 0 0 0 
##$DATE= 1728470699
##$DBL= (0..7)
120 120 120 11 120 120 24 19 
##$DBP= (0..7)
150 150 150 150 150 150 150 150 
##$DBP07= 0
##$DBPNAM0= <>
##$DBPNAM1= <>
##$DBPNAM2= <>
##$DBPNAM3= <>
##$DBPNAM4= <>
##$DBPNAM5= <>
##$DBPNAM6= <>
##$DBPNAM7= <>
##$DBPOAL= (0..7)
0.5 0.5 0.5 0.5 0.5 0.5 0.5 0.5 
##$DBPOFFS= (0..7)
$$ [...]
##$SUBNAM2= <"">
##$SUBNAM3= <"">
##$SUBNAM4= <"">
##$SUBNAM5= <"">
##$SUBNAM6= <"">
##$SUBNAM7= <"">
##$SUBNAM8= <"">
##$SUBNAM9= <"">
##$SW= 400.765351723535
##$SWIBOX= (0..15)
0 1 3 0 0 0 0 0 0 0 0 0 0 0 0 0 
##$SW_h= 32467.5324675325
##$TD= 32768
##$TD0= 1
##$TE= 0
##$TE2= 300
##$TE3= 300
##$TEG= 300
##$TL= (0..7)
0 120 53 12 22 120 120 120 
##$TP= (0..7)
150 150 150 150 150 150 150 150 
##$TP07= 0
##$TPNAME0= <>
##$TPNAME1= <>
##$TPNAME2= <>
##$TPNAME3= <>
##$TPNAME4= <>
##$TPNAME5= <>
##$TPNAME6= <>
##$TPNAME7= <>
##$TPOAL= (0..7)
0.5 0.5 0.5 0.5 0.5 0.5 0.5 0.5 
##$TPOFFS= (0..7)
0 0 0 0 0 0 0 0 
##$TUNHIN= 0
##$TUNHOUT= 0
##$TUNXOUT= 0
##$USERA1= <user>
##$USERA2= <user>
##$USERA3= <user>
##$USERA4= <user>
##$USERA5= <user>
##$V9= 5
##$VALIST= <valist>
##$VCLIST= <CCCCCCCCCCCCCCC>
##$VD= 0
##$VDLIST= <DDDDDDDDDDDDDDD>
##$VPLIST= <PPPPPPPPPPPPPPP>
##$VTLIST= <TTTTTTTTTTTTTTT>
##$WBST= 1024
##$WBSW= 4
##$XGAIN= (0..3)
0 0 0 0 
##$XL= 0
##$YL= 0
##$YMAX_a= 7958
##$YMIN_a= -8483
##$ZGOPTNS= <>
##$ZL1= 120
##$ZL2= 120
##$ZL3= 120
##$ZL4= 120
##$ABSF1= 0
##$ABSF2= 0
##$ABSG= 0
##$ABSL= 0
##$ALPHA= 0
##$AQORDER= 0
##$ASSFAC= 0
##$ASSFACI= 0
##$ASSFACX= 0
##$ASSWID= 0
##$AUNMP= <proc_1d>
##$AZFE= 0.1
##$AZFW= 0.5
##$BCFW= 0
##$BC_mod= 2
##$BYTORDP= 0
##$COROFFS= 0
##$CY= -3
##$DATMOD= 1
##$DC= 0
##$DFILT= <>
##$DTYPP= 0
##$F1P= 0
##$F2P= 0
##$FCOR= 1
##$FTSIZE= 65536
##$FT_mod= 6
##$GAMMA= 0
##$GB= 0
##$INTBC= 1
##$INTSCL= 9.790993e-09
##$ISEN= 30
##$LB= 1.5
##$LEV0= 0
##$LPBIN= 0
##$MAXI= 10000
##$MC2= 0
##$MEAN= 0
##$ME_mod= 0
##$MI= 50
##$NCOEF= 0
##$NC_proc= -8
##$NLEV= 6
##$NOISF1= 182.463
##$NOISF2= 159.3651
##$NSP= 0
##$NTH_PI= 0
##$NZP= 0
##$OFFSET= 198.0616
##$PC= 4
##$PHC0= 2610.934
##$PHC1= 117.4875
##$PH_mod= 1
##$PKNL= yes
##$PPARMOD= 0
##$PSCAL= 0
##$PSIGN= 0
##$REVERSE= no
##$SF= 81.0140089999434
##$SI= 65536
##$SIGF1= 159.3651
##$SIGF2= -187.1042
##$SINO= 113.3802
##$SIOLD= 16384
##$SREGLST= <1H.CDCl3>
##$SSB= 0
##$STSI= 65536
##$STSR= 0
##$SW_p= 32467.5324675325
##$SYMM= 0
##$S_DEV= 0
##$TDeff= 32768
##$TDoff= 0
##$TI= <>
##$TILT= no
##$TM1= 0
##$TM2= 0
##$TOPLEV= 0
##$USERP1= <user>
##$USERP2= <user>
##$USERP3= <user>
##$USERP4= <user>
##$USERP5= <user>
##$WDW= 1
##$XDIM= 65536
##$YMAX_p= 355248005
##$YMIN_p= -146462030
$$ End of Bruker specific parameters
$$ ---------------------------------
##NTUPLES= NMR SPECTRUM
##VAR_NAME=  FREQUENCY,     SPECTRUM/REAL,   SPECTRUM/IMAG
##SYMBOL=    X,             R,               I
##VAR_TYPE=  INDEPENDENT,   DEPENDENT,       DEPENDENT
##VAR_FORM=  AFFN,          ASDF,            ASDF
##VAR_DIM=   65536,         65536,           65536
##UNITS=     HZ,            ARBITRARY UNITS, ARBITRARY UNITS
##FACTOR=    0.49542278885378, 1,            1
##FIRST=     16045.7642231865, 0,            0
##LAST=      -16421.768244346, 0,            0
##MIN=       -16421.768244346, -146462030,   0
##MAX=       16045.7642231865, 355248005,    0
$$ Real data points
##PAGE= N=1
##DATA TABLE= (X++(R..R)), XYDATA
$$ [...]
$$ plain form
7466 -1692786 1299873 5502015 8072122 8071755 7289767 7877159 9891609 11233707 9786696
7457 9786696 5822412 2218205 1718648 4163263 7300601 9876423 12189343 13733147
7449 13733147 12842592 9598580 6619788 5432804 4412667 2315998 1274386 3126527
7441 3126527 4838083 1878497 -4462494 -7623175 -4353982 1308275 4251064 4748322
7433 4748322 6004314 8096325 8086870 5047377 1410210 -911182 -2888899 -5822562 -8522407
7424 -8522407 -8781104 -6671069 -4539162 -3726757 -2954957 -854625 1123243 82277 -4196364
7415 -4196364 -8343767 -9281444 -7443572 -5073144 -2905572 -398125 1856486 2429614 1655032
7406 1655032 1632925 3148689 4524219 4312791 3418812 3393329 3920138 3419254 1604361
$$ packed form
7466a692786K992659M202142K570107l67p81988N87392K014450J342098j447011
7457I786696l964284l604207m99557K444615L137338K575822K312920J543804
7449A3733147q90555l244012k978792j186984j020137k096669j041612J852141
7441C126527J711556k959586o340991l160681L269193N662257K942789M97258
7433D748322J255992K092011r455l039493l637167k321392j977717k933663k699845
7424h522407k58697K110035K131907Q12405P71800K100332J977868j040966m278641
7415d196364m147403r37677J837872K370428K167572K507447K254611N73128p74582
7406A655032k2107J515764J375530k11428q93979k5483N26809n00884j814893
$$ plain form
7397 1604361 281979 1508609 5234885 8717597 8660766 4733437 635345 396540 3639558
7388 3639558 6003402 4533244 963078 -1075113 -413919 1386334 2858382 3976377
7380 3976377 5091683 5966922 6096839 5360085 4273624 3758826 4360452 5629333 6716284
7371 6716284 7373087 7540392 6371550 3327061 302443 484299 4127962 7488811 7449684
7362 7449684 5360368 4233885 3779366 1200724 -3619616 -6960001 -6122369 -3089539 -1927704
7353 -1927704 -4018986 -7311773 -9384348 -9699633 -8977293 -7684616 -5865023 -4002065 -3128825
7344 -3128825 -3577815 -4078632 -3038474 -788943 505121 -323716 -1773979 -1770166 -560809
7335 -560809 -254198 -1934688 -4509695 -6147695 -5620269 -2524610 2185028 5689726 5072371
$$ packed form
7397A604361j322382J226630L726276L482712n6831l927329m098092k38805L243018
7388C639558K363844j470158l570166k038191O61194J800253J472048J117995
7380C976377J115306Q75239J29917p36754j086461n14798O01626J268881J086951
7371F716284O56803J67305j168842l044489l024618J81856L643663L360849l9127
7362G449684k089316j126483m54519k578642m820340l340385Q37632L032830J161835
7353a927704k091282l292787k072575l15285P22340J292677J819593J862958Q73240
7344c128825m48990n00817J040158K249531J294064q28837j450263L813J209357
7335e60809L06611j680490k575007j638000N27426L095659M709638L504698o17355
$$ plain form
7326 5072371 609748 -3704167 -3992741 -413485 3468764 4745460 3741229 2713643
7318 2713643 2947656 3668765 3483858 2131223 352850 -1554331 -4097220 -7241062 -9665678
7309 -9665678 -10183107 -9270291 -8162456 -6819319 -4056975 290954 4628280 7421900 8686711
7300 8686711 8993789 7929694 4629791 -419329 -5074204 -7355014 -7264877 -6576230 -6821504
7291 -6821504 -7595429 -7069119 -4291512 -595039 1739254 1916657 1034015 211356 -675017
7282 -675017 -2080815 -3609869 -4592755 -5301187 -6530831 -7984016 -8033042 -5604265 -1809961
7273 -1809961 903671 1152636 -266034 -1613606 -2036370 -1905788 -1795737 -1686398 -1120169
7264 -1120169 256714 2273719 4047795 4450499 3321313 2006103 1866205 2321871 1509342
$$ packed form
7326E072371m462623m313915k88574L579256L882249J276696j004231j027586
7318B713643K34013P21109j84907j352635j778373j907181k542889l143842k424616
7309i665678n17429R12816J107835J343137K762344M347929M337326K793620J264811
7300H686711L07078j064095l299903n049120m654875k280810R0137O88647k45274
7291f821504p73925N26310K777607L696473K334293J77403q82642q22659q86373
7282f75017j405798j529054r82886p08432j229644j453185m9026K428777L794304
7273a809961K713632K48965j418670j347572m22764J30582J10051J09339N66229
7264a120169J376883K017005J774076M02704j129186j315210j39898M55666q12529
$$ plain form
7255 1509342 -809941 -2311742 -1014877 1901000 3516101 2821791 1419514 643979 -425798
7246 -425798 -3379344 -7818226 -11149582 -10874184 -6825309 -1429944 2058723 1928909 -983492
7237 -983492 -4432014 -6624008 -6922822 -5448622 -2901404 -641233 79303 -581838 -1093851
7228 -1093851 -382985 751201 645451 -888222 -1919414 -562756 2554479 4796727 4674637
7219 4674637 3593111 3707991 4831231 4809580 2685649 -65896 -1573226 -1285359 581072
7210 581072 3416645 5343048 4091667 199691 -2562651 -1852614 -137622 -1047745 -3852528
7201 -3852528 -4684084 -2455298 54474 1191978 2721705 5695578 7352942 4804434
7193 4804434 -155954 -2848174 -1640617 443270 235247 -1474906 -1318381 2225558 7061987
$$ packed form
7255A509342k319283j501801J296865K915877J615101o94310j402277p75535j069777
7246d25798k953546m438882l331356K75398M048875N395365L488667j29814k912401
7237i83492l448522k191994k98814J474200K547218K260171P20536o61141n12013
7228a093851P10866J134186j05750j533673j031192J356658L117235K242248j22090
7219D674637j081526J14880J123240k1651k123931k751545j507330K87867J866431
7210E81072K835573J926403j251381l891976k762342P10037J714992r10123k804783
7201c852528q31556K228786K509772J137504J529727K973873J657364k548508
7193D804434m960388k692220J207557K083887k08023j710153J56525L543939M836429
$$ plain form
7184 7061987 10192434 11172280 11871688 13115521 13158969 10281734 5512587 1341785 -1279294
7175 -1279294 -2931735 -3542975 -2433277 -411782 325566 -1190182 -3703395 -5442613 -5437163
7166 -5437163 -3526673 -857212 200742 -1082255 -1623135 1872932 7601178 10581989
7158 10581989 9852069 9280629 10402985 9689365 5429619 2247659 4632319 9935651 12658755
7149 12658755 12685566 13878900 16552921 17165117 14728881 11951510 9915703 6946961 3477076
7140 3477076 2758093 5062208 5996288 3124280 174048 1466813 5329430 6662123 4057815
7131 4057815 828182 -111148 723161 1343177 885730 -236846 -1351447 -2042972 -2010164
7122 -2010164 -609799 2951259 8075369 11858986 11538985 8270821 6654913 9510202
$$ packed form
7184G061987L130447R79846O99408J243833M3448k877235m769147m170802k621079
7175a279294j652441o11240J109698K021495P37348j515748k513213j739218N450
7166e437163J910490K669461J057954j282997n40880L496067N728246K980811
7158A0581989p29920n71440J122356p13620m259746l181960K384660N303332K723104
7149A2658755K6811J193334K674021O12196k436236k777371k035807k968742l469885
7140C477076p18983K304115R34080k872008k950232J292765L862617J332693k604308
7131D057815l229633r39330Q34309O20016m57447j122576j114601o91525L2808
7122b010164J400365L561058N124110L783617l20001l268164j615908K855289
$$ plain form
7114 9510202 14526196 17166270 15681130 12113298 9337083 8331443 7876649 6136037
7106 6136037 2876343 306711 900481 4236509 7114073 7081845 4689004 2002608 277176
7097 277176 -474332 -905986 -1762121 -2752375 -2138706 872782 3648103 2651972 -1236897
7088 -1236897 -3002001 -158728 4001623 5597918 5385149 6061844 7129157 6157814 3594403
7079 3594403 2387083 3215161 3492461 1390397 -1855338 -4056643 -4223377 -2202765 1738299
7070 1738299 6247304 9237128 9468442 7029728 2623307 -2406439 -5920129 -6610399 -5674843
7061 -5674843 -5438473 -6614621 -8350559 -10306440 -12663132 -14429537 -14033012 -11728418 -9326494
7052 -9326494 -7319616 -4488183 -874990 1155798 21834 -2635238 -3992572 -3429614
$$ packed form
7114I510202N015994K640074j485140l567832k776215j005640m54794j740612
7106F136037l259694k569632N93770L336028K877564l2228k392841k686396j725432
7097B77176p51508m31654q56135r90254O13669L011488K775321r96131l888869
7088a236897j765104K843273M160351J596295k12769O76695J067313r71343k563411
7079C594403j207320Q28078K77300k102064l245735k201305j66734K020612L941064
7070A738299M509005K989824K31314k438714m406421n029746l513690o90270R35556
7061e674843K36370j176148j735938j955881k356692j766405L96525K304594K401924
7052i326494K006878K831433L613193K030788j133964k657072j357334N62958
$$ plain form
7044 -3429614 -2632298 -2982401 -3909383 -3770084 -1979602 -171786 -768934 -4001567 -7201537
7035 -7201537 -7981092 -7103251 -6730269 -6889110 -5924456 -3914969 -2950289 -3746200 -4487307
7026 -4487307 -3779756 -2577763 -2189405 -2214982 -1593725 -334357 679463 564547 -1141435
7017 -1141435 -3594215 -4293274 -1594862 2414833 4002325 2965423 2730012 4524270 4999273
7008 4999273 1553031 -3267209 -5475696 -5130926 -4878407 -5063606 -3951616 -1613425 96305
6999 96305 984063 2466305 3999683 2896688 -1425846 -5647001 -6220722 -3161333 654857
6990 654857 2491477 1429648 -1516323 -4121807 -4633185 -3226532 -1421254 -449538 -959253
6981 -959253 -3366367 -6883425 -8950526 -7820956 -5538797 -6115269 -10527582 -15594913 -18046443
$$ packed form
7044c429614P97316l50103r26982J39299J790482J807816n97148l232633l199970
7035g201537p79555Q77841L72982j58841R64654K009487R64680p95911p41107
7026d487307P07551J201993L88358k5577O21257J259368J013820j14916j705982
7017a141435k452780o99059K698412M009695J587492j036902k35411J794258M75003
7008D999273l446242m820240k208487L44770K52519j85199J111990K338191J709730
6999I6305Q87758J482242J533378j102995m322534m221155n73721L059389L816190
6990F54857J836620j061829k945971k605484n11378J406653J805278R71716n09715
6981i59253k407114l517058k067101J129570K282159n76472m412313n067331k451530
$$ plain form
6972 -18046443 -17415762 -14446682 -9402964 -3539120 -90855 -1524129 -6587741 -11613860
6964 -11613860 -14151406 -14271882 -13114238 -11402986 -9073009 -5631509 -1275549 2193160
6956 2193160 2708497 713154 -729103 533935 3273747 4785187 3877710 909470 -3510167
6947 -3510167 -8093002 -10451947 -9312104 -6532400 -4962350 -4806224 -4103549 -2254267 -590589
6938 -590589 468773 2073486 4105455 4358641 1958410 -564019 -423329 1802324 3595222
6929 3595222 4194657 4693635 5348076 5221651 4320033 3840137 4050965 3896732 3129408 2934519
6919 2934519 3768017 4413885 4143264 4036374 4893160 5541843 4920367 4300699 5231546 6430783
6909 6430783 5460525 3019546 2541260 5116181 7735152 7734287 6330329 5885245 5887867 4278654
$$ packed form
6972a8046443O30681K969080N043718N863844L448265j433274n063612n026119
6964a1613860k537546j20476J157644J711252K329977L441500M355960L468709
6956B193160N15337j995343j442257J263038K739812J511440r07477k968240m419637
6947c510167m582835k358945J139843K779704J570050J56126P02675J849282J663678
6938e90589J059362J604713K031969K53186k400231k522429J40690K225653J792898
6929C595222N99435M98978O54441j26425r01618m79896K10828j54233p67324j94889
6919B934519Q33498O45868k70621j06890Q56786O48683o21476o19668R30847J199237
6909F430783r70258k440979m78286K574921K618971q65j403958m45084K622j609213
$$ plain form
6899 4278654 1530291 589917 2890882 6634449 9234955 9632940 7875668 4267928 -84697
6890 -84697 -3059047 -3014669 -346028 2812151 4270081 3368413 1494051 964390 2794001
6881 2794001 5590917 7097199 6489373 4573326 2289733 67717 -1680916 -2544048 -2436370
6872 -2436370 -1086431 2196878 6920895 10235667 9377222 5283675 1815067 1111302 1701051
6863 1701051 1623215 1132063 1246983 1706330 1917090 2382447 3619439 4865256 5192078
6854 5192078 4663428 3181982 -171410 -5002897 -8508837 -8766151 -7839334 -9093175 -12313234
6845 -12313234 -14189437 -13112995 -10646638 -8345738 -6073551 -3888699 -2715475 -2173970
6837 -2173970 -334622 3038349 5226567 4048969 716662 -2312083 -4451944 -6154973
$$ packed form
6899D278654k748363r40374K300965L743567K600506L97985j757272l607740m352625
6890h4697k974350M4378K668641L158179J457930r01668j874362n29661J829611
6881B794001K796916J506282o07826j916047k283593k222016j748633q63132J07678
6872b436370J349939L283309M724017L314772q58445m093547l468608p03765N89749
6863A701051p7836m91152J14920M59347K10760M65357J236992J245817L26822
6854E192078n28650j481446l353392m831487l505940k57314R26817j253841l220059
6845a2313234j876203J076442K466357K300900K272187K184852J173224N41505
6837b173970J839348L372971K188218j177598l332307l028745k139861j703029
$$ plain form
6829 -6154973 -6686121 -5053145 -2118471 439509 2549818 4930985 6393293 4524033
6821 4524033 -590310 -5460513 -6826062 -4723519 -1301827 1899886 4419011 5741604
6813 5741604 5201279 2918243 -53177 -2719836 -4894461 -6737480 -7759187 -6829069 -3746094
6804 -3746094 -529239 53845 -2245953 -4543069 -4496366 -3485356 -4470819 -7479382 -9485353
6795 -9485353 -8811172 -7263483 -7021640 -7444730 -6467620 -3805000 -1141971 90617 -240185
6786 -240185 -1529994 -2744253 -2629038 -878335 1096654 1483899 -125386 -2902219 -5970763
6777 -5970763 -8402309 -8900398 -7049690 -4450124 -3120743 -3110891 -3108175 -2777302 -2531574 -1513766
6767 -1513766 1470569 4761762 4649053 688036 -2563184 -1366818 1730280 1118350 -4336624
$$ packed form
6829f154973n31148J632976K934674K557980K110309K381167J462308j869260
6821D524033n114343m870203j365549K102543L421692L201713K519125J322593
6813E741604n40325k283036k971420k666659k174625j843019j021707R30118L082975
6804c746094L216855N83084k299798k297116M6703J011010r85463l008563k005971
6795i485353O74181J547689K41843m23090R77110K662620K663029J232588l30802
6786b40185j289809j214259J15215J750703J974989L87245j609285k776833l068544
6777e970763k431546m98089J850708K599566J329381R852K716L30873K45728J017808
6767a513766K984335L291193j12709l961017l251220J196366L097098o11930n454974
$$ plain form
6758 -4336624 -10041242 -11787274 -10178546 -8162691 -6626906 -4286306 -787078 2088059
6750 2088059 2622586 1578107 1659854 4579127 9101017 12360303 12772482 10986510 8276114
6741 8276114 5212232 2116248 -532337 -2755738 -4908417 -6208442 -4966875 -1321191
6733 -1321191 1894628 2519186 1785338 1936181 2825143 3244126 3891835 5642322 5989073
6724 5989073 1472835 -6216292 -10926637 -10081732 -7952807 -8806629 -10650070 -9128797 -4761399
6715 -4761399 -2110418 -3086774 -5111835 -5774164 -5757113 -6355339 -6830318 -5668122 -2942356
6706 -2942356 -160148 1594514 2607072 3824490 5522355 6953943 7755795 9184662
6698 9184662 12338841 15004831 12695037 4336967 -5061008 -9536165 -8484830 -5716502
$$ packed form
6758d336624n704618j746032J608728K015855J535785K340600L499228K875137
6750B088059N34527j044479Q1747K919273M521890L259286M12179j785972k710396
6741H276114l063882l095984k648585k223401k152679j300025J241567L645684
6733a321191L215819O24558p33848J50843Q88962M18983O47709J750487L46751
6724E989073m516238p689127m710345Q44905K128925q53822j843441J521273M367398
6715d761399K650981r76356k025061o62329J7051n98226m74979J162196K725766
6706b942356K782208J754662J012558J217418J697865J431588Q01852J428867
6698I184662L154179K665990k309794q358070r397975m475157J051335K768328
$$ plain form
6690 -5716502 -3916113 -3094327 -3386604 -5540128 -8386070 -9239842 -7719074 -6364592 -6560377
6681 -6560377 -6664418 -5478462 -4745760 -6155685 -8093606 -7839277 -5596963 -3930196 -3999949
6672 -3999949 -4650375 -4994562 -5857796 -8178421 -11175854 -12645438 -10729642 -5571058 339801
6663 339801 3820788 3634132 1368060 -538273 -1216136 -1559504 -2641775 -4463492 -5885195
6654 -5885195 -5471055 -2825028 671481 2895218 2873528 1266658 -644824 -1486198 242180
6645 242180 4939844 10325485 12820004 11288583 7943778 4807228 1118214 -4306167
6637 -4306167 -9715363 -11554511 -8466065 -2603692 2749374 5680249 6235632 5878979 6332650
6628 6332650 8101591 10249997 11950230 13352118 14247560 13203136 9504719 5039150
$$ packed form
6690e716502J800389Q21786k92277k153524k845942q53772J520768J354482j95785
6681f560377j04041J185956P32702j409925j937921K54329K242314J666767o9753
6672c999949o50426l44187q63234k320625k997433j469584J915796N158584N910859
6663C39801L480987j86656k266072j906333o77863l43368j082271j821717j421703
6654e885195M14140K646027L496509K223737k1690j606870j911482q41374J728378
6645B42180M697664N385641K494519j531421l344805l136550l689014n424381
6637d306167n409196j839148L088446N862373N353066K930875N55383l56653M53671
6628F332650J768941K148406J700233J401888Q95442j044424l698417m465569
$$ plain form
6620 5039150 2437405 1755995 754941 -1628502 -3826332 -4029667 -2668987 -1846472 -2999115
6611 -2999115 -5541307 -7485978 -7346524 -5568982 -3740251 -2387553 -685270 1152150
6603 1152150 816819 -3159314 -8469148 -11009441 -9474452 -6346349 -4610490 -5113585 -6927895
6594 -6927895 -8566849 -8799568 -7823957 -7620559 -9611557 -12141837 -12083952 -8839698 -4671935
6585 -4671935 -1051935 2665073 6149516 6554901 2190710 -3998712 -7071762 -5707025
6577 -5707025 -3384391 -4036898 -7814925 -11297009 -11059020 -6788034 -1217290 2709953 4167142
6568 4167142 3769345 1752226 -1595754 -4257971 -3611695 158388 3718093 4578582 3666469
6559 3666469 2862483 1999095 188139 -1353096 -222373 3805966 8225383 10603848 10654086
$$ packed form
6620E039150k601745o81410j001054k383443k197830k03335J360680Q22515j152643
6611b999115k542192j944671J39454J777542J828731J352698J702283J837420
6603A152150l35331l976133n309834k540293J534989L128103J735859n03095j814310
6594f927895j638954k32719R75611K03398j990998k530280N7885L244254M167763
6585d671935L620000L717008L484443M05385m364191o189422l073050J364737
6577e707025K322634o52507l778027l482084K37989M270986N570744L927243J457189
6568D167142l97797k017119l347980k662217O46276L770083L559705Q60489r12113
6559C666469q03986q63388j810956j541235J130723M028339M419417K378465N0238
$$ plain form
6550 10654086 9633387 8770600 8146102 6424135 2331188 -2771585 -4897513 -1550712
6542 -1550712 4946107 9949270 11647767 11728187 11495789 10134595 7330503 4897780 4212382
6533 4212382 3909791 2061345 -546075 -1400858 -76674 1014738 8761 -1971486 -2690000
6524 -2690000 -1952132 -1497232 -2174485 -2845540 -2563990 -2347569 -3363777 -4251121 -2446557
6515 -2446557 1548416 3489958 431291 -5139871 -8221534 -7480998 -6225926 -7378099
6507 -7378099 -9900663 -10924691 -9376680 -6232030 -2671720 524364 2771510 4357792
6499 4357792 6587957 9783442 11824478 10487685 6916836 4685049 5134266 5806533 4413579
6490 4413579 2187729 1442699 1498595 -258131 -3925778 -6695915 -7251347 -7598405 -9225690
$$ packed form
6550A0654086j020699q62787o24498j721967m092947n102773k125928L346801
6542a550712O496819N003163J698497Q0420k32398j361194k804092k432723o85398
6533D212382l02591j848446k607420q54783J324184J091412j005977j980247p18514
6524b690000P37868M54900o77253o71055K81550K16421j016208q87344J804564
6515b446557L994973J941542l058667n571162l081663P40536J255072j152173
6507g378099k522564j024028J548011L144650L560310L196084K247146J586282
6499D357792K230165L195485K041036j336793l570849k231787M49217O72267j392954
6490D413579k225850p45030N5896j756726l667647k770137n55432l47058j627285
$$ plain form
6481 -9225690 -10186707 -8344774 -5443384 -4775350 -5812695 -4684617 -181736 4043407 4413999
6472 4413999 1834864 -452827 -1161379 -1100239 -783501 -205441 19799 -576628 -1075301
6463 -1075301 -568049 -115554 -1261117 -3047186 -2730173 525402 4724201 8024356 10610932
6454 10610932 13009152 14376155 13494231 10325859 5928256 1857762 -39382 1281303
6446 1281303 4464924 6500964 5791005 3381719 742818 -1996462 -4681029 -5865344
6438 -5865344 -4661408 -2610460 -1796526 -1920908 -1256222 18157 -299172 -3067272 -6392242
6429 -6392242 -8205515 -8521907 -8258290 -7352498 -5368142 -2972399 -1425303 -1071045 -1412598
6420 -1412598 -2203466 -3322524 -3969794 -3352893 -2099261 -1599090 -1804176 -1225219 350399
$$ packed form
6481i225690r61017J841933K901390O68034j037345J128078M502881M225143L70592
6472D413999k579135k287691p08552O1140L16738N78060K25240n96427m98673
6463a075301N07252M52495j145563j786069L17013L255575M198799L300155K586576
6454A0610932K398220J367003q81924l168372m397603m070494j897144J320685
6446A281303L183621K036040p09959k409286k638901k739280k684567j184315
6438e865344J203936K050948Q13934j24382O64686J274379l17329k768100l324970
6429f392242j813273l16392K63617R05792J984356K395743J547096L54258l41553
6420a412598p90868j119058o47270O16901J253632N00171k05086N78957J575618
$$ plain form
6411 350399 835351 -1194497 -3837522 -3950036 -1185651 1922426 3568162 4287618 4832822
6402 4832822 4641652 3280547 1538563 -115707 -2559276 -6026085 -8459832 -7669707 -4315939
6393 -4315939 -1062708 599940 1024275 493865 -1417673 -4617587 -8168489 -11145751 -12568917
6384 -12568917 -11043492 -6334318 -1024716 1529744 1089314 372376 804488 777940 -1046153
6375 -1046153 -3032972 -2786323 -590888 947277 -67615 -3114472 -5776221 -5372863 -1207842
6366 -1207842 4114598 6689344 5158650 1468525 -2183875 -5110607 -6538750 -5167243
6358 -5167243 -1831378 65080 -1008231 -2148195 -530818 1670924 306038 -4200827
6350 -4200827 -7132721 -5943221 -2867766 -887009 -445341 -903343 -2172012 -3641426 -3926184
$$ packed form
6411C50399M84952k029848k643025j12514K764385L108077J645736P19456N45204
6402D832822j91170j361105j741984j654270k443569l466809k433747P90125L353768
6393d315939L253231J662648M24335n30410j911538l199914l550902k977262j423166
6384a2568917J525425M709174N309602K554460m40430p16938M32112k6548j824093
6375a046153j986819K46649K195435J538165j014892l046857k661749M03358M165021
6366a207842N322440K574746j530694l690125l652400k926732j428143J371507
6358e167243L335865J896458j073311j139964J617377K201742j364886m506865
6350d200827k931894J189500L075455J980757M41668m58002j268669j469414k84758
$$ plain form
6341 -3926184 -2993855 -2602030 -3609913 -4870802 -5785998 -7586313 -10365100 -10947266 -6315513
6332 -6315513 1613673 6932143 5690963 -354849 -6151449 -8574584 -8720310 -9247372 -10362386
6323 -10362386 -9717739 -6324759 -2429173 -45162 2089233 5148606 5717333 -614335
6315 -614335 -11241882 -17363941 -14599993 -8211755 -5101881 -5109608 -4274185 -2832363 -4250179
6306 -4250179 -8167567 -10182573 -8536176 -5932853 -4186996 -1846244 1578268 3408639
6298 3408639 1865116 -1262520 -4151385 -7742347 -12350276 -14627151 -11542996 -5512502
6290 -5512502 -1897044 -2292655 -3540912 -2873992 -752213 1526048 3780970 5437920 4682997
6281 4682997 954670 -3168573 -4265670 -1643074 2453308 5536935 6735737 6509195
$$ packed form
6341c926184R32329L91825j007883j260889r15196j800315k778787n82166M631753
6332f315513P929186N318470j241180o045812n796600k423135j45726n27062j115014
6323a0362386O44647L392980L895586K384011K134395L059373N68727o331668
6315f14335j0627547o122059K763948O388238L109874p727Q35423J441822j417816
6306d250179l917388k015006J646397K603323J745857K340752L424512J830371
6298C408639j543523l127636k888865l590962m607929k276875L084155O030494
6290e512502L615458l95611j248257O66920K121779K278261K254922J656950p54923
6281D682997l728327m123243j097097K622596M096382L083627J198802k26542
$$ plain form
6273 6509195 5823753 5664435 6334859 6837374 5597489 2333470 -1101016 -2256092 -484457
6264 -484457 2427166 3930242 2783380 -291276 -3409368 -4932391 -4740013 -4404245 -5531298
6255 -5531298 -7597963 -8146587 -5698742 -1710317 1219420 2294564 2458269 2170152 1200440
6246 1200440 521826 2093382 5868985 8944905 9135843 7957379 8283200 10056810 10497397
6237 10497397 8342544 5742829 5337521 7101147 9187741 10827255 12892725 15737513
6229 15737513 17823272 17297121 14450757 11667041 10730173 10931910 10345344 8301810 5758801
6220 5758801 3746865 2638454 2670349 3738735 4647811 4163740 3085083 3429934 4950471
6211 4950471 4612402 905931 -3331531 -4352781 -2107737 853283 3518541 6446504
$$ packed form
6273F509195o85442j59318O70424N02515j239885l264019l434486j155076J771635
6264d84457K911623J503076j146862l074656l118092j523023J92378L35768j127053
6255e531298k066665n48624K447845L988425K929737J075144J63705k88117r69712
6246A200440o78614J571556L775603L075920J90938j178464L25821J773610M40587
6237A0497397k154853k599715m05308J763626K086594J639514K065470K844788
6229A5737513K085759n26151k846364k783716r36868K01737n86566k043534k543009
6220E758801k011936j108411L1895J068386R09076m84071j078657L44851J520537
6211D950471l38069l706471m237462j021250K245044K961020K665258K927963
$$ plain form
6203 6446504 8592585 7678898 3963692 438631 -1420618 -3068403 -5098521 -5353864 -2789380
6194 -2789380 -356700 -1256470 -4263070 -5728700 -4893117 -4020201 -3891567 -2550256 963716
6185 963716 4457522 5434637 4244430 3084536 3066941 3414053 2784874 533868 -2680569
6176 -2680569 -4792199 -3498300 1485578 7493209 10891399 10049842 6157589 1491206
6168 1491206 -2500897 -5422435 -6977710 -6549517 -3943312 -179764 2945351 4136269
6160 4136269 3223267 794583 -2191829 -4604428 -5869537 -6615791 -7582698 -7749122 -5081341
6151 -5081341 70771 3988784 3622695 455142 -1585570 -1146164 31109 1080664 3320562
6142 3320562 6800546 8595090 6652838 3360232 2718235 4968787 6560867 5189836
$$ packed form
6203F446504K146081r13687l715206l525061j859249j647785k030118k55343K564484
6194b789380K432680q99770l006600j465630Q35583Q72916J28634J341311L513972
6185I63716L493806R77115j190207j159894j7595L47112o29179k251006l214437
6176b680569k111630J293899M983878O007631L398190q41557l892253m666383
6168A491206l992103k921538j555275M28193K606205L763548L125115J190918
6160D136269r13002k428684k986412k412599j265109p46254r66907j66424K667781
6151e081341N152112L918013l66089l167553k040712M39406J177273J049555K239898
6142C320562L479984J794544j942252l292606o41997K250552J592080j371031
$$ plain form
6134 5189836 2454748 1081437 1582922 2634463 3156159 2753420 1250320 -750816 -1612485
6125 -1612485 -603278 273496 -1736125 -6079284 -8728212 -6990829 -2786717 348814
6117 348814 1935603 3813050 5618210 4292931 -1061894 -6551773 -7530882 -3763315 908472
6108 908472 2630235 -73377 -6094871 -11729008 -12349047 -6896276 -21386 2862933 2016398
6099 2016398 1880253 3689103 3631876 -638718 -5618358 -6490719 -3236352 543964 2799305
6090 2799305 4037796 4690336 4805222 5839622 9558939 14735329 17438117 15415467 10460557
6081 10460557 5888665 3357665 2842404 3980079 6017949 7317993 6392934 3564211
6073 3564211 946929 525861 2291937 4325819 4815207 3869458 2935712 2579309 1809150
$$ packed form
6134E189836k735088j373311N01485J051541N21696m02739j503100k001136q61669
6125a612485J009207Q76774k009621m343159k648928J737383M204112L135531
6117C48814J586789J877447J805160j325279n354825n489879r79109L767567M671787
6108I08472J721763k703612o021494n634137o20039N452771O874890K884319q46535
6099B016398j36145J808850n7227m270594m979640q72361L254367L780316K255341
6090B799305J238491O52540J14886J034400L719317N176390K702788k022650m954910
6081A0460557m571892k531000n15261J137675K037870J300044r25059k828723
6073C564211k617282m21068J766076K033882M89388r45749r33746l56403p70159
$$ plain form
6064 1809150 -109268 -2327963 -3628838 -3865325 -3266147 -1548851 866157 1945897 326789
6055 326789 -2268604 -3189376 -3052493 -5089950 -9901023 -13619380 -12769791 -8895172 -6376665
6046 -6376665 -6834882 -7743261 -6255379 -2637729 498605 1320825 424775 -408679 -526233
6037 -526233 -864189 -1957815 -2414799 -492435 3213803 6145946 7028952 7305295 8722251
6028 8722251 10694551 11005699 8487043 4312394 1035013 574079 2511031 4250002 3645190
6019 3645190 1405287 -196930 -705746 -1633718 -3002485 -2280824 1823412 6690745 8956847
6010 8956847 8672646 7925219 6712685 3292489 -1762628 -5070248 -4755322 -2849581 -2361766
6001 -2361766 -3855277 -5961550 -7481959 -7574546 -5292406 -726479 3988669 6285649 5679913
$$ packed form
6064A809150j918418k218695j300875k36487N99178J717296K415008J079740j619108
6055C26789k595393r20772J36883k037457m811073l718357Q49589L874619K518507
6046f376665m58217r08379J487882L617650L136334Q22220q96050q33454j17554
6037e26233l37956j093626m56984J922364L706238K932143Q83006K76343J416956
6028H722251J972300L11148k518656m174649l277381m60934J936952J738971o04812
6019C645190k239903j602217n08816r27972j368767P21661M104236M867333K266102
6010H956847k84201p47427j212534l420196n055117l307620L14926J905741M87815
6001b361766j493511k106273j520409r2587K282140M565927M715148K296980o05736
$$ plain form
5992 5679913 3821828 2322513 1329921 48985 -2048829 -4523125 -6201122 -6449449 -6312957
5983 -6312957 -7478703 -9573712 -9659982 -5744706 -131315 2360527 -466383 -6130738 -10576564
5974 -10576564 -11883269 -10629271 -8310965 -6471393 -6115711 -6567574 -5649530 -2364549 1215317
5965 1215317 2301794 1246990 1149834 3439715 5888043 5955831 4369801 3793192 5074148
5956 5074148 6660015 7220158 6922797 5966511 3627156 -334038 -4316527 -5939515 -4254209
5947 -4254209 -533921 2863864 4244238 3594666 2189050 1120983 346592 -605124 -1417942
5938 -1417942 -1263780 -186603 688122 615776 277426 996347 3223001 5960565 7532141
5929 7532141 7114518 5810713 5720386 7315555 8351333 6513172 2776813 714597 2454356
$$ packed form
5992E679913j858085j499315r92592j280936k097814k474296j677997k48327J36492
5983f312957j165746k095009q6270L915276N613391K491842k826910n664355m445826
5974a0576564j306705J253998K318306J839572L55682m51863R18044L284981L579866
5965A215317J086477j054804r7156K289881K448328O7788j586030n76609J280956
5956E074148J585867N60143k97361r56286k339355l961194l982489j622988J685306
5947d254209L720288L397785J380374o49572j405616j068067p74391r51716q12818
5938a417942J54162J077177Q74725p2346l38350P18921K226654K737564J571576
5929G532141m17623j303805r0327J595169J035778j838161l736359k062216J739759
$$ plain form
5920 2454356 6735659 11078614 14174998 15515628 14343139 10325791 4478207 -1539308
5912 -1539308 -6436286 -9143010 -8833949 -6167483 -3707884 -3912264 -6816877 -10141355 -11264230
5903 -11264230 -9062156 -4885582 -2048908 -3014842 -6385527 -7922669 -5260465 -296431
5895 -296431 3669321 5270309 4510463 1198996 -3926496 -8235516 -9812894 -9844224 -10141044
5886 -10141044 -9769381 -7096935 -3988863 -4162917 -7464200 -9544387 -7953909 -5060060
5878 -5060060 -3684481 -3256799 -2303198 -1701897 -2585143 -3132216 -776504 3366699 5452024
5869 5452024 4193515 2355687 2320638 2719123 1172130 -1192881 -430561 4872997 10951830
5860 10951830 12955655 10698514 8399590 8803591 9909394 8688136 5906504 4882722
$$ packed form
5920B454356M281303M342955L096384J340630j172489m017348n847584o017515
5912a539308m896978k706724L09061K666466K459599k04380k904613l324478j122875
5903a1264230K202074M176574K836674r65934l370685j537142K662204M964034
5895b96431L965752J600988p59846l311467n125492m309020j577378l1330k96820
5886a0141044L71663K672446L108072j74054l301283k080187J590478K893849
5878e060060J375579M27682R53601O01301q83246n47073K355712M143203K085325
5869E452024j258509j837828l5049L98485j546993k365011P62320N303558O078833
5860A0951830K003825k257141k298924M04001J105803j221258k781632j023782
$$ plain form
5852 4882722 6533992 8329734 7997549 5875486 3425299 1723534 1849114 4412115 7801431
5843 7801431 8966226 7049949 4521184 3715234 4070830 3933492 3205906 2660607 2214714
5834 2214714 1611552 1586357 2687332 3934362 4162053 3733678 3455400 2775277 667894
5825 667894 -2435618 -5050571 -6267541 -5759406 -3219797 635194 3457060 3450788 1540035
5816 1540035 -246090 -1730907 -4035509 -6736375 -7835920 -6551058 -4167020 -1899950
5808 -1899950 328323 2518880 3444147 1624160 -3111734 -9144088 -13746341 -14816606
5800 -14816606 -12781716 -10272821 -9161933 -8751986 -7695547 -6259417 -5210901 -4032362
5792 -4032362 -2446864 -2329651 -5171018 -8453106 -7980613 -3884323 -898020 -1900079 -4419637
$$ packed form
5852D882722J651270J795742l32185k122063k450187j701765J25580K563001L389316
5843G801431J164795j916277k528765q05950L55596j37338p27586n45299m45893
5834B214714o03162k5195J100975J247030K27691m28375k78278o80123k107383
5825F67894l103512k614953j216970N08135K539609L854991K821866o272j910753
5816A540035j786125j484817k304602k700866j099545J284862K384038K267070
5808a899950K228273K190557R25267j819987m735894o032354m602253j070265
5800a4816606K034890K508895J110888M09947J056439J436130J048516J178539
5792d032362J585498J17213k841367l282088M72493M096290K986303j002059k519558
$$ plain form
5783 -4419637 -4965445 -3885372 -3813424 -5462845 -7335661 -8288395 -8235479 -7083800 -4796680
5774 -4796680 -2132900 16230 1698564 3349568 4678126 5086916 4868812 5152667 6690138
5765 6690138 8909674 9952902 8011114 3534860 -265240 -595918 1372893 1930039 -190249
5756 -190249 -2520731 -3026257 -2894723 -3940864 -5832834 -7727145 -10140899 -12691649 -12298624
5747 -12298624 -7132063 -982775 286594 -3490701 -6330551 -4140723 257990 1777564
5739 1777564 -209453 -2364434 -2846219 -3307675 -5652368 -9111226 -11205338 -10317310 -6693656
5730 -6693656 -1857196 2203309 3906674 3206669 1870235 1826744 3002216 3483048 2109281
5721 2109281 -30379 -1359157 -1973052 -2669119 -2645532 -257656 3911836 6851538 6662216
$$ packed form
5783d419637n45808J080073P1948j649421j872816r52734N2916J151679K287120
5774d796680K663780K149130J682334J651004J328558M08790k18104K83855J537471
5765F690138K219536J043228j941788m476254l800100l30678J968811N57146k120288
5756a90249k330482n05526J31534j046141j891970j894311k413754k550750L93025
5747a2298624N166561O149288J269369l777295k839850K189828M398713J519574
5739A777564j987017k154981m81785m61456k344693l458858k094112Q88028L623654
5730f693656M836460M060505J703365p00005j336434m3491J175472M80832j373767
5721B109281k139660j328778o13895o96067K3587K387876M169492K939702j89322
$$ plain form
5712 6662216 4530869 2370760 312644 -2240073 -4700917 -6039540 -6281599 -5843903 -4496131
5703 -4496131 -2443213 -1270962 -2087426 -3639537 -3995040 -3277389 -3040483 -3791585 -4909716
5694 -4909716 -6067094 -6723739 -5245551 -1036367 3182245 4064964 2350164 1956429 4311506
5685 4311506 6666425 6644487 5379954 4913291 5191371 5268683 5281779 5568692 5614873 5292651
5675 5292651 5386424 5604852 4085304 438806 -2730133 -3189065 -2047405 -1321626 -521822
5666 -521822 1676226 3954424 3756594 1469186 129471 1043878 2423221 2591009 2014635
5657 2014635 1570498 982854 -154492 -1431988 -2414319 -3108801 -3314770 -2878449 -2835897
5648 -2835897 -4770557 -8609898 -12423269 -14705105 -15433801 -14667544 -11831704 -6962770 -1127618
$$ packed form
5712F662216k131347k160109k058116k552717k460844j338623k42059M37696J347772
5703d496131K052918J172251q16464j552111l55503P17651K36906p51102j118131
5694d909716j157378o56645J478188M209184M218612Q82719j714800l93735K355077
5685D311506K354919k1938j264533m66663K78080P7312J3096K86913M6181l22222
5675E292651R3773K18428j519548l646498l168939m58932J141660P25779P99804
5666e21822K198048K278198j97830k287408j339715R14407J379343J67788n76374
5657B014635m44137n87644j137346j277496r82331o94482k05969M36321M2552
5648b835897j934660l839341l813371k281836p28696P66257K835840M868934N835152
$$ plain form
5639 -1127618 4843074 10404873 13818227 12946854 8559367 4594656 3652114 4272704 4357296
5630 4357296 4844752 7247233 9525181 8248225 4250100 2248863 4344858 7448915
5622 7448915 8417750 8399063 9797953 11513440 10264795 5390197 -560641 -5433395 -8917835
5613 -8917835 -10526317 -9121817 -5478897 -2910984 -3555197 -5430765 -5030267 -2077330 136147
5604 136147 -963133 -4256230 -6735946 -7122349 -6766156 -7293685 -8133827 -6845817 -2055744
5595 -2055744 4207849 7841860 6706715 2787675 -121551 -170215 1839231 4503462 6950874
5586 6950874 8235198 7523832 5416830 3571819 2370965 467528 -2443508 -4049711
5578 -4049711 -2283317 1270267 2755279 543225 -3263575 -5738428 -6043811 -5305192 -4948639
$$ packed form
5639a127618N970692N561799L413354q71373m387487l964711r42542O20590Q4592
5630D357296M87456K402481K277948j276956l998125k001237K095995L104057
5622G448915R68835j8687J398890J715487j248645m874598n950838m872754l484440
5613h917835j608482J404500L642920K567913o44213j875568M00498K952937K213477
5604A36147j099280l293097k479716l86403L56193n27529q40142J288010M790073
5595b055744O263593L634011j135145l919040k909226m8664K009446K664231K447412
5586F950874J284324p11366k107002j845011j200854j903437k911036j606203
5578d049711J766394L553584J485012k212054l806800k474853l05383P38619L56553
$$ plain form
5569 -4948639 -5600072 -6673662 -6657143 -4463433 -688549 2927602 5068780 5326039 3808434
5560 3808434 1427212 13427 638959 2081072 2475477 2124697 2733310 4107699 4157076
5551 4157076 2580072 1804626 3097650 4293299 3118908 571240 -1120479 -2048488 -3748695
5542 -3748695 -6127904 -7699572 -7970903 -7434523 -6109397 -4223619 -3341484 -4537429 -6470225
5533 -6470225 -7586326 -8764456 -10726808 -10477102 -4794571 3278433 6580127 3317874
5525 3317874 -562379 -278969 1468996 92736 -3507523 -5496515 -5702926 -6602690 -7649410
5516 -7649410 -5866688 -1591561 1143721 458082 -1126675 -1167849 -604545 -1355290 -3448013
5507 -3448013 -5886223 -8085900 -9236907 -8249141 -5494247 -2930606 -1719007 -1480547 -2353129
$$ packed form
5569d948639o51433j073590J6519K193710L774884L616151K141178K57259j517605
5560C808434k381222j413785O25532J442113L94405l50780O08613J374389M9377
5551D157076j577004p75446J293024J195649j174391k547668j691719r28009j700207
5542c748695k379209j571668k71331N36380J325126J885778Q82135j195945j932796
5533f470225j116101j178130j962352K49706N682531Q073004L301694l262253
5525C317874l880253K83410J747965j376260l600259j988992k06411q99764j046720
5516g649410J782722M275127K735282o85639j584757m1174N63304p50745k092723
5507c448013k438210k199677j151007R87766K754894K563641J211599K38460q72582
$$ plain form
5498 -2353129 -5241321 -8904223 -9523669 -5310899 447884 3388515 3723518 5235557 9262096
5489 9262096 12442627 10997964 5345124 -607730 -3921234 -5443610 -8152398 -13145393
5481 -13145393 -18027101 -19818921 -18679389 -17215416 -16363194 -14149176 -9267639 -3702908
5473 -3702908 -163016 1503916 3354430 5837908 7310060 6620607 4406184 2013972
5465 2013972 641653 1256584 3742360 6123645 6078590 3388077 -149798 -3001201 -4804606
5456 -4804606 -5268934 -3870272 -1047391 1536862 2412634 1322951 -974104 -2909437 -2516020
5447 -2516020 727379 4344650 4777043 1368756 -2821302 -4593940 -3730422 -2185589 -1657498
5438 -1657498 -2669539 -4708175 -6305675 -5983337 -3922409 -1775659 -268986 1640501
$$ packed form
5498b353129k888192l662902o19446M212770N758783K940631L35003J512039M026539
5489I262096L180531j444663n652840n952854l313504j522376k708788m992995
5481a3145393m881708j791820J139532J463973Q52222K214018M881537N564731
5473c702908L539892J666932J850514K483478J472152o89453k214423k392212
5465B013972j372319O14931K485776K381285m5055k690513l537875k851403j803405
5456d804606m64328J398662K822881K584253Q75772j089683k297055j935333L93417
5447b516020L243399L617271M32393l408287m190058j772638Q63518J544833N28091
5438a657498j012041k038636j597500L22338K060928K146750J506673J909487
$$ plain form
5430 1640501 4308224 5713414 3977046 604196 -786177 1265284 4740714 7039937
5422 7039937 7477281 6554639 4435591 1201800 -2326396 -5131860 -6943785 -7776196 -6890924
5413 -6890924 -3359268 2117960 6930885 8813369 7818483 5273957 1462556 -4001690
5405 -4001690 -9430919 -11003807 -7160586 -1610700 467039 -1293481 -2567760 -818068
5397 -818068 1462617 1384743 688365 3274817 9099338 13619564 13251192 8831136 3240784
5388 3240784 -2038087 -6786362 -10239792 -11347077 -10458370 -9303354 -8900968 -8205827 -5475582
5379 -5475582 -943663 2552081 2360432 -729778 -3118556 -2631312 -876774 -465489 -1189625
5370 -1189625 -720351 1649355 4171890 5573218 6601352 7971847 8789138 8342930 8012399
$$ packed form
5430A640501K667723J405190j736368l372850j390373K051461L475430K299223
5422G039937M37344r22642k119048l233791l528196k805464j811925q32411Q85272
5413f890924L531656N477228M812925J882484r94886k544526l811401n464246
5405d001690n429229j572888L843221N549886K077739j760520j274279J749692
5397h18068K280685p7874o96378K586452N824521M520226l68372m420056n590352
5388C240784n278871m748275l453430j107285Q88707J155016M02386O95141K730245
5379e475582M531919L495744j91649l090210k388778M87244J754538M11285p24136
5370a189625M69274K369706K522535J401328J028134J370495Q17291m46208l30531
$$ plain form
5361 8012399 9728826 13272890 16519296 17937889 17608864 16031814 13169714 8865604
5353 8865604 3563335 -1388680 -3913738 -2465832 1931787 5472284 4749308 234924
5345 234924 -4364106 -6120872 -5135187 -2855286 113398 3545545 6167383 6375107 4384852
5336 4384852 2455186 2450398 3880305 5040853 5656435 7239429 10439909 13140864 12542989
5327 12542989 8908697 5702265 5514441 7158570 7633051 5694817 2261919 -1470383
5319 -1470383 -4355990 -4465619 -429476 5992055 10698800 11403280 9497093 7253798 5056156
5310 5056156 2466636 199122 -774279 -981082 -1562988 -2323824 -2202284 -1053213 612351
5301 612351 3053404 6629247 10000664 11019149 9682186 8367320 8426600 8115625 5112801
$$ packed form
5361H012399J716427L544064L246406J418593l29025j577050k862100m304110
5353H865604n302269m952015k525058J447906M397619L540497p22976m514384
5345B34924m599030j756766R85685K279901K968684L432147K621838K07724j990255
5336D384852j929666m788J429907J160548O15582J582994L200480K700955n97875
5327A2542989l634292l206432j87824J644129M74481j938234l432898l732302
5319a470383k885607j09629M036143O421531M706745P04480j906187k243295k197642
5310E056156k589520k267514r73401k06803n81906p60836J21540J149071J665564
5301F12351K441053L575843L371417J018485j336963j314866N9280l10975l002824
$$ plain form
5292 5112801 223939 -2808265 -1362035 2888171 5502538 4171447 1400709 1250186
5284 1250186 3826743 5110220 2774752 -501403 -1383188 -870512 -1693200 -2786813 -1029006
5275 -1029006 2136848 1279227 -4408676 -8173897 -4570811 2552852 5016759 857684
5267 857684 -4380806 -5744971 -4050658 -2869479 -3841405 -5970434 -7295018 -6334662 -3364024
5258 -3364024 -766290 -984463 -3982674 -7690519 -10585414 -12570705 -13753344 -13921846 -13142476
5249 -13142476 -11659319 -9497942 -7192445 -6054174 -6251980 -5629728 -2471062 1261075
5241 1261075 1769911 -1728583 -6184411 -8640464 -8887199 -8268264 -7975182 -8626803 -9629481
5232 -9629481 -9090075 -6339243 -4018765 -5046103 -7858423 -7870661 -3887233 305433 1435661
$$ packed form
5292E112801m888862l032204J446230M250206K614367j331091k770738j50523
5284A250186K576557J283477k335468l276155q81785N12676q22688j093613J757807
5275a029006L165854q57621n687903l765221L603086P123663K463907m159075
5267H57684n238490j364165J694313J181179r71926k129029j324584R60356K970638
5258c364024K597734k18173k998211l707845k894895j985291j182639j68502P79370
5249a3142476J483157K161377K305497J138271j97806O22252L158666L732137
5241A261075N08836l498494m455828k456053k46735O18935K93082o51621j002678
5232i629481N39406K750832K320478j027338k812320j2238L983428M192666J130228
$$ plain form
5223 1435661 343073 -1141018 -3290404 -6287540 -7948405 -6379991 -2931749 -191984
5215 -191984 1187024 1600989 384848 -2905015 -6437545 -7611588 -5712939 -1607796 3578025
5206 3578025 7693500 7429324 1582010 -6579656 -12345935 -14017117 -12777270 -9999617
5198 -9999617 -7099264 -6388561 -8949072 -12297062 -12712208 -9368738 -4223955 881974 4554322
5189 4554322 4844680 1320534 -2656495 -3143157 -750814 685185 148955 395320 2694111
5180 2694111 4611906 4125915 2416911 1063610 -341248 -1914752 -1761894 1023173 3812110
5171 3812110 3525739 880180 -881776 -612449 -238688 -1322997 -2724968 -2334455 -31291
5162 -31291 1912543 1277064 -1660834 -4478862 -5328550 -4561191 -3369239 -1991991 -255981
$$ packed form
5223A435661j092588j484091k149386k997136j660865J568414L448242K739765
5215a91984J379008M13965j216141l289863l532530j174043J898649M105143N185821
5206C578025M115475k64176n847314q161666n766279j671182J239847K777653
5198i999617K900353P10703k560511l347990m15146L343470N144783N105929L672348
5189D554322K90358l524146l977029m86662K392343J435999n36230K46365K298791
5180B694111J917795m85991j709004j353301j404858j573504J52858K785067K788937
5171C812110k86371k645559j761956K69327L73761j084309j401971L90513K303164
5162c1291J943834o35479k937898k818028q49688P67359J191952J377248J736010
$$ plain form
5153 -255981 1257223 2117679 3201501 5109101 6184439 4290906 184784 -3130788 -4298108
5144 -4298108 -4648495 -5439943 -6414009 -7216024 -7810242 -7195512 -4248044 -377859 1211541
5135 1211541 -254654 -1971164 -1432218 834893 3148162 4739046 4955919 3008029 -166877
5126 -166877 -2118363 -2199543 -2297700 -3186600 -3050783 -1182324 -5343 -1147210 -2339897
5117 -2339897 -907424 2138271 4230739 5021238 5008075 2938470 -1667550 -5474042 -5109488
5108 -5109488 -2641401 -2794005 -5522926 -6252378 -3626948 -1975501 -4616353 -9100314 -11365067
5099 -11365067 -10993380 -9553726 -6672708 -1343065 4359106 6425725 3828151 -175008
5091 -175008 -2104691 -1905379 -1829809 -2916413 -3774338 -2785510 -619073 270547 -1308743
$$ packed form
5153b55981J513204Q60456J083822J907600J075338j893533m106122l315572j167320
5144d298108l50387p91448r74066q02015n94218O14730K947468L870185J589400
5135A211541j466195j716510N38946K267111K313269J590884K16873j947890l174906
5126a66877j951486q1180r8157q88900J35817J868459J176981j141867j192687
5117b339897J432473L045695K092468P90499j3163k069605m606020l806492L64554
5108e109488K468087j52604k728921p29452K625430J651447k640852m483961k264753
5099a1365067L71687J439654K881018N329643N702171K066619k597574m003159
5091a75008j929683J99312P5570j086604q57925R88828K166437Q89620j579290
$$ plain form
5082 -1308743 -3607368 -3956143 -1826791 1087796 3358737 5021662 6289754 6516817 5110942
5073 5110942 2601694 106081 -1795657 -3238639 -4591828 -6114483 -7595414 -8047102
5065 -8047102 -6426926 -3263077 -980758 -1538605 -3714832 -3893343 -301073 4344393 5704676
5056 5704676 3066995 81337 -100613 1494119 2060197 1199231 452620 -29486 -1329116
5047 -1329116 -2669757 -1850742 602176 995994 -2254135 -5701256 -5447850 -2571265 -1421642
5038 -1421642 -3769854 -7115890 -8268924 -6627738 -4138694 -3385852 -5360309 -8079041
5030 -8079041 -8046962 -4024899 1496406 5412294 7385645 9050683 11146593 12750061 12259147
5021 12259147 8122639 126240 -8805480 -13913933 -13457330 -10703213 -9477871 -9673732
$$ packed form
5082a308743k298625l48775K129352K914587K270941J662925J268092K27063j405875
5073E110942k509248k495613j901738j442982j353189j522655j480931m51688
5065h047102J620176L163849K282319n57847k176227j78511L592270M645466J360283
5056E704676k637681k985658j81950J594732N66078q60966p46611m82106j299630
5047a329116j340641Q19015K452918L93818l250129l447121K53406K876585J149623
5038a421642k348212l346036j153034J641186K489044P52842j974457k718732
5030h079041L2079M022063N521305L915888J973351J665038K095910J603468m90914
5021A2259147m136508p996399q931720n108453M56603K754117J225342j95861
$$ plain form
5013 -9673732 -9142236 -7717875 -6410514 -4458478 -732756 2949484 3385202 396997 -3293128
5004 -3293128 -5908139 -7208682 -6131140 -1768237 3378883 5170213 3518453 2607778
4996 2607778 4512345 6442213 6012104 5515851 8083035 12160505 13207015 9847503 5439334
4987 5439334 3517388 3827861 3617976 1705623 90144 1291826 4842727 7623070 7748750
4978 7748750 6492284 5531448 4218219 1421701 -1515586 -2300872 -1409755 -1544253 -3418642
4969 -3418642 -4521791 -2482928 2217671 7271687 10688280 11544555 9861034 6281904
4961 6281904 1676035 -2581684 -4273382 -2226368 1057729 1372118 -1437236 -2901231
4953 -2901231 -926236 651428 -1302715 -3290950 -818521 3548928 3950221 752143
$$ packed form
5013i673732N31496J424361J307361J952036L725722L682240M35718k988205l690125
5004c293128k615011j300543J077542M362903N147120J791330j651760r10675
4996B607778J904567J929868m30109m96253K567184M077470J046510l359512m408169
4987E439334j921946L10473k09885j912353j615479J201682L550901K780343J25680
4978G748750j256466r60836j313229k796518k937287p85286Q91117j34498j874389
4969c418642j103149K038863M700599N054016L416593Q56275j683521l579130
4961F281904m605869m257719j691698K047014L284097L14389k809354j463995
4953b901231J974995J577664j954143j988235K472429M367449M01293l198078
$$ plain form
4945 752143 -456252 1784166 3456148 2840368 2409328 2069805 -2178777 -10337847 -15479086
4936 -15479086 -12264482 -3842972 2829581 4729400 3202176 268508 -2638980 -4543505
4928 -4543505 -5337881 -4868677 -2069850 2261855 3457140 -1493752 -7632672 -7319850 -1341266
4919 -1341266 2160021 134739 -1675505 970227 4652943 5258763 3935623 2705540
4911 2705540 616123 -2293939 -3188278 -1662762 -873793 -1012170 1701159 7091210 9556941
4902 9556941 7387793 5718771 7124096 7724859 6044969 6402238 9298264 8298592 1476495
4893 1476495 -4084967 -4404545 -4408394 -6248053 -4169291 2425523 4430618 -570172 -2231438
4884 -2231438 3165901 4346398 -2540372 -2789951 10264741 19236538 13433876 11702182
$$ packed form
4945G52143j208395K240418J671982o15780m31040l39523m248582q159070n141239
4936a5479086L214604Q421510O672553J899819j527224k933668k907488j904525
4928d543505p94376M69204K798827M331705J195285m950892o138920L12822N978584
4919a341266L501287k025282j810244K645732L682716O05820j323140j230083
4911B705540k089417k910062q94339J525516P88969j38377K713329N390051K465731
4902I556941k169148j669022J405325O00763j679890L57269K896026r99672o822097
4893A476495n561462l19578l849j839659K078762O594814K005095n000790j661266
4884b231438N397339J180497o886770k49579J3054692Q971797n802662j731694
$$ plain form
4876 11702182 27545969 38508382 31098842 52083569 154389739 295312514 355248005
4869 355248005 279449747 146575566 65464792 52425840 52221100 37873841 30446725
4862 30446725 39152228 41899786 28501086 17522469 20259620 22901037 15502990 9608084
4854 9608084 14713990 21127731 18907568 14237667 14763174 15212995 9446591 2953496 2239511
4845 2239511 3365660 1019251 -1356923 235940 1422941 -2312718 -6624234 -5869802
4837 -5869802 -2460421 -1017764 -11942 3351958 6159728 5033182 2908107 3641943
4829 3641943 4730243 2063139 -2347694 -3810541 -2560986 -2080269 -2860101 -3082715 -2811061
4820 -2811061 -2887139 -2188989 62490 1921143 2083483 2587911 4774121 5876246 3330477
$$ packed form
4876A1702182J5843787J0962413p409540K0984727J02306170J40922775N9935491
4869C55248005p5798258j32874181q1110774j3038952k04740j4347259p427116
4862C0446725Q705503K747558j3398700j0978617K737151K641417p398047n894906
4854I608084N105906O413741k220163m669901N25507M49821n766404o493095p13985
4845B239511J126149k346409k376174J592863J187001l735659m311516P54432
4837e869802L409381J442657J005822L363900K807770j126546k125075P33836
4829C641943J088300k667104m410833j462847J249555M80717p79832k22614K71654
4820b811061p6078O98150K251479J858653J62340N04428K186210J102125k545769
$$ plain form
4811 3330477 -597624 -2172620 -1371372 -253173 1034116 3035032 4198215 2780495
4803 2780495 -228403 -2649735 -3671767 -3104136 -856309 984256 -1124926 -7040894
4795 -7040894 -11747016 -11729917 -9369182 -8645307 -9884505 -11241493 -11846316 -10792210 -6617732
4786 -6617732 -695726 2482376 1459867 611245 3583827 7709974 8568568 6462208 4374128
4777 4374128 2866202 1225735 599253 1620008 1633090 -1462463 -5145464 -6018542 -4754803
4768 -4754803 -3199702 37052 5932780 10108041 7759675 1717741 -673433 2082768
4760 2082768 4232011 1513883 -4119120 -8760320 -10569737 -9065075 -4977171 -1541174
4752 -1541174 -1868469 -4305243 -4033947 237699 4757832 6285811 5585645 4852550 5086777
$$ packed form
4811C330477l928101j574996Q01248J118199J287289K000916J163183j417720
4803B780495l008898k421332j022032N67631K247827J840565k109182n915968
4795g040894m706122J7099K360735P23875j239198j356988o04823J054106M174478
4786f617732N922006L178102j022509q48622K972582M126147Q58594k106360k088080
4777D374128j507926j640467o26482J020755J3082l095553l683001q73078J263739
4768d754803J555101L236754N895728M175261k348366o041934k391174K756201
4760B082768K149243k718128n633003m641200j809417J504662M087904L435997
4752a541174l27295k436774K71296M271646M520133J527979p00166p33095K34227
$$ plain form
4743 5086777 6639475 9167376 10496069 8583406 5017709 3524153 4741072 5663882
4735 5663882 4440742 2169528 -432428 -4149290 -7993795 -8803542 -6055197 -3766234
4727 -3766234 -5261752 -8642916 -9890906 -8486065 -7407341 -8685260 -11232070 -12846015
4719 -12846015 -12869892 -12560108 -13219253 -14204169 -13389535 -9941448 -5517230 -1875848 1124996
4710 1124996 3675759 4191435 1974516 -23896 1307865 3921760 2821813 -2459871
4702 -2459871 -6768747 -6576918 -4423201 -4419266 -6570491 -7813845 -6481884 -3611757 -1206993
4693 -1206993 -735975 -2307526 -4349028 -4964127 -3905269 -2215272 -428686 1081372 721837
4684 721837 -2547047 -6190794 -5971091 -1349451 3782728 6176049 6029090 4402587 1525154
$$ packed form
4743E086777J552698K527901J328693j912663l565697j493556J216919R22810
4735E663882j223140k271214k601956l716862l844505q09747K748345K288963
4727c766234j495518l381164j247990J404841J078724j277919k546810j613945
4719a2846015k3877L09784o59145r84916Q14634L448087M424218L641382L000844
4710A124996K550763N15676k216919j998412J331761K613895j099947n281684
4702b459871m308876J91829K153717L935k151225j243354J331961K870127K404764
4693a206993M71018j571551k041502o15099J058858J689997J786586J510058l59535
4684G21837l268884l643747K19703M621640N132179K393321j46959j626503k877433
$$ plain form
4675 1525154 -1244561 -1524743 242865 427303 -2355130 -4730977 -3690849 -887459 848033
4666 848033 2032461 4236798 6021516 5009213 2144443 201473 -538988 -1677247 -3152807
4657 -3152807 -3954554 -5194989 -8449336 -11577039 -10422292 -5081523 -659095 -722553 -3175815
4648 -3175815 -3936650 -1997053 703009 2196289 1546067 -1411280 -5645848 -9056348 -10182707
4639 -10182707 -9385120 -8001696 -7210624 -7868692 -10089138 -12377243 -12421453 -9558979 -5608635
4630 -5608635 -2740470 -1494305 -1394465 -2279965 -4045308 -5928071 -7078662 -7309132 -6552178
4621 -6552178 -4356375 -957530 1829547 2278548 1245644 1491886 3959912 6023260 4690903
4612 4690903 908961 -1013446 1317439 5066087 5360170 1166081 -3520409 -4447530 -1613861
$$ packed form
4675A525154k769715k80182J767608J84438k782433k375847J040128K803390J735492
4666H48033J184428K204337J784718j012303k864770j942970p40461j138259j475560
4657c152807q01747j240435l254347l127703J154747N340769M422428o3458k453262
4648c175815p60835J939597K700062J493280o50222k957347m234568l410500j126359
4639a0182707P97587J383424P91072o58068k220446k288105m4210K862474L950344
4630e608635K868165J246165R9840q85500j765343j882763j150591k30470P56954
4621f552178K195803L398845K787077M49001j032904K46242K468026K063348j332357
4612D690903l781942j922407K330885L748648K94083m194089m686490r27121K833669
$$ plain form
4603 -1613861 1731325 3338893 3694032 3914041 3730270 2386965 458273 -620566 -711068
4594 -711068 -1360386 -3457565 -5518015 -5481479 -3740478 -2840454 -3950546 -5192921 -4343703
4585 -4343703 -1900555 -181229 -314069 -1609655 -3215306 -4645282 -5015634 -3673618 -1732204
4576 -1732204 -1207252 -2271308 -3096287 -2957602 -3579189 -6209899 -8935262 -8634912 -4950820
4567 -4950820 -822602 802327 -206259 -1660619 -1777934 -1197835 -2129433 -5233885 -7999659
4558 -7999659 -7447959 -4187398 -1997843 -3027069 -5349676 -6245060 -5902724 -6117391 -6843525
4549 -6843525 -6411307 -4505859 -2549864 -1089038 956654 3682671 4669239 1538292 -4697436
4540 -4697436 -10150337 -11888338 -10434162 -8384231 -7409552 -7263211 -7209543 -7161404 -6972367
$$ packed form
4603a613861L345186J607568L55139K20009j83771j343305j928692j078839r0502
4594g11068o49318k097179k060450L6536J741001R00024j110092j242375Q49218
4585d343703K443148J719326j32840j295586j605651j429976l70352J342016J941414
4576a732204N24952j064056q24979J38685o21587k630710k725363L00350L684092
4567d950820M128218J624929j008586j454360j17315N80099r31598l104452k765774
4558g999659N51700L260561K189555j029226k322607q95384L42336k14667p26134
4549f843525M32218J905448J955995J460826K045692K726017R86568l130947o235728
4540d697436n452901j738001J454176K049931R74679J46341N3668M8139J89037
$$ plain form
4531 -6972367 -5707858 -2780178 654487 2662261 2817645 2431194 2513924 2680602 2210929
4522 2210929 1005516 -804074 -3030564 -4803229 -4868457 -3078787 -792844 495862 204496
4513 204496 -1407298 -3029135 -2336480 1695020 6288106 7096418 3816673 1112036 2480499
4504 2480499 5635721 6158253 3602915 1051223 -2528 -880099 -2117307 -1974106 507823
4495 507823 3316105 3712655 1412704 -1434126 -2533128 -1008542 2486859 6287938 8516903
4486 8516903 8073350 5400129 2530010 1891144 4070470 6712172 6773087 4168338 1909500
4477 1909500 2188270 3867693 4586489 3542649 992602 -3038512 -7611483 -10077322 -8863181
4468 -8863181 -6089450 -5108758 -6201933 -6938818 -5946268 -3754764 -615648 3508112 6927849
$$ packed form
4531f972367J264509K927680L434665K007774J55384l86451Q2730J66678m69673
4522B210929j205413j809590k226490j772665o5228J789670K285943J288706k91366
4513B04496j611794j621837O92655M031500M593086Q08312l279745k704637J368463
4504B480499L155222N22532k555338k551692j053751q77571j237208J43201K481929
4495E07823K808282L96550k299951k846830j099002J524586L495401L801079K228965
4486H516903m43553k673221k870119o38866K179326K641702O0915k604749k258838
4477A909500K78770J679423P18796j043840k550047m031114m572971k465839J214141
4468h863181K773731R80692j093175p36885R92550K191504L139116M123760L419737
$$ plain form
4459 6927849 7314466 5223858 3700294 3804122 3491300 1870596 1400752 3993912 7540292
4450 7540292 8649348 6973851 4494742 2112816 -399072 -2063570 -1210565 1658048
4442 1658048 3807235 3495384 1563434 -503438 -2317196 -3655130 -3449770 -1231859 1139651
4433 1139651 823082 -2627360 -6212420 -6458694 -3063988 943318 2474684 1241536 -607565
4424 -607565 -1005077 242242 1704457 1804547 85252 -2650412 -5226899 -6871331 -7041120
4415 -7041120 -5199843 -1683996 1591950 2679990 2007449 1833015 2877217 3084887 640509
4406 640509 -3327180 -6397807 -7917059 -8763544 -9079900 -8154236 -6066014 -3668009 -1185304
4397 -1185304 1531604 3558829 3424757 1220700 -1276352 -2796628 -3602129 -4141391 -4055024
$$ packed form
4459F927849L86617k090608j523564J03828l12822j620704m69844K593160L546380
4450G540292J109056j675497k479109k381926k511888j664498Q53005K868613
4442A658048K149187l11851j931950k066872j813758j337934K05360K217911K371510
4433A139651l16569l450442l585060k46274L394706M007306J531366j233148j849101
4424f07565l97512J247319J462215J00090j719295k735664k576487j644432j69789
4415g041120J841277L515847L275946J088040o72541j74434J044202K07670k444378
4406F40509l967689l070627j519252q46485l16356R25664K088222K398005K482705
4397a185304K716908K027225j34072k204057k497052j520276q05501n39262Q6367
$$ plain form
4388 -4055024 -3121789 -2270901 -2867299 -5086684 -7231050 -6957147 -3710412 303682 2631333
4379 2631333 3786202 6051564 8955007 8826753 4209080 -1322146 -4114169 -5304195
4371 -5304195 -7366572 -8483280 -5172918 806128 3594100 1533701 -690669 509916
4363 509916 2571156 1256078 -3531008 -8932832 -13226141 -16063977 -16744678 -14774429 -11009318
4354 -11009318 -6771233 -3152690 -1905829 -4636600 -9758173 -12716116 -11129913 -7593962
4346 -7593962 -5486840 -4288705 -1589494 2088962 3557849 1417006 -2210746 -4297428
4338 -4297428 -3617046 -1057269 1475535 2607368 2674248 2985902 3788184 4041290 3331004
4329 3331004 2358573 1236609 -650418 -2538123 -2470829 -621218 123747 -1647822 -3619918
$$ packed form
4388d055024R33235Q50888n96398k219385k144366K73903L246735M014094K327651
4379B631333J154869K265362K903443j28254m617673n531226k792023j190026
4371e304195k062377j116708L310362N979046K787972k060399k224370J200585
4363E09916K061240j315078m787086n401824m293309k837836o80701J970249L765111
4354a1009318M238085L618543J246861k730771n121573k957943J586203L535951
4346g593962K107122J198135K699211L678456J468887k140843l627752k086682
4338d297428O80382K559777K532804J131833O6880L11654Q02282K53106p10286
4329C331004r72431j121964j887027j887705O7294J849611P44965j771569j972096
$$ plain form
4320 -3619918 -3508588 -2616671 -3401729 -5706097 -7892434 -9742395 -11489441 -11689330 -9105797
4311 -9105797 -5620537 -4388716 -5782432 -7616850 -8616201 -9177685 -9356425 -8588109 -7107137
4302 -7107137 -5561817 -3606559 -710620 2245665 4032795 5051278 6417651 7799760
4294 7799760 7984543 6883673 5301054 3608429 2256511 2349209 3863936 4696255 3543861
4285 3543861 2228492 2803149 3970381 3209113 1072412 228988 1267391 2627234 3790272
4276 3790272 5179623 5563546 3125222 -1050891 -3850666 -4411833 -4438751 -4494217 -3365438
4267 -3365438 -1140335 559074 1754897 4172485 7611087 9530275 9004083 8061079 8316280
4258 8316280 9112115 9660371 10194432 10450962 9962425 10271002 13441823 17660375 18087757
$$ packed form
4320c619918J11330Q91917p85058k304368k186337j849961j747046j99889K583533
4311i105797L485260J231821j393716j834418r99351n61484j78740P68316J480972
4302g107137J545320J955258K895939K956285J787130J018483J366373J382109
4294G799760J84783j100870j582619j692625j351918R2698J514727Q32319j152394
4285C543861j315369N74657J167232p61268k136701q43424J038403J359843J163038
4276C790272J389351L83923k438324m176113k799775n61167k6918n5466J128779
4267c365438K225103J699409J195823K417588L438602J919188n26192r43004K55201
4258H316280P95835N48256N34061K56530m88537L08577L170821M218552M27382
$$ plain form
4249 18087757 13514173 8516023 7020092 7096570 4719346 -48736 -3571292 -3582539 -1040816
4240 -1040816 1778848 2961589 1651923 -1188680 -3294029 -3395547 -2359720 -1629091 -1689553
4231 -1689553 -2361687 -3120332 -2838356 -876887 1322066 1548580 -76447 -1289108 -1097117
4222 -1097117 -826884 -1637843 -3328646 -5640468 -8092228 -8520056 -4927286 862283 4677814
4213 4677814 5622923 6731005 9358408 10847414 9077617 5587577 2588436 428697
4205 428697 -483895 924902 3316720 3179670 140911 -1932068 -1159663 -489716 -1757451
4196 -1757451 -1841060 1614575 5325639 5708380 4883229 6208227 7530763 4853060 29518
4187 29518 -1594987 184775 420533 -2651049 -5049984 -3700631 -916184 -668949 -3534962
$$ packed form
4249A8087757m573584m998150j495931P6478k377224m768082l522556j1247K541723
4240a040816K819664J182741j309666k840603k105349j01518J035827P30629o0462
4231a689553o72134p58645K81976J961469K198953K26514j625027j212661J91991
4222a097117K70233q10959j690803k311822k451760m27828L592770N789569L815531
4213D677814R45109J108082K627403J489006j769797l490040k999141k159739
4205D28697r12592J408797K391818j37050l038759k072979P72405O69947j267735
4196a757451q3609L455635L711064L82741q25151J324998J322536k677703m823542
4187B9518j624505J779762K35758l071582k398935J349353K784447K47235k866013
$$ plain form
4178 -3534962 -6666840 -6923523 -3617402 588378 2054209 439844 -895557 204178
4170 204178 1960749 2429374 2728413 4111935 5239281 5143917 5258800 5601691 3472247
4161 3472247 -530447 -665577 5078343 10378146 10784678 11441064 16438579 18213336 9083858
4152 9083858 -3965397 -11848571 -25490254 -63843310 -117450333 -146462030 -126313150
4145 -126313150 -78743316 -43693033 -33742775 -32413369 -26799467 -21072803 -20123452 -19174459
4137 -19174459 -14054306 -8482404 -5800558 -3075113 1687494 4335325 1622097 -2660790
4129 -2660790 -3482766 -1831065 -1635017 -3039535 -3155140 -1274063 421973 220104 -1692253
4120 -1692253 -4345352 -6713547 -7971483 -8162588 -8039967 -7889653 -7478708 -7129199 -7354585
$$ packed form
4178c534962l131878k56683L306121M205780J465831j614365j335401J099735
4170B04178J756571M68625K99039J383522J127346r5364J14883L42891k129444
4161C472247m002694j35130N743920N299803M06532O56386M997515J774757r129478
4152I083858j3049255p883174j3641683l8353056n3607023k9011697K0148880
4145a26313150M7569834L5050283R950258J329406N613902N726664R49351R48993
4137a9174459N120153N571902K681846K725445M762607K647831k713228m282887
4129b660790q21976J651701J96048j404518j15605J881077J696036k01869j912357
4120a692253k653099k368195j257936j91105J22621J50314M10945L49509k25386
$$ plain form
4111 -7354585 -7437271 -6209874 -4539276 -5114307 -8993108 -13730833 -15616917 -12935787 -7027889
4102 -7027889 -1250067 1289866 348870 -1096792 -269732 1944732 2251031 -832908 -5563845
4093 -5563845 -9264523 -10180283 -7484651 -1745063 4301857 7391056 6864664 5069891 4508254
4084 4508254 5662132 7363106 7917056 6107246 2534071 -293748 -592334 471056 706727
4075 706727 193658 460427 1066141 -144063 -3224267 -5379682 -4888031 -3508671 -3941587
4066 -3941587 -6650910 -10067252 -12267695 -11597127 -7265179 -529315 5619472 8651785
4058 8651785 7854810 3925805 -1225308 -4527824 -3839992 -552288 1693816 1318765 -34948
4049 -34948 -902573 -1956332 -3480059 -3486326 -460699 3643890 5374591 3991057 1972960
$$ packed form
4111g354585q2686J227397J670598n75031l878801m737725j886084K681130N907898
4102g027889N777822K539933r40996j445662Q27060K214464L06299l083939m730937
4093e563845l700678r15760K695632N739588O046920L089199n26392j794773n61637
4084D508254J153878J700974N53950j809810l573175k827819k98586J063390K35671
4075G06727n13069K66769O05714j210204l080204k155415M91651J379360m32916
4066c941587k709323l416342k200443O70568M331948O735864O148787L032313
4058H651785p96975l929005n151113l302516O87832L287704K246104l75051j353713
4049c4948q67625j053759j523727o267L025627M104589J730701j383534k018097
$$ plain form
4040 1972960 1703642 2920491 3288822 875515 -3522859 -6345527 -4632230 264532 3780454
4031 3780454 3503063 1675586 1400212 2385790 2267274 514050 -1319427 -2318652 -2814884
4022 -2814884 -2691743 -1429180 91729 59674 -1374533 -1553210 1316198 5622537 8388152
4013 8388152 8884942 8790388 9088979 8361934 4828333 -700142 -4948821 -5415739 -2848403
4004 -2848403 -88092 1090362 1276477 1744242 2498653 2599860 1897478 1484698 2093235
3995 2093235 2549197 657467 -4032231 -8965335 -10980674 -9754292 -7687616 -6311479
3987 -6311479 -4487639 -1036181 2635267 4351031 4392604 4576563 4700938 2565252 -2208559
3978 -2208559 -6893055 -9174531 -10004492 -11702340 -14624431 -16898472 -16470743 -12620928 -6562273
$$ packed form
4040A972960k69318J216849L68331k413307m398374k822668J713297M896762L515922
4031C780454k77391j827477k75374R85578j18516j753224j833477r99225m96232
4022b814884J23141J262563J520909l2055j434207j78677K869408M306339K765615
4013H388152M96790r4554K98591p27045l533601n528475m248679m66918K567336
4004b848403K760311J178454J86115M67765P54411J01207p02382m12780O08537
3995B093235M55962j891730m689698m933104k015339J226382K066676J376137
3987f311479J823840L451458L671448J715764M1573J83959J24375k135686m773811
3978b208559m684496k281476q29961j697848k922091k274041M27729L849815O058655
$$ plain form
3969 -6562273 -1301950 285207 -1870608 -5216817 -7834511 -10001396 -11907814 -11926310 -8820448
3960 -8820448 -4215948 -1048548 -502824 -1955976 -4698019 -7812650 -9430283 -8402906
3952 -8402906 -6251278 -5344822 -5505504 -4632675 -2603014 -2138253 -5190864 -10384182 -14778473
3943 -14778473 -16587029 -15512855 -12158171 -8267627 -6254511 -7083706 -9155642 -10134828
3935 -10134828 -9368624 -7935342 -7027870 -6973429 -7221821 -6671725 -4654420 -2237537 -1819316
3926 -1819316 -4495107 -8236298 -9597024 -7172208 -2858704 135951 230804 -1140985 -768494
3917 -768494 3021080 7866571 9266204 5882003 1724173 1343186 3782722 3881295 -392018
3908 -392018 -4864547 -4780853 -1026329 1590110 675691 -1929596 -3972348 -5343083 -6357802
$$ packed form
3969f562273N260323J587157k155815l346209k617694k166885j906418j8496L105862
3960h820448M604500L167400N45724j453152k742043l114631j617633J027377
3952h402906K151628R06456j60682Q72829K029661M64761l052611n193318m394291
3943a4778473j808556J074174L354684L890544K013116q29195k071936r79186
3935a0134828P66204J433282R07472N4441k48392N50096K017305K416883M18221
3926a819316k675791l741191j360726K424816M313504K994655R4853j371789L72491
3917g68494L789574M845491J399633l384201m157830l80987K439536R8573m273313
3908c92018m472529Q3694L754524K616439r14419k605287k042752j370735j014719
$$ plain form
3899 -6357802 -6183882 -4371361 -2262560 -1499801 -2210570 -3651579 -5501187 -7484397 -8818622
3890 -8818622 -9148684 -9112734 -9076499 -8478381 -7432909 -7456475 -9001969 -9643392 -6807383 -1500725
3880 -1500725 2659613 3450820 1212161 -3000299 -7939701 -11412615 -11710449 -9807859 -7873439
3871 -7873439 -5995961 -3085812 -442074 -635646 -2528656 -1655342 2970253 6522025 5195790
3862 5195790 1625954 342671 1167975 1150204 454372 1446765 3226306 2247103 -1386457
3853 -1386457 -2948819 146215 4305265 4534850 693404 -3124590 -3738859 -1546282 858636
3844 858636 1181157 -807679 -2989746 -2986527 -1123222 -348096 -2400116 -5079686 -4624110
3835 -4624110 -384456 4155573 5289662 3149941 1108022 1326997 2030045 182389 -3729649
$$ packed form
3899f357802J73920J812521K108801P62759p10769j441009j849608j983210j334225
3890h818622l30062L5950L6235N98118J045472k3566j545494o41423K836009N306658
3880a500725M160338P91207k238659m212460m939402l472914k97834J902590J934420
3871g873439J877478K910149K643738j93572j893010Q73314M625595L551772j326235
3862E195790l569836j283283Q25304j7771o95832R92393J779541r79203l633560
3853a386457j562362L095034M159050K29585l841446l817994o14269K192577K404918
3844H58636L22521j988836k182067L219J863305P75126k052020k679570M55576
3835d624110M239654M540029J134089k139721k041919K18975P03048j847656l912038
$$ plain form
3826 -3729649 -5517687 -2550483 2530753 4863557 3032072 -28679 -1068357 416033
3818 416033 2822083 4214772 3324885 483471 -2036364 -1981667 176308 1677110 900396
3809 900396 -903578 -1822459 -2062055 -3576110 -7273016 -11207239 -11862531 -7642851 -1098886
3800 -1098886 3200399 3362907 1608391 587488 185376 -685892 -1285231 -529262 291992
3791 291992 -709033 -2559726 -2981825 -2631408 -4068600 -6773395 -7388184 -5447100 -4458897
3782 -4458897 -5908374 -6611266 -4373974 -2083235 -2780537 -4190049 -2386966 1550078 3204592
3773 3204592 1831538 1026221 2523354 3648699 1934345 -1208416 -3157647 -4101508 -6370606
3764 -6370606 -10596638 -13937306 -12442037 -5354525 2974476 6579323 4004927 -314692
$$ packed form
3826c729649j788038K967204N081236K332804j831485l060751j039678J484390
3818D16033K406050J392689q89887k841414k519835N4697K157975J500802p76714
3809I00396j803974r18881k39596j514055l696906l934223o55292M219680O543965
3800a098886M299285J62508j754516j020903m02112q71268n99339P55969Q21254
3791B91992j001025j850693m22099L50417j437192k704795o14789J941084R88203
3782d458897j449477p02892K237292K290739o97302j409512J803083L937044J654514
3773C204592j373054q05317J497133J125345j714354l142761j949231r43861k269098
3764f370606m226032l340668J495269P087512Q329001L604847k574396m319619
$$ plain form
3756 -314692 -1766728 -827026 -794816 -2236992 -2829093 -1791553 -945394 -1173161 -1005625
3747 -1005625 517392 2339631 3752865 5765750 8769384 10927578 10440582 7917179
3739 7917179 5246491 3462588 2723742 2854905 2738438 690622 -3213100 -6561779 -7666575
3730 -7666575 -7656477 -7894020 -7002632 -3058426 2147026 4094367 1187444 -3127099 -4991277
3721 -4991277 -4865817 -5878827 -8683112 -10286983 -8258911 -4285893 -2235647 -3288004
3713 -3288004 -4372038 -1779384 4524156 10782397 13133288 10820957 6219356 2576744
3705 2576744 1678571 2853061 3890536 3283276 1700215 1053955 2312486 4654052 6488760
3696 6488760 6595336 4421451 326611 -3998326 -6071155 -4485935 -500816 2534001
$$ packed form
3756c14692j452036R39702L2210j442176n92101J037540Q46159k27767J67536
3747a005625J523017J822239J413234K012885L003634K158194m86996k523403
3739G917179k670688j783903p38846J31163j16467k047816l903722l348679j104796
3730g666575J0098k37543Q91388L944206N205452J947341k906923m314543j864178
3721d991277J25460j013010k804285j603871K028072L973018K050246j052357
3713c288004j084034K592654O303540O258241K350891k312331m601601l642612
3705B576744q98173J174490J037475o07260j583061o46260J258531K341566J834708
3696F488760J06576k173885m094840m324937k072829J585220L985119L034817
$$ plain form
3688 2534001 1947763 -1504244 -3950848 -2373235 1798334 4334817 3597020 2321457 3085775
3679 3085775 4329218 3131678 159300 -1240995 23050 2002589 3441011 4801847
3671 4801847 5521096 4153601 2126919 3238180 7533465 9596671 5746066 -450425
3663 -450425 -3288480 -2635458 -2366640 -3309091 -2713424 -33616 1580263 80748 -3061669
3654 -3061669 -5935873 -8172937 -9018017 -6888101 -2258322 1878810 3826893 4899896
3646 4899896 6162566 6291328 4245201 1324581 -1315609 -4596696 -8778824 -11328291
3638 -11328291 -10303853 -7941835 -7913563 -10392620 -12682078 -13537690 -13851973 -13861161 -12794315
3629 -12794315 -11041555 -9809533 -8613455 -5758378 -1491657 1761423 2536798 1485524
$$ packed form
3688B534001n86238l452007k446604J577613M171569K536483p37797j275563P64318
3679C085775J243443j197540k972378j400295J264045J979539J438422J360836
3671D801847P19249j367495k026682J111261M295285K063206l850605o196491
3663d50425k838055O53022K68818r42451N95667K679808J613879j499515l142417
3654c061669k874204k237064q45080K129916M629779M137132J948083J073003
3646D899896J262670J28762k046127k920620k640190l281087m182128k549467
3638a1328291J024438K362018K8272k479057k289458q55612l14283r188J066846
3629a2794315J752760J232022J196078K855077M266721L253080P75375j051274
$$ plain form
3621 1485524 -566564 -3151971 -4632591 -3031019 895921 4030629 5112192 5923047
3613 5923047 7418686 7752391 5771127 3615520 3628818 4956523 5432689 4713281 3217546
3604 3217546 192579 -4262710 -7148070 -5962388 -2982321 -2727540 -5866074 -8968828
3596 -8968828 -9775555 -9113553 -7725959 -5085927 -2018092 -793506 -1352420 -720877 2330906
3587 2330906 5176155 5580226 4936990 5141628 5387788 4951508 6254364 11245943 16601108
3578 16601108 16896999 12043521 7564101 7289569 9388568 10297595 9074560 6455734 2703846
3569 2703846 -1411643 -3630607 -2564612 113480 1668421 1486241 632182 -592469 -2447220
3560 -2447220 -3676083 -2123927 2054668 5667545 5954822 3655668 1717547 1844177 3331143
$$ packed form
3621A485524k052088k585407j480620J601572L926940L134708J081563Q10855
3613E923047J495639L33705j981264k155607J3298J327705M76166p19408j495735
3604C217546l024967m455289k885360J185682K980067K54781l138534l102754
3596h968828q06727O62002J387594K640032L067835J224586n58914O31543L051783
3587B330906K845249M04071o43236K04638K46160m36280J302856M991579N355165
3578A6601108K95891m853478m479420k74532K098999R09027j223035k618826l751888
3569B703846m115489k218964J065995K678092J554941j82180q54059j224651j854751
3560b447220j228863J552156M178595L612877K87277k299154j938121J26630J486966
$$ plain form
3551 3331143 4665973 5034969 4426779 3493925 3548703 5529916 8365899 9419471 7575429
3542 7575429 5044130 4648575 5771813 4855279 200363 -5537526 -8511868 -7832275 -5432899
3533 -5432899 -3255403 -2221399 -2925703 -5185761 -7127303 -6661654 -4110161 -1836130 -1099071
3524 -1099071 -850350 24211 921820 677712 -866887 -3140238 -5349294 -6054592 -3901520
3515 -3901520 34130 2237223 836347 -1579381 -1390060 766130 983358 -1699885 -3376573
3506 -3376573 -1002613 2716780 2871226 -752381 -3513757 -2425817 370082 1539434
3498 1539434 1083949 937381 1187541 525400 -612292 -476717 455594 -559431 -4141088
3489 -4141088 -6991236 -5997985 -2032700 2034633 5160784 7841219 9632618 9617529 8507512
$$ packed form
3551C331143J334830L68996o08190r32854N4778J981213K835983J053572j844042
3542G575429k531299l95555J123238r16534m654916n737889k974342O79593K399376
3533e432899K177496J034004p04304k260058j941542M65649K551493K274031P37059
3524a099071K48721Q74561Q97609k44108j544599k273351k209056p05298K153072
3515c901520L935650K203093j400876k415728J89321K156190K17228k683243j676688
3506c376573K373960L719393J54446l623607k761376J087940K795899J169352
3498A539434m55485j46568K50160o62141j137692J35575R32311j015025l581657
3489d141088k850148R93251L965285M067333L126151K680435J791399j5089j110017
$$ plain form
3480 8507512 7787034 7248047 5678944 3484227 2144037 1572913 896211 1488947 5549418
3471 5549418 11079423 12364317 7451456 1703977 1081655 4531552 6303033 3842305
3463 3842305 -269395 -3088326 -4141884 -3614054 -1357185 1383837 2118634 299536 -1673539
3454 -1673539 -1793941 -994160 -1092691 -1813619 -1548860 -216813 320464 -1324153 -4205643
3445 -4205643 -5799218 -4284925 -142370 4352347 7171292 7786746 6358822 2861843
3437 2861843 -1731978 -4352643 -2259321 3156394 7207254 7463154 6380154 6923556 7711814
3428 7711814 5248215 -37958 -3247561 -1079346 4038324 7022241 5488511 727804
3420 727804 -4978400 -10015139 -13213306 -14043845 -13168332 -11524095 -8946647 -4939160 -563947
$$ packed form
3480H507512p20478n38987j569103k194717j340190n71124o76702N92736M060471
3471E549418N530005J284894m912861n747479o22322L449897J771481k460728
3463C842305m111700k818931j053558N27830K256869K741022P34797j819098j973075
3454a673539j20402P99781r8531p20928K64759J332047N37277j644617k881490
3445d205643j593575J514293M142555M494717K818945O15454j427924l496979
3437B861843m593821k620665K093322N415715M050860K55900j083000N43402P88258
3428G711814k463599n286173l209603K168215N117670K983917j533730m760707
3420G27804n706204n036739l198167q30539Q75513J644237K577448M007487M375213
$$ plain form
3411 -563947 2089066 2483623 2043864 1692630 884306 -267484 -130190 1744223 3108870
3402 3108870 2285786 1243856 2856695 6358620 8461690 8103822 6729811 4369203 -387973
3393 -387973 -5842910 -7038278 -2363115 3260862 4647145 2889367 2382743 3853838 4505559
3384 4505559 3647700 3597375 4985159 5346975 3439815 1583570 2127463 4144239 5340217
3375 5340217 5286873 5065346 5267929 6046256 7838228 10138085 10414835 6503373 209235
3366 209235 -3422755 -1516882 3032259 4793581 2280129 -579576 -29085 2490530 2992940
3357 2992940 1247826 1021514 3860795 6387612 5483424 2856348 1809486 2316875 2714330
3348 2714330 3855583 7221793 10369505 9207555 4568552 1641567 2252774 2538621 -177108
$$ packed form
3411e63947K653013L94557m39759l51234q08324j151790J37294J874413J364647
3402C108870q23084j041930J612839L501925K103070l57868j374011k360608m757176
3393c87973n454937j195368M675163N623977J386283j757778n06624J471095O51721
3384D505559q57859n0325J387784L61816j907160j856245N43893K016776J195978
3375E340217n3344k21527K02583P78327J791972K299857K76750l911462o294138
3366B09235l631990J905873M549141J761322k513452k859705N50491K519615N02410
3357B992940j745114k26312K839281K526817r04188k627076j046862N07389L97455
3348B714330J141253L366210L147712j161950m639003k926985O11207K85847k715729
$$ plain form
3339 -177108 -2856317 -1782426 1642702 3508781 3251021 3508390 5594006 7975897 8556744
3330 8556744 6552837 2846165 -329701 -1180655 -589434 -875143 -1904826 -1268168 724637
3321 724637 24061 -4821479 -9023623 -7833344 -3494662 -1729258 -3537913 -5124765 -4484032
3312 -4484032 -3177826 -2192478 -808821 382796 -76875 -601130 2395295 8434923 12146586
3303 12146586 10068903 4607773 -352551 -3930857 -6181318 -5413950 -1040959 3410277
3295 3410277 3755025 399164 -2768091 -3778947 -4149917 -5525538 -7308293 -7889571 -6521554
3286 -6521554 -3618850 -271905 2333308 3612871 3728413 2987155 1710336 722911 847489
3277 847489 1555918 1290014 -487157 -2848908 -5326519 -8537083 -12179996 -14261739 -13484172
$$ packed form
3339a77108k679209J073891L425128J866079k57760K57369K085616K381891N80847
3330H556744k003907l706672l175866q50954N91221k85709j029683O36658J992805
3321G24637p00576m845540m202144J190279M338682J765404j808655j586852O40733
3312d484032J306206R85348J383657J191617m59671n24255K996425O039628L711663
3303A2146586k077683n461130m960324l578306k250461P67368M372991M451236
3295C410277L44748l355861l167255j010856l70970j375621j782755n81278J368017
3286f521554K902704L346945K605213J279563J15542p41258j276819r87425J24578
3277H47489P08429k65904j777171k361751k477611l210564l642913k081743P77567
$$ plain form
3268 -13484172 -10842973 -7799850 -4673106 -2081664 -1772510 -3945847 -5645252 -4368225
3260 -4368225 -1858897 -1522708 -3180969 -3604887 -1787097 -230794 -597101 -1351582 -967679
3251 -967679 -716311 -2423175 -5377736 -7457583 -8108167 -8330977 -8451518 -7748461 -6218310
3242 -6218310 -5200270 -5731499 -7007512 -7041248 -4856665 -1884133 -826969 -2725070 -5431826
3233 -5431826 -5852594 -3705204 -1962446 -3075437 -5806313 -6789720 -4605027 -1163084 694790
3224 694790 -180179 -3034697 -6316662 -8360941 -8041175 -5915590 -4267428 -4738575 -6006804
3215 -6006804 -5260453 -2362248 -820691 -3214916 -6942537 -6822456 -1803239 3208417 2989828
3206 2989828 -2324557 -8289477 -11199859 -10435896 -7063568 -2569466 949885 1453197 -1065665
$$ packed form
3268a3484172K641199L043123L126744K591442L09154k173337j699405J277027
3260d368225K509328L36189j658261m23918J817790J556303l66307p54481L83903
3251i67679K51368j706864k954561k079847o50584k22810j20541P03057J530151
3242f218310J018040n31229j276013l3736K184583K972532J057164j898101k706756
3233e431826m20768K147390J742758j112991k730876r83407K184693L441943J857874
3224F94790q74969k854518l281965k044279L19766K125585J648162m71147j268229
3215f006804P46351K898205J541557k394225l727621J20081N019217N011656k18589
3206B989828n314385n964920k910382P63963L372328M494102L519351N03312k518862
$$ plain form
3197 -1065665 -4033168 -4424652 -1156303 4626200 10786028 15299272 16861569 15307928
3189 15307928 11616160 7287124 3601038 1299330 649578 1603155 3888613 6958792
3181 6958792 9859861 11335623 10376217 6985444 2617811 -351587 -304881 1997194 3907841
3172 3907841 3578976 1762754 359333 -85011 -260835 -159303 873398 2201576 2150158
3163 2150158 812914 557740 2537554 4481139 3616919 546490 -1530902 -683273 2127727
3154 2127727 4603807 5014977 3270067 1252850 1260123 3070357 3806840 1993891 146971
3145 146971 1434247 5274282 8583126 10008236 10155164 8864906 5707770 2530244 1744642
3136 1744642 2124838 211366 -3652809 -4914217 -1718864 1993019 2512074 1574986 2506304
$$ packed form
3197a065665k967503l91484L268349N782503O159828M513244J562297j553641
3189A5307928l691768m329036l686086k301708o49752R53577K285458L070179
3181F958792K901069J475762r59406l390773m367633k969398M6706K302075J910647
3172C907841l28865j816222j403421m44344j75824J01532J032701J328178n1418
3163B150158j337244k55174J979814J943585q64220l070429k077392Q47629K811000
3154B127727K476080M11170j744910k017217P273J810234P36483j812949j846920
3145A46971J287276L840035L308844J425110J46928j290258l157136l177526p85602
3136A744642L80196j913472l864175j261408L195353L711883N19055r37088R31318
$$ plain form
3127 2506304 4541841 4919577 4201959 5080925 7081789 6829048 3479610 44462 -1221341
3118 -1221341 -1419336 -2160338 -3172828 -4072511 -5796504 -8307435 -8882174 -5153732 1011592
3109 1011592 4941773 4465578 2064886 1363753 3044094 5327691 7360711 10057296 13319463
3100 13319463 14475793 11182541 4928144 -253155 -2228388 -2108583 -1482376 -724714 -346965
3091 -346965 -1287625 -2683425 -1860376 1720450 4686814 3962092 809813 -1575956 -2597230
3082 -2597230 -3587767 -4284794 -3394111 -1811720 -1727171 -2665591 -1809320 1391916 4066215
3073 4066215 4025823 2148775 -115093 -2685482 -5032609 -5093291 -1860795 2665630 5613935
3064 5613935 6043693 4788113 3114566 2397366 3477699 5501095 6877255 7736602 9415688
$$ packed form
3127B506304K035537L77736p17618Q78966K000864k52741l349438l435148j265803
3118a221341j97995p41002j012490q99683j723993k510931n74739L728442O165324
3109A011592L930181m76195k400692p01133J680341K283597K033020K696585L262167
3100A3319463J156330l293252o254397n181299j975233J19805O26207P57662L77749
3091c46965r40660j395800Q23049L580826K966364p24722l152279k385769j021274
3082b597230r90537o97027Q90683J582391Q4549r38420Q56271L201236K674299
3073D066215m0392j877048k263868k570389k347127o0682L232496M526425K948305
3064E613935M29758j255580j673547p17200J080333K023396J376160Q59347J679086
$$ plain form
3055 9415688 11260002 10730024 7469014 4141523 1972037 -980345 -4983537 -5884881 -760566
3046 -760566 6585216 9968330 8741071 7054197 6620702 5053984 1233472 -2310755 -3348837
3037 -3348837 -2746001 -2329323 -2916134 -5081928 -8762606 -11339572 -9428288 -3819955 406757
3028 406757 111593 -2504401 -4206759 -5245123 -7380372 -10290518 -12667939 -14565224 -15757564
3019 -15757564 -13834848 -7320854 551894 4527533 3270623 -87194 -2561231 -3425359
3011 -3425359 -2241035 1622438 6812036 10220456 10444072 8897303 6868666 3859062
3003 3859062 -182415 -3314464 -3809984 -2251303 -190786 1642721 2610913 1524935 -1512249
2994 -1512249 -4101398 -4285556 -3161357 -2941513 -3626682 -3828988 -3905216 -5459837 -7925164
$$ packed form
3055I415688J844314n29978l261010l327491k169486k952382m003192r01344N124315
3046g60566P345782L383114j227259j686874m33495j566718l820512l544227j038082
3037c348837O02836M16678n86811k165794l680678k576966J911284N608333M226712
3028D06757k95164k615994j702358j038364k135249k910146k377421j897285j192340
3019a5757564J922716O513994P872748L975639j256910l357817k474037q64128
3011c425359J184324L863473N189598L408420K23616j546769k028637l009604
3003C859062m041477l132049m95520J558681K060517J833507R68192j085978l037184
2994a512249k589149j84158J124199K19844o85169k02306p6228j554621k465327
$$ plain form
2985 -7925164 -8512861 -6194859 -3244753 -1792467 -1088486 362362 1932259 2110771 1196959
2976 1196959 496765 -347424 -2771891 -6101413 -7323738 -4857553 -846962 1361402 870932
2967 870932 -641818 -1443330 -1097902 101404 1580937 2275011 1212644 -1028812 -2163361
2958 -2163361 -413741 3123789 5082146 3257829 -936713 -4084657 -4624338 -4138159 -4594013
2949 -4594013 -5563390 -5195676 -3043817 -476519 1228542 1604182 116961 -3439858 -7484480
2940 -7484480 -9727853 -10398074 -12130037 -15435842 -16734948 -13111635 -7081056 -3706792
2932 -3706792 -4165412 -5361824 -5302106 -5198557 -5876943 -5799855 -4201376 -3112009 -4014264
2923 -4014264 -4786817 -2666309 1105799 2283835 -1165566 -6940059 -11315126 -12393240
$$ packed form
2985g925164n87697K318002K950106J452286P03981J450848J569897J78512r13812
2976A196959p00194q44189k424467l329522j222325K466185M010591K208364m90470
2967H70932j512750q01512L45428J199306J479533O94074j062367k241456j134549
2958b163361J749620L537530J958357j824317m194542l147944n39681M86179m55854
2949d594013r69377L67714K151859K567298J705061L75640j487221l556819m044622
2940g484480k243373o70221j731963l305805j299106L623313O030579L374264
2932c706792m58620j196412N9718J03549o78386P7088J598479J089367r02255
2923d014264p72553K120508L772108J178036l449401n774493m375067j078114
$$ plain form
2915 -12393240 -10419582 -6539794 -1993428 2033527 4249154 3441320 -233161 -4172441
2907 -4172441 -5218507 -3464910 -2578156 -5074157 -8876659 -10237418 -8491283 -5721797
2899 -5721797 -3133312 -605239 1028837 600856 -446656 1058101 5449085 9300244
2891 9300244 10014647 8731737 7493334 6150035 3840796 1300673 -459789 -2126302
2883 -2126302 -4569250 -6594964 -6297897 -3775082 -668130 2069626 4084993 4339940 2261032
2874 2261032 -352187 -983657 90053 234352 -1407850 -2633368 -1849538 -758413 -1709502
2865 -1709502 -3829646 -3874367 -620883 3362642 4869771 3878431 3214501 4695851 6822255
2856 6822255 7019908 5360470 4516095 5898370 7483937 6456045 2782574 -1183130 -3774407
$$ packed form
2915a2393240J973658L879788M546366M026955K215627q07834l674481l939280
2907d172441j046066J753597Q86754k496001l802502j360759J746135K769486
2899e721797K588485K528073J634076m27981j047512J504757M390984L851159
2891I300244P14403j282910j238403j343299k309239k540123j760462j666513
2883b126302k442948k025714K97067K522815L106952K737756K015367K54947k078908
2874B261032k613219o31470J073710J44299j642202j225518P83830J091125r51089
2865a709502k120144m4721L253484L983525J507129r91340o63930J481350K126404
2856F822255J97653j659438q44375J382275J585567j027892l673471l965704k591277
$$ plain form
2847 -3774407 -5032772 -5137250 -3741855 -1221985 915392 1584030 1214710 803354 582284
2838 582284 84772 -1038638 -2675069 -4337091 -5324698 -5058448 -3409997 -715760 2188491
2829 2188491 3801633 2624312 -1234021 -5639726 -8463605 -9543196 -9788341 -9120289 -6760948
2820 -6760948 -3194820 -183089 1319655 1916587 2320922 2516856 2574945 2916955 3354017
2811 3354017 3095811 2195575 1918687 3258743 6022877 9527745 12999674 15098259 14485076
2802 14485076 11402771 7519549 3861566 213875 -3133207 -4723264 -3785345 -1358713
2794 -1358713 1142030 3166327 4334437 4178992 3319494 3174623 3701006 3316568 1902854
2785 1902854 1408861 2018472 553151 -4724772 -10117701 -10760484 -7436782 -5442172 -7302712
$$ packed form
2847c774407j258365j04478J395395K519870K137377O68638l69320m11356k21070
2838E82284m97512j123410j636431j662022r87607K66250J648451K694237K904251
2829B188491J613142j177321l858333m405705k823879j079591k45145O68052K359341
2820f760948L566128L011731J502744N96932M04335J95934N8089L42010M37062
2811C354017k58206r00236k76888J340056K764134L504868L471929K098585o13183
2802A4485076l082305l883222l657983l647691l347082j590057R37919K426632
2794a358713K500743K024297J168110j55445q59498j44871N26383l84438j413714
2785A902854m93993O09611j465321n277923n392929o42783L323702J994610j860540
$$ plain form
2776 -7302712 -10382565 -11829127 -12132230 -12662006 -12843421 -11606514 -9515207 -7673449 -5914616
2767 -5914616 -3500280 -533617 2445205 5284498 7664426 8642396 7758122 5957294 4584181
2758 4584181 3829947 2679636 168089 -3338669 -5816434 -5131362 -1847776 241314 -1955982
2749 -1955982 -6684500 -9038614 -6822411 -2628689 259896 1662087 3101237 4696920
2741 4696920 5151207 3662024 528009 -3170693 -5478819 -4390546 -135888 4193072
2733 4193072 5568709 4107339 2484723 2997511 5790362 8993517 9940293 7408335 3486182
2724 3486182 2052898 4549350 8470461 10775237 11077878 10336769 8505448 5647119 3804788
2715 3804788 4997087 7873932 8746003 5850250 732222 -4311938 -8177529 -10493710
$$ packed form
2776g302712l079853j446562l03103n29776j81415J236907K091307J841758J758833
2767e914616K414336K966663K978822K839293K379928R77970q84274j800828j373113
2758D584181p54234j150311k511547l506758k477765O85072L283586K089090k197296
2749a955982m728518k354114K216203M193722K888585J402191J439150J595683
2741D696920M54287j489183l134015l698702k308126J088273M254658M328960
2733D193072J375637j461370j622616N12788K792851L203155R46776k531958l922153
2724C486182j433284K496452L921111K304776L02641p41109j831321k858329j842331
2715C804788J192299K876845Q72071k895753n118028n044160l865591k316181
$$ plain form
2707 -10493710 -11339411 -11741555 -12775751 -13903124 -13723496 -12488666 -12121493 -13351993 -14540989
2698 -14540989 -14045791 -12296141 -10632469 -9215486 -7104932 -3813530 -28960 2953483
2690 2953483 4245088 4121049 3794319 4117654 4759521 5034799 4889906 4325958 2728581
2681 2728581 70937 -1928124 -1523480 537834 1939754 1976091 1861952 1948153 960981
2672 960981 -1370053 -3104779 -2649762 -853880 597571 1380299 1860018 1592154 57661
2663 57661 -1962833 -3237870 -3832042 -4762935 -6209721 -7129475 -6568370 -4600905 -2061482
2654 -2061482 53970 939313 199953 -1945471 -4379005 -5024788 -2102720 3517326 7935077
2645 7935077 7797639 4083920 743226 -268172 -605506 -2023551 -3577575 -3262989 -509264
$$ packed form
2707a0493710q45701m02144j034196j127373J79628J234830L67173j230500j188996
2698a4540989M95198J749650J663672J416983K110554L291402L784570K982443
2690B953483J291605j24039l26730L23335O41867K75278j44893n63948j597377
2681B728581k657644j999061M04644K061314J401920L6337j14139Q6201r87172
2672I60981k331034j734726M55017J795882J451451P82728M79719k67864j534493
2663E7661k020494j275037n94172r30893j446786r19754N61105J967465K539423
2654b061482K115452Q85343p39360k145424k433534o45783K922068N620046M417751
2645G935077j37438l713719l340694j011398l37334j418045j554024L14586K753725
$$ plain form
2636 -509264 3981492 8966762 12077087 10645030 4997372 -659564 -2559793 -1314043
2628 -1314043 172753 1088177 2630072 4751305 5826358 5243257 3857981 1957290 -847895
2619 -847895 -3512688 -3750028 -1188670 1433844 1259720 -1599063 -4628755 -5628217 -4290415
2610 -4290415 -1846263 275457 1643266 2680618 3276564 2452525 255177 -1056447 595635
2601 595635 3860860 4822653 1336748 -4731700 -9783274 -11933304 -12020926 -12020172 -12620715 -12188884
2591 -12188884 -8853625 -3974820 -1864049 -4652646 -9125113 -10795521 -9503709 -7974498
2583 -7974498 -6210638 -1637762 5041801 8690440 6259393 1030288 -1946001 -1967241 -1799940
2574 -1799940 -2862208 -3982394 -3615504 -974760 3935348 9245192 11180614 7496652
$$ packed form
2636e09264M490756M985270L110325j432057n647658n656936j900229J245750
2628a314043J486796R15424J541895K121233J075053n83101j385276j900691k805185
2619h47895k664793k37340K561358K622514j74124k858783l029692r99462J337802
2610d290415K444152K121720J367809J037352N95946q24039k197348j311624J652082
2601E95635L265225R61793l485905o068448n051574k150030q7622P54o00543M31831
2591a2188884L335259M878805K110771k788597m472467j670408J291812J529211
2583g974498J763860M572876O679563L648639k431047n229105k976289k1240J67301
2574a799940j062268j120186L66890K640744M910108N309844J935422l683962
$$ plain form
2566 7496652 756328 -3552661 -2201259 3284482 8516607 9653604 6028952 759388
2558 759388 -2064578 -1830447 -1889735 -4560698 -7468935 -6835352 -2913056 358627 324611
2549 324611 -2127931 -4764530 -6201517 -6196844 -5765090 -6727152 -9357022 -11090958 -9578779
2540 -9578779 -6196156 -4063924 -3380232 -1806275 893266 2196529 1207468 74294 34381
2531 34381 -321510 -1195476 308309 5465758 10344978 10506609 7401972 6360245 9171495
2522 9171495 12397132 12993866 12044375 11869400 12265898 11458645 9256482 7478092 7659104
2513 7659104 9347633 10575266 9688211 7014456 4828491 5176739 7587911 9400571 8491618
2504 8491618 5287349 2079201 879454 2010951 4146525 5293577 4068171 616598
$$ packed form
2566G496652o740324m308989J351402N485741N232125J136997l624652n269564
2558G59388k823966K34131n9288k670963k908237O33583L922296L271683l4016
2549C24611k452542k636599j436987M673M31754r62062k629870j733936J512179
2540i578779L382623K132232O83692J573957K699541J303263r89061j133174l9913
2531C4381l55891q73966J503785N157449M879220J61631l104637j041727K811250
2522I171495L225637N96734r49491j74975L96498q07253k202163j778390J81012
2513G659104J688529J227633q87055k673755k185965L48248K411172J812660r08953
2504H491618l204269l208148j199747J131497K135574J147052j225406l451573
$$ plain form
2496 616598 -3375064 -5677853 -5054881 -2341951 154700 960970 1084276 2579086 5438269
2487 5438269 7070519 5427253 1584685 -1677646 -2998981 -3067034 -2890058 -2867827 -3331702
2478 -3331702 -4618310 -6345093 -7452656 -7100122 -5021554 -1439727 2433175 4346939
2470 4346939 3076854 678700 1069484 5569093 10952837 12847530 10348255 6421195
2462 6421195 4280357 4343888 4675790 3578966 1267476 -878564 -2190088 -3206568 -4267822
2453 -4267822 -4605855 -3625274 -2202967 -1353303 -252607 2420440 5260182 4782642 398154
2444 398154 -3433325 -1942044 4400853 11032070 14891520 16512983 17131323 16534868 14391408
2435 14391408 11454098 8349266 4777749 980113 -1479099 -1685642 -969221 -1139473 -2061450
$$ packed form
2496F16598l991662k302789O22972K712930K496651Q06270J23306J494810K859183
2487E438269J632250j643266l842568l262331j321335o8053J76976K2231m63875
2478c331702j286608j726783j107563L52534K078568L581827L872902J913764
2470D346939j270085k398154L90784M499609N383744J894693k499275l927060
2462F421195k140838O3531L31902j096824k311490k146040j311524j016480j061254
2453d267822l38033R80581J422307Q49664J100696K673047K839742m77540m384488
2444C98154l831479J491281O342897O631217L859450J621463O18340n96455k143460
2435A4391408k937310l104832l571517l797636k459212k06543P16421j70252r21977
$$ plain form
2426 -2061450 -2435888 -2131284 -1914987 -1308550 1180476 5366160 8743381 9304534 7605357
2417 7605357 5214743 2501136 -806552 -3978632 -5880050 -6747098 -7765075 -8930914
2409 -8930914 -8864622 -7033609 -4709269 -3028129 -1364591 1274904 4102226 5179231 4015758
2400 4015758 2383255 2335877 4188592 6687842 8582933 9685289 10611905 11608701 11649261
2391 11649261 9218617 4473013 -45735 -1937474 -1786564 -1988359 -2842185 -1957048 1554245
2382 1554245 4505366 3377211 -804213 -4076364 -5419625 -7766898 -12563436 -16710947
2374 -16710947 -17068921 -15431836 -15794037 -17889125 -17142973 -11427634 -4610912 -1822004 -3467968
2365 -3467968 -5947102 -6680116 -5965460 -4598101 -2447021 11380 927120 -782201 -3756951
$$ packed form
2426b061450l74438L04604K16297O06437K489026M185684L377221N61153j699177
2417G605357k390614k713607l307688l172080j901418q67048j017977j165839
2409h930914O6292J831013K324340J681140J663538K639495K827322J077005j163473
2400D015758j632503m7378J852715K499250J895091J102356R26616R96796M0560
2391A1649261k430644m745604m518748j891739J50910k01795q53826Q85137L511293
2382A554245K951121j128155m181424l272151j343261k347273m796538m147511
2374a6710947l57974J637085l62201k095088P46152N715339O816722K788908j645964
2365c467968k479134p33014P14656J367359K151080K458401R15740j709321k974750
$$ plain form
2356 -3756951 -6048344 -7805987 -10488119 -13726943 -14937557 -12727152 -9126871 -7096689
2348 -7096689 -6823074 -6254300 -4873250 -4712625 -7007152 -9903165 -11040595 -10925459 -11580277
2339 -11580277 -12590062 -11053802 -5779546 742023 5452137 7865016 8847407 8175678
2331 8175678 5444212 2299364 1259639 2397209 3336766 2849781 2401429 3383620 4812820
2322 4812820 5258066 5526115 7300134 9752228 9906707 6864242 3666259 3652149 6275877
2313 6275877 8272928 8256464 7908683 8350805 7807202 4594697 736059 -70582 2329778
2304 2329778 4129687 2941872 939654 1023441 2064159 591545 -3804799 -7615854 -8133918
2295 -8133918 -6711103 -6452870 -8252541 -10179045 -9946721 -7208563 -3875475 -2543556 -4232014
$$ packed form
2356c756951k291393j757643k682132l238824j210614K210405L600281K030182
2348g096689K73615N68774J381050J60625k294527k896013j137430J15136o54818
2339a1580277j009785J536260N274256O521569M710114K412879R82391o71729
2331H175678k731466l144848j039725J137570R39557m86985m48352R82191J429200
2322D812820M45246K68049J774019K452094J54479l042465l197983j4110K623728
2313F275877J997051j6464l47781M42122n43603l212505l858638q06641K400360
2304B329778J799909j187815k002218Q3787J040718j472614m396344l811055n18064
2295h133918J422815K58233j799671j926504K32324K738158L333088J331919j688458
$$ plain form
2286 -4232014 -7689181 -11326042 -15164228 -19684643 -23361222 -23346948 -18887811 -12312397 -6275657
2277 -6275657 -1919714 -215926 -2501424 -7950333 -12565449 -13058935 -10572650 -8374158
2269 -8374158 -6982939 -4242989 326659 4263358 5665125 5368721 4740235 3630773 1941839
2260 1941839 1244766 2792613 5013130 5088876 2726289 567833 782380 2861951 5264421
$$ packed form
2286d232014l457167l636861l838186m520415l676579J4274M459137O575414O036740
2277f275657M355943J703788k285498n448909m615116m93486K486285K198492
2269h374158J391219K739950M569648L936699J401767k96404o28486j109462j688934
2260A941839o97073J547847K220517P5746k362587k158456K14547K079571K402470
$$ [...]
##END NTUPLES=NMR SPECTRUM
##END=
