##TITLE=31Pdec_DE_30H_D2O
 D2O, 64 sc
 6.8.2024
##JCAMPDX= 6.0         $$ Bruker NMR JCAMP-DX V2.0
##DATA TYPE= NMR SPECTRUM
##DATA CLASS= NTUPLES
##ORIGIN= UXNMR, Bruker Analytische Messtechnik GmbH
##OWNER= root
$$ XWIN-NMR		Version 3.5
$$ Tue Aug  6 14:51:15 2024 Russian Standard Time (UT+4h)  she@DPX200
##.OBSERVE FREQUENCY= 81.013821
##.OBSERVE NUCLEUS= ^31P
##.ACQUISITION MODE= SIMULTANEOUS
##.ACQUISITION SCHEME= undefined
##.AVERAGES= 64
##.DIGITISER RES= 17
##SPECTROMETER/DATA SYSTEM= spect
##.PULSE SEQUENCE= zgpg30
##.SOLVENT NAME= D2O
##.SHIFT REFERENCE= (INTERNAL, D2O, 0, 198.062)
##AUDIT TRAIL= $$ (NUMBER, WHEN, WHO, WHERE, WHAT)
$$ ##TITLE= Audit trail, XWIN-NMR		Version 3.5
$$ ##JCAMPDX= 5.01
$$ ##ORIGIN= Bruker BioSpin GmbH
$$ ##OWNER= she
$$ F:/spectra/data/she/nmr/P31/2/pdata/1/auditp.txt
$$ ##AUDIT TRAIL=  $$ (NUMBER, WHEN, WHO, WHERE, WHAT)
(   1,<2024-08-06 14:50:25.23 +0400>,<she>,<DPX200>,
      <created by zg, POWCHK disabled, PULCHK disabled
       configuration hash MD5:
       00 E9 B6 7A A2 85 ED C7 34 08 36 98 17 FE 4E 26
       data hash MD5: 32K
       FC 1E 52 3B 0B 9F 17 10 E1 D3 EF 39 19 E1 8A 70>)
(   2,<2024-08-06 14:50:27.70 +0400>,<she>,<DPX200>,
      <Start of raw data processing
       efp BC_mod = 2 LB = 1.5 FT_mod = 6 PKNL = 1 PHC0 = 2622.089 PHC1 = 185.2869 SI = 64K 
       data hash MD5: 64K
       44 E1 EC EE 66 C0 04 E0 32 96 0F 28 8D 02 FE C8>)
(   3,<2024-08-06 14:50:45.78 +0400>,<she>,<DPX200>,
      <pk PHC0 = 5.77269 PHC1 = 0 
       data hash MD5: 64K
       1B 50 6E 11 C7 A9 B3 BA 5D 8B 44 CF 3A 32 77 F5>)
$$ ##END=
$$ 
$$ hash MD5
$$ D0 D6 F8 27 A5 CF AF 6B B7 F2 D3 98 9B E9 AB 63
##$RELAX= 
##$RELAX= 
##$RELAX= 
##$RELAX= 
##$RELAX= 
##$RELAX= 
##$RELAX= 
##$RELAX= 
$$ Bruker specific parameters
$$ --------------------------
##$DU= <F:/spectra>
##$EXPNO= 2
##$NAME= <P31>
##$PROCNO= 1
##$TYPE= <nmr>
##$USER= <she>
##$AMP= (0..31)
100 100 100 100 100 100 100 100 100 100 100 100 100 100 100 100 100 100 
100 100 100 100 100 100 100 100 100 100 100 100 100 100 
##$AQSEQ= 0
##$AQ_mod= 1
##$AUNM= <au_zg>
##$AUTOPOS= <>
##$BF1= 81.014009
##$BF2= 200.13
##$BF3= 200.13
##$BF4= 200.13
##$BF5= 200.13
##$BF6= 200.13
##$BF7= 200.13
##$BF8= 200.13
##$BYTORDA= 1
##$CFDGTYP= 0
##$CFRGTYP= 5
##$CHEMSTR= <none>
##$CNST= (0..31)
1 1 145 1 1 1 1 1 1 1 1 1 1 1 1 1 1 1 1 1 1 1 1 1 1 1 1 1 1 1 1 1 
##$CPDPRG= <waltz16>
##$CPDPRG1= <>
##$CPDPRG2= <waltz16>
##$CPDPRG3= <>
##$CPDPRG4= <mlev>
##$CPDPRG5= <mlev>
##$CPDPRG6= <mlev>
##$CPDPRG7= <mlev>
##$CPDPRG8= <mlev>
##$CPDPRGB= <>
##$CPDPRGT= <>
##$D= (0..31)
0 1 0 0 0 0 0 0 0 0.06 0 0.03 2e-05 3e-06 0 0 0.0002 0 0 0 0 0 0 0 0 0 
0 0 0 0 0 0 
##$DATE= 1722941424
##$DBL= (0..7)
120 120 120 11 120 120 24 19 
##$DBP= (0..7)
150 150 150 150 150 150 150 150 
##$DBP07= 0
##$DBPNAM0= <>
##$DBPNAM1= <>
##$DBPNAM2= <>
##$DBPNAM3= <>
##$DBPNAM4= <>
##$DBPNAM5= <>
##$DBPNAM6= <>
##$DBPNAM7= <>
##$DBPOAL= (0..7)
0.5 0.5 0.5 0.5 0.5 0.5 0.5 0.5 
##$DBPOFFS= (0..7)
0 0 0 0 0 0 0 0 
$$ [...]
##$SUBNAM2= <"">
##$SUBNAM3= <"">
##$SUBNAM4= <"">
##$SUBNAM5= <"">
##$SUBNAM6= <"">
##$SUBNAM7= <"">
##$SUBNAM8= <"">
##$SUBNAM9= <"">
##$SW= 400.765351723535
##$SWIBOX= (0..15)
0 1 3 0 0 0 0 0 0 0 0 0 0 0 0 0 
##$SW_h= 32467.5324675325
##$TD= 32768
##$TD0= 1
##$TE= 0
##$TE2= 300
##$TE3= 300
##$TEG= 300
##$TL= (0..7)
0 120 53 12 22 120 120 120 
##$TP= (0..7)
150 150 150 150 150 150 150 150 
##$TP07= 0
##$TPNAME0= <>
##$TPNAME1= <>
##$TPNAME2= <>
##$TPNAME3= <>
##$TPNAME4= <>
##$TPNAME5= <>
##$TPNAME6= <>
##$TPNAME7= <>
##$TPOAL= (0..7)
0.5 0.5 0.5 0.5 0.5 0.5 0.5 0.5 
##$TPOFFS= (0..7)
0 0 0 0 0 0 0 0 
##$TUNHIN= 0
##$TUNHOUT= 0
##$TUNXOUT= 0
##$USERA1= <user>
##$USERA2= <user>
##$USERA3= <user>
##$USERA4= <user>
##$USERA5= <user>
##$V9= 5
##$VALIST= <valist>
##$VCLIST= <CCCCCCCCCCCCCCC>
##$VD= 0
##$VDLIST= <DDDDDDDDDDDDDDD>
##$VPLIST= <PPPPPPPPPPPPPPP>
##$VTLIST= <TTTTTTTTTTTTTTT>
##$WBST= 1024
##$WBSW= 4
##$XGAIN= (0..3)
0 0 0 0 
##$XL= 0
##$YL= 0
##$YMAX_a= 9548
##$YMIN_a= -8563
##$ZGOPTNS= <>
##$ZL1= 120
##$ZL2= 120
##$ZL3= 120
##$ZL4= 120
##$ABSF1= 0
##$ABSF2= 0
##$ABSG= 0
##$ABSL= 0
##$ALPHA= 0
##$AQORDER= 0
##$ASSFAC= 0
##$ASSFACI= 0
##$ASSFACX= 0
##$ASSWID= 0
##$AUNMP= <proc_1d>
##$AZFE= 0.1
##$AZFW= 0.5
##$BCFW= 0
##$BC_mod= 2
##$BYTORDP= 0
##$COROFFS= 0
##$CY= -3
##$DATMOD= 1
##$DC= 0
##$DFILT= <>
##$DTYPP= 0
##$F1P= 0
##$F2P= 0
##$FCOR= 1
##$FTSIZE= 65536
##$FT_mod= 6
##$GAMMA= 0
##$GB= 0
##$INTBC= 1
##$INTSCL= 9.790993e-09
##$ISEN= 30
##$LB= 1.5
##$LEV0= 0
##$LPBIN= 0
##$MAXI= 10000
##$MC2= 0
##$MEAN= 0
##$ME_mod= 0
##$MI= 50
##$NCOEF= 0
##$NC_proc= -9
##$NLEV= 6
##$NOISF1= 182.463
##$NOISF2= 159.3651
##$NSP= 0
##$NTH_PI= 0
##$NZP= 0
##$OFFSET= 198.0616
##$PC= 4
##$PHC0= 2627.862
##$PHC1= 185.2869
##$PH_mod= 1
##$PKNL= yes
##$PPARMOD= 0
##$PSCAL= 0
##$PSIGN= 0
##$REVERSE= no
##$SF= 81.0140089999434
##$SI= 65536
##$SIGF1= 159.3651
##$SIGF2= -187.1042
##$SINO= 113.3802
##$SIOLD= 16384
##$SREGLST= <1H.CDCl3>
##$SSB= 0
##$STSI= 65536
##$STSR= 0
##$SW_p= 32467.5324675325
##$SYMM= 0
##$S_DEV= 0
##$TDeff= 32768
##$TDoff= 0
##$TI= <>
##$TILT= no
##$TM1= 0
##$TM2= 0
##$TOPLEV= 0
##$USERP1= <user>
##$USERP2= <user>
##$USERP3= <user>
##$USERP4= <user>
##$USERP5= <user>
##$WDW= 1
##$XDIM= 65536
##$YMAX_p= 354678610
##$YMIN_p= -69795600
$$ End of Bruker specific parameters
$$ ---------------------------------
##NTUPLES= NMR SPECTRUM
##VAR_NAME=  FREQUENCY,     SPECTRUM/REAL,   SPECTRUM/IMAG
##SYMBOL=    X,             R,               I
##VAR_TYPE=  INDEPENDENT,   DEPENDENT,       DEPENDENT
##VAR_FORM=  AFFN,          ASDF,            ASDF
##VAR_DIM=   65536,         65536,           65536
##UNITS=     HZ,            ARBITRARY UNITS, ARBITRARY UNITS
##FACTOR=    0.49542278885378, 1,            1
##FIRST=     16045.7642231865, 0,            0
##LAST=      -16421.768244346, 0,            0
##MIN=       -16421.768244346, -69795600,    0
##MAX=       16045.7642231865, 354678610,    0
$$ Real data points
##PAGE= N=1
##DATA TABLE= (X++(R..R)), XYDATA
$$ [...]
$$ plain form
41273 6435853 3838162 2899086 2668530 -322914 -7219035 -14244478 -15827864 -10324352
41265 -10324352 -2484370 24574 -6532886 -17724399 -24306058 -21369588 -13607855 -9157412
41257 -9157412 -8705543 -5009669 5286665 14734260 14662052 7542944 2997323 3919898 4978784
41248 4978784 4450907 7584183 15288705 19199485 13964422 6487918 5594458 9378955
41240 9378955 11490938 13692488 21009394 28499734 25950726 15243781 10084611 16084681
41232 16084681 23143413 22001334 16949499 15251262 13899270 6238208 -5092080 -11754603
41224 -11754603 -12276407 -11984152 -12858942 -11930348 -8745362 -6804221 -7465440 -8775799 -10613696
41215 -10613696 -15158005 -21503509 -24923131 -22655462 -16564941 -9565054 -3070730 1732780
$$ packed form
41273F435853k597691r39076k30556k991444o896121p025443j583386N503512
41265a0324352P839982K508944o557460j1191513o581659K936470P761733M450443
41257i157412M51869L695874J0296334R447595p2208p119108m545621R22575J058886
41248D978784n27877L133276P704522L910780n235063p476504q93460L784497
41240I378955K111983K201550P316906P490340k549008j0706945n159170O000070
41232A6084681P058732j142079n051835j698237j351992p661062j1330288o662523
41224a1754603n21804K92255q74790R28594L184986J941141o61219j310359j837897
41215a0613696m544309o345504l419622K267669O090521O999887O494324M803510
$$ plain form
41207 1732780 3608214 2591848 -947069 -7435728 -15078483 -17881648 -11845061 -1936421
41199 -1936421 2897023 1284153 -100083 2363398 4829363 4339908 4171094 6990631
41191 6990631 8883921 5439090 -565810 -2988233 -966444 1291505 1390793 698007 496239
41182 496239 317433 -310238 -1592402 -4402037 -8909721 -13183111 -15524460 -16848459 -18153064
41173 -18153064 -17410773 -12469513 -5819472 -2601428 -4297175 -7878773 -10702835 -12416136
41165 -12416136 -12331286 -9488325 -6054462 -6014999 -8718943 -8122866 -1156059 7195362 10852206
41156 10852206 11175771 13481365 17186385 15720572 6774140 -3014271 -6160360 -3249984
41148 -3249984 -729759 -2465402 -6615702 -9038293 -6713994 772715 9861668 14115409
$$ packed form
41207A732780J875434j016366l538917o488659p642755k803165O036587R908640
41199a936421M833444j612870j384236K463481K465965m89455j68814K819537
41191F990631J893290l444831o004900k422423K021789K257949R9288o92786k01768
41182D96239j78806o27671j282164k809635m507684m273390k341349j323999j304605
41173a8153064P42291M941260O650041L218044j695747l581598k824062j713301
41165a2416136Q4850K842961L433863L9463k703944N96077O966807Q351421L656844
41156A0852206L23565K305594L705020j465813q946432r788411l146089K910376
41148c249984K520225j735643m150300k422591K324299P486709R088953M253741
$$ plain form
41140 14115409 10331295 3282373 698821 3439744 4828275 656902 -4971472 -6480727
41132 -6480727 -5124045 -5967040 -9350117 -10721443 -8152374 -4774236 -2906350 -338143
41124 -338143 5277557 11524269 13726643 11057862 7742641 8346214 13214351 18568080
41116 18568080 20245056 17078488 10935499 4207929 -1681981 -5397223 -5341698 -1723054
41108 -1723054 2336561 3734692 2854987 2399658 3325126 3670415 998567 -5471394 -14328727
41099 -14328727 -21839032 -23447510 -17707323 -8045199 1222986 9097189 15640102 17974016
41091 17974016 13362833 5544634 2605712 7482423 14964686 19343741 20673954 21721800
41083 21721800 22930390 22870575 20348425 14016373 3397356 -7535271 -11604396 -6293423
$$ packed form
41140A4115409l784114p048922k583552K740923J388531m171373n628374j509255
41132f480727J356682q42995l383077j371326K569069L378138J867886K568207
41124c38143N615700O246712K202374k668781l315221O03573M868137N353729
41116A8568080J676976l166568o142989o727570n889910l715242N5525L618644
41108a723054M059615J398131q79705m55329R25468L45289k671848o469961q857333
41099a4328727p510305j608478N740187R662124R268185P874203O542913K333914
41091A7974016m611183p818199k938922M876711P482263M379055J330213J047846
41083B1721800J208590n9815k522150o332052j0619017j0932627m069125N310973
$$ plain form
41075 -6293423 2477543 6902668 4661279 -2192354 -11388707 -20054550 -24049195 -21934207
41067 -21934207 -16817930 -10964211 -2606934 7646912 12346086 6208362 -3763994 -5559890
41059 -5559890 1633901 6894310 3535809 -2942399 -5179157 -4209554 -4934494 -7447557
41051 -7447557 -8409638 -7301221 -6180061 -5517735 -4616872 -4512130 -6498118 -8691059 -7461747
41042 -7461747 -2068715 4492914 8928987 10217063 9446068 8659355 9130033 9666860 7873752
41033 7873752 4120805 2189582 4135321 6812992 6487611 5107417 7890508 14975089
41025 14975089 19856629 17760238 12258892 10776764 15181744 19814638 18715472 12357249
41017 12357249 6197375 3963110 3971376 2087301 -2847866 -7499926 -7978613 -4587399 -1861408
$$ packed form
41075f293423Q770966M425125k241389o853633r196353q665843l994645K114988
41067b1934207N116277N853719Q357277J0253846M699174o137724r972356j795896
41059e559890P193791N260409l358501o478208k236758R69603p24940k513063
41051g447557r62081J108417J121160O62326R00863J04742j985988k192941J229312
41042g461747N393032O561629M436073J288076p70995p86713M70678N36827j793108
41033G873752l752947j931223J945739K677671l25381j380194K783091P084581
41025A4975089M881540k096391n501346j482128M404980M632894j099166o358223
41017A2357249o159874k234265Q266j884075m935167m652060m78687L391214K725991
$$ plain form
41008 -1861408 -3776349 -9672676 -15475869 -18099900 -17262275 -13472574 -6802655 1168840
41000 1168840 6471241 6281818 2313490 -1611032 -4325365 -6908401 -8518091 -6555797
40992 -6555797 -1317097 3284706 4594105 3400333 655491 -3542119 -6367094 -3205844
40984 -3205844 4547282 7858125 1097006 -9422613 -13427291 -9614385 -4443303 -1377695
40976 -1377695 868817 1253232 -3365580 -10143738 -10852484 -3319887 4499997 4994067 -425560
40967 -425560 -6110900 -9770775 -11473360 -10407536 -7242904 -5647813 -7211508 -8498261
40959 -8498261 -6973204 -5703864 -7584497 -8905376 -4382278 4180749 10061710 10696633
40951 10696633 9162134 7883232 6219037 3729955 924233 -3036741 -8924204 -13923836
$$ packed form
41008a861408j914941n896327n803193k624031Q37625L789701O669919P971495
41000A168840N302401j89423l968328l924522k714333k583036j609690J962294
40992f555797N238700M601803J309399j193772k744842m197610k824975L161250
40984c205844P753126L310843o761119j0519619m004678L812906N171082L065608
40976a377695K246512L84415m618812o778158p08746P532597P819884M94070n419627
40967d25560n685340l659875j702585J065824L164632J595091j563695j286753
40959h498261J525057J269340j880633j320879M523098Q563027N880961O34923
40951A0696633j534499j278902j664195k489082k805722l960974n887463m999632
$$ plain form
40943 -13923836 -13778597 -8337132 -1092846 6016328 12590658 15200245 9058155 -4170919
40935 -4170919 -15608588 -18864980 -16435483 -13946515 -12119605 -8015847 -1359096 4433305
40927 4433305 6494161 4974000 1949467 -178054 -24629 1391958 1435401 -749637 -2804234
40918 -2804234 -2353046 -103843 1882446 3430907 5498069 7344576 7311217 6288958 7608020
40909 7608020 12431834 17244430 17619458 13700010 10314446 11422082 15462290 17006747
40901 17006747 12825683 5534686 845740 1742565 6089700 9682576 10506546 9608307
40893 9608307 8847179 8940272 9493869 9911472 10001800 10392268 12567499 17499093 23395914
40884 23395914 25745944 21372327 12538124 5282829 3047145 3640789 3453603 2454291
$$ packed form
40943a3923836J45239N441465P244286P109174O574330K609587o142090j3229074
40935d170919j1437669l256392K429497K488968J826910M103758O656751N792401
40927D433305K060856j520161l024533k127521J53425J416587M3443k185038k054597
40918b804234M51188K249203J986289J548461K067162J846507l3359j022259J319062
40909G608020M823814M812596L75028l919448l385564J107636M040208J544457
40901A7006747m181064p290997m688946Q96825M347135L592876Q23970q98239
40893I608307p61128R3093N53597M17603R0328L90468K175231M931594N896821
40884B3395914K350030m373617q834203p255295k235684N93644j87186r99312
$$ plain form
40876 2454291 2839595 4550229 5419973 5099180 5274582 5741731 3826065 -1186524 -6315319
40867 -6315319 -9198563 -11071023 -13302434 -13953229 -10898113 -6236993 -3929519 -4001347 -2660135
40858 -2660135 1756467 5990459 5921997 1397565 -4110742 -7549535 -8853576 -9555503 -9644988
40849 -9644988 -7115038 -1423362 4040706 5199112 2246723 -1441578 -4695918 -8811071
40841 -8811071 -12402986 -11439972 -6292997 -3075238 -4340721 -3862740 4019611 14402308
40833 14402308 17846012 13286044 7623875 4427298 1193139 -2300063 -1380118 5342154
40825 5342154 11834417 12016510 6646020 411272 -3449699 -3462331 594006 5903744 8328515
40816 8328515 8221800 10392487 15967716 19100046 15211110 8028515 3993339 3288277
$$ packed form
40876B454291L85304J710634Q69744l20793J75402M67149j915666n012589n128795
40867f315319k883244j872460k231411o50795L055116M661120K307474p1828J341212
40858b660135M416602M233992o8462m524432n508307l438793j304041p01927q9485
40849i644988K529950N691676N464068J158406k952389l688301l254340m115153
40841h811071l591915R63014N146975L217759j265483M77981P882351J0382697
40833A4402308L443704m559968n662169l196577l234159l493202R19945O722272
40825E342154O492263J82093n370490o234748l860971j2632M056337N309738K424771
40816H328515j06715K170687N575229L132330l888936p182595m035176p05062
$$ plain form
40808 3288277 1526111 -2051236 -3506492 -745417 3335477 4834402 3275572 1585583
40800 1585583 3031536 7939476 12827609 13873206 11344575 8421020 5816096 1544466
40792 1544466 -3263766 -3856158 -33366 872066 -5673122 -12748573 -10475316 -335238
40784 -335238 6554724 4599780 -380640 -1305138 1268631 3267779 4445203 7306137
40776 7306137 11862861 15314557 15515262 12243639 6253826 -859688 -6668663 -9378355
40768 -9378355 -8990556 -6538281 -3122308 -153598 647769 -1669614 -6596290 -12417548
40760 -12417548 -16518448 -16347484 -11851007 -6607288 -4656182 -6288521 -8717292 -10441694
40752 -10441694 -12369334 -14431571 -14014811 -9195441 -1674872 4928750 8568953 9673290
$$ packed form
40808C288277j762166l577347j455256K761075M080894J498925j558830j689989
40800A585583J445953M907940M888133J045597k528631k923555k604924m271630
40792A544466m808232n92392L822792R05432o545188p075451K273257J0140078
40784c35238O889962j954944m980420r24498K573769J999148J177424K860934
40776G306137M556724L451696K00705l271623n989813p113514n808975k709692
40768i378355L87799K452275L415973K968710Q01367k317383m926676n821258
40760a2417548m100900J70964M496477N243719J951106j632339k428771j724402
40752a0441694j927640k062237M16760M819370P520569O603622L640203J104337
$$ plain form
40744 9673290 9793950 10361160 11976461 14144671 15940525 16804051 16195998 13410967 9120530
40735 9120530 6034881 5718991 5419346 1083065 -6327670 -10819880 -8748012 -3288674
40727 -3288674 27111 -331889 -1890774 -2111332 72049 4744126 10173654 12563536
40719 12563536 9524975 3636368 212028 1305693 3710626 3194520 -773136 -4935917
40711 -4935917 -5744311 -2381837 3094350 8105429 11782583 14528361 15909758 14612900
40703 14612900 10864714 6937840 4062443 845898 -3259672 -4900849 -558672 7283245
40695 7283245 11204399 6801893 -2879426 -11302328 -14237369 -11242356 -4802400 382102
40687 382102 376181 -3387112 -5197494 -3331877 -4076331 -13414226 -27181666 -35008387 -33216288
$$ packed form
40744I673290J20660N67210J615301K168210J795854Q63526o08053k785031m290437
40735I120530l085649l15890k99645m336281p410735m492210K071868N459338
40727c288674L315785l59000j558885k20558K183381M672077N429528K389882
40719A2563536l038561n888607l424340J093665K404933n16106l967656m162781
40711d935917q08394L362474N476187N011079L677154K745778J381397j296858
40703A4612900l748186l926874k875397l216545m105570j641177M342177P841917
40695G283245L921154m402506r681319q422902k935041K995013O439956N184502
40687C82102n921l763293j810382J865617p44454r337895j3767440p826721J792099
$$ plain form
40678 -33216288 -27893073 -24712979 -22205768 -17578614 -12920873 -10878526 -8855592 -3406893
40670 -3406893 2648895 3932085 1765975 2933481 8807206 12062652 6400909 -5194723
40662 -5194723 -14413859 -16225555 -11426281 -4193998 186917 -1980981 -9350435 -16209353
40654 -16209353 -18295260 -16168601 -12013736 -6467016 -608992 2606462 2456703 3304910
40646 3304910 9228160 17315732 20457147 16353980 10083189 7379876 8358504 8762812
40638 8762812 5407999 -662614 -5579890 -6638887 -4736666 -2306083 452559 5019034
40630 5019034 10248185 12053492 8912218 4439607 2194937 962475 -1974457 -5676290
40622 -5676290 -6936066 -4499488 1006545 8378680 13675391 10596382 -1692512 -14081363
$$ packed form
40678c3216288N323215L180094K507211M627154M657741K042347K022934N448699
40670c406893O055788J283190k166110J167506N873725L255446n661743j1595632
40662e194723r219136j811696M799274P232283M380915k167898p369454o858918
40654a6209353k085907K126659M154865N546720N858024L215454j49759Q48207
40646C304910N923250Q087572L141415m103167o270791k703313R78628M04308
40638H762812l354813o070613m917276j058997J902221K430583K758642M566475
40630E019034N229151J805307l141274m472611k244670j232462k936932l701833
40622e676290j259776K436578N506033P372135N296711l079009j2288894j2388851
$$ plain form
40614 -14081363 -17066103 -12719123 -10440140 -12519956 -12359307 -7446536 -4984516 -10953127
40606 -10953127 -20716379 -25477833 -23130508 -17935329 -13342610 -10062493 -8699007 -9721664
40598 -9721664 -11944565 -14026920 -16191631 -18380126 -18834726 -16856656 -14715822 -14268865
40590 -14268865 -13935867 -11858995 -9876285 -10939509 -13995474 -14907980 -11979637 -7705052
40582 -7705052 -5157863 -4966025 -6061688 -7715144 -10257050 -14140450 -18045992 -18345433
40574 -18345433 -12318677 -2526581 3921409 1831483 -7080714 -15798772 -17450922 -10005236
40566 -10005236 1765269 9299044 8450992 4559882 5481689 9862955 8100246 -3561741
40558 -3561741 -16317640 -19779065 -13956351 -5538940 2354180 10101777 15237404 14184967
$$ packed form
40614a4081363k984740M346980K278983k079816J60649M912771K462020n968611
40606a0953127r763252m761454K347325N195179M592719L280117J363486j022657
40598i721664k222901k082355k164711k188495m54600J978070K140834M46957
40590a4268865L32998K076872J982710j063224l055965r12506K928343M274585
40582g705052K547189J91838j095663j653456k541906l883400l905542k99441
40574a8345433O026756R792096O447990k089926q912197q718058j652150P445686
40566a0005236J1770505P533775q48052l891110R21807M381266j762709j1661987
40558c561741j2755899l461425N822714Q417411P893120P747597N135627j052437
$$ plain form
40550 14184967 9113384 5972700 5811665 4416697 802294 -669002 1684147 2895871
40542 2895871 -1448827 -8687388 -13210406 -13586158 -11967872 -9127143 -4256510 1339773
40534 1339773 4218386 3055776 442715 -706029 -986070 -3097771 -7089629 -9157011
40526 -9157011 -6442742 -1462405 743175 -726793 -1973092 -614587 988712 400017
40518 400017 -909475 -1240813 -2973493 -8986389 -16832503 -20842624 -18923074 -13271058
40510 -13271058 -5411704 4899724 15951438 23754062 26457185 25837129 23772163 20333923
40502 20333923 15916412 12130893 9752635 8422171 8848869 12484423 18441319 23508853
40494 23508853 25805810 25746917 23176336 16967389 8434559 1829962 -118184 1470631
$$ packed form
40550A4184967n071583l140684j61035j394968l614403j471296K353149J211724
40542B895871m344698p238561m523018l75752J618286K840729M870633N596283
40534A339773K878613j162610k613061j148744k80041k111701l991858k067382
40526i157011K714269M980337K205580j469968j246299J358505J603299n88695
40518D00017j309492l31338j732680o012896p846114m010121J919550N652016
40510a3271058P859354J0311428J1051714P802624K703123o20056k064966l438240
40502B0333923m417511l785519k378258j330464M26698L635554N956896N067534
40494B3508853K296957n8893k570581o208947q532830o604597j948146J588815
$$ plain form
40486 1470631 4921392 10519217 17864610 23592543 24530469 21625979 18404150 16513510
40478 16513510 14826944 12333236 9887808 8641276 7755997 4702216 -1590800 -8215560
40470 -8215560 -10351982 -6474102 -46558 4792080 7265257 8423118 8285881 6964345
40462 6964345 6022197 5537805 2428548 -4300110 -9323185 -7248244 -902525 2952381
40454 2952381 4543485 9764824 17891344 19858063 12033307 3438234 3686664 9867914
40446 9867914 11737582 5635359 -3131626 -8819247 -9918812 -7008048 -1813393 1911082
40438 1911082 1271004 -1810240 -2936077 -1139634 916055 2098165 4244629 7820126
40430 7820126 9496918 5863867 -2047079 -9426412 -12393656 -11089286 -7929247 -3813431
$$ packed form
40486A470631L450761N597825P345393N727933R37926k904490l221829j890640
40478A6513510j686566k493708k445428j246532q85279l053781o293016o624760
40470h215560k136422L877880O427544M838638K473177J157861j37237j321536
40462F964345r42148m84392l109257o728658n023075K074941O345719L854906
40454B952381J591104N221339Q126520J966719p824756q595073K48430O181250
40446I867914J869668o102223q766985n687621j099565K910764N194655L724475
40438A911082o40078l081244j125837J796443K055689J182110K146464L575497
40430G820126J676792l633051p910946p379333k967244J304370L160039M115816
$$ plain form
40422 -3813431 2052168 8397198 11306758 10032023 10173888 16381127 24269817 25911948
40414 25911948 21998756 20640925 23775632 23936841 17234461 10077849 7835564 5745104
40406 5745104 -1452258 -8428740 -6960312 965014 7441170 11674127 18183106 24707589
40398 24707589 23197108 12879395 2400917 -2094354 -2222668 192257 6632920 15420350
40390 15420350 20146274 17985643 12836909 7678059 936361 -6734695 -9681762 -5471684
40382 -5471684 553907 3079178 3019024 1901239 -2982329 -11967570 -17567693 -12861667
40374 -12861667 -1621249 6482772 8003013 7133796 7635954 9542445 12312948 15382192
40366 15382192 16151305 12310866 5826913 752340 -1991605 -3950089 -4821609 -3300511
$$ packed form
40422c813431N865599O345030K909560j274735J41865O207239P888690J642131
40414B5911948l913192j357831L134707J61209o702380p156612k242285k090460
40406E745104p197362o976482J468428P925326O476156M232957O508979O524483
40398B4707589j510481j0317713j0478478m495271j28314K414925O440663Q787430
40390A5420350M725924k160631n148734n158850o741698p671056k947067M210078
40382e471684O025591K525271o0154j117785m883568q985241n600123M706026
40374a2861667J1240418Q104021J520241q69217N02158J906491K770503L069244
40366A5382192P69113l840439o483953n074573k743945j958484q71520J521098
$$ plain form
40358 -3300511 -1205282 -1968299 -4973153 -5442570 -340492 8642945 17608214 22867448
40350 22867448 21755032 14847462 7106227 3254607 2298712 108079 -3345966 -3914760
40342 -3914760 -528469 2559415 2440446 2065065 5304426 10528831 12291758 8132335
40334 8132335 1390610 -2395275 -876920 2860943 3183693 -2264566 -9895130 -14301812
40326 -14301812 -14136977 -12198676 -10906527 -10454573 -10717651 -11608579 -11565179 -9185194 -6699229
40317 -6699229 -7876428 -11368635 -10422813 -1818203 8338471 11180867 5352617 -2534881
40309 -2534881 -6267892 -5616853 -4254396 -5195350 -8715127 -12831109 -15237245 -15399411 -14300012
40300 -14300012 -11791925 -6152760 2035183 7650998 6051877 -241128 -3500161 -294760
$$ packed form
40358c300511K095229p63017l004854m69417N102078Q983437Q965269N259234
40350B2867448j112416o907570p741235l851620r55895k190633l454045n68794
40342c914760L386291L087884j18969l75381L239361N224405J762927m159423
40334H132335o741725l785885J518355L737863L22750n448259p630564m406682
40326a4301812J64835J938301J292149M51954k63078q90928M3400K379985K485965
40317f699229j177199l492207R45822Q604610J0156674K842396n828250p887498
40309b534881l733011O51039J362457r40954l519777m115982k406136j62166J099399
40300a4300012K508087N639165Q187943N615815j599121o293005l259033L205401
$$ plain form
40292 -294760 4142076 3089498 -2447758 -4909626 -147064 6985486 8640692 3747052
40284 3747052 -989567 72622 4473460 5382879 472763 -6177152 -10559883 -13082677
40276 -13082677 -14906251 -13826933 -7646062 269326 3301159 -454931 -6328357 -9931748
40268 -9931748 -12114104 -15231247 -17964878 -17194099 -13052932 -8545254 -4983774 -1245517
40260 -1245517 2697241 5187164 6578662 9967687 16298398 21493105 20984801 15242497
40252 15242497 8323787 2708964 -1379136 -2942371 -562955 4162726 7450496 8617300
40244 8617300 10956466 15615831 18221665 14780052 8367734 5777105 8303040 9878789
40236 9878789 5063189 -4215097 -11355352 -12551875 -9929824 -8150959 -9314937 -11439590
$$ packed form
40292b94760M436836j052578n537256k461868M762562P132550J655206m893640
40284C747052m736619J062189M400838R09419m910116o649915m382731k522794
40276a3082677j823574J079318O180871P915388L031833l756090n873426l603391
40268i931748k182356l117143k733631P70779M141167M507678L561480L738257
40260a245517L942758K489923J391498L389025O330711N194707n08304n742304
40252A5242497o918710n614823m088100j563235K379416M725681L287770J166804
40244H617300K339166M659365K605834l441613o412318k590629K525935J575749
40236I878789m815600r278286p140255j196523K622051J778865j163978k124653
$$ plain form
40228 -11439590 -11688914 -10552913 -11628018 -16782725 -23139619 -26239663 -24682516 -19774913
40220 -19774913 -12588585 -4784709 -955174 -5065156 -13716604 -17714795 -12638202 -3983413
40212 -3983413 822606 1466976 1935470 2462511 201905 -3782460 -4689896 -1606011 940259
40203 940259 772888 1862890 7012158 11435965 8697497 501782 -4860890 -3353495
40195 -3353495 353457 105187 -4188909 -8290197 -9899494 -10189260 -10309020 -9260142 -5729652
40186 -5729652 -458968 4137016 6346460 6624166 6504906 6304666 4796736 1914060 783073
40177 783073 4875184 12700902 17665739 15042203 7657908 2402738 1998819 3021156
40169 3021156 1819056 -1114692 -3788687 -6105954 -7844560 -6111606 941658 9093273
$$ packed form
40228a1439590k49324J136001j075105n154707o356894l100044J557147M907603
40220a9774913P186328P803876L829535m109982q651448l998191N076593Q654789
40212c983413M806019O44370M68494N27041k260606l984365r07436L083885K546270
40203I40259j67371J090002N149268M423807k738468q195715n362672J507395
40195c353495L706952k48270m294096m101288j609297k89766j19760J048878L530490
40186e729652N270684M595984K209444K77706j19260k00240j507930k882676j130987
40177G83073M092111P825718M964837k623536p384295n255170m03919J022337
40169C021156j202100k933748k673995k317267j738606J732954P053264Q151615
$$ plain form
40161 9093273 11517549 7742878 4620390 6689778 9871596 7781449 771780 -5455296
40153 -5455296 -7785711 -7413851 -5003105 320813 6700010 9487721 7329897 4073933
40145 4073933 2388503 -332598 -6340308 -11447710 -9483255 -1326666 5196209 4520707
40137 4520707 -1198577 -6305095 -8070815 -7682089 -7101410 -6597577 -4733458 -338316 5210304
40128 5210304 8532673 8241090 7263656 9279741 13785922 17029995 17067834 15175878 12849051
40119 12849051 10675958 10092985 12461798 15469861 14046041 6722779 -1525895 -4494271
40111 -4494271 -722966 6581863 12660208 13026461 5909100 -4476128 -10012031 -7098321
40103 -7098321 -820784 1988643 1347994 2391860 7212524 12595527 15037001 14368433
$$ packed form
40161I093273K424276l774671l122488K069388L181818k090147p009669o227076
40153e455296k330415L71860K410746N323918O379197K787711k157824l255964
40145D073933j685430k721101o007710n107402J964455Q156589O522875o75502
40137D520707n719284n106518j765720L88726N80679N03833J864119M395142N548620
40128E210304L322369k91583r77434K016085M506181L244073L7839j891956k326827
40119A2849051k173093n82973K368813L008063j423820p323262q248674k968376
40111d494271L771305P304829O078345L66253p117361j0385228n535903K913710
40103g098321O277537K809427o40649J043866M820664N383003K441474o68568
$$ plain form
40095 14368433 12578871 11673295 12153669 11643805 6742521 -1305016 -5536426 -1825476
40087 -1825476 4215264 4345903 -362525 -1665133 2476027 4939392 1713323 -1205594
40079 -1205594 2147501 7450710 6396688 -823571 -5989916 -3959309 2168809 5881876
40071 5881876 2698690 -7949512 -21559921 -29956000 -28270430 -20191119 -12442463 -5461517
40063 -5461517 4947299 17286974 23001469 18060841 9814640 7722751 11387366 13011720
40055 13011720 9123144 4006039 2097809 2611516 3043278 3425785 4436376 4454798 1770639
40046 1770639 -2070095 -4268221 -4933256 -5835036 -5656775 -864556 7543673 12387909 8376071
40037 8376071 -1044045 -8259201 -10476317 -9963110 -7384444 -913704 7704621 12296302
$$ packed form
40095A4368433j789562r05576M80374n09864m901284q047537m231410L710950
40087a825476O040740J30639m708428j302608M141160K463365l226069k918917
40079a205594L353095N303209j054022p220259n166345K030607O128118L713067
40071E881876l183186j0648202j3610409q396079J685570Q079311P748656O980946
40063e461517J0408816J2339675N714495m940628q246201k091889L664615J624354
40055A3011720l888576n117105j908230N13707M31762L82507J010591J8422k684159
40046A770639l840734k198126o65035r01780J78261M792219Q408229M844236m011838
40037H376071r420116p215156k217116N13207K578666O470740Q618325M591681
$$ plain form
40029 12296302 10028867 5464198 3873304 4563207 4332258 3606646 4390511 5027540 2508473
40020 2508473 -1563026 -2838928 -1461792 -1968203 -5703386 -8664860 -8009897 -5682959
40012 -5682959 -3825788 -1413095 2015839 3708954 2099900 227239 1189112 3328184
40004 3328184 3810277 4084443 7027772 10567501 9415620 2751288 -4518866 -8393972
39996 -8393972 -9363224 -8827697 -6452159 -2723826 -226150 44654 646508 3503229 6289066
39987 6289066 5706622 2350459 -558054 -1734758 -2149205 -1878380 185650 3810280 7389068
39978 7389068 10333565 12923599 13936057 11423065 6323992 2354854 1285481 1005877
39970 1005877 -465286 -1794658 -991925 1187289 2716945 3058646 2055528 -1660087
$$ packed form
40029A2296302k267435m564669j590894O89903k30949p25612P83865O37029k519067
40020B508473m071499j275902J377136n06411l735183k961474O54963K326938
40012e682959J857171K412693L428934J693115j609054j872661R61873K139072
40004C328184M82093K74166K943329L539729j151881o664332p270154l875106
39996h393972r69252N35527K375538L728333K497676K70804O01854K856721K785837
39987F289066n82444l356163k908513j176704m14447K70825K064030L624630L578788
39978G389068K944497K590034J012458k512992n099073l969138j069373k79604
39970A005877j471163j329372Q02733K179214J529656L41701j003118l715615
$$ plain form
39962 -1660087 -7873114 -12208868 -10565101 -5513046 -3869570 -7462750 -10758572 -9177681
39954 -9177681 -5380971 -4277732 -5388665 -4707632 -2452956 -3826520 -11182024 -19337694
39946 -19337694 -21064358 -15278140 -7379061 -2319029 93286 2508329 5051035 5308972
39938 5308972 2639961 -239532 -1016041 -998171 -2619562 -5240178 -6139413 -5080043 -4772178
39929 -4772178 -6200785 -6255896 -1579195 6878468 14560091 17586674 15542893 11084508
39921 11084508 7538339 6107734 5218600 3415144 2196170 4051314 8196625 10938498
39913 10938498 10313329 7600227 4351425 1510699 1585101 6799017 13559771 14039646 6323561
39904 6323561 -1969639 -4259150 -4272429 -9004440 -16466792 -18021361 -11240933 -2713413
$$ packed form
39962a660087o213027m335754J643767N052055J643476l593180l295822J580891
39954i177681L796710J103239j110933O81033K254676j373564p355504q155670
39946a9337694j726664N786218P899079N060032K412315K415043K542706K57937
39938E308972k669011k879493p76509J7870j621391k620616q99235J059370L07865
39929d772178j428607n5111M676701Q457663P681623L026583k043781m458385
39921A1084508l546169j430605q89134j803456j218974J855144M145311K741873
39913A0938498o25169k713102l248802k840726P4402N213916O760754M79875p716085
39904F323561q293200k289511j3279m732011p462352j554569O780428Q527520
$$ plain form
39896 -2713413 2255661 5501582 9690976 12559519 11045870 6914897 4405976 4442920
39888 4442920 3987132 111390 -6608501 -11898848 -11168485 -4891512 160041 -2035212
39880 -2035212 -9049378 -12901030 -10295840 -5774870 -4490989 -6587760 -9767260 -12579987
39872 -12579987 -13223673 -9456070 -2086567 5072564 10479410 15965052 20955265 20940835
39864 20940835 14737664 7899498 4690387 1816107 -4357744 -9031018 -4754283 6613776
39856 6613776 15532711 17874484 19104972 24244508 30091648 30212839 23239649 13354518
39848 13354518 5474199 2173046 3014895 4937480 4870363 3157032 2881240 5236330 7536568
39839 7536568 6586526 2201558 -3192523 -6516123 -5221489 805998 7292013 8097414
$$ packed form
39896b713413M969074L245921M189394K868543j513649m130973k508921L6944
39888D442920m55788l875742o719891n290347P30363O276973N051553k195253
39880b035212p014166l851652K605190M520970J283881k096771l179500k812727
39872a2579987o43686L767603P369503P159131N406846N485642M990213j4430
39864B0940835o203171o838166l209111k874280o173851m673274M276735J1368059
39856F613776Q918935K341773J230488N139536N847140J21191o973190r885131
39848A3354518p880319l301153Q41849J922585o7117j713331k75792K355090K300238
39839G536568r50042m384968n394081l323600J294634O027487O486015Q05401
$$ plain form
39831 8097414 1940231 -4958488 -5316343 844235 6465143 5906175 849016 -3082470
39823 -3082470 -3657373 -3804838 -6488829 -10409139 -12191913 -11150968 -9673004 -9692897 -11205854
39814 -11205854 -13845045 -17007410 -18255577 -15088633 -9536041 -7460094 -10954690 -14508960
39806 -14508960 -11889161 -4480355 891831 904309 -1465926 -2563018 -2606094 -3824538 -6638429
39797 -6638429 -8835741 -7615727 -2541693 2969662 4472243 1905996 72685 1870868
39789 1870868 3820473 1544657 -2838898 -3369484 1097741 5848969 7645516 8276702
39781 8276702 10248692 13291536 16094310 17666197 16224843 10740774 4497615 2907907
39773 2907907 6474960 10083541 10708758 11220359 14380036 17853524 18481107 17359444 16846908
$$ packed form
39831H097414o157183o898719l57855O160578N620908n58968n057159l931486
39823c082470n74903j47465k683991l920310j782774J040945J477964j9893j512957
39814a1205854k639191l162365j248167L166944N552592K075947l494596l554270
39806a4508960K619799P408806N372186J2478k370235j097092m3076j218444k813891
39797f638429k197312J220014N074034N511355J502581k566247j833311J798183
39789A870868J949605k275816m383555n30586M467225M751228J796547O31186
39781H276702J971990L042844K802774J571887j441354n484069o243159j589708
39773B907907L567053L608581O25217N11601L159677L473488O27583j121663n12536
$$ plain form
39764 16846908 16118093 13913651 12456175 13667836 13877668 7741553 -3696077 -13941742
39756 -13941742 -19393584 -21576519 -21191414 -15891649 -5974149 2677164 4796749 1982827
39748 1982827 -389199 -420346 -695779 -3211506 -6415587 -7402718 -4941770 43354 5596481
39739 5596481 10031341 13103755 16019736 19602677 22855838 24375470 24498806 24163544
39731 24163544 22038685 15859797 7717547 4590135 10346411 19328283 22116341 16828273
39723 16828273 9983380 6267117 3631470 756716 2493343 11912668 21635697 21225721
39715 21225721 11839846 5494046 8971384 16100390 18529232 16780719 15791534 15535307
39707 15535307 12919000 9416658 9232369 10826569 7488230 -2338007 -11282854 -12387351
$$ packed form
39764A6846908p28815k204442j457476J211661K09832o136115j1437630j0245665
39756a3941742n451842k182935L85105N299765R917500Q651313K119585k813922
39748A982827k372026l1147k75433k515727l204081r87131K460948M985124N553127
39739E596481M434860L072414K915981L582941L253161J519632J23336l35262
39731B4163544k124859o178888q142250l127412N756276Q981872K788058n288068
39723A6828273o844893l716263k635647k874754J736627R419325R723029m09976
39715B1225721r385875o345800L477338P129006K428842j748513r89185k56227
39707A5535307k616307l502342j84289J594200l338339r826237q944847j104497
$$ plain form
39699 -12387351 -7670470 -3697938 -1883901 1943139 9319025 15486113 15639385 11560814
39691 11560814 9111963 10468148 11881954 9283818 3478216 -1281829 -1840095 2164724
39683 2164724 9189678 16157912 19291293 17323561 13453035 11536629 10534862 5689747
39675 5689747 -4028221 -12376186 -11683967 -1330624 10671885 14302374 6107481 -7611845
39667 -7611845 -16426309 -15814819 -10930611 -9020183 -9968765 -7717074 53536 8342952
39659 8342952 11640396 10054683 7154592 5566534 6667070 10921204 15797094 16272208
39651 16272208 10275442 1589635 -4621809 -6719963 -5423336 -1340915 3546084 5390516
39643 5390516 3144712 1047151 2800832 5902139 5865569 3670543 4159032 8445138 12596468
$$ packed form
39699a2387351M716881L972532J814037L827040P375886O167088J53272m078571
39691A1560814k448851J356185J413806k598136n805602m760045n58266M004819
39683B164724P024954O968234L133381j967732l870526j916406j001767m845115
39675E689747r717968q347965O92219J0353343J2002509L630489q194893j3719326
39667g611845q814464O11490M884208J910428r48582K251691P770610Q289416
39659H342952L297444j585713k900091j588058J100536M254134M875890M75114
39651A6272208n996766q685807o211444k098154J296627M082421M886999J844432
39643E390516k245804k097561J753681L101307l6570k195026M88489M286106M151330
$$ plain form
39634 12596468 12964848 8569935 -500048 -11901410 -18884035 -15213103 -3416836 6628528
39626 6628528 8777668 6108551 4110605 3173246 619696 -3552645 -6691236 -7524681
39618 -7524681 -7354937 -7983929 -9994029 -12152709 -11663521 -6511981 1436542 7193456 7547681
39609 7547681 3912948 -348795 -3588884 -5686682 -5952376 -3133331 2889764 10404384
39601 10404384 16637426 19113161 17205676 12869554 9270749 8372639 9865219 11653480
39593 11653480 10892262 6133129 19620 -1808717 2896405 8850269 8785294 2852143
39585 2852143 -1021691 3199235 12661568 19263674 17734241 9243826 -426235 -5231935
39577 -5231935 -3778761 -1009790 -2862311 -8633956 -11538426 -7860507 -2014224 -188395
$$ packed form
39634A2596468L68380m394913r069983j1401362o982625L670932J1796267J0045364
39626F628528K149140k669117j997946r37359k553550m172341l138591q33445
39618g524681J69744o28992k010100k158680M89188N151540P948523N756914L54225
39609G547681l634733m261743l240089k097798k65694K819045O023095P514620
39601A0404384O233042K475735j907485m336122l598805q98110J492580J788261
39593A1653480p61218m759133o113509j828337M705122N953864o4975n933151
39585B852143l873834M220926R462333O602106j529433q490415r670061m805700
39577e231935J453174K768971j852521n771645k904470L677919N846283J825829
$$ plain form
39569 -188395 -2165138 -3030179 -1051495 459626 -763644 -1606653 2823577 12722298 22501527
39560 22501527 26272034 23435442 18083566 13474950 8990954 3168501 -2711973 -6492519
39552 -6492519 -8957097 -12470799 -16412905 -17510295 -14889222 -11272069 -8436475 -4948273
39544 -4948273 445135 6563845 12392587 18402911 23257490 22851656 15867434 7533606
39536 7533606 4081511 5082082 4942373 1061093 -3268941 -4233202 -2409240 -951410
39528 -951410 -999007 -950237 98635 149854 -2936062 -7102954 -7192468 -1623225 4773119
39519 4773119 7284754 7887509 10747359 13426892 9491775 704 -5435930 -1958350
39511 -1958350 3406866 2846031 -193687 3024870 12430477 18594353 14963257 4365709
$$ packed form
39569a88395j976743q65041J978684J511121j223270q43009M430230R898721R779229
39560B2501527L770507k836592n351876m608616m483996n822453n880474l780546
39552f492519k464578l513702l942106j097390K621073L617153K835594L488202
39544d948273N393408O118710N828742O010324M854579m05834o984222q333828
39536G533606l452095J000571j39709l881280m330034r64261J823962J457830
39528i51410m7597M8770J048872N1219l085916m166892q9514N569243O396344
39519D773119K511635O02755K859850K679533l935117r491071n436634L477580
39511a958350N365216n60835l039718L218557R405607O163876l631096j0597548
$$ plain form
39503 4365709 -6140653 -11425948 -9570744 -2283313 5306152 9156429 10670889 13221878
39495 13221878 15607490 13687516 7808589 3194735 2586510 3610068 4256309 5849731
39487 5849731 9029499 11422046 11312724 9796217 7658036 3995004 -413964 -2322615
39479 -2322615 -540032 2370197 4446088 6220562 6605116 2165647 -6086412 -10028442
39471 -10028442 -3495036 9066899 17711484 18405527 14855773 11230433 8410210 6685357
39463 6685357 7089575 9287197 11385015 12135370 11008718 7124984 1292537 -2014746
39455 -2014746 1220030 8723430 14165157 15221259 15304482 16956373 18180967 16819597
39447 16819597 14185425 11896043 8713689 3487352 -1596420 -3859644 -4174491 -5152253
$$ packed form
39503D365709j0506362n285295J855204P287431P589465L850277J514460K550989
39495A3221878K385612j919974n878927m613854o08225J023558O46241J593422
39487E849731L179768K392547j09322j516507k138181l663032m408968j908651
39479b322615J782583K910229K075891J774474L84554m439469q252059l942030
39471a0028442O533406J2561935Q644585O94043l549754l625340k820223j724853
39463F685357M04218K197622K097818P50355j126652l883734n832447l307283
39455b014746L234776P503400N441727J056102Q3223J651891J224594j361370
39447A6819597k634172k289382l182354n226337n083772k263224l14847r77762
$$ plain form
39439 -5152253 -6847138 -7060760 -4662341 -36100 6464458 13739117 18695180 18680577 14573320
39430 14573320 9090271 3206992 -2902417 -6920058 -6529060 -3851783 -3084865 -3564016
39422 -3564016 -488988 6008895 8312248 1591940 -7796289 -9299635 -1225439 8051564
39414 8051564 10842058 7730287 4735652 6727682 13928353 21946952 25002857 21392048
39406 21392048 15482198 12339088 11794538 10677793 8947943 9103735 10588035 10158337
39398 10158337 7997577 8028397 11120701 13355826 12683516 11795968 11986488 9933438 4406247
39389 4406247 929809 4678572 12553365 17495366 17627330 16033072 14344703 12213045
39381 12213045 11004544 12079090 12644728 9052790 3393836 1179096 3059519 4700989
$$ packed form
39439e152253j694885k13622K398419M626241O500558P274659M956063j4603m107257
39430A4573320n483049n883279o109409m017641L90998K677277P66918m79151
39422c564016L075028O497883K303353o720308r388229j503346Q074196R277003
39414H051564K790494l111771k994635J992030P200671Q018599L055905l610809
39406B1392048n909850l143110n44550j116745j729850J55792J484300m29698
39398A0158337k160760L0820L092304K235125o72310q87548J90520k053050n527191
39389D406247l476438L748763P874793M942001J31964j594258j688369k131658
39381A2213045j208501J074546N65638l591938n658954k214740J880423J641470
$$ plain form
39373 4700989 4600855 5625333 8203857 8709380 6421629 5713518 8554806 10803764 9534141
39364 9534141 8425075 11066400 13583385 9878900 1353719 -4670589 -4980579 -3292116
39356 -3292116 -3071334 -2741286 377707 5159247 8203809 8408655 7798011 8340746 9600674
39347 9600674 10038935 9687237 9985514 10567034 8236681 1458281 -5324513 -5422634 1584810
39338 1584810 8567620 9567930 6586292 5321835 7027958 8153018 6663061 5008067
39330 5008067 6570453 11699317 17940246 22745022 25514927 27755548 31179746 35130914
39322 35130914 36452612 32721610 25093558 17116280 11167395 6888807 2863918 -1082480
39314 -1082480 -3824428 -5148480 -6909630 -10087154 -10998418 -4268242 8240113 15646820
$$ packed form
39373D700989j00134J024478K578524N05523k287751p08111K841288K248958j269623
39364I534141j109066K641325K516985l704485q525181o024308l09990J688463
39356c292116K20782L30048L118993M781540L044562K04846o10644N42735J259928
39347I600674M38261l51698K98277N81520k330353o778400o782794r8121P007444
39338A584810O982810J000310k981638j264457J706123J125060j489957j654994
39330E008067J562386N128864O240929M804776K769905K240621L424198L951168
39322C5130914J321698l731002p628052p977278n948885m278588m024889l946398
39314a082480k741948j324052j761150l177524r11264O730176J2508355P406707
$$ plain form
39306 15646820 10221753 -1478911 -6280263 -1747889 2327372 218992 -1876504 1706324
39298 1706324 5484833 2520848 -2499724 -44815 8210889 10663323 2420119 -8735421
39290 -8735421 -14024666 -13013398 -9166305 -3566977 3342511 9299648 13150163 16356508
39282 16356508 19110728 18863320 14935977 10569908 8070967 5920316 3118022 2192154
39274 2192154 4851739 8435899 9924171 10012306 10055993 8791016 5954723 5322805 9042592
39265 9042592 11848343 6900593 -3799065 -10459622 -6994116 3178873 12918546 18350173
39257 18350173 19450369 18240541 18236622 22361296 29441534 34943679 36195037 34560359
39249 34560359 31950924 28464616 24801016 23466511 24966095 25454879 21282558 14164488
$$ packed form
39306A5646820n425067j1700664m801352M532374M075261k108380k095496L582828
39298A706324L778509k963985n020572K454909Q255704K452434q243204j1155540
39290h735421n289245J011268L847093N599328O909488N957137L850515L206345
39282A6356508K754220k47408l927343m366069k498941k150651k802294r25868
39274B192154K659585L584160J488272Q8135M3687j264977k836293o31918L719787
39265I042592K805751m947750j0699658o660557L465506J0172989R739673N431627
39257A8350173J100196j209828l919M124674P080238N502145J251358j634678
39249C4560359k609435l486308l663600j334505J499584M88784m172321p118070
$$ plain form
39241 14164488 8830901 6881804 6226813 5684655 6184799 7033222 4946694 -1253049 -7855229
39232 -7855229 -10702409 -10394064 -10098225 -9521062 -4892852 4570165 13540151 15756185 10536363
39223 10536363 2752277 -1976447 -768870 5469724 11851854 11963170 3941986 -6076795
39215 -6076795 -9430060 -3907919 5211945 12534800 17116067 19246886 17513128 11923791
39207 11923791 6505735 5036703 6101994 5651561 2833564 37162 -1292640 -1268404
39199 -1268404 606575 4015933 5235206 1024847 -4747040 -3850724 5331758 14699164
39191 14699164 16893245 13961507 11756737 10324196 5858569 -248138 -1343808 4757936
39183 4757936 11463433 11123019 3727936 -4161855 -6697255 -3019937 3769186 9732352
$$ packed form
39241A4164488n333587j949097o54991n42158N00144Q48423k086528o199743o602180
39232g855229k847180L08345K95839N77163M628210R463017Q969986K216034n219822
39223A0536363p784086m728724J207577O238594O382130J11316q021184j0018781
39215f076795l353265N522141R119864P322855M581267K130819j733758n589337
39207A1923791n418056j469032J065291m50433k817997k796402j329802K4236
39199a268404J874979L409358J219273m210359n771887Q96316R182482R367406
39191A4699164K194081k931738k204770j432541m465627o106707j095670O101744
39183D757936O705497l40414p395083p889791k535400L677318O789123N963166
$$ plain form
39175 9732352 12925745 14465157 16543463 19358017 21183206 21441260 21632010 22388757 21613790
39166 21613790 17130140 9968838 3526013 266486 459785 3226731 7245955 10856337
39158 10856337 13103283 15016167 18740918 24594255 29298240 28254451 20648456 11993282
39150 11993282 9690762 15025735 21303884 21670323 16970868 13208074 13020073 13850352
39142 13850352 13743598 13620809 12838272 8002134 -935379 -7871118 -7542002 -2056017 2947710
39133 2947710 5347795 6056773 5107141 3166825 4119481 10382728 17296094 17943815 12713265
39124 12713265 8426059 8467659 9754313 9810304 10708382 14339385 18911143 22075739 23350891
39115 23350891 22242859 18483454 15231965 16911704 22112187 23790716 18747384 11796616
$$ packed form
39175I732352L193393J539412K078306K814554J825189K58054J90750P56747p74967
39166B1613790m483650p161302o442825l259527J93299K766946M019224L610382
39158A0856337K246946J912884L724751N853337M703985j043789p605995q655174
39150A1993282k302520N334973O278149L66439m699455l762794j88001Q30279
39142A3850352j06754j22789p82537m836138q937513o935739L29116N485985N003727
39133B947710K400085P08978r49632j940316R52656O263247O913366O47721n230550
39124A2713265m287206M1600J286654N5991Q98078L631003M571758L164596J275152
39115B3350891j108032l759405l251489J679739N200483J678529n043332o950768
$$ plain form
39107 11796616 8000567 6173788 3542421 1621431 2892370 5664693 6821712 6612066
39099 6612066 6963999 8307763 11417495 18266267 27017993 30701745 26091941 19924250
39091 19924250 20404206 25897600 28311948 24813393 19406474 15069348 11539256 9765611
39083 9765611 11379908 13834099 12584253 8373294 6356048 7827249 8936775 8147880
39075 8147880 8824931 13159110 18926324 23487064 26153361 25966687 22202794 17476877
39067 17476877 15027954 12923428 7075798 -128660 -1808350 1973721 3422235 154163
39059 154163 -123467 7083792 13784649 10784200 1556164 -3581201 -2643774 -2412574 -5767377
39050 -5767377 -7214236 -1845373 7531677 14112484 14373215 10577311 8218333 11010950
$$ packed form
39107A1796616l796049j826779k631367j920990J270939K772323J157019k09646
39099F612066L51933J343764L109732O848772Q751726L683752m609804o167691
39091A9924250M79956N493394K414348l498555n406919m337126l530092j773645
39083I765611J614297K454191j249846m210959k017246J471201J109526p88895
39075H147880O77051M334179N767214M560740K666297j86674l763893m725917
39067A7476877k448923k104526n847630p204458j679690L782071J448514l268072
39059A54163k77630P207259O700857l000449r228036n137365R37427K31200l354803
39050e767377j446859N368863R377050O580807K60731l795904k358978K792617
$$ plain form
39042 11010950 16849063 19541581 15830916 9175237 5560892 7947037 15733750 25928373
39034 25928373 32943376 31741472 24580201 20713958 25519185 33466102 35851186 31678743
39026 31678743 26193941 22485327 20404967 20847012 24570609 28330600 28146550 25405101
39018 25405101 24491837 25826326 26626542 26722045 27376086 26022814 19526312 12000464 11319260
39009 11319260 16971619 19410240 13829810 7073500 7101849 12125015 15145570 14423456
39001 14423456 13957391 16372014 20102562 22416877 22117114 20296060 20210552 24605129 31596765
38992 31596765 35452009 33174805 28159652 25723764 27250070 30250607 31830116 30422849
38984 30422849 26341260 22256113 21260469 23464323 26648136 30509995 36710376 43834975
$$ packed form
39042A1010950N838113K692518l710665o655679l614345K386145P786713J0194623
39034B5928373P015003j201904p161271l866243M805227P946917K385084m172443
39026C1678743n484802l708614k080360M42045L723597L759991j84050k741449
39018B5405101r13264J334489Q00216R5503O54041j353272o496502p525848o81204
39009A1319260N652359K438621n580430o756310K8349N023166L020555p22114
39001A4423456m66065K414623L730548K314315k99763j821054q5508M394577O991636
38992C1596765L855244k277204n015153k435888J526306L000537J579509j407267
38984C0422849m081589m085147r95644K203854L183813L861859O200381P124599
$$ plain form
38976 43834975 46779528 43517803 38575221 36904292 37877053 38472280 38715098 39934616
38968 39934616 40889144 40483512 41955404 48914641 58269172 62373272 58259334 50126290
38960 50126290 42388438 35180493 28311821 25074574 28605284 36617999 43039921 44532165
38952 44532165 43339530 43556311 46089868 48290684 48176153 47594195 49837248 54581077
38944 54581077 57357650 54819962 48432197 41469274 34645848 27574539 23037697 25543291
38936 25543291 34631709 42922208 43373332 37247581 32581504 34846446 41042711 44057720
38928 44057720 41786893 39963904 45251009 56963160 67445626 70377439 66913059 63308340
38920 63308340 64222247 69191159 74186638 75301729 71709229 66217551 62773653 63025698
$$ packed form
38976D3834975K944553l261725m942582j670929R72761N95227K42818J219518
38968C9934616R54528m05632J471892O959237R354531M104100m113938q133044
38960E0126290p737852p207945o868672l237247L530710Q012715O421922J492244
38952D4532165j192635K16781K533557K200816j14531n81958K243053M743829
38944E4581077K776573k537688o387765o962923o823426p071309m536842K505594
38936B5543291R088418Q290499M51124o125751m666077K264942O196265L015009
38928D4057720k270827j822989N287105J1712151J0482466K931813l464380l604719
38920F3308340R13907M968912M995479J115091l592500n491678l443898K52045
$$ plain form
38912 63025698 65594237 68242850 69516380 68814454 67295656 68965987 77695559 91334667
38904 91334667 101359989 101091130 92871249 84679523 80887526 79198770 76178708 72777379
38896 72777379 73432776 81016020 93015762 102255855 102476416 94638334 86675637 85221580
38888 85221580 88627282 90327917 87863094 85189054 86231489 90012319 93626824 96964763
38880 96964763 102052645 109532249 118243173 127290950 136135679 142917772 145021689 142072100
38872 142072100 136983953 133094681 131027671 129321480 127673354 128255618 133335121 142346762
38864 142346762 152143397 159943339 165334978 169463171 173161587 176379849 178911563 180912208
38856 180912208 182496094 183190349 182485636 181442815 183125225 189873218 199857653 208272804
$$ packed form
38912F3025698K568539K648613J273530p01926j518798J670331Q729572J3639108
38904I1334667J0025322k68859q219881q191726l791997j688756l020062l401329
38896G2777379O55397P583244J1999742R240093K20561p838082p962697j454057
38888H5221580L405702J700635k464823k674040J042435L780830L614505L337939
38880I6964763N087882P479604Q710924R047777Q844729O782093K103917k949589
38872A42072100n088147l889272k067010j706191j648126N82264N079503R011641
38864A42346762R796635P799942N391639M128193L698416L218262K531714K000645
38856A80912208J583886O94255p04713j042821J682410O747993R984435Q415151
$$ plain form
38848 208272804 213200152 218310011 227502218 238647444 246106349 248599057 250322042 253895115
38840 253895115 256918422 257564915 259208804 265689500 274707097 280204906 280209218 278554834
38832 278554834 279094044 281426279 282859608 282374804 282023864 285400113 294261160 305713751
38824 305713751 314103214 317223443 318883614 323193867 328623550 331303599 332326337 336608921
38816 336608921 344608457 350600955 350874960 348833727 349044428 350227194 348300486 343898539
38808 343898539 342153004 345551678 350982678 354307580 354678610 353474469 351829797 350741264
38800 350741264 351260416 352334494 349898596 340748451 327117668 315332212 309767145 309826920
38792 309826920 312647137 315989157 317571067 314674248 307042635 298230895 291231064 284384106
$$ packed form
38848B08272804M927348N109859R192207J1145226P458905K492708J722985L573073
38840B53895115L023307O46493J643889O480696R017597N497809M312j654384
38832B78554834N39210K332235J433329m84804l50940L376249Q861047J1452591
38824C05713751Q389463L120229J660171M310253N429683K680049J022738M282584
38816C36608921P999536N992498K74005k041233K10701J182766j926708m401947
38808C43898539j745535L398674N431000L324902L71030j204141j644672j088533
38800C50741264N19152J074078k435898r150145j3630783j1785456n565067N9775
38792C09826920K820217L342020J581910k896819p631613q811740o999831o846958
$$ plain form
38784 284384106 274942289 265046263 259363068 257135134 252296752 243154280 236422581 238095297
38776 238095297 244685600 248216565 247002613 246382348 250134288 255869275 258653678 255543747
38768 255543747 246891314 236469199 229796945 229020541 229878096 226839116 220324709 215130152
38760 215130152 212662279 209483582 203621646 197428906 193144590 190089798 187692099 187016890
38752 187016890 187513990 186412282 183536563 182639242 185261879 187356403 185600536 183401443
38744 183401443 185853949 190997043 191258898 183135386 171140691 161753900 156810879 153641804
38736 153641804 149153777 142775659 136856689 134479467 135720233 136555507 133177339 126858344
38728 126858344 122322465 121465540 121286970 118643074 114525358 112159315 112740158 114913467
$$ packed form
38784B84384106r441817r896026n683195k227934m838382r142472o731699J672716
38776B38095297O590303L530965j213952o20265L751940N734987K784403l109931
38768B55543747q652433j0422115o672254p76404Q57555l038980o514407n194557
38760B15130152k467873l178697n861936o192740m284316l054792k397699o75209
38752A87016890M97100j101708k875719q97321K622637K094524j755867k199093
38744A83401443K452506N143094K61855q123512j1994695r386791m943021l169075
38736A53641804m488027o378118n918970k377222J240766Q35274l378168o318995
38728A26858344m535879q56925j78570k643896m117716k366043N80843K173309
$$ plain form
38720 114913467 117120724 118118253 115837362 108753226 99354196 93634836 94734173 98432294
38712 98432294 97827949 92024296 86847427 86395645 87692389 85981427 81974253 79992053
38704 79992053 80788162 80619064 77170088 72551864 69949376 70426094 73344215 76674697
38696 76674697 76440862 69601636 58906022 51600098 51497232 55137558 57522964 58477993
38688 58477993 60662537 64017637 65918305 65744865 65826300 67537401 68820554 66580204
38680 66580204 60659588 54658754 52456723 53884207 54857736 52738981 50110939 51085962
38672 51085962 55094206 57507961 55963839 52623779 50285272 49974698 52360240 57048183
38664 57048183 59879777 55986101 47100557 40919724 41314118 44292742 45671029 46540645
$$ packed form
38720A14913467K207257R97529k280891p084136r399030n719360J099337L698121
38712I8432294o04345n803653n176869m51782J296744j710962m007174j982200
38704G9992053P96109j69098l448976m618224k602488M76718K918121L330482
38696G6674697k33835o839226j0695614p305924j02866L640326K385406R55029
38688E8477993K184544L355100J900668j73440Q1435J711101J283153k240350
38680F6580204n920616o000834k202031J427484R73529k118755k628042R75023
38672E1085962M008244K413755j544122l340060k338507l10574K385542M687943
38664E7048183K831594l893676q885544o180833L94394K978624J378287Q69616
$$ plain form
38656 46540645 47976667 47263779 44378926 45359415 52404779 56932083 51166939 41515189
38648 41515189 40016257 45905582 47605803 42222554 40232174 47974700 57177105 57648668
38640 57648668 51345066 47026124 47757347 50639523 53673960 55914263 54668836 49350384
38632 49350384 45466429 48388648 54773733 55976588 49082528 39436852 32967533 31105923
38624 31105923 33202165 38743420 45574826 49456752 47374703 39881874 29940015 21137017
38616 21137017 16701052 17909732 23030447 29172412 34848307 39506371 41994940 41996380
38608 41996380 41907563 43991209 45788985 41868236 31193387 19942758 15271466 18039190
38600 18039190 23242750 26231585 26730676 27281977 29175223 30252543 26674074 17398261
$$ packed form
38656D6540645J436022p12888k884853R80489P045364M527304n765144r651750
38648D1515189j498932N889325J700221n383249j990380P742526R202405M71563
38640E7648668o303602m318942P31223K882176L034437K240303j245427n318452
38632D9350384l883955K922219O385085J202855o894060r645676o469319j861610
38624C1105923K096242N541255O831406L881926k082049p492829r941859q802998
38616B1137017m435965J208680N120715O141965N675895M658064K488569J440
38608D1996380q8817K083646J797776l920749j0674849j1250629m671292K767724
38600A8039190N203560K988835M99091N51301J893246J077320l578469r275813
$$ plain form
38592 17398261 6929576 2293238 6240805 14256971 19604744 20782764 22043773 26340607
38584 26340607 30608703 30554240 28220383 30201063 37516569 42067701 36760258 25834923
38576 25834923 19945620 22449559 26525852 26237858 24040590 24559746 26589758 26197082
38568 26197082 24133758 24432416 27199698 28298358 26130345 23875590 24019549 24777924
38560 24777924 23703023 21625866 20820039 21411984 21687681 20511662 17736251 13501507
38552 13501507 8899031 6374017 7565821 11055138 13814789 14834877 15912341 18701116
38544 18701116 22422205 25182489 26341014 26298713 24691446 20662428 15173103 11155420
38536 11155420 10151364 10163595 8486047 5617244 4235747 4971218 5940080 6555342 8574083
$$ packed form
38592A7398261j0468685m636338L947567Q016166N347773J178020J261009M296834
38584B6340607M268096n4463k333857J980680P315506M551132n307443j0925335
38576B5834923n889303K503939M076293k87994k197268N19156K030012l92676
38568B6197082k063324K98658K767282J098660k168013k254755J43959P58375
38560B4777924j074901k077157q05827N91945K75697j176019k775411m234744
38552A3501507m602476k525014J191804L489317K759651J020088J077464K788775
38544A8701116L721089K760284J158525m2301j607267m029018n489325m017683
38536A1155420j004056J2231j677548k868803j381497P35471R68862O15262K018741
$$ plain form
38527 8574083 11999468 12903655 8048817 139933 -4332167 -2142580 3787225 8319998
38519 8319998 9077623 7424684 6150393 6928738 9523358 12991299 17111629 21697720
38511 21697720 24767723 23458165 17878569 12435229 11584612 14988096 18067141 16619164
38503 16619164 10144496 2003993 -2634619 -642490 5783723 11146256 13115783 14595438
38495 14595438 17551740 18309511 13217211 6618928 7269629 16541426 25433451 25017708
38487 25017708 15775085 4620419 -3325098 -6830447 -5541756 556122 8913086 14956948
38479 14956948 16152233 14443850 13889833 16054160 18213910 16759758 12318196 9831737
38471 9831737 12307551 16350755 16527152 12846781 10297215 11355054 13230747 13370727
$$ packed form
38527H574083L425385R04187m854838p908884m472100K189587N929805M532773
38519H319998P57625j652939j274291P78345K594620L467941M120330M586091
38511B1697720L070003j309558n579596n443340q50617L403484L079045j447977
38503A6619164o474668q140503m638612J992129O426213N362533J969527J479655
38495A4595438K956302P57771n092300o598283O50701R271797Q892025m15743
38487B5017708r242623j1154666p945517l505349J288691O097878Q356964O043862
38479A4956948J195285j708383n54017K164327K159750j454152m441562k486459
38471I831737K475814M043204J76397l680371k549566J057839J875693J39980
$$ plain form
38463 13370727 13349619 15243425 17960868 20006089 22625828 26744087 29335579 26861287
38455 26861287 20806878 15879548 13508905 10989533 6937520 3785832 3901700 6131173
38447 6131173 7657255 7619878 7851433 10893996 17347521 24185309 26367797 21912390 14867062
38438 14867062 11175441 12042703 13889878 14459981 15405023 17930872 19573707 17868161
38430 17868161 14797691 14452809 17283401 19540592 18301201 14624307 11218001 8932568
38422 8932568 6721260 3984397 1583240 678881 1652889 4635018 10227110 18322862
38414 18322862 26080984 28806692 24476874 16754130 11777119 12023182 14819940 16548110
38406 16548110 15959547 13039809 7643087 1183606 -2635459 -1545240 2126104 4828330
$$ packed form
38463A3370727k1108J893806K717443K045221K619739M118259K591492k474292
38455B6861287o054409m927330k370643k519372m052013l151688J15868K229473
38447F131173J526082l7377K31555L042563O453525O837788K182488m455407p045328
38438A4867062l691621Q67262J847175N70103R45042K525849J642835j705546
38430A7868161l070470l44882K830592K257191j239391l676894l406306k285433
38422H932568k211308k736863k401157r04359R74008K982129N592092Q095752
38414A8322862P758122K725708m329818p722744m977011K46063K796758J728170
38406A6548110n88563k919738n396722o459481l819065J090219L671344K702226
$$ plain form
38398 4828330 7425324 14023919 24930951 34207597 35772884 29475452 19415122 8620537
38390 8620537 -1941624 -10490389 -13931372 -10939843 -3908825 2782445 5841940 4880767
38382 4880767 2324943 1178062 1789498 1466631 -1469323 -4504434 -4260768 -2203426 -3469591
38373 -3469591 -9390710 -14832048 -14883676 -11001228 -7656400 -5640970 -2791463 155988
38365 155988 -508658 -4974568 -7797110 -4843360 387196 628699 -5758891 -12035712 -10467992
38356 -10467992 -1111963 7922587 8899221 2246033 -4856665 -7022394 -5798112 -5734037
38348 -5734037 -7922428 -9775491 -9359278 -6598605 -1088799 7336876 15621266 19038249
38340 19038249 16928983 13357441 10709957 6670797 -98152 -5514778 -5355868 -1899141
$$ packed form
38398D828330K596994O598595J0907032R276646J565287o297432j0060330j0794585
38390H620537j0562161q548765l440983K991529P031018O691270L059495r61173
38382D880767k555824j146881O11436l22867k935954l035111K43666K057342j266165
38373c469591n921119n441338n1628L882448L344828K015430K849507K947451
38365A55988o64646m465910k822542K953750N230556K41503o387590o276821J567720
38356a0467992R356029R034550R76634o653188p102698k165729J224282O4075
38348e734037k188391j853063M16213K760673N509806Q425675Q284390L416983
38340A9038249k109266l571542k647484m039160o768949n416626J58910L456727
$$ plain form
38332 -1899141 -530895 -1716406 -1551571 602108 635561 -3492353 -8502040 -11088340 -12237125
38323 -12237125 -13920403 -14995273 -13272047 -9232252 -5057339 -1915823 -484532 -1873723
38315 -1873723 -5080532 -5493698 232967 8512448 11741209 7162803 -344361 -4889685
38307 -4889685 -5706713 -5292169 -4633943 -3182637 -1741440 -1911920 -2851295 -1633522 2295344
38298 2295344 5406483 4240601 -553462 -5965140 -10567965 -14159023 -14826187 -10233430
38290 -10233430 -2250345 3500242 4539322 4770227 8185208 12258661 11618733 6631781
38282 6631781 3618145 6548852 12833100 18066378 20662768 20101861 14799263 4982442
38274 4982442 -4992811 -10612052 -12025907 -12230256 -12004496 -9665540 -4749836 1234422
$$ packed form
38332a899141J368246j185511J64835K153679L3453m127914n009687k586300j148785
38323a2237125j683278j074870J723226M039795M174913L141516J431291j389191
38315a873723l206809m13166N726665Q279481L228761m578406p507164m545324
38307d889685q17028M14544O58226J451306J441197j70480r39375J217773L928866
38298B295344L111139j165882m794063n411678m602825l591058o67164M592757
38290a0233430P983085N750587J039080K30905L414981M073453o39928m986952
38282F631781l013636K930707O284248N233278K596390n60907n302598r816821
38274D982442r975253n619241j413855k04349K25760K338956M915704N984258
$$ plain form
38266 1234422 7248127 12903777 16322917 14916622 9124818 3053492 319160 813288
38258 813288 2368989 4228083 7786022 14365744 22725530 29010771 30190255 27997163
38250 27997163 27689422 31455012 35065528 33515602 27918684 23081834 19862485 15232695
38242 15232695 9839587 9139435 14477904 18668282 14978696 6617702 2023728 3330145
38234 3330145 5462450 5631017 7194148 12719109 18789878 20896248 19714329 18748569
38226 18748569 18045075 14474967 7799267 2575049 2648865 6112184 7822114 6105268
38218 6105268 4821593 8116199 14576616 18425584 16588161 12753730 13001239 18359922
38210 18359922 23856279 25228918 24374612 26221416 31156643 33367857 27984935 18011311
$$ packed form
38266A234422O013705N655650L419140j406295n791804o071326k734332M94128
38258H13288J555701J859094L557939O579722Q359786O285241J179484k193092
38250B7997163l07741L765590L610516j549926n596918m836850l219349m629790
38242A5232695n393108p00152N338469M190378l689586q360994m593974J306417
38234C330145K132305J68567J563131N524961O070769K106370j181919r65760
38226A8748569p03494l570108o675700n224218P3816L463319J709930j716846
38218F105268j283675L294606O460417L848968j837423l834431K47509N358683
38210A8359922N496357J372639q54306J846804M935227K211214n382922r973624
$$ plain form
38202 18011311 11499021 12047056 15126417 15108356 12727385 12179593 13056608 10606966 4374375
38193 4374375 851904 4653973 11611308 14812850 13921016 13285852 13564034 11920387 9708752
38184 9708752 12403882 20022656 24323653 19340114 9587130 3317698 1807775 709386
38176 709386 -1004088 127293 5070541 10009864 11794986 11131003 9428082 6741213
38168 6741213 4248464 4736162 8421005 11561468 11609557 10853633 12312029 14798148 15505791
38159 15505791 15318011 17184185 19941435 18243369 9593275 -1961543 -10534848 -13970154
38151 -13970154 -13117323 -8462946 -443364 8365781 14559750 17415887 18947401 20477747
38143 20477747 21251901 20673013 19744560 19491896 19760994 20522844 22598903 25803212 27991565
$$ packed form
38202A8011311o512290N48035L079361j8061k380971n47792Q77015k449642o232591
38193D374375l522471L802069O957335L201542q91834o35164K78182j643647k211635
38184I708752K695130P618774M300997m983539r752984o269432j509923j098389
38176G09386j713474J131381M943248M939323J785122o63983j702921k686869
38168F741213k492749M87698L684843L140463M8089p55924J458396K486119P07643
38159A5505791j87780J866174K757250j698066q650094j1554818q573305l435306
38151a3970154Q52831M654377Q019582Q809145O193969K856137J531514J530346
38143B0477747P74154n78888r28453k52664K69098P61850K076059L204309K188353
$$ plain form
38134 27991565 27621414 25920288 24647641 22947247 18810107 12957628 8678541 7879047
38126 7879047 9550368 11971586 13888239 13625338 10289652 6593049 7100607 12042523
38118 12042523 15881366 14092079 8546813 3766211 863203 -1281991 -1405115 2780435
38110 2780435 9443713 13453804 12739896 10189961 8803259 8541092 8685203 9639561 11036341
38101 11036341 11385016 11285219 13823822 19586114 24060235 22715754 16668315 10682359
38093 10682359 7210372 5136836 3166414 1497054 481541 10936 257791 1426905
38085 1426905 3061954 4938117 7918812 12366504 16509583 18188526 17555553 16199136
38077 16199136 14300884 10830711 6185183 2407771 805863 1249837 3553202 7284331
$$ packed form
38134B7991565l70151j701126j272647j700394m137140n852479m279087p99494
38126G879047J671321K421218J916653k62901l335686l696603N07558M941916
38118A2042523L838843j789287n545266m780602k903008k145194j23124M185550
38110B780435O663278M010091p13908k549935j386702k62167J44111R54358J396780
38101A1036341L48675r9797K538603N762292M474121j344481o047439n985956
38093A0682359l471987k073536j970422j669360j015513m70605K46855J169114
38085A426905J635049J876163K980695M447692M143079J678943o32973j356417
38077A6199136j898252l470173m645528l777412j601908M43974K303365L731129
$$ plain form
38069 7284331 10310582 10205077 7700157 6283485 7425247 8565789 7234580 5031228
38061 5031228 5472432 9110789 12704961 12667254 8011447 598747 -6080791 -8727354 -6197604
38052 -6197604 8360 7313528 13459371 16302227 14055852 7348722 141824 -3188193
38044 -3188193 -1666782 2238554 5740723 7738454 8522110 9180460 10919582 13295214
38036 13295214 13475283 9181036 2095687 -3989961 -8306739 -13135384 -17888494 -17316132
38028 -17316132 -8839220 1401416 4637758 509855 -3025035 -1030443 2649914 3124393
38020 3124393 2602562 6038723 11918596 13528832 9013882 4678172 6835461 14522731
38012 14522731 22292919 26706388 27322384 24008444 16911365 8218137 1076760 -3221388
$$ packed form
38069G284331L026251j05505k504920j416672J141762J140542j331209k203352
38061E031228M41204L638357L594172l7707m655807p412700o679538k646563K529750
38052f197604O205964P305168O145843K842856k246375o707130p206898l330017
38044c188193J521411L905336L502169J997731P83656O58350J739122K375632
38036A3295214J80069m294247p085349o085648m316778m828645m753110N72362
38028a7316132Q476912J0240636L236342m127903l534890J994592L680357M74479
38020C124393n21831L436161N879873J610236m514950m335710K157289P687270
38012A4522731P770188M413469O15996l313940p097079q693228p141377m298148
$$ plain form
38004 -3221388 -5432628 -6540146 -7539028 -10041186 -14568863 -18422351 -17690750 -11926171
37996 -11926171 -5020363 -886778 219752 646496 2241611 5145696 8406364 10750412
37988 10750412 11432386 11090819 11311343 12831126 14559183 14728298 12753799 9875403 8241892
37979 8241892 9100478 11236835 11359762 6872390 -1474907 -9956942 -14729715 -14233472 -9750307
37970 -9750307 -4539105 -1717294 -1760342 -2350452 -1446038 278749 940800 59403 -1856481
37961 -1856481 -4776692 -7889697 -8376168 -4702056 -148999 927090 -15563 2631895
37953 2631895 9390637 13648102 11373718 7588159 8726298 12601692 11668278 4136185
37945 4136185 -3939714 -7077590 -5731039 -3083976 -1216545 -1290891 -3377965 -4907891
$$ packed form
38004c221388k211240j107518r98882k502158m527677l853488P31601N764579
37996a1926171O905808M133585J106530M26744J595115K904085L260668K344048
37988A0750412O81974l41567K20524J519783J728057J69115j974499k878396j633511
37979H241892Q58586K136357J22927m487372q347297q482035m772773M96243M483165
37970i750307N211202K821811m3048n90110R04414J724787O62051q81397j915884
37961a856481k920211l113005m86471L674112M553057J076089r42653K647458
37953B631895O758742M257465k274384l785559J138139L875394r33414p532093
37945D136185q075899l137876J346551K647063J867431p4346k087074j529926
$$ plain form
37937 -4907891 -2948856 833821 1193437 -3324952 -7853711 -8047619 -5670934 -4480449
37929 -4480449 -3939474 -1039576 3625829 5843817 3423951 -1327924 -4765000 -5184300
37921 -5184300 -3234368 -1310353 -2421146 -7590878 -14214317 -18268848 -17657695 -12273218
37913 -12273218 -2530106 9485017 18679609 20522537 16232876 11348107 8731472 6182954
37905 6182954 1724722 -2397187 -3052320 -795818 1351749 1790270 860512 -712835 -1729173
37896 -1729173 -738855 1138482 -383960 -7088155 -13335667 -11135778 -262940 10726416
37888 10726416 14599369 12765148 10664192 9591497 6640712 659684 -5815411 -10321220
37880 -10321220 -12921593 -14439318 -14860372 -14360649 -13725076 -12571512 -9047089 -2836766
$$ packed form
37937d907891J959035L782677L59616m518389m528759j93908K376685J190485
37929d480449N40975K899898M665405K217988k419866m751875l437076m19300
37921e184300J949932J924015j110793n169732o623439m054531O11153N384477
37913a2273218R743112J2015123R194592J842928m289661m884769k616635k548518
37905F182954m458232m121909o55133K256502K147567M38521r29758j573347j016338
37896a729173R90318J877337j522442o704195o247512K199889J0872838J0989356
37888A0726416L872953j834221k100956j072695k950785n981028o475095m505809
37880a0321220k600373j517725m21054M99723O35573J153564L524423O210323
$$ plain form
37872 -2836766 3071579 5561924 5211979 4637473 3760163 -88201 -6650602 -10543988 -6998825
37863 -6998825 1958672 9635127 11904327 9748719 5734626 1722284 144441 3138680
37855 3138680 8388636 9472467 3482083 -4265169 -6480606 -2708758 1970841 5078764
37847 5078764 8370115 11908138 12588746 10397649 10760632 16921771 23558309 22441659
37839 22441659 12908259 2870820 -191911 3560215 7926672 7163388 761194 -6703283
37831 -6703283 -10305215 -9857898 -9564297 -12498381 -17390694 -21500214 -23775989 -23516147 -19249978
37822 -19249978 -12040487 -6937428 -6963449 -7821076 -3441070 4570166 8530117 5561727
37814 5561727 1237588 1226323 4498060 6910202 6971095 5278051 2029697 -1698349 -2985457
$$ packed form
37872b836766N908345K490345l49945n74506q77310l848364o562401l893386L545163
37863f998825Q957497P676455K269200k155608m014093m012342j577843K994239
37855C138680N249956J083831n990384p747252k215437L771848M679599L107923
37847E078764L291351L538023O80608k191097L62983O161139O636538j116650
37839B2441659r533400j0037439l062731L752126M366457p63284o402194p464477
37831f703283l601932M47317K93601k934084m892313m109520k275775K59842M266169
37822a9249978P209491N103059k6021q57627M380006Q011236L959951k968390
37814E561727m324139j1265L271737K412142O0893j693044l248354l728046j287108
$$ plain form
37805 -2985457 -403462 3600763 5754729 5234487 2401080 -2427889 -6651137 -5674691
37797 -5674691 673768 5194536 1585405 -6356768 -9032404 -3696741 2583081 3213576
37789 3213576 210006 -269040 3112768 5703219 3357229 -2583841 -7144229 -7343791
37781 -7343791 -5072874 -4116691 -5181086 -5445816 -2840775 1688897 6724488 11935158
37773 11935158 15417333 13315514 5743496 4751 2854593 11102229 15198001 11567885
37765 11567885 5854900 3608500 3723502 3040836 1914871 1679780 628868 -3435648
37757 -3435648 -9163794 -13720301 -16980403 -20426065 -23450229 -24025762 -21980968 -18455084
37749 -18455084 -12732295 -2842376 10357586 22214612 28257457 27782704 23184723 17179439
$$ packed form
37805b985457K581995M004225K153966n20242k833407m828969m223248R76446
37797e674691O348459M520768l609131p942173k675636N335663O279822O30495
37789C213576l003570m79046L381808K590451k345990n941070m560388j99562
37781g343791K270917R56183j064395k64730K605041M529672N035591N210670
37773A1935158L482175k101819p572018n738745K849842Q247636M095772l630116
37765A1567885n712985k246400J15002o82666j125965k35091j050912m064516
37757c435648n728146m556507l260102l445662l024164n75533K044794L525884
37749a8455084N722789R889919J3199962J1857026O042845m74753m597981o005284
$$ plain form
37741 17179439 11467104 7291116 6005140 8057803 11181862 10979289 5233198 -2614009
37733 -2614009 -6376210 -3791231 1697377 5857030 7496007 6715088 3078142 -1980495
37725 -1980495 -3919204 76990 6366851 8203787 3242785 -4761441 -10799213 -12313763
37717 -12313763 -8793500 -1128698 7868160 14653770 17713370 18114544 17411374 16256889
37709 16256889 14629071 11867473 6985081 585978 -4269429 -5175199 -3747488 -3599968
37701 -3599968 -5492528 -7152456 -7637110 -8660968 -10897834 -11934591 -9475374 -4699320
37693 -4699320 -1039669 -746725 -3266011 -5827955 -5548824 -2515087 -650728 -3511091
37685 -3511091 -9445995 -13549017 -14276404 -14631125 -16112523 -15597043 -10416495 -3123219 1666045
$$ packed form
37741A7179439n712335m175988j285976K052663L124059k02573n746091p847207
37733b614009l762201K584979N488608M159653J638977p80919l636946n058637
37725a980495j938709L996194O289861J836936m961002q004226o037772j514550
37717a2313763L520263P664802Q996858O785610L059600M01174p03170j154485
37709A6256889j627818k761598m882392o399103m855407r05770J427711J47520
37701c599968j892560j659928m84654j023858k236866j036757K459217M776054
37693d699320L659651K92944k519286k561944K79131L033737J864359k860363
37685c511091n934904m103022p27387l54721j481398N15480N180548P293276M789264
$$ plain form
37676 1666045 2595234 993744 -2408365 -6903663 -10231916 -11420181 -13500560 -19174220
37668 -19174220 -24832726 -23590811 -14406913 -3882544 1746630 2398138 894665 -1738381
37660 -1738381 -5295773 -8048883 -8483697 -7526237 -6626653 -5245928 -2381624 1089587 3899290
37651 3899290 6703737 10469055 13869782 14931104 14165721 13247045 11503363 7081515
37643 7081515 1282261 -1927653 -1345840 -64015 -357948 -257877 2892489 8233451 13160991
37634 13160991 17047826 20345737 21566069 18378352 11305517 3844558 -838634 -1486316
37626 -1486316 1841375 7072000 9496686 5382248 -3202932 -10022610 -11669550 -10034815
37618 -10034815 -7398422 -2992991 3804566 10683019 15630761 19722150 23355634 22989699
$$ packed form
37676A666045R29189j601490l402109m495298l328253j188265k080379n673660
37668a9174220n658506J241915R183898J0524369N629174O51508j503473k633046
37660a738381l557392k753110m34814R57460Q99584J380725K864304L471211K809703
37651C899290K804447L765318L400727J061322p65383r18676j743682m421848
37643G081515n799254l209914N81813J281825k93933J00071L150366N340962M927540
37634A3160991L886835L297911J220332l187717p072835p460959m683192o47682
37626a486316L327691N230625K424686m114438q585180o819678j646940J634735
37618a0034815K636393M405431O797557O878453M947742M091389L633484l65935
$$ plain form
37610 22989699 16355849 8554762 7000470 10916839 12117759 7218526 2777487 5307368
37602 5307368 11472332 12790102 6747219 -1378503 -5622201 -3962321 2367109 9531256
37594 9531256 11960195 7281801 462748 -1183512 2688835 5620178 4453145 3923098
37586 3923098 8507501 14357019 13908970 6307602 -1059879 -876543 7116021 16813794
37578 16813794 21045309 16953188 8468079 2910045 3374106 5667192 4604666 1098391
37570 1098391 -216442 1819077 4806239 8578239 14991012 21477161 21566769 14858297
37562 14858297 10672459 16914450 29246774 36594976 34555897 27687308 20620891 13860068
37554 13860068 8611609 8823273 15246730 21884050 22018749 15630275 8390542 5232054
$$ packed form
37610B2989699o633850p801087j554292L916369J200920m899233m441039K529881
37602E307368O164964J317770o042883q125722m243698J659880O329430P164147
37594I531256K428939m678394o819053j646260L872347K931343j167033n30047
37586C923098M584403N849518m48049p601368p367481J83336P992564R697773
37578A6813794M231515m092121q485109n558034M64061K293086j062526l506275
37570A098391j314833K035519K987162L772000O412773O486149Q9608o708472
37562A4858297m185838O241991J2332324P348202k039079o868589p066417o760823
37554A3860068n248459K11664O423457O637320J34699o388474p239733l158488
$$ plain form
37546 5232054 6980653 11351237 14713749 14020608 9324790 4008270 1127416 333170
37538 333170 -218432 -50594 3234668 9622933 14693939 13443595 6112800 -775530 -480451
37529 -480451 6645711 13470424 14582132 12212358 11373094 11665371 8625566 2281679 -1570561
37520 -1570561 16070 2855383 2780038 2033181 4520579 8912858 11308118 11585439 12215058
37511 12215058 13603040 15766107 21546404 31628521 38711675 34624375 22729727 14904187
37503 14904187 15107846 14593673 6475975 -3395149 -5581732 -330168 5133641 7837828
37495 7837828 10274580 13303042 15182490 16555534 19809079 23605500 23959303 21161143
37487 21161143 19945796 21591654 21369274 16269850 10498777 9564682 12085253 11801246
$$ packed form
37546E232054J748599M370584L362512o93141m695818n316520k880854p94246
37538C33170n51602J67838L285262O388265N071006j250344p330795o888330K95079
37529d80451P126162O824713J111708k369774q39264K92277l039805o343887l852240
37520a570561J586631K839313p5345p46857K487398M392279K395260K77321O29619
37511A2215058J387982K163067N780297J0082117P083154m087300j1894648p825540
37503A4904187K03659n14173q117698r871124k186583N251564N463809K704187
37495G837828K436752L028462J879448J373044L253545L796421L53803k798160
37487B1161143j215347J645858k22380n099424n771073r34095K520571k84007
$$ plain form
37479 11801246 6539449 1173295 1079790 5554107 9531829 10326157 9923864 10192336 8850106
37470 8850106 3275798 -3165449 -3334590 4062923 11552461 12296189 8458520 6200067
37462 6200067 5818131 2657322 -3756778 -7833634 -5672813 650840 7726956 14808837
37454 14808837 21350867 25095564 25330513 24622823 24652940 23153036 17541066 9234195 2008799
37445 2008799 -1978976 -2802722 -1592463 -256830 7337 974235 4897709 8747954 5866670
37436 5866670 -3847715 -10731737 -7215778 1496057 4865497 1953097 1454847 8107103
37428 8107103 16927757 21901759 23185869 23155418 21454488 17821445 15388857 16975016
37420 16975016 20799469 23267031 23807321 23992732 23923776 22590807 20339000 18051787 14976005
$$ packed form
37479A1801246n261797n366154r3505M474317L977722P94328m02293K68472j342230
37470H850106n574308o441247j69141P397513P489538P43728l837669k258453
37462F200067l81936l160809o414100m076856K160821O323653P076116P081881
37454A4808837O542030L744697K34949p07690L0117j499904n611970q306871p225396
37445B008799l987775q23746J210259J335633K64167R66898L923474L850245k881284
37436E866670r714385o884022L515959Q711835L369440k912400m98250O652256
37428H107103Q820654M974002J284110l0451j700930l633043k432588J586159
37420A6975016L824453K467562N40290J85411o8956j332969k251807k287213l075782
$$ plain form
37411 14976005 10214794 5784156 5303768 9189730 13212901 12979917 9087801 6705856
37403 6705856 9542619 14857511 16153836 11272258 5291041 3487538 4449020 4169260
37395 4169260 4357199 10188043 20192122 25887714 23665335 19975778 20808268 22627030
37387 22627030 19479510 13568710 11421764 13113826 13083567 9877891 7611782 8307165
37379 8307165 9659947 10441060 11636856 11971563 8839229 4384027 4027374 7726468 9365279
37370 9365279 6477442 3558897 3338591 2280620 -1322205 -2019836 4507760 13686009
37362 13686009 18513961 18920732 18707285 17792669 14179605 9831967 7664109 5828784
37354 5828784 1913920 -385087 3415166 9277522 9428262 4872744 3752123 7628229
$$ packed form
37411A4976005m761211m430638m80388L885962M023171k32984l892116k381945
37403F705856K836763N314892J296325m881578n981217j803503R61482k79760
37395D169260J87939N830844J0004079N695592k222379l689557Q32490J818762
37387B2627030l147520n910800k146946J692062l0259l205676k266109O95383
37379H307165J352782P81113J195796L34707l132334m455202l56653L699094J638811
37370I365279k887837k918545k20306j057971l602825o97631O527596R178249
37362A3686009M827952M06771k13447r14616l613064m347638k167858j835325
37354E828784l914864k299007L800253N862356J50740m555518j120621L876106
$$ plain form
37346 7628229 9418936 6130316 3297468 3762248 2213972 -4120657 -8680620 -6103536
37338 -6103536 -1621788 -2324708 -5765602 -5658378 -3120194 -2710575 -1756760 5570929 15820138
37329 15820138 19129312 14589450 11832897 15267397 17301610 11726315 4466853 4189839
37321 4189839 9069936 10793449 7531648 5042891 6689915 9467786 10123384 9789798
37313 9789798 11482550 16494298 23709488 29720048 30000067 23194687 14167930 9704203
37305 9704203 11229576 14855695 18243888 23135086 30015518 34603159 32635699 25762882
37297 25762882 19716550 17704456 17909058 16987179 14172517 11742088 12161532 14837082
37289 14837082 16205640 14285256 12466254 15990684 24188583 29628473 26892319 19022005
$$ packed form
37346G628229J790707l288620k832848M64780j548276o334629m559963K577084
37338f103536M481748p02920l440894J07224K538184M09619R53815P327689J0249209
37329A5820138L309174m539862k756553L434500K034213n575295p259462k77014
37321D189839M880097J723513l261801k488757J647024K777871O55598l33586
37313I789798J692752N011748P215190O010560K80019o805380r026757m463727
37305I704203J525373L626119L388193M891198O880432M587641j967460o872817
37297B5762882o046332k012094K04602r21879k814662k430429M19444K675550
37289A4837082J368558j920384j819002L524430Q197899N439890k736154p870314
$$ plain form
37281 19022005 12363863 8056260 3030838 -2572068 -4796324 -2901622 -1403657 -2973763
37273 -2973763 -3863855 235312 6919912 9622702 6109263 1121697 812795 6617815
37265 6617815 14192483 16928697 11595254 2338193 -1956723 3633791 14682787 22432964
37257 22432964 23056052 19773774 17129867 16437072 16755482 17187705 17250053 16958853 17107665
37248 17107665 17849003 17073392 12306235 4386095 -2778704 -6202681 -5553147 -1352147
37240 -1352147 5461115 11910562 14445466 13407121 13175396 16349080 20384315 21455862
37232 21455862 18813457 13588185 6494117 -670606 -4238914 -2914507 -690677 -1881092
37224 -1881092 -4876777 -4789521 -1156717 1458884 498867 -1419939 -1539344 -1329386 -3515257
$$ packed form
37281A9022005o658142m307603n025422n602906k224256J894702J497965j570106
37273b973763q90092M099167O684600K702790l513439m987566l08902N805020
37265F617815P574668K736214n333443r257061m294916N590514J1048996P750177
37257B2432964O23088l282278k643907o92795L18410M32223O2348k91200J48812
37248A7107665P41338p75611m767157p920140p164799l423977O49534M201000
37240a352147O813262O449447K534904j038345k31725L173684M035235J071547
37232B1455862k642405n225272p094068p164723l568308J324407K223830j190415
37224a881092k995685Q7256L632804K615601r60017j918806j19405K09958k185871
$$ plain form
37215 -3515257 -7109095 -7960422 -3668769 3333312 7496818 5118583 -1490638 -5308068
37207 -5308068 -1650504 6573419 12675693 14461156 15280748 16642091 14447270 5634359
37199 5634359 -4665377 -7293301 -11546 9359346 11518891 4911736 -4412797 -9749297
37191 -9749297 -8930844 -4295877 198096 2016381 1822801 2475710 5381279 8206559 7751124
37182 7751124 4995960 4874009 9638886 14571920 13055828 5226165 -1410493 -559111
37174 -559111 6025797 11275951 10389992 4366518 -2344676 -5926518 -5746417 -4313188 -4489421
37165 -4489421 -6263608 -7051283 -5420827 -3047624 -2322694 -3616661 -5762413 -7500974
37157 -7500974 -7388302 -4231711 877122 4793500 6197084 7324141 10026495 12274171
$$ packed form
37215c515257l593838q51327M291653P002081M163506k378235o609221l817430
37207e308068L657564Q223923O102274J785463Q19592J361343k194821q812911
37199E634359j0299736k627924P281755R370892K159545o607155r324533n336500
37191i749297Q18453M634967M493973J818285j93580O52909K905569K825280m55435
37182G751124k755164j21951M764877M933034j516092p829663o636658Q51382
37174e59111O584908N250154q85959o023474o711194l581842J80101J433229j76233
37165d489421j774187p87675J630456K373203P24930j293967k145752j738561
37157g500974J12672L156591N108833L916378J403584J127057K702354K247676
$$ plain form
37149 12274171 11016076 6633209 1924343 -1434384 -2475398 812349 8609712 15729034
37141 15729034 15465541 7280641 -2729608 -8930505 -10307400 -7926109 -2601403 3927879
37133 3927879 9089079 12077852 13821134 13983355 11116679 6228957 2757911 2092073
37125 2092073 2214905 1433938 172423 -1330982 -3124959 -2700085 3170527 12045481 16192401
37116 16192401 12254277 6262240 5460200 8747417 9307331 4084985 -3368425 -7661245
37108 -7661245 -5725693 1994896 11098982 15380531 12657350 7508442 5772621 7761887
37100 7761887 9370370 8120593 5110380 2178242 -80647 -2188445 -5397817 -9994267
37092 -9994267 -12766669 -9035887 627855 8962089 10259538 6753654 3306282 -253050
$$ packed form
37149A2274171j258095m382867m708866l358727j041014L287747P797363P119322
37141A5729034k63493q184900j0010249o200897j376895K381291N324706O529282
37133C927879N161200K988773J743282J62221k866676m887722l471046o65838
37125B092073J22832p80967j261515j503405j793977M24874N870612Q874954M146920
37116A6192401l938124n992037q02040L287217N59914n222346p453410m292820
37108g661245J935552P720589R104086M281549k723181n148908j735821J989266
37100G761887J608483j249777l010213k932138k258889k107798l209372m596450
37092i994267k772402L730782R663742Q334234J297449l505884l447372l559332
$$ plain form
37084 -253050 -6155429 -11435998 -10874324 -6291612 -5844393 -12903225 -21270412 -23253627 -18092251
37075 -18092251 -10606609 -5147939 -2711804 -1449393 1156638 4897985 6043110 2271100
37067 2271100 -3095318 -5501548 -6089621 -8833114 -11664937 -7457881 4631104 15356355
37059 15356355 16255862 9499227 3579304 3366499 7816927 13625992 17079187 15091117
37051 15091117 8467782 2604857 2060936 5886038 10153624 12657367 13049067 11381078
37043 11381078 9315302 9895943 13033914 14136342 10708210 7128144 8213387 10775531
37035 10775531 7654325 -907619 -6479545 -3973453 2018506 4928037 5163880 7328357
37027 7328357 11982988 15263614 15403666 14567985 13591025 9624208 1707804 -4824263 -3934565
$$ packed form
37084b53050n902379n280569N61674M582712M47219p058832q367187j983215N161376
37075a8092251P485642N458670K436135J262411K606031L741347J145125l772010
37067B271100n366418k406230n88073k743493k831823M207056J2088985J0725251
37059A5356355Q99507o756635n919923k12805M450428N809065L453195j988070
37051A5091117o623335n862925n43921L825102M267586K503743L91700j667989
37043A1381078k065776N80641L137971J102428l428132l580066J085243K562144
37035A0775531l121206q561944n571926K506092N991959K909531K35843K164477
37027G328357M654631L280626J40052q35681r76960l966817p916404o532067Q89698
$$ plain form
37018 -3934565 2392302 5755512 2157353 -3371786 -4692090 -2336857 155714 3335412
37010 3335412 9459027 15282149 13913463 4226886 -6911388 -12682553 -12084498 -7360860
37002 -7360860 -1009729 3434444 3008653 -255961 -1280419 67138 -1467582 -6768208
36994 -6768208 -8897324 -3741593 2121503 333683 -7115309 -11406490 -9265217 -4991590
36986 -4991590 -2352990 -1315513 -1841126 -4597629 -8023655 -9918589 -11474254 -14759466
36978 -14759466 -17253080 -14668873 -8656614 -5441960 -6533950 -7030713 -4102873 -897121
36970 -897121 -164019 93075 1923556 3427934 2364549 -545796 -4562700 -10737741 -17595491
36961 -17595491 -19240136 -12095899 -972860 5508193 4141806 -883095 -3603469 -1491077
$$ packed form
37018c934565O326867L363210l598159n529139j320304K355233K492571L179698
37010C335412O123615N823122j368686r686577j1138274n771165N98055M723638
37002g360860O351131M444173m25791l264614j024458J347557j534720n300626
36994f768208k129116N155731N863096j787820p448992m291181K141273M273627
36986d991590K638600J037477n25613k756503l426026j894934j555665l285212
36978a4759466k493614K584207O012259L214654j091990m96763K927840L205752
36970h97121P33102K57094J830481J504378j063385k910345m016904o175041o857750
36961a7595491j644645P144237J1123039O481053j366387n024901k720374K112392
$$ plain form
36953 -1491077 3411164 6409243 4435551 -305558 -2742711 -1866958 -2406717 -7911233
36945 -7911233 -15209467 -18345388 -15640953 -10122875 -4907433 -1030437 1464109 2930272
36937 2930272 4105433 5258789 6166607 7305123 8979074 8950869 4424417 -2302699 -4329466
36928 -4329466 1039262 7869563 9423965 6605045 4181432 2265203 -2233066 -7564706
36920 -7564706 -7561097 -803458 6195926 6722575 835002 -6728285 -11978331 -13347614 -10920077
36911 -10920077 -6035956 -313607 5470302 10178440 11009776 6561667 759910 -452528
36903 -452528 2713537 3103835 -3892083 -13275207 -15551875 -6997767 7259685 18718856
36895 18718856 22223437 18865216 14279006 13281033 15049518 14567542 9214369 1862654
$$ packed form
36953a491077M902241K998079j973692m741109k437153Q75753n39759n504516
36945g911233p298234l135921K704435N518078N215442L876996K494546J466163
36937B930272J175161J153356R07818J138516J673951k8205m526452o727116k026767
36928d329466N368728O830301J554402k818920k423613j916229m498269n331640
36920g564706L609O757639O999384N26649n887573p563287n250046j369283K427537
36911a0920077M884121N722349N783909M708138Q31336m448109n801757j212438
36903d52528L166065L90298o995918r383124k276668Q554108J4257452J1459171
36895A8718856L504581l358221m586210r97973J768485m81976n353173p351715
$$ plain form
36887 1862654 -3442445 -6279747 -8525567 -10604924 -11606769 -11540470 -10898152 -9076210 -5667362
36878 -5667362 -2388052 -1204573 -1169214 382955 3862890 7123767 8934480 10130697
36870 10130697 10973984 9859997 5571714 -986349 -7987339 -13866584 -16705728 -14524652
36862 -14524652 -7589594 846586 7220995 10071447 9331556 5238507 -638174 -5130769
36854 -5130769 -6409617 -6064398 -6109726 -5015158 405670 9405979 16707707 18298181 15319871
36845 15319871 11208724 7566625 4476690 2316574 590806 -3233919 -10469898 -17535620
36837 -17535620 -18791522 -13195841 -5436340 -273047 1410325 661924 -1785776 -4264537
36829 -4264537 -4016397 -856119 1528529 723833 -223447 2886600 8708894 11859366 9966614
$$ packed form
36887A862654n305099k837302k245820k079357j001845O6299O42318J821942L408848
36878e667362L279310J183479L5359J552169L479935L260877J810713J196217
36870A0130697Q43287j113987m288283o558063p000990n879245k839144K181076
36862a4524652O935058Q436180O374409K850452p39891m093049n876681m492595
36854e130769j278848L45219m5328J094568N420828R000309P301728J590474k978310
36845A5319871m111147l642099l089935k160116j725768l824725p235979p065722
36837a7535620j255902N595681P759501N163293J683372p48401k447700k478761
36829d264537K48140L160278K384648q04696r47280L110047N822294L150472j892752
$$ plain form
36820 9966614 4963553 -1875907 -10800362 -18726127 -19442358 -11874149 -3590730 -1841784
36812 -1841784 -4518845 -4917554 -2715006 -3694702 -9001109 -11608955 -6040177 3625982
36804 3625982 9383860 9521454 8707955 9666753 9628951 5512094 -1117345 -5904469 -6452968
36795 -6452968 -3797602 -533223 1238621 1047185 374496 1427126 4797815 8731311
36787 8731311 11204333 11979593 11763876 10167138 6132918 492417 -3545347 -3623797 -1348067
36778 -1348067 -947400 -4664747 -10262721 -13510985 -12624144 -9697205 -8113630 -9332832
36770 -9332832 -12253693 -14802717 -15443363 -13569231 -9416788 -3999379 1248074 5244785
36762 5244785 7843221 9527301 10375413 9447663 5758912 158652 -4521626 -6198108
$$ packed form
36820I966614n003061o839460q924455p925765p16231P568209Q283419J748946
36812a841784k677061l98709K202548r79696n306407k607846N568778R666159
36804C625982N757878J37594q13499R58798l7802m116857o629439m787124n48499
36795f452968K655366L264379J771844j91436o72689J052630L370689L933496
36787H731311K473022P75260k15717j596738m034220n640501m037764p8450K275730
36778a348067M00667l717347n597974l248264Q86841K926939J583575j219202
36770i332832k920861k549024o40646J874132M152443N417409N247453L996711
36762E244785K598436J684080Q48112r27750l688751n600260m680278j676482
$$ plain form
36754 -6198108 -5938907 -6231409 -7141921 -6282191 -2836257 1174080 4826204 9999855 16167631
36745 16167631 16968125 7558185 -6045535 -11819121 -7139499 -2666092 -7465328 -16387162
36737 -16387162 -18023520 -10889666 -4243600 -4398142 -7768167 -8441403 -6154134 -4122787
36729 -4122787 -3781709 -4884071 -7500576 -10861730 -12524747 -11243094 -8816113 -7059942
36721 -7059942 -4933663 -874440 3710448 5575582 3258013 -1928576 -7251209 -9744432
36713 -9744432 -7851090 -3438055 -614059 -1288643 -3705419 -6217487 -9523685 -13423526
36705 -13423526 -14844330 -12161035 -8547608 -7452146 -7407715 -5460873 -3116323 -3482520
36697 -3482520 -4164863 608866 10541118 17949112 17424132 11699704 5984573 1423678
$$ packed form
36754f198108K59201k92502r10512Q59730L445934M010337L652124N173651O167776
36745A6167631Q00494r409940j3603720n773586M679622M473407m799236q921834
36737a6387162j636358P133854O646066j54542l370025o73236K287269K031347
36729d122787L41078j102362k616505l361154j663017J281653K426981J756171
36721g059942K126279M059223M584888J865134k317569n186589n322633k493223
36713i744432J893342M413035K823996o74584k416776k512068l306198l899841
36705a3423526j420804K683295L613427J095462M4431J946842K344550l66197
36697c482520o82343M773729R932252P407994n24980n724428n715131m560895
$$ plain form
36689 1423678 -2885361 -5635312 -4968141 -1820565 1704233 5376485 9470517 12255283
36681 12255283 11758219 8774494 5786074 4138430 4132999 5964151 8108900 6724032 -139941
36672 -139941 -8761809 -13182228 -11868038 -8531832 -7247979 -9487375 -14973404 -21821331
36664 -21821331 -25731875 -22701392 -13953517 -5774208 -2986964 -4154625 -4321968 -1168671
36656 -1168671 2699505 2965426 -1420901 -6241723 -5592732 1602753 9651862 12385234
36648 12385234 10414680 9564976 12699591 16675481 18104062 18302084 20055193 22200088
36640 22200088 20940696 15699175 10531380 9238955 11076562 12162346 10060819 6135854
36632 6135854 3699921 4353320 6288909 6078730 1741295 -6064168 -14941766 -21843136
$$ packed form
36689A423678m309039k749951O67171L147576L524798L672252M094032K784766
36681A2255283m97064k983725k988420j647644n431J831152K144749j384868o863973
36672a39941q621868m420419J314190L336206J283853k239396n486029o847927
36664b1821331l910544L030483Q747875Q179309K787244j167661j67343L153297
36656a168671L868176K65921m386327m820822O48991P195485Q049109K733372
36648A2385234j970554q49704L134615L975890J428581J98022J753109K144895
36640B2200088j259392n241521n167795j292425J837607J085784k101527l924965
36632F135854k435933O53399J935589k10179m337435p805463q877598o901370
$$ plain form
36624 -21843136 -24043977 -20900656 -14897390 -9691521 -7074994 -6952419 -9393219 -14135400
36616 -14135400 -18389103 -18724845 -16131175 -15550920 -18497719 -19923144 -15587053 -9107883
36608 -9107883 -7182982 -10145661 -12479018 -11429009 -9348739 -7526361 -3829546 1772714
36600 1772714 4808338 2312291 -3098282 -8094555 -13243878 -19010282 -21411025 -17112410
36592 -17112410 -10235351 -8032547 -10646662 -11008442 -5439017 1131185 2634293 347936
36584 347936 680548 6400709 12722957 12006994 1740600 -11836174 -18820391 -15697896
36576 -15697896 -9190373 -8022297 -12505886 -15771129 -13913800 -9813052 -6855258 -4695946
36568 -4695946 -2995796 -3696436 -6430865 -6754586 -3103893 -1041236 -5460305 -12270842
$$ packed form
36624b1843136k200841L143321O003266N205869K616527J22575k440800m742181
36616a4135400m253703l35742K593670N80255k946799j425425M336091O479170
36608i107883J924901k962679k333357J050009K080270J822378L696815N602260
36600A772714L035624k496047n410573m996273n149323n766404k400743M298615
36592a7112410O877059K202804k614115l61780N569425O570202J503108k286357
36584C47936L32612N720161O322248p15963j0266394j3576774o984217L122495
36576a5697896O507523J168076m483589l265243J857329M100748K957794K159312
36568d695946J700150p00640k734429l23721L650693K062657m419069o810537
$$ plain form
36560 -12270842 -13939700 -10810168 -10088433 -14363049 -17925826 -15498917 -8921295 -3394151
36552 -3394151 -1722025 -4162721 -9846596 -16028631 -19032351 -17846689 -14413423 -9804696
36544 -9804696 -3637814 2130020 3599777 1025867 -266713 2154973 3832030 1376795
36536 1376795 -369787 4766593 13283311 15137310 7471186 -1557048 -4181585 -2467922
36528 -2467922 -3131056 -7092370 -8833887 -4924266 916427 2538751 -850932 -3810977
36520 -3810977 -1791194 2810989 3854712 -99330 -3942842 -3514752 -1189482 -1261022 -2950044
36511 -2950044 -2223642 1293087 4037327 4640119 5759700 9478589 14990901 21223800
36503 21223800 27332141 29940826 25162178 15419254 9131288 10302626 12956468 10005708
$$ packed form
36560a2270842j668858L129532P21735m274616l562777K426909O577622N527144
36552c394151J672126k440696n683875o182035l003720J185662L433266M608727
36544i804696O166882N767834J469757k573910j292580K421686J677057k455235
36536A376795j746582N136380Q516718J853999p666124r028234k624537J713663
36528b467922o63134l961314j741517L909621N840693J622324l389683k960045
36520c810977K019783M602183J043723l954042l843512M28090K325270p1540j689022
36511b950044P26402L516729K744240O02792J119581L718889N512312O232899
36503B1223800O108341K608685m778648r742924o287966J171338K653842k950760
$$ plain form
36495 10005708 3357037 -294256 -360440 -2092284 -6701873 -9085854 -6449279 -2726540
36487 -2726540 -1820365 -1695864 1310474 6318786 9915677 11402625 12081295 11343145 7393281
36478 7393281 714334 -6524433 -13337633 -18893141 -20100728 -14661854 -6141340 -1330436
36470 -1330436 -1848552 -2699526 -246585 3203400 5028528 7452202 12716978 16790160
36462 16790160 13653171 4543472 -2468913 -2203243 2904884 8160370 11892391 13892589
36454 13892589 13151141 10156942 8361553 10125232 13181748 13908476 12189363 9908614
36446 9908614 6323434 -864237 -9872130 -14312442 -10051694 -326546 7643313 9649119
36438 9649119 6654448 1484516 -4088191 -8712796 -10176065 -6928123 -895178 3040967
$$ packed form
36495A0005708o648671l651293o6184j731844m609589k383981K636575L722739
36487b726540R06175J24501L006338N008312L596891J486948O78670p38150l949864
36478G393281o678947p238767o813200n555508j207587N438874Q520514M810904
36470a330436n18116q50974K452941L449985J825128K423674N264776M073182
36462A6790160l136989r109699p012385K65670N108127N255486L732021K000198
36454A3892589p41448k994199j795389J763679L056516P26728j719113k280749
36446I908614l585180p187671r007893m440312M260748R725148P969859K005806
36438I649119k994671n169932n572707m624605j463269L247942O032945L936145
$$ plain form
36430 3040967 1686732 -3035026 -6452473 -6155336 -3048931 1598485 7160763 11501301
36422 11501301 11410409 7158868 3868377 5707704 10710441 14110150 14975315 16125389
36414 16125389 18651267 20325693 19213315 15393939 9145705 985689 -6289458 -9598388
36406 -9598388 -10503671 -13949923 -20301003 -22945823 -17037430 -7050145 -1298026 -1191076
36398 -1191076 -894188 3004056 6533669 4344889 -3074044 -10390499 -13416506 -11993926
36390 -11993926 -8343744 -4816630 -2963335 -2924089 -3047123 -1028381 3652727 8541474
36382 8541474 10218573 7875748 4317437 2863933 4018635 6200228 8623936 11048617
36374 11048617 11077559 5437145 -4321706 -10655279 -7892263 497675 5989075 5268582
$$ packed form
36430C040967j354235m721758l417447K97137L106405M647416N562278M340538
36422A1501301r0892m251541l290491J839327N002737L399709Q65165J150074
36414A6125389K525878J674426j112378l819376o248234q160016p275147l308930
36406i598388r05283l446252o351080k644820N908393R987285N752119J06950
36398a191076K96888L898244L529613k188780p418933p316455l026007J422580
36390a1993926L650182L527114J853295L9246j23034K018742M681108M888747
36382H541474J677099k342825l558311j453504J154702K181593K423708K424681
36374A1048617K8942n640414r758851o333573K763016Q389938N491400p20493
$$ plain form
36366 5268582 2607245 2442133 4113197 5109315 5405380 6193746 7385867 8968358 12140913
36357 12140913 16087402 16111880 9074596 -632346 -5041414 -2608042 10979 -2624520
36349 -2624520 -7364268 -6987091 350083 8983534 12116113 8347366 2309274 -36520
36341 -36520 2731638 5831361 3646416 -3011802 -7313487 -5116896 -384585 409120 -3396487
36332 -3396487 -7279740 -8309866 -6949564 -3520453 1689340 4669354 879 -10790104
$$ packed form
36366E268582k661337j65112J671064R96118K96065P88366J192121J582491L172555
36357A2140913L946489K4478p037284r706942m409068K433372K619021k635499
36349b624520m739748L77177P337174Q633451L132579l768747o038092k345794
36341c6520K768158L099723k184945o658218m301685K196591M732311P93705l805607
36332c396487l883253j030126J360302L429111N209793K980014m668475j0790983
$$ [...]
##END NTUPLES=NMR SPECTRUM
##END=
