##TITLE=31Pdec_DE-29HK_HCl
 CDCl3
  24 sc
 12.1.2024
##JCAMPDX= 6.0         $$ Bruker NMR JCAMP-DX V2.0
##DATA TYPE= NMR SPECTRUM
##DATA CLASS= NTUPLES
##ORIGIN= UXNMR, Bruker Analytische Messtechnik GmbH
##OWNER= root
$$ XWIN-NMR		Version 3.5
$$ Fri Jan 12 14:33:58 2024 Russian Standard Time (UT+4h)  she@DPX200
##.OBSERVE FREQUENCY= 81.013821
##.OBSERVE NUCLEUS= ^31P
##.ACQUISITION MODE= SIMULTANEOUS
##.ACQUISITION SCHEME= undefined
##.AVERAGES= 24
##.DIGITISER RES= 16
##SPECTROMETER/DATA SYSTEM= spect
##.PULSE SEQUENCE= zgpg30
##.SOLVENT NAME= CDCl3
##.SHIFT REFERENCE= (INTERNAL, CDCl3, 0, 248.564)
##AUDIT TRAIL= $$ (NUMBER, WHEN, WHO, WHERE, WHAT)
$$ ##TITLE= Audit trail, XWIN-NMR		Version 3.5
$$ ##JCAMPDX= 5.01
$$ ##ORIGIN= Bruker BioSpin GmbH
$$ ##OWNER= she
$$ F:/spectra/data/she/nmr/P31/1/pdata/1/auditp.txt
$$ ##AUDIT TRAIL=  $$ (NUMBER, WHEN, WHO, WHERE, WHAT)
(   1,<2024-01-12 14:32:53.46 +0400>,<she>,<DPX200>,
      <created by zg, POWCHK disabled, PULCHK disabled
       configuration hash MD5:
       00 E9 B6 7A A2 85 ED C7 34 08 36 98 17 FE 4E 26
       data hash MD5: 32K
       F0 85 35 E3 92 E5 57 A5 51 DC 6F C9 87 35 EA 7C>)
(   2,<2024-01-12 14:33:07.93 +0400>,<she>,<DPX200>,
      <Start of raw data processing
       efp BC_mod = 2 LB = 10 FT_mod = 6 PKNL = 1 PHC0 = -12294.53 PHC1 = 391.0886 SI = 64K 
       data hash MD5: 64K
       58 A9 55 44 E0 21 B3 D3 5B 27 6C 99 00 2E 83 34>)
(   3,<2024-01-12 14:33:23.06 +0400>,<she>,<DPX200>,
      <pk PHC0 = 5.019136 PHC1 = 0 
       data hash MD5: 64K
       D5 F3 F9 25 F8 91 F7 87 9C F0 1D 73 B7 2E 73 29>)
(   4,<2024-01-12 14:33:26.15 +0400>,<she>,<DPX200>,
      <abs ABSG = 5 
       data hash MD5: 64K
       60 29 9C 48 7A E9 CC E7 BA 6D 8F 44 59 56 54 D5>)
$$ ##END=
$$ 
$$ hash MD5
$$ 51 1A 86 19 2A B4 7C 37 12 05 23 DD 34 96 E3 6B
##$RELAX= 
##$RELAX= 
##$RELAX= 
##$RELAX= 
##$RELAX= 
##$RELAX= 
##$RELAX= 
##$RELAX= 
##$RELAX= 
$$ Bruker specific parameters
$$ --------------------------
##$DU= <F:/spectra>
##$EXPNO= 1
##$NAME= <P31>
##$PROCNO= 1
##$TYPE= <nmr>
##$USER= <she>
##$AMP= (0..31)
100 100 100 100 100 100 100 100 100 100 100 100 100 100 100 100 100 100 
100 100 100 100 100 100 100 100 100 100 100 100 100 100 
##$AQSEQ= 0
##$AQ_mod= 1
##$AUNM= <au_zg>
##$AUTOPOS= <>
##$BF1= 81.014009
##$BF2= 200.13
##$BF3= 200.13
##$BF4= 200.13
##$BF5= 200.13
##$BF6= 200.13
##$BF7= 200.13
##$BF8= 200.13
##$BYTORDA= 1
##$CFDGTYP= 0
##$CFRGTYP= 5
##$CHEMSTR= <none>
##$CNST= (0..31)
1 1 145 1 1 1 1 1 1 1 1 1 1 1 1 1 1 1 1 1 1 1 1 1 1 1 1 1 1 1 1 1 
##$CPDPRG= <waltz16>
##$CPDPRG1= <>
##$CPDPRG2= <waltz16>
##$CPDPRG3= <>
##$CPDPRG4= <mlev>
##$CPDPRG5= <mlev>
##$CPDPRG6= <mlev>
##$CPDPRG7= <mlev>
##$CPDPRG8= <mlev>
##$CPDPRGB= <>
##$CPDPRGT= <>
##$D= (0..31)
0 1 0 0 0 0 0 0 0 0 0 0.03 2e-05 3e-06 0 0 0 0 0 0 0 0 0 0 0 0 0 0 0 0 
0 0 
##$DATE= 1705055572
##$DBL= (0..7)
120 120 120 11 120 120 24 19 
##$DBP= (0..7)
150 150 150 150 150 150 150 150 
##$DBP07= 0
##$DBPNAM0= <>
##$DBPNAM1= <>
$$ [...]
##$SUBNAM3= <"">
##$SUBNAM4= <"">
##$SUBNAM5= <"">
##$SUBNAM6= <"">
##$SUBNAM7= <"">
##$SUBNAM8= <"">
##$SUBNAM9= <"">
##$SW= 501.771253377433
##$SWIBOX= (0..15)
0 1 3 0 0 0 0 0 0 0 0 0 0 0 0 0 
##$SW_h= 40650.406504065
##$TD= 32768
##$TD0= 1
##$TE= 0
##$TE2= 300
##$TE3= 300
##$TEG= 300
##$TL= (0..7)
0 120 53 12 22 120 120 120 
##$TP= (0..7)
150 150 150 150 150 150 150 150 
##$TP07= 0
##$TPNAME0= <>
##$TPNAME1= <>
##$TPNAME2= <>
##$TPNAME3= <>
##$TPNAME4= <>
##$TPNAME5= <>
##$TPNAME6= <>
##$TPNAME7= <>
##$TPOAL= (0..7)
0.5 0.5 0.5 0.5 0.5 0.5 0.5 0.5 
##$TPOFFS= (0..7)
0 0 0 0 0 0 0 0 
##$TUNHIN= 0
##$TUNHOUT= 0
##$TUNXOUT= 0
##$USERA1= <user>
##$USERA2= <user>
##$USERA3= <user>
##$USERA4= <user>
##$USERA5= <user>
##$V9= 5
##$VALIST= <valist>
##$VCLIST= <CCCCCCCCCCCCCCC>
##$VD= 0
##$VDLIST= <DDDDDDDDDDDDDDD>
##$VPLIST= <PPPPPPPPPPPPPPP>
##$VTLIST= <TTTTTTTTTTTTTTT>
##$WBST= 1024
##$WBSW= 4
##$XGAIN= (0..3)
0 0 0 0 
##$XL= 0
##$YL= 0
##$YMAX_a= 1613
##$YMIN_a= -2235
##$ZGOPTNS= <>
##$ZL1= 120
##$ZL2= 120
##$ZL3= 120
##$ZL4= 120
##$ABSF1= 248.5645
##$ABSF2= -253.2056
##$ABSG= 5
##$ABSL= 3
##$ALPHA= 0
##$AQORDER= 0
##$ASSFAC= 0
##$ASSFACI= 0
##$ASSFACX= 0
##$ASSWID= 0
##$AUNMP= <proc_1d>
##$AZFE= 0.1
##$AZFW= 0.5
##$BCFW= 0
##$BC_mod= 2
##$BYTORDP= 0
##$COROFFS= 0
##$CY= -3
##$DATMOD= 1
##$DC= 0
##$DFILT= <>
##$DTYPP= 0
##$F1P= 0
##$F2P= 0
##$FCOR= 1
##$FTSIZE= 65536
##$FT_mod= 6
##$GAMMA= 0
##$GB= 0
##$INTBC= 1
##$INTSCL= 6.047779e-11
##$ISEN= 30
##$LB= 10
##$LEV0= 0
##$LPBIN= 0
##$MAXI= 10000
##$MC2= 0
##$MEAN= 0
##$ME_mod= 0
##$MI= 50
##$NCOEF= 0
##$NC_proc= -10
##$NLEV= 6
##$NOISF1= 182.463
##$NOISF2= 159.3651
##$NSP= 0
##$NTH_PI= 0
##$NZP= 0
##$OFFSET= 248.5645
##$PC= 4
##$PHC0= -12289.51
##$PHC1= 391.0886
##$PH_mod= 1
##$PKNL= yes
##$PPARMOD= 0
##$PSCAL= 0
##$PSIGN= 0
##$REVERSE= no
##$SF= 81.0140089999694
##$SI= 65536
##$SIGF1= 159.3651
##$SIGF2= -187.1042
##$SINO= 113.3802
##$SIOLD= 16384
##$SREGLST= <1H.CDCl3>
##$SSB= 0
##$STSI= 65536
##$STSR= 0
##$SW_p= 40650.406504065
##$SYMM= 0
##$S_DEV= 0
##$TDeff= 32768
##$TDoff= 0
##$TI= <>
##$TILT= no
##$TM1= 0
##$TM2= 0
##$TOPLEV= 0
##$USERP1= <user>
##$USERP2= <user>
##$USERP3= <user>
##$USERP4= <user>
##$USERP5= <user>
##$WDW= 1
##$XDIM= 65536
##$YMAX_p= 287209280
##$YMIN_p= -213623232
$$ End of Bruker specific parameters
$$ ---------------------------------
##NTUPLES= NMR SPECTRUM
##VAR_NAME=  FREQUENCY,     SPECTRUM/REAL,   SPECTRUM/IMAG
##SYMBOL=    X,             R,               I
##VAR_TYPE=  INDEPENDENT,   DEPENDENT,       DEPENDENT
##VAR_FORM=  AFFN,          ASDF,            ASDF
##VAR_DIM=   65536,         65536,           65536
##UNITS=     HZ,            ARBITRARY UNITS, ARBITRARY UNITS
##FACTOR=    0.620285442955139, 1,           1
##FIRST=     20137.2065510682, 0,            0
##LAST=      -20513.1999529968, 0,           0
##MIN=       -20513.1999529968, -213623232,  0
##MAX=       20137.2065510682, 287209280,    0
$$ Real data points
##PAGE= N=1
##DATA TABLE= (X++(R..R)), XYDATA
$$ [...]
43525 -4491279 -3437642 -2484140 -1693481 -1102817 -731050 -586235 -668282 -966224 -1453252
43516 -1453252 -2085178 -2807033 -3567069 -4330667 -5084715 -5828619 -6557646 -7250174 -7867830
43507 -7867830 -8367959 -8719471 -8912617 -8960067 -8892856 -8754324 -8591233 -8440590 -8315079 -8193946
43497 -8193946 -8025306 -7740755 -7277606 -6600526 -5714292 -4663755 -3523297 -2381423 -1324765
43488 -1324765 -422955 283982 791921 1128904 1341813 1478911 1575621 1648940 1701434 1731037
43478 1731037 1740220 1738845 1739360 1748159 1759770 1758616 1727921 1660480 1565071 1465722 1395815 1391255 1485259
43465 1485259 1703929 2060521 2548929 3140591 3788959 4441013 5050083 5583905 6025825
43456 6025825 6371127 6621629 6781341 6855669 6855790 6806498 6751928 6752400 6869835 7146426 7586692
43445 7586692 8151950 8768910 9346298 9791118 10020273 9968209 9592988 8882020 7857304
43436 7857304 6578813 5142856 3671637 2293369 1118242 219192 -375489 -676876 -722103
43427 -722103 -559636 -237938 201149 725540 1313643 1952156 2630003 3330060 4023287 4669366
43417 4669366 5223610 5645813 5906599 5989696 5891086 5616718 5180799 4606661 3930069 3201115
43407 3201115 2479621 1823254 1273483 846301 530998 296222 100648 -95028 -318510
43398 -318510 -581464 -879808 -1196420 -1505509 -1779947 -2001364 -2168754 -2299821 -2422274 -2557880
43388 -2557880 -2706411 -2837965 -2898989 -2830451 -2589998 -2168799 -1598347 -947645 -312518 202321
43378 202321 507197 552376 345304 -48337 -522618 -962709 -1277358 -1420388 -1395985 -1250693
43368 -1250693 -1058806 -906059 -873602 -1023697 -1389994 -1974870 -2753391 -3680565 -4698503
43359 -4698503 -5742155 -6743743 -7636212 -8356647 -8851736 -9086217 -9050932 -8763886 -8260710
43350 -8260710 -7578867 -6745622 -5777382 -4689691 -3509739 -2282074 -1063144 92376 1145608
43341 1145608 2080076 2897893 3608559 4216888 4715603 5084245 5292943 5309606 5110677 4694626
43331 4694626 4093399 3374680 2632083 1968269 1479523 1245854 1323909 1738734 2475405 3476086
43321 3476086 4646693 5872004 7034199 8030137 8784964 9260560 9457053 9406376 9159827
43312 9159827 8774794 8305986 7803190 7312747 6877608 6532929 6299447 6180036 6162289 6224374
43302 6224374 6339532 6478448 6612570 6719391 6785980 6806950 6778759 6696223 6554379 6353335
43292 6353335 6101782 5817544 5526503 5261419 5060138 4960773 4992210 5162536 5452033 5816369
43282 5816369 6198979 6545791 6816130 6988332 7060995 7049718 6978980 6871675 6741550 6592612
43272 6592612 6425038 6242975 6058282 5886716 5738302 5608092 5473938 5303397 5066162
43263 5066162 4745149 4340735 3867383 3346773 2802630 2258964 1739359 1264948 851707
43254 851707 509041 240542 46730 -70139 -100704 -27191 169463 496327 938320 1459857
43244 1459857 2018609 2583080 3143407 3708993 4294096 4899435 5499963 6044915 6469422
43235 6469422 6712593 6735819 6534980 6141025 5607617 4991154 4332468 3647996 2933610 2179672
43225 2179672 1390713 598501 -141399 -768953 -1241979 -1546866 -1694412 -1710141 -1629740 -1500102
43215 -1500102 -1377023 -1312378 -1334707 -1436294 -1577585 -1707767 -1789150 -1811746 -1792686 -1764236
43205 -1764236 -1758070 -1792318 -1865498 -1959027 -2046568 -2104871 -2120003 -2086700 -2003863 -1871589 -1692548
43194 -1692548 -1475749 -1238052 -1000141 -777688 -571836 -363853 -117312 211475 657222
43185 657222 1229128 1900793 2610971 3274411 3798195 4098879 4117503 3829705 3247002 2407461
43175 2407461 1360333 154497 -1162290 -2535918 -3900436 -5182763 -6316439 -7255533
43167 -7255533 -7980362 -8493860 -8814038 -8968472 -8991834 -8923195 -8800598 -8655043 -8508547 -8377843
43157 -8377843 -8279126 -8226721 -8223258 -8247454 -8249812 -8162062 -7916222 -7462672 -6779211 -5870909 -4766050
43146 -4766050 -3512399 -2173873 -825482 454530 1594345 2537879 3251887 3729936 3992970
43137 3992970 4085689 4067516 3998354 3922877 3859312 3796496 3698330 3512239 3179060 2643375 1863261
43126 1863261 817866 -488228 -2023900 -3733793 -5544990 -7378453 -9162935 -10846225
43118 -10846225 -12398278 -13804959 -15057192 -16143153 -17047184 -17752167 -18239764 -18488222 -18473383
43109 -18473383 -18177681 -17604330 -16787906 -15794008 -14707248 -13612614 -12577156 -11638198 -10802003
43100 -10802003 -10053344 -9372337 -8751736 -8207226 -7775580 -7500772 -7414925 -7525487 -7817224
43091 -7817224 -8267299 -8861381 -9597863 -10477024 -11483516 -12573941 -13676623 -14703722 -15570975
43082 -15570975 -16217178 -16614788 -16767671 -16700253 -16446697 -16044492 -15529842 -14931378 -14264251
43073 -14264251 -13529924 -12723054 -11840922 -10890046 -9888831 -8868454 -7873184 -6958693 -6186226
43064 -6186226 -5612776 -5280135 -5206667 -5384276 -5780939 -6347619 -7027763 -7767294 -8523155 -9269490
43054 -9269490 -10000982 -10731576 -11485785 -12282692 -13118924 -13960107 -14745548 -15402330 -15860755
43045 -15860755 -16065960 -15985353 -15613224 -14973041 -14117318 -13124197 -12088389 -11104290 -10243782
43036 -10243782 -9537842 -8972135 -8499362 -8060843 -7605606 -7099406 -6524196 -5873696 -5151079
43027 -5151079 -4371049 -3564189 -2778336 -2072317 -1501366 -1098690 -860325 -739321 -651912 -495165
43017 -495165 -172722 378300 1169012 2156956 3260926 4383841 5432959 6332409 7029576
43008 7029576 7497909 7735445 7756855 7580201 7213826 6649861 5868181 4850657 3601315
42999 3601315 2164302 630287 -874230 -2211963 -3264061 -3951823 -4245013 -4158503 -3742623
42990 -3742623 -3070861 -2226147 -1287854 -323952 608590 1457400 2168858 2688211 2966457
42981 2966457 2971033 2695982 2167361 1441028 593153 -293191 -1141243 -1890837 -2503854 -2963551
42971 -2963551 -3268757 -3427378 -3454115 -3373028 -3220030 -3038916 -2868672 -2726682 -2597571 -2436836
42961 -2436836 -2190748 -1823541 -1337294 -774305 -202698 304843 687683 903511 927170 749972
42951 749972 384763 -126876 -715585 -1300180 -1813359 -2222297 -2531970 -2771743 -2976531 -3173575
42941 -3173575 -3377297 -3588101 -3792193 -3964194 -4074905 -4102085 -4038407 -3892702 -3685406 -3441951
42931 -3441951 -3186969 -2939974 -2711529 -2498847 -2281861 -2024317 -1685037 -1238773 -697085
42922 -697085 -116218 414692 800224 967763 887582 578587 100498 -463423 -1027861 -1524930
42912 -1524930 -1915099 -2185910 -2340957 -2386947 -2325812 -2153304 -1861564 -1443892 -901884 -253833
42902 -253833 459661 1176981 1824525 2331076 2643720 2740839 2637496 2380091 2031101 1648705
42892 1648705 1268736 896973 517237 113692 -303485 -684493 -948405 -1011429 -820991 -378495
42882 -378495 259892 1003122 1753887 2431431 2979977 3364482 3562277 3558945 3350439 2946248
42872 2946248 2366373 1630621 747474 -287192 -1478009 -2811551 -4242562 -5692017 -7057112
42863 -7057112 -8229708 -9119158 -9674273 -9897174 -9842210 -9598284 -9260882 -8905666 -8574461
42854 -8574461 -8277374 -8007043 -7757217 -7537900 -7380207 -7326417 -7408043 -7624417 -7936693 -8281768
42844 -8281768 -8595812 -8832436 -8968905 -9003934 -8952279 -8837389 -8682521 -8504158 -8312271 -8116746
42834 -8116746 -7933356 -7782995 -7684140 -7644545 -7658746 -7713172 -7794710 -7896527 -8018296 -8163413
42824 -8163413 -8337109 -8545839 -8794959 -9083541 -9399725 -9720724 -10017535 -10261268 -10429310
42815 -10429310 -10511648 -10515804 -10465894 -10393606 -10325533 -10274577 -10238504 -10202113 -10138633 -10010742 -9775205
42804 -9775205 -9393194 -8843474 -8132178 -7293569 -6380760 -5451293 -4555632 -3733458 -3015651
42795 -3015651 -2426016 -1979530 -1679562 -1518314 -1481739 -1556463 -1735266 -2018492 -2409756 -2905979
42785 -2905979 -3485482 -4101154 -4684778 -5162421 -5473997 -5588074 -5506801 -5261364 -4901598 -4484037
42775 -4484037 -4062067 -3680594 -3375364 -3174972 -3103129 -3179564 -3418134 -3820461 -4365492 -5000123
42765 -5000123 -5639151 -6179449 -6524515 -6608687 -6411077 -5956512 -5307304 -4550314 -3779989 -3076680
42755 -3076680 -2484472 -1999536 -1579021 -1168861 -735102 -280341 162430 551342 858150
42746 858150 1080603 1241263 1375570 1515459 1676286 1853018 2025954 2170340 2263537 2288264
42736 2288264 2235009 2105516 1914699 1686883 1446362 1206994 966508 708294 410040 55904
42726 55904 -353317 -797518 -1243693 -1657245 -2011824 -2294199 -2504975 -2657583 -2777309 -2901329
42716 -2901329 -3079345 -3371737 -3840876 -4535234 -5472874 -6633308 -7961054 -9376379 -10787204
42707 -10787204 -12100392 -13233541 -14125754 -14743166 -15077424 -15140671 -14961439 -14581459 -14049956
42698 -14049956 -13414626 -12713442 -11972165 -11207960 -10435084 -9667942 -8919116 -8192744 -7476588
42689 -7476588 -6739071 -5937371 -5036184 -4027019 -2934163 -1801767 -671442 432558 1500679
42680 1500679 2522965 3475090 4315263 4992163 5458094 5681145 5652080 5384273 4908505
42671 4908505 4266870 3508721 2687909 1859135 1073075 370991 -221668 -703068 -1100088
42662 -1100088 -1463751 -1852651 -2312130 -2861279 -3493623 -4187011 -4913691 -5644791 -6349225
42653 -6349225 -6991055 -7530900 -7935367 -8192653 -8324826 -8385361 -8438549 -8530621 -8669470 -8824335
42643 -8824335 -8943577 -8978600 -8901296 -8709369 -8421848 -8070996 -7695770 -7337896 -7037737 -6826655
42633 -6826655 -6716122 -6689043 -6700509 -6690924 -6606460 -6416554 -6120016 -5738355 -5301787 -4835766
42623 -4835766 -4354227 -3861656 -3361500 -2864799 -2393226 -1975310 -1639702 -1410111 -1303065
42614 -1303065 -1326908 -1481407 -1759319 -2149827 -2640307 -3212488 -3834102 -4453152 -5002213 -5413557
42604 -5413557 -5637943 -5657441 -5487229 -5167912 -4753127 -4296378 -3839817 -3408087 -3009831 -2645977
42594 -2645977 -2319532 -2040975 -1827193 -1696202 -1661457 -1728513 -1895213 -2154756 -2499254 -2920989
42584 -2920989 -3410560 -3953574 -4528022 -5103035 -5638890 -6089079 -6406232 -6552246 -6509764 -6289580
42574 -6289580 -5929511 -5484532 -5012972 -4565229 -4178777 -3878620 -3679716 -3588635 -3603618 -3713498
42564 -3713498 -3896486 -4120331 -4345515 -4532169 -4649500 -4684595 -4646598 -4563141 -4468858 -4389509
42554 -4389509 -4327584 -4255305 -4118904 -3854500 -3410707 -2768552 -1949314 -1007167 -11870 969394
42544 969394 1884129 2698419 3394049 3962054 4396477 4691463 4842576 4850771 4726208 4489129
42534 4489129 4166505 3785376 3366346 2920952 2454411 1971695 1482824 1004351 557407
42525 557407 165787 -143123 -336185 -376236 -230666 116653 656944 1355291 2155159 2985796
42515 2985796 3771482 4441616 4938914 5223165 5271207 5075900 4645289 4000366 3169983 2184497
42505 2184497 1072008 -139691 -1415816 -2706514 -3944488 -5052732 -5960808 -6622416
42497 -6622416 -7025762 -7192132 -7164490 -6992259 -6718731 -6374400 -5976106 -5530335 -5038569 -4501938
42487 -4501938 -3922474 -3301141 -2636730 -1929730 -1189715 -439394 289760 967944 1575781
42478 1575781 2105935 2558314 2933713 3230073 3442854 3568507 3608246 3568911 3459644 3286943
42468 3286943 3052932 2759403 2414686 2036798 1648052 1262263 871480 440815 -83576
42459 -83576 -755343 -1606001 -2630351 -3785125 -4999687 -6193112 -7291625 -8242137 -9018468
42450 -9018468 -9617706 -10047199 -10308013 -10384090 -10244264 -9856902 -9209257 -8321000 -7245261
42441 -7245261 -6057689 -4839971 -3665976 -2595768 -1676913 -947204 -432145 -135688 -30109
42432 -30109 -54368 -126599 -168024 -128280 -734 178411 344539 423473 346441 59040 -472415
42421 -472415 -1254378 -2261094 -3435566 -4698158 -5959339 -7130745 -8132267 -8898966 -9393362
42412 -9393362 -9622121 -9646664 -9575561 -9537125 -9644438 -9968800 -10528832 -11291810 -12181881 -13094322
42402 -13094322 -13916584 -14551838 -14936518 -15046580 -14894807 -14524532 -14001058 -13398310 -12781297
42393 -12781297 -12191550 -11643534 -11132797 -10648678 -10183529 -9735589 -9307441 -8903151 -8526082
42384 -8526082 -8178057 -7859173 -7567055 -7296064 -7039456 -6796345 -6579690 -6417085 -6338995 -6358398
42374 -6358398 -6453582 -6565600 -6613777 -6522290 -6244853 -5776243 -5147812 -4413234 -3634249 -2872026
42364 -2872026 -2182775 -1613035 -1192913 -930558 -812849 -813400 -903137 -1056302 -1248974 -1454175
42354 -1454175 -1640619 -1778082 -1845884 -1838808 -1768043 -1657827 -1538509 -1436269 -1362315 -1307246
42344 -1307246 -1244471 -1140668 -967211 -707772 -360494 64819 552880 1088916 1660439 2254408
42334 2254408 2854024 3439836 3995092 4510848 4986658 5426712 5834670 6210643 6551925
42325 6551925 6856929 7130615 7389236 7661557 7983615 8386340 8880507 9447592 10043321
42316 10043321 10613152 11111725 11516948 11833488 12085616 12302565 12501622 12675658 12791798
42307 12791798 12803877 12673836 12390645 11975750 11472552 10928170 10379749 9851851 9361783
42298 9361783 8924739 8553160 8250727 8005656 7788184 7554863 7259005 6863598 6351505
42289 6351505 5729142 5023910 4279658 3554496 2920475 2458978 2245552 2325820 2694161 3289724
42279 3289724 4015628 4772706 5490128 6138313 6721329 7256985 7756577 8213023 8600275
42270 8600275 8881744 9022617 9000784 8813361 8478721 8035023 7535648 7041404 6610585 6289734
42260 6289734 6108338 6078786 6199982 6460875 6840330 7302765 7793257 8238634 8559305 8690221
42250 8690221 8602130 8311873 7875599 7368302 6860186 6400221 6011126 5693125 5430825 5199172
42240 5199172 4968021 4706930 4390659 4003403 3539911 3004720 2412887 1793246 1190442
42231 1190442 660542 259079 25726 -27600 79644 302135 580112 851884 1064063 1178940
42221 1178940 1179062 1067411 861802 585386 258787 -101762 -480353 -855504 -1197595 -1472887
42211 -1472887 -1653071 -1724086 -1687188 -1551871 -1328926 -1032314 -688848 -345090 -61678 104755
42201 104755 123046 1617 -211525 -443588 -620670 -689530 -627429 -437262 -133712 270786
42191 270786 774317 1386104 2119812 2981498 3957368 5008202 6074145 7086629 7980168
42182 7980168 8699855 9206367 9481463 9532373 9390320 9102271 8721861 8305937 7915464 7612603
42172 7612603 7448490 7446681 7594114 7847198 8149130 8446986 8699523 8875553 8948977 8895780
42162 8895780 8694082 8326570 7785885 7082887 6253343 5356014 4460087 3629133 2911827
42153 2911827 2342182 1942315 1720440 1665786 1749139 1933496 2188547 2497533 2851252 3235083
42143 3235083 3620042 3964621 4225961 4373981 4401979 4329489 4195853 4046375 3916316 3819352
42133 3819352 3744987 3665716 3551077 3382922 3164703 2919880 2680719 2474617 2314818 2197046
42123 2197046 2099413 1984012 1801822 1502482 1047009 418735 -371249 -1284817 -2262084 -3229509
42113 -3229509 -4110065 -4835065 -5356049 -5653475 -5738853 -5649564 -5439078 -5166926 -4891096 -4662762
42103 -4662762 -4522041 -4494424 -4588599 -4795903 -5090710 -5431286 -5762269 -6020429 -6143911 -6083197
42093 -6083197 -5811733 -5334630 -4693120 -3961354 -3233532 -2604029 -2147623 -1907559 -1895428 -2101048
42083 -2101048 -2505466 -3088587 -3826701 -4682697 -5597687 -6492090 -7277938 -7877006 -8236420
42074 -8236420 -8335054 -8179282 -7792513 -7205957 -6455863 -5586247 -4651551 -3714453 -2838646 -2079888
42064 -2079888 -1478253 -1052712 -798965 -691961 -693280 -760892 -858014 -960048 -1059757 -1168326
42054 -1168326 -1307857 -1494748 -1721678 -1949587 -2115405 -2151726 -2009243 -1673282 -1168946 -553666
42044 -553666 98939 716254 1238790 1626547 1862406 1954101 1932998 1847414 1750737 1687586
42034 1687586 1682959 1739089 1841987 1974904 2131548 2321712 2566580 2887128 3292260 3771854
42024 3771854 4296199 4821238 5298910 5691233 5983750 6191778 6355319 6524745 6744183
42015 6744183 7039431 7413949 7852858 8332418 8830539 9333460 9835440 10331705 10808607
42006 10808607 11237437 11577497 11788473 11845208 11745830 11509970 11171382 10770678 10349254 9942745
41996 9942745 9575369 9259647 9002231 8809552 8686290 8627465 8612022 8603755 8558017 8429523
41986 8429523 8179828 7785294 7243146 6570409 5794380 4941028 4029735 3076866 2103418
41977 2103418 1140344 228079 -589801 -1276318 -1809676 -2186563 -2419707 -2533195 -2558594 -2531081
41967 -2531081 -2483697 -2441311 -2418794 -2424420 -2463343 -2535157 -2626747 -2708628 -2741067 -2687003 -2522666
41956 -2522666 -2240793 -1849927 -1376157 -867489 -394168 -38977 120715 31124 -326701 -934046
41946 -934046 -1737933 -2659435 -3607995 -4501534 -5286599 -5948184 -6501725 -6970454 -7361785 -7657633
41936 -7657633 -7823694 -7829735 -7666881 -7352175 -6921038 -6416055 -5880239 -5355992 -4884362 -4499706
41926 -4499706 -4221335 -4048866 -3965661 -3947929 -3973091 -4022733 -4080070 -4124872 -4129955 -4062840 -3893048
41915 -3893048 -3600947 -3182239 -2646014 -2009720 -1295613 -529922 256467 1026234 1732930
41906 1732930 2320311 2728667 2909700 2844791 2557898 2116646 1620668 1180547 893015 818598
41896 818598 967475 1297947 1729370 2166903 2529729 2771320 2883660 2885975 2806234 2665780
41886 2665780 2474007 2234140 1955454 1663831 1403491 1228222 1186640 1308501 1597207 2030017
41876 2030017 2564723 3149528 3731245 4257794 4675413 4926695 4956229 4724314 4221037 3471356
41866 3471356 2528475 1461166 342992 -753087 -1757267 -2607227 -3256251 -3682087 -3890507
41857 -3890507 -3909680 -3778112 -3533612 -3208851 -2832452 -2430911 -2029014 -1650564 -1321289 -1071773
41847 -1071773 -935575 -940143 -1094197 -1379526 -1753181 -2158860 -2540287 -2850054 -3053921 -3135355
41837 -3135355 -3103012 -2997044 -2886240 -2851826 -2962651 -3253432 -3716499 -4309123 -4969748 -5634067
41827 -5634067 -6246201 -6765903 -7174445 -7479235 -7713386 -7926220 -8165913 -8462803 -8823471
41818 -8823471 -9238156 -9693893 -10183306 -10705129 -11258942 -11837200 -12416611 -12952902 -13384885
41809 -13384885 -13649355 -13700075 -13520614 -13125366 -12550806 -11843103 -11047589 -10202488 -9336409
41800 -9336409 -8468281 -7609466 -6768446 -5956622 -5191441 -4494304 -3884772 -3374306 -2960607
41791 -2960607 -2622138 -2315405 -1980992 -1561252 -1023100 -372874 345770 1068209 1728126
41782 1728126 2269923 2653003 2853000 2864180 2702417 2405583 2029847 1643410 1319622 1129278
41772 1129278 1130093 1353449 1793265 2404178 3111730 3829399 4474186 4976893 5289032 5388615
41762 5388615 5283177 5006969 4612385 4159078 3704049 3293678 2957284 2702410 2513305
41753 2513305 2354304 2178135 1936869 1592684 1127265 549370 -102028 -763148 -1359934
41744 -1359934 -1826286 -2118426 -2221526 -2149153 -1937533 -1636542 -1299793 -975854 -700943 -492742
41734 -492742 -346397 -234531 -111560 78702 391962 868486 1517955 2312244 3192177 4085811
41724 4085811 4928914 5678981 6320519 6864670 7346381 7818500 8339382 8953592 9672492
41715 9672492 10465472 11267378 11997599 12580776 12962068 13115540 13046174 12785211 12379468 11878604
41705 11878604 11325522 10752131 10178554 9613380 9055535 8500197 7948331 7414270 6924836
41696 6924836 6509295 6186990 5961298 5822710 5756600 5748861 5785784 5849087 5909582 5923293 5832936
41685 5832936 5576303 5101217 4384562 3450163 2377443 1292419 338303 -365597 -758600
41676 -758600 -850309 -705571 -413474 -56717 307064 648426 956197 1221602 1426213 1541180
41666 1541180 1537055 1395598 1115323 710045 205722 -361114 -946404 -1508190 -2021965 -2492835
41656 -2492835 -2954631 -3454586 -4032608 -4706864 -5470427 -6295324 -7138401 -7947219 -8667669
41647 -8667669 -9254480 -9683219 -9960018 -10123863 -10237180 -10365575 -10554870 -10816622 -11128076
41638 -11128076 -11443528 -11709165 -11875396 -11905100 -11778598 -11495830 -11074964 -10546187 -9940803
41629 -9940803 -9279213 -8564115 -7783242 -6919583 -5962368 -4913922 -3792565 -2633178 -1484239
41620 -1484239 -399329 574783 1407457 2086837 2617159 3014173 3300140 3498004 3625507
41611 3625507 3690760 3689819 3606002 3412369 3079808 2590311 1949990 1194739 385191 -406262
41601 -406262 -1110044 -1669542 -2044179 -2206857 -2140284 -1837044 -1305225 -576490 290109 1213884
41591 1213884 2107710 2897366 3538464 4025667 4390214 4684234 4956290 5228769 5487498
41582 5487498 5685999 5759119 5639518 5273420 4633488 3726406 2593843 1307161 -43924
41573 -43924 -1368799 -2596358 -3690028 -4648896 -5493706 -6245515 -6908538 -7465959 -7890278
41564 -7890278 -8161552 -8281987 -8277898 -8189601 -8058034 -7916793 -7790934 -7697193 -7640444 -7606660
41554 -7606660 -7558024 -7436170 -7175051 -6719109 -6039449 -5141786 -4063788 -2863892 -1607168
41545 -1607168 -354174 844059 1945985 2917354 3729275 4357608 4783818 4996704 4993684
41536 4993684 4780985 4373392 3794317 3075531 2255024 1372458 463140 -447666 -1347911
41527 -1347911 -2237541 -3123186 -4011925 -4907969 -5813487 -6731652 -7668969 -8634477 -9634489
41518 -9634489 -10663947 -11698959 -12696227 -13601165 -14360826 -14935417 -15304448 -15467258 -15439854
41509 -15439854 -15250502 -14935670 -14536347 -14093898 -13645400 -13219522 -12833608 -12491398 -12181628
41500 -12181628 -11880072 -11557710 -11193770 -10787551 -10362148 -9957600 -9616827 -9370552 -9226626
41491 -9226626 -9166852 -9152505 -9137165 -9081882 -8965513 -8785642 -8551330 -8273043 -7954970 -7592576
41481 -7592576 -7176099 -6697832 -6158102 -5565477 -4932228 -4271027 -3596965 -2932345 -2308150
41472 -2308150 -1758901 -1312890 -982608 -760011 -618865 -522862 -435199 -325562 -173028 35034
41462 35034 307888 658555 1108365 1683779 2405202 3273453 4260993 5311778 6349846
41453 6349846 7294335 8076542 8653077 9010337 9160182 9131427 8962517 8696982 8378782 8044625
41443 8044625 7715089 7390915 7058842 6703826 6319137 5908075 5478368 5035151 4577659
41434 4577659 4101128 3602505 3087089 2572766 2089056 1670444 1346825 1136235 1044472 1071871
41424 1071871 1222101 1505953 1936752 2520583 3248149 4093460 5019430 5986003 6955081
41415 6955081 7889157 8745468 9471573 10008244 10301187 10317256 10057146 9557347 8879019 8088567
41405 8088567 7239591 6364955 5480669 4595440 3717463 2854580 2010391 1181238 356554
41396 356554 -477666 -1333078 -2211759 -3099890 -3965752 -4763312 -5439086 -5939429 -6218014 -6244231
41386 -6244231 -6010666 -5535621 -4858941 -4034398 -3123720 -2194632 -1321030 -581342 -52197
41377 -52197 202406 142893 -237570 -910640 -1815772 -2867323 -3965202 -5008447 -5909638
41368 -5909638 -6606842 -7070154 -7301471 -7328194 -7193007 -6942003 -6612594 -6223456 -5770906 -5235773
41358 -5235773 -4599026 -3857686 -3032276 -2163701 -1303744 -504203 192738 762051 1201116
41349 1201116 1533123 1807811 2095707 2471956 2992343 3672341 4480542 5348784 6190867
41340 6190867 6919278 7455669 7738644 7734152 7448055 6932969 6280686 5599397 4985381 4502574
41330 4502574 4178045 4011723 3991620 4104553 4337416 4671981 5081216 5532429 5994763 6443687
41320 6443687 6858409 7215387 7484658 7632351 7626600 7441207 7054592 6447858 5609284 4548126
41310 4548126 3310853 1986718 694073 -448638 -1353239 -1979268 -2332063 -2444629 -2353272
41301 -2353272 -2079370 -1626669 -994869 -200149 711027 1663779 2571315 3357530 3975885
41292 3975885 4417764 4708282 4892103 5015937 5115099 5208142 5298590 5380128 5442562 5477495
41282 5477495 5482624 5462536 5424240 5368222 5279290 5123302 4854207 4430556 3834331 3082115
41272 3082115 2222083 1318442 431800 -395533 -1145043 -1819340 -2433896 -3005439 -3540007
41263 -3540007 -4025531 -4433220 -4727854 -4882493 -4891714 -4778897 -4594628 -4404974 -4271597 -4229907
41253 -4229907 -4274038 -4355845 -4399749 -4327992 -4085511 -3654238 -3053559 -2331135 -1549819 -773116
41243 -773116 -50218 595465 1168645 1693896 2202053 2718340 3255641 3812480 4374663 4920344
41233 4920344 5427499 5880881 6274817 6610146 6887280 7100457 7237401 7284192 7230978 7074993
41223 7074993 6821518 6485717 6095577 5692453 5325634 5041477 4871795 4827256 4899001 5067475
41213 5067475 5313493 5625246 5997095 6420958 6876089 7324898 7719502 8016904 8194596
41204 8194596 8257633 8233729 8160126 8069675 7981925 7900831 7817626 7716751 7583395 7411515 7210665
41193 7210665 7009307 6852388 6792246 6874072 7119781 7516280 8013703 8535678 8998305 9330907
41183 9330907 9491336 9471198 9290180 8982496 8581576 8109840 7577600 6990204 6358429 5706364
41173 5706364 5073214 4508676 4064050 3782594 3692458 3804046 4111352 4594843 5223561 5956059
41163 5956059 6742518 7531122 8278669 8960080 9569321 10109448 10579014 10966108 11254564
41154 11254564 11435773 11516076 11516037 11465217 11396366 11339365 11314700 11328742 11373059 11426981 11461617
41143 11461617 11445996 11356884 11189900 10965168 10722072 10504358 10342994 10245652 10197801 10173483
41133 10173483 10148067 10104757 10032737 9922024 9761759 9543550 9265399 8930799 8542501 8095861
41123 8095861 7577211 6968400 6254197 5428724 4499088 3485285 2415540 1318704 219147
41114 219147 -861164 -1895752 -2849940 -3685246 -4368036 -4875160 -5194311 -5322930 -5269448
41105 -5269448 -5056334 -4721812 -4317900 -3904321 -3539467 -3271288 -3131791 -3136910 -3289840 -3584347
41095 -3584347 -4006342 -4534880 -5144130 -5805943 -6491247 -7169467 -7807671 -8372297 -8834577
41086 -8834577 -9177522 -9400301 -9517205 -9551770 -9529201 -9470074 -9386414 -9280156 -9144606 -8970150
41076 -8970150 -8753788 -8508183 -8263627 -8059273 -7927569 -7881951 -7916236 -8015244 -8167645 -8371838
41066 -8371838 -8632848 -8955440 -9339444 -9779663 -10269366 -10805034 -11388988 -12026324 -12715589
41057 -12715589 -13437926 -14152160 -14800173 -15320881 -15667069 -15819150 -15791119 -15625773 -15379006
41048 -15379006 -15097537 -14799147 -14465610 -14053416 -13517719 -12837541 -12030745 -11154025 -10289151
41039 -10289151 -9519721 -8905844 -8468153 -8190361 -8038058 -7979623 -7995492 -8073717 -8200020 -8350502
41029 -8350502 -8489670 -8573266 -8555246 -8397708 -8080688 -7608328 -7009235 -6330687 -5628038 -4952493
41019 -4952493 -4341424 -3814343 -3375119 -3018526 -2737582 -2527916 -2387528 -2313843 -2301974 -2346531
41009 -2346531 -2445746 -2604320 -2831289 -3131736 -3495649 -3891199 -4268840 -4575967 -4774710 -4854054
40999 -4854054 -4832044 -4749098 -4655931 -4599762 -4612006 -4699818 -4842976 -4997152 -5104082 -5106649 -4963195
40988 -4963195 -4654337 -4179852 -3550016 -2779381 -1887837 -907032 114289 1111234 2010373
40979 2010373 2740579 3242670 3474421 3409955 3036535 2354477 1383248 169261 -1213768
40970 -1213768 -2676620 -4133339 -5516294 -6780300 -7896733 -8844173 -9602032 -10149355 -10466530
40961 -10466530 -10537153 -10350711 -9909205 -9237446 -8390432 -7449885 -6508617 -5650221 -4934733
40952 -4934733 -4396704 -4054009 -3918742 -4000340 -4297534 -4785655 -5410363 -6093517 -6747451 -7289856
40942 -7289856 -7654906 -7801588 -7721229 -7443130 -7033826 -6585599 -6194861 -5937942 -5855026 -5948445
40932 -5948445 -6192948 -6550254 -6981703 -7457381 -7962200 -8498362 -9082388 -9736072 -10474008
40923 -10474008 -11293165 -12169580 -13062739 -13923075 -14697292 -15330757 -15770566 -15971641 -15903152
40914 -15903152 -15550595 -14913070 -14000732 -12836879 -11462715 -9937681 -8330690 -6706022
40906 -6706022 -5113176 -3586611 -2152085 -830912 362949 1429691 2387049 3266252
40898 3266252 4101760 4918483 5720604 6486946 7177230 7748081 8170191 8436903 8562073
40889 8562073 8573549 8508562 8410600 8323418 8281805 8304284 8392638 8537717 8727150 8951348 9206585
40878 9206585 9494379 9816637 10168237 10532413 10884371 11203273 11485392 11748498 12023005
40869 12023005 12335005 12692314 13081756 13477208 13851103 14182065 14456353 14665479 14803388
40860 14803388 14865169 14847277 14748219 14568708 14310842 13976050 13561534 13055866 12436673 11674421
40850 11674421 10743540 9636662 8374489 7005964 5598846 4225078 2946909 1808602
40842 1808602 835296 36203 -592776 -1068914 -1422100 -1689748 -1907285 -2098951 -2274027
40833 -2274027 -2429942 -2559891 -2660728 -2736998 -2798659 -2852899 -2893377 -2892359 -2801634 -2564991 -2138345
40822 -2138345 -1507184 -691405 263993 1304890 2381470 3455116 4499889 5500454 6447050
40813 6447050 7328390 8125249 8807896 9338425 9675879 9781186 9621659 9178255 8457557
40804 8457557 7503776 6400740 5257348 4180819 3250602 2504881 1943166 1539768 1259133
40795 1259133 1066193 930386 826778 737822 656238 586697 544040 546854 606949 718074 850334
40784 850334 955920 985804 910341 734281 499071 270203 113765 72583 153294 328762
40774 328762 550567 762719 912192 957175 874696 666310 358667 -3056 -367537 -690970
40764 -690970 -946598 -1127373 -1242876 -1312778 -1357700 -1388199 -1396140 -1355536 -1236215 -1024600 -738837
40753 -738837 -427759 -153051 35786 120595 119029 73672 32021 26750 63851 121255 155454
40742 155454 112843 -55821 -380112 -860419 -1471941 -2181616 -2966348 -3819258 -4741079 -5724870
40732 -5724870 -6743749 -7746510 -8662017 -9411488 -9924701 -10153572 -10078900 -9711481 -9090370
40723 -9090370 -8277968 -7350102 -6382388 -5437221 -4554701 -3748471 -3007639 -2306026 -1616422
40714 -1616422 -923007 -226037 460933 1116408 1715336 2232959 2649862 2957701 3162722
40705 3162722 3284152 3346918 3371270 3364122 3316597 3209419 3023579 2751134 2401874 2005113
40695 2005113 1608141 1271531 1059078 1021907 1182678 1529548 2024617 2621185 3278003 3962703
40685 3962703 4645890 5294268 5870620 6341767 6688147 6906592 7003878 6986989 6858349 6618523
40675 6618523 6272054 5830741 5311795 4731355 4096178 3398877 2622744 1757094 815914
40666 815914 -151422 -1064590 -1831056 -2371830 -2644445 -2654643 -2452848 -2117421 -1731172 -1358823
40656 -1358823 -1032296 -748401 -479055 -188870 147192 531279 937271 1313534 1593986
40647 1593986 1714361 1627376 1311676 774288 49371 -805269 -1714494 -2595021 -3365895 -3958877
40637 -3958877 -4328684 -4462407 -4384491 -4152526 -3842722 -3530695 -3277188 -3125163 -3106107 -3246818
40627 -3246818 -3569069 -4082120 -4774606 -5612411 -6544343 -7512691 -8464191 -9357427 -10164432
40618 -10164432 -10866946 -11450730 -11901691 -12204776 -12343680 -12300025 -12053575 -11585950 -10887493
40609 -10887493 -9964093 -8840988 -7562755 -6189650 -4790348 -3431731 -2167915 -1031757
40601 -1031757 -32111 840287 1598394 2242003 2749014 3081366 3201537 3088282 2743703
40592 2743703 2192117 1475099 645114 -241903 -1133645 -1985857 -2763061 -3437251 -3987527
40583 -3987527 -4403155 -4689815 -4875007 -5006954 -5145092 -5346334 -5653194 -6085858 -6636521
40574 -6636521 -7265919 -7905980 -8472100 -8882730 -9078420 -9032761 -8753037 -8273364 -7643913 -6918057
40564 -6918057 -6139253 -5332032 -4501773 -3642872 -2749188 -1821248 -870587 76008 973959
40555 973959 1765582 2393735 2818275 3025991 3028784 2851594 2516876 2035086 1408329 645728
40545 645728 -220627 -1131543 -2011589 -2787264 -3402382 -3826443 -4057674 -4123043 -4074682 -3980888
40535 -3980888 -3912142 -3925909 -4054886 -4301102 -4635758 -5004136 -5335355 -5555616 -5601741 -5431765
40525 -5431765 -5031235 -4414705 -3621061 -2702076 -1707654 -674806 374408 1426417 2465859
40516 2465859 3466524 4386936 5172668 5765194 6113642 6184032 5963073 5458514 4699867
40507 4699867 3740543 2658550 1552589 533029 -290615 -823877 -1001093 -795278 -220723
40498 -220723 672059 1805688 3085710 4409397 5674053 6785159 7664268 8256377 8535137
40489 8535137 8502419 8180392 7599934 6793038 5792951 4637880 3371361 2038044 679796
40480 679796 -663824 -1952886 -3147381 -4212048 -5121874 -5863852 -6434750 -6838728 -7088311
40471 -7088311 -7208574 -7240944 -7242136 -7275506 -7395484 -7630426 -7972828 -8384333 -8814860 -9225029
40461 -9225029 -9598243 -9937180 -10251635 -10549122 -10832838 -11102408 -11351586 -11563626 -11710149
40452 -11710149 -11756948 -11673951 -11443521 -11063398 -10544411 -9905624 -9170263 -8364572 -7518708 -6666343
40442 -6666343 -5841005 -5070892 -4375183 -3762024 -3226081 -2746000 -2285651 -1802337 -1260226
40433 -1260226 -644287 29600 712288 1331088 1812383 2108501 2213261 2155757 1976845 1704218
40423 1704218 1340360 866978 259959 -494059 -1386505 -2384407 -3436060 -4481198 -5461110
40414 -5461110 -6326004 -7039482 -7581347 -7949093 -8156899 -8230819 -8200995 -8094382 -7931167 -7724598
40404 -7724598 -7480810 -7196800 -6859429 -6450604 -5959199 -5393003 -4781393 -4165496 -3582246
40395 -3582246 -3053031 -2582655 -2165556 -1792337 -1453532 -1142913 -862458 -626226 -458136
40386 -458136 -382950 -415669 -555372 -784810 -1073182 -1380195 -1662171 -1880854 -2012308 -2050876
40376 -2050876 -2005029 -1886930 -1702088 -1445951 -1110175 -694421 -214549 300594 823439 1343597
40366 1343597 1873739 2440501 3065474 3746614 4448988 5108737 5648777 6000079 6119639
40357 6119639 5997943 5654516 5125726 4451132 3664166 2791377 1860357 910122 -5839
40348 -5839 -828341 -1507806 -2015985 -2348563 -2520082 -2555225 -2479613 -2313497 -2071564 -1768256
40338 -1768256 -1423025 -1060116 -703443 -371467 -75346 180662 398684 587028 759473
40329 759473 933439 1126436 1350188 1603585 1867942 2107837 2277396 2328825 2220129 1921062
40319 1921062 1417642 715074 -161909 -1172109 -2263903 -3382477 -4476339 -5502394 -6429959
40310 -6429959 -7243077 -7938818 -8520236 -8987019 -9330453 -9537267 -9599987 -9525626 -9335205 -9053580
40300 -9053580 -8697107 -8269011 -7766392 -7193325 -6570024 -5932346 -5323532 -4783518 -4339626
40291 -4339626 -4000824 -3757765 -3589208 -3471764 -3388150 -3331843 -3308761 -3335811 -3434804 -3622675
40281 -3622675 -3902875 -4262386 -4674690 -5106474 -5526582 -5915065 -6267581 -6590892 -6891484
40272 -6891484 -7165244 -7394933 -7555870 -7625645 -7593485 -7465908 -7266058 -7026670 -6780549 -6554335
40262 -6554335 -6368410 -6240941 -6191256 -6238611 -6395441 -6657952 -6999369 -7370084 -7704556 -7930908
40252 -7930908 -7980032 -7794997 -7342860 -6626739 -5691005 -4613577 -3486906 -2396348 -1404971
40243 -1404971 -548496 161656 731797 1179710 1529668 1806507 2026591 2188015 2267406 2229340
40233 2229340 2046433 1720332 1292273 836750 439517 168828 53292 76895 191533 337787
40223 337787 462894 530175 519845 423980 240393 -29019 -373517 -767325 -1170202 -1538172
40213 -1538172 -1839463 -2066994 -2241208 -2401863 -2591056 -2832889 -3117669 -3398260 -3601429
40204 -3601429 -3649452 -3482155 -3070540 -2419320 -1561559 -550018 552265 1681455 2781832
40195 2781832 3813598 4759285 5627201 6448345 7264528 8111542 9006264 9944266 10906256
40186 10906256 11866471 12798439 13679408 14496253 15251084 15960106 16641768 17299841 17914190
40177 17914190 18447727 18864621 19145391 19288455 19300226 19184069 18936368 18551016 18028889
40168 18028889 17387432 16665433 15919280 15210509 14588898 14077734 13667260 13319660 12984736
40159 12984736 12620343 12207992 11755445 11285064 10815314 10346900 9861495 9332087 8736507
40150 8736507 8065449 7323036 6524975 5699811 4892860 4166758 3593201 3236597 3136259
40141 3136259 3294906 3677868 4222646 4854722 5503682 6114672 6653298 7105489 7474825
40132 7474825 7778621 8043001 8297385 8569208 8879157 9237170 9640586 10076313 10526759
40123 10526759 10976120 11413342 11831069 12222934 12581721 12898939 13164815 13368024 13495807
40114 13495807 13535693 13478832 13322835 13071858 12734204 12320169 11841860 11313426 10749088 10158731
40104 10158731 9543857 8897117 8207086 7467461 6686952 5894074 5132568 4448448 3874356
40095 3874356 3417547 3055834 2743372 2424657 2050080 1584399 1005084 296498 -551239
40086 -551239 -1535556 -2631031 -3781245 -4897411 -5867708 -6579590 -6950127 -6950436 -6609577 -5995506
40076 -5995506 -5185778 -4245593 -3221815 -2149471 -1062134 -626 982332 1824327 2464803
40067 2464803 2862528 3007787 2918718 2622843 2138161 1470053 628024 -349790 -1383150
40058 -1383150 -2358477 -3155618 -3677605 -3869695 -3724236 -3276811 -2599848 -1794815 -980439
40049 -980439 -275173 224273 463074 440082 206084 -151378 -530583 -838052 -1005794 -1000898
40039 -1000898 -825215 -504529 -72222 442991 1018706 1632385 2255524 2854354 3396035
40030 3396035 3855414 4219104 4486838 4671391 4797772 4901227 5022743 5201543 5466456
40021 5466456 5830225 6289459 6828597 7423444 8042009 8645039 9189980 9638317 9961670
40012 9961670 10142121 10167124 10023897 9698116 9177879 8460329 7557777 6501421 5341599
40003 5341599 4143663 2979320 1915406 1003712 274811 -263774 -626851 -849435 -982416
39994 -982416 -1084849 -1214373 -1419596 -1736488 -2185958 -2768243 -3455084 -4187448 -4885912 -5471398
39984 -5471398 -5885256 -6098904 -6112474 -5948674 -5646324 -5252360 -4809816 -4344686 -3859528 -3339601
39974 -3339601 -2768479 -2142977 -1478395 -803228 -149846 451506 972506 1382347 1643817
39965 1643817 1715052 1559970 1165131 554792 -205409 -1020360 -1788616 -2426869 -2886467 -3158163
39955 -3158163 -3267626 -3267137 -3226827 -3223871 -3326261 -3572396 -3955047 -4420440 -4885778 -5266998
39945 -5266998 -5502211 -5560597 -5436939 -5139883 -4682133 -4076262 -3335578 -2477832 -1528969 -524265
39935 -524265 494085 1481239 2393682 3193095 3851611 4357700 4718341 4953826 5086944
39926 5086944 5133639 5101972 4999913 4844898 4665944 4495031 4354171 4248391 4168480 4098055
39916 4098055 4017670 3905913 3743517 3523802 3264797 3014738 2846232 2840495 3066690 3562496
39906 3562496 4321722 5293110 6391090 7515322 8572720 9494362 10241120 10797417 11159860
39897 11159860 11330748 11321369 11160182 10895293 10584989 10280604 10012629 9788109 9598607 9432012
39887 9432012 9282042 9152660 9056446 9006716 9006455 9041094 9081455 9095869 9063196 8978468 8849693
39876 8849693 8690606 8514971 8334874 8162427 8012816 7906056 7865104 7909617 8047197 8266000
39866 8266000 8532836 8799202 9014067 9138051 9151782 9054347 8854399 8561748 8185582 7737974
39856 7737974 7234920 6689193 6098767 5441756 4685210 3803670 2795811 1690735 544345
39847 544345 -569213 -1568191 -2376158 -2936569 -3225409 -3257254 -3081577 -2769184 -2392159 -2003840
39837 -2003840 -1625717 -1245546 -826996 -327810 279911 996210 1793342 2628160 3457715
39828 3457715 4249115 4982337 5650572 6260455 6828885 7373062 7896745 8381208 8786541
39819 8786541 9060878 9150619 9008228 8600461 7919776 6995091 5893428 4708637 3542248
39810 3542248 2485223 1605355 940713 499273 265481 211440 306944 523801 834773 1209912
39800 1209912 1611800 1990534 2282276 2417175 2338403 2025131 1506140 853916 159801 -498290
39790 -498290 -1080498 -1591925 -2070897 -2565595 -3109857 -3707753 -4330991 -4926759 -5430533 -5780217
39780 -5780217 -5930336 -5864110 -5598998 -5182404 -4678951 -4154510 -3662723 -3238472 -2900345 -2659817
39770 -2659817 -2530001 -2526511 -2658810 -2917578 -3266300 -3643033 -3973565 -4191871 -4259289 -4173874
39760 -4173874 -3967155 -3692498 -3411062 -3178142 -3030222 -2974512 -2985255 -3010315 -2987270 -2863273
39750 -2863273 -2610415 -2230296 -1747509 -1197908 -618644 -42765 503452 1002562 1446616
39741 1446616 1834230 2164415 2431654 2627501 2749217 2809263 2837353 2872461 2950470 3096291
39731 3096291 3324742 3647535 4079885 4640941 5346068 6194756 7162598 8204087 9264666
39722 9264666 10292783 11244233 12079798 12763430 13266139 13574573 13699625 13680397 13579732
39713 13579732 13469658 13409882 13428221 13512655 13618593 13686854 13664269 13520703 13259091 12916172
39703 12916172 12552563 12234379 12012816 11909006 11908400 11965157 12014894 11992476 11849322 11564234
39693 11564234 11145210 10624141 10047582 9465313 8918231 8429166 8000762 7620947 7272669
39684 7272669 6943935 6635782 6365977 6165590 6067556 6091115 6229667 6448610 6694924 6914276
39674 6914276 7067511 7139200 7136503 7082915 7012467 6965764 6985137 7106566 7349353 7706539 8139725
39663 8139725 8582239 8953190 9179665 9218018 9064155 8749335 8326560 7855845 7393557 6986075
39653 6986075 6665523 6446109 6321392 6264126 6230080 6165569 6016913 5739616 5306043 4711185
39643 4711185 3976197 3148612 2297247 1500290 827742 323647 -4229 -182509 -259745 -289670
39633 -289670 -316020 -361870 -425181 -482407 -499927 -448633 -314392 -99780 181905 515153 887566
39622 887566 1288625 1703141 2105332 2460321 2734102 2905494 2971444 2942199 2830124 2639266
39612 2639266 2361766 1983364 1495457 907401 253425 -407016 -993873 -1416325 -1590407
39603 -1590407 -1463628 -1038380 -382285 382395 1109315 1669242 1987168 2060439 1950185 1750903
39593 1750903 1553859 1421536 1382094 1440384 1593614 1840310 2179241 2603083 3093310 3619471
39583 3619471 4143539 4629495 5055757 5422966 5749389 6054933 6345381 6609093 6827984
39574 6827984 6992913 7111246 7201543 7280340 7351063 7402246 7414523 7370368 7260995 7088474
39564 7088474 6863245 6598231 6302574 5979225 5627662 5248177 4843813 4420801 3991011
39555 3991011 3576316 3210149 2932264 2778069 2767582 2898699 3147116 3472322 3826565 4162974
39545 4162974 4441385 4633161 4725895 4726414 4659453 4560875 4466193 4397110 4351462 4303339 4215555
39534 4215555 4057623 3817228 3498642 3112887 2670704 2185014 1679820 1196761 792777
39525 792777 529488 460421 622300 1032048 1686098 2557620 3591589 4703405 5787910
39516 5787910 6739830 7478498 7966401 8214905 8276392 8225446 8133384 8043175 7954376 7825508
39506 7825508 7593794 7203789 6632436 5900159 5064312 4199748 3376647 2644637 2026293
39497 2026293 1518479 1099244 738329 407706 87748 -232543 -558202 -890111 -1225263
39488 -1225263 -1556989 -1875760 -2169979 -2427378 -2638956 -2805629 -2944141 -3087629 -3279165
39479 -3279165 -3560758 -3962388 -4494856 -5147963 -5893103 -6687913 -7480669 -8213784 -8827702
39470 -8827702 -9267135 -9490254 -9479103 -9247715 -8843922 -8342076 -7827003 -7374023 -7032618 -6819709
39460 -6819709 -6722745 -6708393 -6733072 -6754596 -6744296 -6695495 -6622865 -6551779 -6503657 -6485388 -6486627
39449 -6486627 -6483369 -6444449 -6338926 -6143350 -5847683 -5458553 -4999132 -4505827 -4022638 -3594519
39439 -3594519 -3261154 -3051524 -2978706 -3034939 -3189370 -3391880 -3583962 -3712623 -3740329 -3646280
39429 -3646280 -3420789 -3059767 -2565462 -1952685 -1253351 -512289 225725 930440 1593064
39420 1593064 2221095 2823658 3396257 3914860 4343338 4648313 4810413 4826271 4705431 4469589
39410 4469589 4155124 3812580 3497691 3255906 3108141 3045009 3031912 3021672 2967444 2829472
39400 2829472 2575359 2180026 1631191 938592 138662 -711610 -1549176 -2319238 -2983130
39391 -2983130 -3520385 -3928865 -4223747 -4432003 -4580558 -4683052 -4734036 -4715560 -4612711 -4429465
39381 -4429465 -4196994 -3970599 -3815881 -3789579 -3923340 -4217077 -4642611 -5153545 -5697043 -6225171
39371 -6225171 -6703537 -7114004 -7449517 -7703007 -7855853 -7872124 -7702965 -7301222 -6641184 -5734483
39361 -5734483 -4634371 -3426642 -2212494 -1091713 -151859 537126 927550 1000564 771521
39352 771521 287830 -382764 -1168490 -2006422 -2846727 -3648417 -4370923 -4968076 -5389759 -5591280
39342 -5591280 -5544844 -5246827 -4718982 -4005229 -3165295 -2265559 -1369651 -533295 194946 770882
39332 770882 1155342 1319618 1252261 963191 483986 -134429 -825959 -1516766 -2137795 -2640847
39322 -2640847 -3011587 -3271395 -3465177 -3640708 -3829926 -4040466 -4259156 -4462775 -4628670
39313 -4628670 -4740242 -4787880 -4769388 -4691950 -4573323 -4439252 -4317863 -4234475 -4208978 -4255469
39303 -4255469 -4383719 -4602309 -4921448 -5352162 -5901352 -6567117 -7338979 -8202460 -9142689
39294 -9142689 -10142800 -11177986 -12210118 -13188108 -14056242 -14767855 -15297441 -15644575 -15828736
39285 -15828736 -15880371 -15833956 -15723705 -15578539 -15415029 -15232011 -15011931 -14729603 -14363937 -13907117
39275 -13907117 -13368548 -12773838 -12159699 -11565566 -11023678 -10550921 -10145597 -9789690 -9454623
39266 -9454623 -9107667 -8717489 -8258468 -7714057 -7079590 -6365189 -5598467 -4824706 -4101382
39257 -4101382 -3486814 -3027411 -2749676 -2659507 -2746141 -2986871 -3351210 -3805044 -4313681 -4841223
39247 -4841223 -5346694 -5782352 -6100669 -6270090 -6291206 -6201994 -6066156 -5948934 -5892848 -5906492
39237 -5906492 -5971679 -6062967 -6166512 -6287508 -6444308 -6655039 -6924044 -7232687 -7536918 -7773480
39227 -7773480 -7875099 -7790555 -7501250 -7026257 -6413727 -5723846 -5012279 -4321008 -3677907 -3101376
39217 -3101376 -2604939 -2198757 -1887699 -1666703 -1514300 -1386657 -1217352 -928026 -449428
39208 -449428 256134 1183225 2288864 3510280 4782940 6049498 7259533 8367264 9333636
39199 9333636 10131645 10747647 11173999 11397996 11398199 11153880 10661196 9943561 9049408 8040824
39189 8040824 6980871 5924676 4915563 3985972 3161337 2462855 1905143 1489040 1194469
39180 1194469 979120 785569 555334 245084 -161250 -648788 -1176304 -1685602 -2112405
39171 -2112405 -2397412 -2496206 -2385727 -2065900 -1557436 -897631 -134665 679498 1495793 2271696
39161 2271696 2971433 3565231 4030086 4352014 4527765 4564287 4476113 4281991 4001842 3654150
39151 3654150 3253929 2812477 2340239 1851656 1368112 915796 519296 194809 -53577
39142 -53577 -233275 -358933 -446897 -512296 -571334 -646579 -769036 -972330 -1280824 -1698506
39132 -1698506 -2205430 -2763763 -3329885 -3865636 -4342835 -4740573 -5040483 -5226536 -5291205 -5243509
39122 -5243509 -5111548 -4935435 -4753376 -4588744 -4445374 -4312386 -4174151 -4019204 -3844021
39113 -3844021 -3650584 -3439658 -3204157 -2927395 -2588337 -2171888 -1679878 -1138177 -595840
39104 -595840 -114169 251379 468132 532968 466225 297946 54772 -247070 -602338 -1013968
39094 -1013968 -1490213 -2042784 -2684589 -3424854 -4261144 -5170462 -6103737 -6988289 -7740025
39085 -7740025 -8282005 -8562009 -8562537 -8301396 -7824906 -7196407 -6482285 -5738595 -5002352 -4290467
39075 -4290467 -3606338 -2951081 -2333970 -1776101 -1304301 -938559 -681216 -514791 -409083
39066 -409083 -332361 -260559 -181182 -91945 4309 106613 222405 370030 573710 851484
39056 851484 1202668 1603279 2012501 2384982 2680650 2868128 2924433 2835992 2603225 2246381
39046 2246381 1807955 1348304 934867 628904 474749 494547 687999 1033902 1490799 1997654
39036 1997654 2478878 2856810 3069223 3085036 2911900 2593144 2194979 1788064 1430683 1160729
39026 1160729 997897 950009 1016391 1187116 1442327 1754962 2096248 2441262 2772123 3076906
39016 3076906 3344175 3556736 3690447 3720961 3635371 3442744 3179222 2905703 2696852 2621576
39006 2621576 2719750 2984900 3362265 3764712 4099749 4295496 4314815 4153382 3825847 3350062
38996 3350062 2739722 2009417 1186622 319803 -524569 -1273349 -1857168 -2213621 -2285825 -2024642
38986 -2024642 -1400074 -418602 863806 2343533 3889493 5375014 6707806 7844885
38978 7844885 8787629 9562792 10201791 10728356 11156890 11497448 11762532 11973512 12164931
38969 12164931 12383308 12678011 13086747 13622383 14266809 14973812 15680665 16326389 16870216
38960 16870216 17300253 17626676 17865067 18022786 18096906 18081977 17980757 17812925 17619057 17456465
38950 17456465 17384884 17446640 17652282 17980313 18389331 18832404 19264728 19644443 19933243 20101887
38940 20101887 20138535 20053351 19875600 19645884 19408591 19206193 19073173 19028578 19070619 19177807
38930 19177807 19316943 19453768 19561620 19626130 19646029 19630694 19595796 19559126 19538027 19547953 19600964
38919 19600964 19704152 19859588 20067525 20333003 20673151 21119907 21713918 22491426 23472463
38910 23472463 24658234 26036640 27586846 29275727 31049788 32833862 34544020 36109524
38902 36109524 37489556 38673754 39669355 40489274 41153298 41700017 42194483 42719053 43349789
38893 43349789 44133248 45077124 46156862 47331072 48557654 49806360 51065968 52344604
38885 52344604 53663349 55046560 56514069 58078172 59745016 61519352 63412661 65453259
38877 65453259 67692774 70202641 73060375 76333663 80071992 84309357 89074075 94398909
38869 94398909 100326089 106904690 114181001 122186345 130928852 140393400 150548047 161350018
38861 161350018 172743840 184649273 196943976 209450149 221932285 234106965 245661022
38854 245661022 256274273 265644561 273512284 279680466 284028156 286519156 287209280 286251208
38846 286251208 283890688 280447861 276283712 271758858 267194820 262845670 258883445 255396301
38838 255396301 252395365 249824883 247571638 245473243 243328247 240911415 237994186 234366845
38830 234366845 229858406 224353083 217804849 210250378 201815811 192709250 183193538 173542925
38822 173542925 163996487 154724031 145814506 137287557 129120824 121282015 113755189 106553972
38814 106553972 99719429 93305498 87358593 81899403 76913732 72355620 68160756 64263432
38806 64263432 60608861 57156386 53875986 50744959 47749458 44888651 42175843 39634786
38798 39634786 37295636 35194583 33374390 31878679 30737469 29950626 29480334 29259638
38790 29259638 29215013 29292529 29474123 29775268 30225572 30842899 31613469 32485997 33381494 34214031
38780 34214031 34912584 35433473 35760122 35896425 35862349 35693377 35437667 35145340 34851403
38771 34851403 34560113 34239846 33833807 33284185 32558831 31666312 30651728 29577522 28501476
38762 28501476 27463290 26483936 25573741 24740235 23988465 23314224 22698145 22108414 21512008
38753 21512008 20887359 20231684 19561780 18911260 18326684 17862158 17570129 17487433 17620256
38744 17620256 17935708 18366834 18830537 19249731 19568644 19755807 19797864 19692206 19444727
38735 19444727 19072548 18606119 18085173 17548175 17020253 16505237 15984741 15424483 14786787
38726 14786787 14046563 13205440 12297774 11385009 10540056 9827578 9287268 8925712 8719149
38717 8719149 8625411 8599878 8608939 8636199 8680593 8749647 8852789 8997904 9190805 9435161 9730830
38706 9730830 10070689 10437474 10802723 11129740 11381347 11529919 11563816 11484730 11297028 10997869
38696 10997869 10577784 10032906 9379469 8658580 7927086 7240662 6639352 6141937 5749268
38687 5749268 5452998 5245116 5123570 5090519 5143922 5268525 5433530 5598823 5724324 5775558
38677 5775558 5724245 5548549 5236745 4792373 4235610 3598083 2913510 2209037 1501160 797258
38667 797258 100957 -582296 -1242884 -1869139 -2452636 -2993714 -3503746 -4001638 -4505189 -5021990
38657 -5021990 -5545600 -6058947 -6541878 -6978476 -7362234 -7698917 -8006123 -8307994 -8626321
38648 -8626321 -8972815 -9347132 -9740703 -10142236 -10540772 -10925548 -11284574 -11603623 -11866109
38639 -11866109 -12054241 -12152507 -12153670 -12065149 -11911908 -11732888 -11571078 -11460915 -11419018 -11443051
38629 -11443051 -11518239 -11625143 -11742002 -11841415 -11888069 -11844312 -11683791 -11406581 -11047294 -10670465
38619 -10670465 -10353419 -10163453 -10139921 -10288848 -10589633 -11006619 -11498031 -12019487 -12524208
38610 -12524208 -12964052 -13294055 -13479575 -13502144 -13360323 -13065410 -12634800 -12085873 -11431793
38601 -11431793 -10680249 -9836150 -8907536 -7911188 -6874006 -5829647 -4814090 -3864161 -3019300
38592 -3019300 -2322182 -1813207 -1517862 -1431219 -1506509 -1654230 -1755788 -1690736 -1369472 -757536
38582 -757536 119853 1193724 2377552 3590726 4771680 5880461 6895136 7807255 8619434
38573 8619434 9344453 10002905 10617415 11204413 11766823 12291434 12753404 13126629 13394023
38564 13394023 13550657 13597957 13534769 13353597 13045741 12612356 12074636 11476126 10873508 10319013
38554 10319013 9844102 9454014 9134931 8867004 8635241 8434979 8272380 8160056 8107246
38545 8107246 8106837 8125430 8103157 7965580 7644257 7099118 6335357 5409084 4418825 3484418
38535 3484418 2719649 2207582 1985784 2044073 2332931 2778236 3297706 3815625 4273748 4636634
38525 4636634 4889694 5030777 5060892 4981211 4797903 4527952 4197711 3833776 3453811 3064350
38515 3064350 2665231 2255040 1833531 1401557 961360 518656 85086 -321950 -683988
38506 -683988 -989030 -1237050 -1438937 -1608537 -1752277 -1862399 -1917494 -1890231 -1759459 -1522355
38496 -1522355 -1201380 -841817 -500231 -230104 -72263 -52301 -180862 -452859 -847031 -1329900
38486 -1329900 -1864470 -2419025 -2971341 -3507554 -4018325 -4495741 -4933068 -5326562 -5675738
38477 -5675738 -5978944 -6225704 -6391540 -6440102 -6333020 -6044157 -5573512 -4955218 -4254938 -3556297
38467 -3556297 -2942011 -2477619 -2202858 -2131204 -2255189 -2553823 -2998387 -3555116 -4186707 -4855557
38457 -4855557 -5529102 -6184740 -6811789 -7409687 -7983465 -8539029 -9081582 -9618362 -10162268
38448 -10162268 -10730702 -11337790 -11984398 -12652453 -13306529 -13901052 -14389401 -14731388 -14896939
38439 -14896939 -14866467 -14631367 -14197630 -13591105 -12858141 -12056173 -11235510 -10421291 -9606304
38430 -9606304 -8759427 -7844439 -6837635 -5734767 -4546627 -3290439 -1985376 -655109
38422 -655109 666485 1933407 3093729 4101931 4929812 5568792 6023099 6300385 6407025
38413 6407025 6349647 6139308 5794851 5344572 4825548 4278455 3737297 3218513 2716652 2209992
38403 2209992 1672755 1087225 450954 -222184 -906083 -1569458 -2182687 -2721355 -3165739
38394 -3165739 -3498744 -3706057 -3780107 -3725302 -3559527 -3308482 -2994689 -2628112 -2206087 -1724886
38384 -1724886 -1196777 -661931 -188056 141104 242413 50987 -462467 -1278566 -2328403
38375 -2328403 -3509596 -4712653 -5843483 -6832247 -7630280 -8203740 -8531138 -8606255 -8443152
38366 -8443152 -8077486 -7559932 -6943473 -6272169 -5578332 -4888099 -4229539 -3637367 -3151911
38357 -3151911 -2812960 -2650990 -2679472 -2891242 -3259216 -3739736 -4277303 -4810423 -5277761 -5623610
38347 -5623610 -5803280 -5790482 -5586444 -5226287 -4776987 -4324994 -3956701 -3737770 -3696916 -3818018
38337 -3818018 -4042609 -4282874 -4442704 -4441306 -4232062 -3810622 -3210611 -2490129 -1715292 -947487
38327 -947487 -238375 368325 833831 1125383 1221846 1119457 833611 396037 -150860 -760781
38317 -760781 -1390344 -2005174 -2585183 -3129250 -3657735 -4208751 -4825216 -5535747 -6338783 -7199787
38307 -7199787 -8063851 -8876163 -9598410 -10213702 -10721765 -11131501 -11455843 -11708478 -11900091
38298 -11900091 -12034553 -12108451 -12116219 -12058962 -11951443 -11822070 -11704736 -11626455 -11597093 -11606264 -11628590
38287 -11628590 -11634696 -11602367 -11522320 -11396489 -11232141 -11037252 -10819832 -10589668 -10360018 -10147820
38277 -10147820 -9971233 -9843625 -9766252 -9725817 -9701411 -9677858 -9656538 -9656503 -9705492 -9825649 -10019813
38266 -10019813 -10263229 -10503788 -10671383 -10694003 -10515932 -10112164 -9493802 -8702503 -7797270
38257 -7797270 -6839977 -5884438 -4970062 -4119334 -3339032 -2624959 -1968196 -1359698 -791434
38248 -791434 -255100 258497 756115 1234301 1671847 2030558 2268835 2362577 2320377 2183127
38238 2183127 2009370 1856117 1763975 1749480 1803662 1895523 1978852 1999896 1904285 1644077 1186104
38227 1186104 519823 -339212 -1352314 -2465405 -3618324 -4752711 -5815987 -6760848 -7544006
38218 -7544006 -8130084 -8501813 -8669337 -8669548 -8554226 -8374859 -8173158 -7979735 -7817389 -7704456
38208 -7704456 -7656350 -7685766 -7802626 -8013801 -8321817 -8722344 -9202052 -9738717 -10303940 -10867287
38198 -10867287 -11400640 -11882209 -12299232 -12648272 -12932715 -13158083 -13326227 -13430478 -13454742
38189 -13454742 -13377937 -13180951 -12851012 -12381758 -11771882 -11025522 -10154128 -9177720 -8124845
38180 -8124845 -7031540 -5939233 -4891888 -3933841 -3108233 -2452834 -1991048 -1721906 -1616863
38171 -1616863 -1626891 -1695313 -1768990 -1804584 -1771442 -1653505 -1450401 -1176336 -856340 -521513
38161 -521513 -205641 56729 233845 304238 265660 139255 -34625 -206827 -331354 -375925
38151 -375925 -329629 -205286 -34277 144724 297414 399617 434761 386234 231503 -56097
38141 -56097 -498194 -1101580 -1855175 -2734653 -3709150 -4744550 -5802737 -6839907 -7806842
38132 -7806842 -8652726 -9333171 -9821107 -10116064 -10246401 -10262533 -10224252 -10187339 -10193141 -10262518
38122 -10262518 -10394334 -10567810 -10747258 -10887882 -10942613 -10870047 -10641599 -10244470 -9679270 -8955863
38112 -8955863 -8093082 -7123947 -6101241 -5095306 -4180025 -3410961 -2805639 -2335967 -1937103
38103 -1937103 -1528750 -1038885 -419653 348822 1263409 2304636 3440249 4625907 5806418
38094 5806418 6920070 7905927 8712100 9303241 9666228 9812760 9776829 9606063 9349392
38085 9349392 9046737 8724917 8398267 8068754 7723685 7335795 6871576 6306311 5636482
38076 5636482 4881275 4073974 3251387 2448669 1700352 1042768 512163 136247 -77315
38067 -77315 -147925 -118263 -39904 44496 113033 164693 208807 251119 286279 302540 295396 279441
38055 279441 288363 361026 520592 758116 1030423 1275383 1437676 1490862 1443511 1328558
38045 1328558 1186215 1051730 950860 898051 893153 919009 945592 941731 888072 782892 638314
38034 638314 471454 296336 118608 -67041 -275271 -522253 -814400 -1141475 -1480119 -1805146
38024 -1805146 -2099815 -2358851 -2585324 -2785882 -2966556 -3128687 -3266244 -3368404 -3428777 -3455998
38014 -3455998 -3477183 -3531282 -3658446 -3893823 -4267385 -4803305 -5512731 -6381906 -7364981 -8389505
38004 -8389505 -9373994 -10247981 -10963234 -11491147 -11810951 -11898703 -11725017 -11262743 -10499795 -9450292
37994 -9450292 -8159038 -6698093 -5157187 -3630516 -2201906 -931062 154761 1059798
37986 1059798 1810148 2441087 2987445 3479504 3942853 4398582 4860096 5324825 5764431
37977 5764431 6122153 6324082 6301483 6012120 5449197 4636039 3613784 2430409 1134100
37968 1134100 -231003 -1628241 -3028834 -4405721 -5722106 -6922750 -7936732 -8692038
37960 -8692038 -9132586 -9226880 -8965364 -8352721 -7404029 -6149388 -4644447 -2978039 -1266695
37951 -1266695 367732 1829019 3069132 4088939 4917733 5585185 6102108 6459025 6641089
37942 6641089 6649615 6517093 6305924 6090780 5934500 5869977 5894441 5974889 6060316 6097153 6044353
37931 6044353 5883613 5621226 5281707 4897095 4496925 4102125 3722940 3358771 2998634
37922 2998634 2623587 2212863 1751539 1234325 662824 39749 -634634 -1362671 -2148432
37913 -2148432 -2996645 -3909986 -4884509 -5906007 -6950385 -7988884 -8996792 -9962395 -10891146
37904 -10891146 -11801154 -12711729 -13632059 -14556575 -15467841 -16343446 -17162424 -17907383 -18560462
37895 -18560462 -19095470 -19472742 -19641863 -19551406 -19160986 -18452517 -17439709 -16173252 -14736966
37886 -14736966 -13233081 -11761176 -10399284 -9193688 -8158769 -7283673 -6540979 -5894580
37878 -5894580 -5306944 -4746162 -4190302 -3625330 -3037057 -2403812 -1697498 -894197 12620
37869 12620 1005350 2045866 3085889 4077562 4980741 5767935 6427902 6965334 7393545
37860 7393545 7722395 7949292 8059583 8035299 7865761 7554527 7120668 6594237 6006533 5378445
37850 5378445 4713160 3998627 3219020 2368167 1457459 516247 -411666 -1271689 -2002612
37841 -2002612 -2543944 -2846623 -2883080 -2651990 -2176505 -1498634 -673558 234371 1155062 2018469
37831 2018469 2764634 3356582 3790854 4099001 4335773 4555889 4788906 5025357 5222279
37822 5222279 5324318 5287704 5095827 4763719 4334519 3870844 3442841 3115694 2939732 2943177
37812 2943177 3125739 3454298 3865779 4279921 4617398 4815603 4838615 4682779 4378228 3982554
37802 3982554 3563948 3178527 2853004 2582330 2343136 2114471 1893556 1698027 1554911
37793 1554911 1484696 1490902 1560448 1671882 1803636 1935872 2045600 2101170 2064038 1900820
37783 1900820 1600214 1184245 706235 236119 -159669 -435239 -572740 -577593 -464228 -241129
37773 -241129 94853 551938 1130774 1814721 2567151 3334518 4053502 4662191 5114467 5393538
37763 5393538 5518663 5540720 5526264 5534710 5597297 5706725 5821486 5881484 5826714 5611350 5210622
37752 5210622 4622982 3871363 3004103 2092180 1220165 473337 -73846 -366250 -376565 -115083
37742 -115083 365049 975345 1613407 2188729 2639491 2932967 3053050 2986362 2718188 2240886
37732 2240886 1566360 730567 -214184 -1212226 -2212447 -3167587 -4029860 -4749967 -5282853
37723 -5282853 -5598837 -5695590 -5604889 -5389275 -5128445 -4900973 -4768876 -4769500 -4914790 -5195645
37713 -5195645 -5589017 -6065619 -6596376 -7156547 -7727551 -8296735 -8854883 -9391656 -9890744
37704 -9890744 -10327995 -10674858 -10906288 -11008947 -10984951 -10849314 -10623242 -10327565 -9979071 -9589738
37694 -9589738 -9167761 -8720281 -8258010 -7799687 -7371826 -7000853 -6700577 -6462704 -6257226
37685 -6257226 -6043671 -5788637 -5482454 -5147607 -4833000 -4593263 -4460910 -4425847 -4434104 -4405885
37675 -4405885 -4261361 -3940836 -3413890 -2680970 -1772732 -748277 310153 1307743 2151414
37666 2151414 2764434 3097761 3135363 2892646 2410247 1747495 978021 185276 -546358 -1145718
37656 -1145718 -1569275 -1808930 -1890008 -1861266 -1780384 -1697378 -1638630 -1597189 -1536140 -1406574 -1171869
37645 -1171869 -824901 -390253 85510 546827 939698 1219304 1354784 1330439 1144372 808331
37635 808331 350233 -184706 -739357 -1256087 -1688477 -2008607 -2209094 -2300059 -2300682 -2227436
37625 -2227436 -2085035 -1865476 -1554544 -1140569 -621442 -9258 667915 1369689 2053735
37616 2053735 2688779 3262083 3776023 4236261 4640477 4976044 5228123 5391843 5479714 5519471
37606 5519471 5544758 5585449 5663185 5792374 5982310 6235803 6543860 6880875 7206190 7474346
37596 7474346 7650019 7719548 7692444 7593004 7449168 7287363 7135872 7029854 7007658 7095340
37586 7095340 7288977 7549629 7816835 8031744 8154665 8169088 8075451 7882067 7598036 7230379
37576 7230379 6787275 6287061 5767976 5291390 4934373 4773327 4864264 5227337 5842687 6659683
37566 6659683 7613000 8634403 9654459 10598758 11387688 11944187 12206851 12142973 11757251
37557 11757251 11093339 10227308 9254853 8276047 7380488 6633546 6065001 5664172 5386325
37548 5386325 5170422 4961050 4723898 4447848 4134984 3786634 3394770 2944035 2423587
37539 2423587 1842648 1241120 688375 269063 61374 116382 445477 1018356 1770124 2613945
37529 2613945 3455548 4206728 4796184 5176675 5327988 5256032 4989794 4578271 4087759 3597204
37519 3597204 3189200 2937499 2895509 3089485 3515433 4136392 4880966 5649576 6332844 6836760
37509 6836760 7102533 7113207 6888946 6477504 5943653 5357925 4785526 4277351 3863906 3552027
37499 3552027 3325457 3151007 2989093 2804240 2571780 2280511 1932568 1540426 1120508
37490 1120508 685665 241128 -212993 -674430 -1131860 -1563030 -1939006 -2232091 -2423273
37481 -2423273 -2505605 -2482150 -2360314 -2146889 -1848089 -1475621 -1055264 -631877 -265916 -20956
37471 -20956 53257 -64748 -361423 -790137 -1280386 -1753086 -2140037 -2401366 -2531801 -2551322
37461 -2551322 -2486517 -2355330 -2163590 -1911957 -1606095 -1263895 -916619 -602861 -356098 -190043
37451 -190043 -89083 -10131 103821 305445 629521 1088973 1678237 2378749 3163981 4004596
37441 4004596 4874061 5753056 6630179 7497643 8342904 9140411 9849966 10425299 10828544
37432 10828544 11040689 11061665 10903130 10582199 10121107 9550426 8909211 8237067 7559681
37423 7559681 6877142 6165865 5396568 4558460 3675302 2805782 2030260 1429987 1065153
37414 1065153 959469 1098864 1445177 1955126 2591477 3321641 4110329 4915803 5692461
37405 5692461 6395514 6983531 7419798 7675635 7735622 7600710 7286643 6820638 6241681 5604503
37395 5604503 4979592 4441135 4044044 3802333 3682942 3619905 3541414 3396091 3167078 2869494
37385 2869494 2534409 2188427 1839726 1477058 1079880 631693 129004 -417028 -984974
37376 -984974 -1550339 -2092024 -2595615 -3053658 -3464889 -3833053 -4163552 -4457210 -4704934 -4888740
37366 -4888740 -4989897 -4998373 -4917071 -4760154 -4550225 -4318419 -4106010 -3962052 -3933114 -4046974
37356 -4046974 -4297794 -4641677 -5007102 -5316973 -5512509 -5568445 -5494457 -5325077 -5104304 -4870206
37346 -4870206 -4642840 -4418524 -4173624 -3877668 -3509891 -3070329 -2579984 -2071780 -1578841
37337 -1578841 -1126127 -727575 -387277 -102082 136277 340276 526471 714893 926728
37328 926728 1180380 1487678 1852146 2269467 2728977 3214967 3706883 4177399 4589230 4895687
37318 4895687 5051023 5029589 4842357 4537553 4183292 3843955 3564946 3371144 3273638 3276247
37308 3276247 3377170 3566114 3820090 4102046 4365487 4565091 4669544 4671099 4587713 4456396
37298 4456396 4319219 4206225 4122072 4043105 3927140 3731593 3431570 3030427 2559101 2064905
37288 2064905 1594948 1182377 842123 576217 382889 264107 230287 302416 509795 882115
37278 882115 1438953 2182343 3094341 4136702 5250546 6359027 7377381 8229458 8863489
37269 8863489 9259340 9425685 9392872 9209045 8941328 8675243 8503090 8499927 8698092 9076583
37259 9076583 9574032 10118873 10659263 11176931 11681488 12194268 12733437 13305277 13899642
37250 13899642 14487707 15023899 15453933 15726917 15806956 15681045 15361813 14883573 14291048
37241 14291048 13624483 12909022 12154498 11364445 10546582 9716960 8896225 8102944 7350010
37232 7350010 6645391 5993670 5395136 4843671 4327201 3832093 3348812 2875040 2414828
37223 2414828 1975135 1562509 1182457 841869 551647 324820 168453 73753 12198 -57976
37213 -57976 -178187 -376286 -658740 -1007843 -1381951 -1719416 -1948939 -2006229 -1851831 -1482949
37203 -1482949 -934452 -268149 446888 1155997 1832860 2478784 3109526 3739907 4375642
37194 4375642 5013314 5642509 6245072 6792087 7242806 7548670 7662412 7549822 7200314
37185 7200314 6632062 5889109 5030994 4118539 3200475 2304951 1438587 593275 -242196
37176 -242196 -1070706 -1879475 -2638148 -3302344 -3823351 -4163699 -4314227 -4304187 -4196826 -4069759
37166 -4069759 -3988402 -3985788 -4059461 -4185810 -4340957 -4513780 -4704209 -4911697 -5124678 -5318502
37156 -5318502 -5462113 -5528663 -5504543 -5393509 -5215871 -5004738 -4800864 -4646546 -4579909 -4632192
37146 -4632192 -4828266 -5185936 -5709383 -6379322 -7149239 -7953995 -8726626 -9412988 -9977976
37137 -9977976 -10404936 -10692525 -10850809 -10896702 -10849827 -10729974 -10554534 -10333098 -10060012 -9710877
37127 -9710877 -9248490 -8637106 -7857496 -6915594 -5842454 -4687538 -3508611 -2361733 -1294732
37118 -1294732 -345441 457627 1095752 1562482 1865849 2028573 2086577 2085750 2074666 2091689
37108 2091689 2150255 2230699 2285094 2254482 2091339 1778287 1336346 819877 300146 -155926
37098 -155926 -503269 -726426 -837209 -865739 -848445 -815112 -777617 -724743 -626436 -446356 -157308
37087 -157308 246357 742837 1284269 1804862 2234347 2514424 2614670 2542867 2344324 2088211
37077 2088211 1845635 1669350 1583497 1585149 1653080 1757530 1866618 1948709 1973263 1913719 1753644
37066 1753644 1493900 1157671 791407 459821 232254 160689 257476 485944 771680 1029064
37056 1029064 1188436 1211229 1089996 839225 486058 67228 -367595 -752168 -1007547 -1057229
37046 -1057229 -850162 -382638 291226 1067359 1817294 2421559 2796127 2901633 2736563
37037 2736563 2324762 1707134 939461 91261 -760427 -1544329 -2212093 -2751870 -3190093
37028 -3190093 -3578257 -3970707 -4406019 -4901796 -5462424 -6090163 -6789187 -7559373 -8385257
37019 -8385257 -9229417 -10036527 -10747324 -11315904 -11722614 -11977407 -12112566 -12168137 -12177717 -12162651
37009 -12162651 -12136242 -12110600 -12097022 -12099632 -12111393 -12120054 -12120228 -12120152 -12136401 -12181116 -12251860 -12329645
36997 -12329645 -12382557 -12369969 -12246437 -11968711 -11507544 -10859693 -10051935 -9133087 -8158265 -7174549
36987 -7174549 -6215263 -5304168 -4465486 -3732896 -3151253 -2768679 -2622459 -2726067 -3063900
36978 -3063900 -3595799 -4268133 -5025401 -5816951 -6597330 -7323270 -7952561 -8448122 -8786341
36969 -8786341 -8964767 -9003411 -8937019 -8801395 -8621194 -8405739 -8154177 -7865796 -7549605 -7229032
36959 -7229032 -6940663 -6728353 -6635328 -6696859 -6935140 -7356920 -7953400 -8700813 -9560051 -10475766
36949 -10475766 -11377969 -12189257 -12837842 -13273262 -13480141 -13484816 -13350288 -13159085 -12990693 -12903848
36939 -12903848 -12929632 -13073054 -13317518 -13629925 -13968089 -14291299 -14571149 -14797808 -14978701
36930 -14978701 -15130543 -15269102 -15401551 -15523518 -15619626 -15665965 -15634551 -15499969 -15246163 -14870369
36920 -14870369 -14383370 -13807936 -13177315 -12533587 -11924255 -11395446 -10981396 -10692776 -10509513
36911 -10509513 -10383729 -10253799 -10064566 -9785975 -9423098 -9012975 -8607955 -8252003 -7962215
36902 -7962215 -7726095 -7515118 -7304337 -7085418 -6867417 -6668941 -6509301 -6403604 -6361740 -6388279
36892 -6388279 -6480980 -6628040 -6806207 -6982008 -7116422 -7170927 -7112041 -6913217 -6555481 -6029324
36882 -6029324 -5339586 -4512956 -3604321 -2695150 -1878641 -1234521 -805463 -587770 -539406 -597749
36872 -597749 -696513 -775899 -785877 -686178 -447836 -58974 468047 1095293 1768160 2430474
36862 2430474 3036379 3552906 3955163 4220814 4328952 4263997 4022262 3618320 3088373 2487847
36852 2487847 1881599 1328648 867222 506376 227387 -5757 -229732 -464091 -699484
36843 -699484 -898036 -1006144 -973576 -771261 -402700 94034 655440 1210492 1699383 2084848
36833 2084848 2354205 2516318 2597026 2632878 2662458 2717852 2819960 2978734 3196152 3469529
36823 3469529 3794343 4166749 4585039 5048108 5549355 6067596 6560397 6966027 7215843
36814 7215843 7252215 7043172 6586959 5905779 5034002 4008204 2863520 1635639 364116
36805 364116 -907438 -2136235 -3288926 -4349618 -5321814 -6221100 -7060637 -7836375 -8519634
36796 -8519634 -9060987 -9403764 -9500851 -9327080 -8882290 -8185977 -7269676 -6173689 -4949651
36787 -4949651 -3663318 -2389535 -1197023 -130257 800134 1612845 2341780 3021595 3678595
36778 3678595 4326789 4966082 5580253 6135044 6580003 6858600 6926100 6766981 6401746 5880278
36768 5880278 5267341 4627140 4010063 3443213 2927603 2443610 1961633 1452425 894117
36759 894117 276490 -396193 -1103779 -1811245 -2473219 -3042553 -3481219 -3769121 -3906554 -3909492
36749 -3909492 -3800541 -3599437 -3316500 -2951616 -2499306 -1956818 -1330314 -636178 101699
36740 101699 855963 1599320 2307099 2959276 3542641 4053298 4498184 4893600 5260613 5619925
36730 5619925 5988961 6381024 6804130 7258316 7733185 8207964 8654088 9038652 9328544
36721 9328544 9497056 9532870 9446349 9266523 9027885 8754525 8451936 8111130 7721556 7284746
36711 7284746 6820985 6364684 5949233 5588031 5262298 4924577 4518856 4008344 3396005
36702 3396005 2725816 2063467 1467299 965362 549133 183829 -172828 -553124 -969512
36693 -969512 -1414007 -1864727 -2295706 -2686082 -3025493 -3313504 -3552779 -3739408 -3856751 -3878141
36683 -3878141 -3777942 -3544687 -3189559 -2747919 -2275378 -1839537 -1506522 -1323369 -1302555 -1417808
36673 -1417808 -1615293 -1834448 -2025915 -2156566 -2201992 -2137012 -1935862 -1584453 -1095196 -511923
36663 -511923 99906 671933 1151388 1513732 1768057 1954906 2136205 2378871 2736060 3230958
36653 3230958 3847249 4528725 5188592 5726921 6052997 6107608 5878409 5401858 4750074 4008423
36643 4008423 3253873 2541692 1901831 1342051 854432 423284 32953 -326856 -661039
36634 -661039 -974519 -1278543 -1590936 -1927585 -2290327 -2660208 -3001399 -3273797 -3447675 -3513100
36624 -3513100 -3479345 -3364964 -3185248 -2945285 -2641483 -2267622 -1820192 -1301335 -719650 -88054
36614 -88054 581884 1286432 2032593 2836584 3721196 4714355 5846174 7140094 8598276
36605 8598276 10187732 11835389 13436646 14875832 16051804 16899407 17399613 17577302 17491754
36596 17491754 17225555 16872897 16524608 16250142 16083004 16018324 16025950 16073936 16151293 16278276
36586 16278276 16497702 16850779 17350923 17971569 18655279 19337089 19966143 20512506 20957993
36577 20957993 21280949 21447076 21411234 21126576 20555756 19683145 18528528 17157527 15678756
36568 15678756 14221919 12903355 11795267 10913321 10226537 9681663 9228519 8834954 8487243
36559 8487243 8179167 7897400 7611403 7273644 6830455 6238090 5476367 4555522 3516105
36550 3516105 2422390 1348650 360038 -505158 -1243442 -1880756 -2457270 -3009256 -3554650
36541 -3554650 -4087028 -4579540 -4995876 -5301883 -5471921 -5488510 -5338784 -5013599 -4512727 -3853874
36531 -3853874 -3078322 -2246756 -1425706 -672253 -25869 489106 854252 1048669 1047426 828548
36521 828548 386437 -253072 -1023176 -1819870 -2521453 -3015511 -3218984 -3083550 -2592603 -1761454
36511 -1761454 -643275 668445 2050189 3370079 4511308 5388789 5956173 6203936 6150311
36502 6150311 5828202 5273042 4516174 3585156 2508823 1323490 77618 -1166664 -2337016
36493 -2337016 -3360754 -4179212 -4759734 -5097772 -5208052 -5111937 -4830430 -4386928 -3815759
36484 -3815759 -3167939 -2506943 -1894235 -1372694 -959066 -650185 -436413 -310211 -262685 -271228
36474 -271228 -287867 -237482 -29766 417641 1153214 2173664 3422147 4802962 6205019
36465 6205019 7523507 8673033 9592581 10246731 10625719 10742604 10624691 10300247 9786362
36456 9786362 9084354 8184537 7076491 5758792 4244593 2563372 760918 -1101797
36448 -1101797 -2952248 -4713745 -6315550 -7702550 -8841412 -9722106 -10355729 -10769982 -11002743
36439 -11002743 -11093708 -11075370 -10966506 -10771665 -10487817 -10115770 -9670901 -9186521 -8705807 -8264861
36429 -8264861 -7876343 -7523975 -7171254 -6778865 -6321028 -5793131 -5208365 -4587262 -3948073
36420 -3948073 -3304545 -2670638 -2066122 -1518118 -1059167 -724073 -544658 -540029 -704026 -996469
36410 -996469 -1344745 -1657385 -1845290 -1842590 -1619230 -1181921 -566223 174773 981633 1798276
36400 1798276 2578458 3287513 3900874 4403234 4789276 5062336 5228049 5285776 5223540 5018913
36390 5018913 4643602 4069147 3273307 2246966 999716 -438049 -2016801 -3672264 -5331862
36381 -5331862 -6922182 -8374542 -9625936 -10617078 -11293877 -11616677 -11573253 -11186234 -10509856
36372 -10509856 -9619733 -8602190 -7545031 -6527337 -5608152 -4818671 -4162768 -3625665 -3185810
36363 -3185810 -2824106 -2527350 -2286604 -2094089 -1941682 -1821084 -1723588 -1638967 -1555501 -1462924
36353 -1462924 -1356911 -1241703 -1128239 -1027780 -943855 -867285 -777892 -651707 -468239 -213686
36343 -213686 118550 526454 997310 1509235 2038395 2567616 3089591 3602731 4104323 4586921
36333 4586921 5039252 5448582 5802271 6089926 6308034 6465108 6582189 6685597 6794379
36324 6794379 6908727 7005443 7043170 6975065 6762076 6380089 5820354 5088713 4208166 3222350
36314 3222350 2193729 1193920 289602 -470531 -1064096 -1496760 -1797527 -2010313 -2185787
36305 -2185787 -2374957 -2622741 -2960054 -3396384 -3916373 -4481911 -5038548 -5524028 -5877130
36296 -5877130 -6045532 -5992402 -5702016 -5183691 -4471537 -3617919 -2682212 -1719972 -777494 107104
36286 107104 899150 1563840 2067977 2388711 2526500 2514989 2418996 2316594 2270867 2304915
36276 2304915 2393789 2478189 2492964 2395986 2184105 1891062 1572120 1284981 1074351 962081
36266 962081 942008 979597 1017431 986501 821582 478194 -53000 -740440 -1519121 -2308660
36256 -2308660 -3032212 -3626972 -4044990 -4250526 -4221051 -3953787 -3473516 -2834812 -2114818 -1399776
36246 -1399776 -773149 -310713 -80187 -138390 -522212 -1236883 -2249139 -3490738 -4871944
36237 -4871944 -6298960 -7687244 -8966045 -10076319 -10969070 -11609171 -11982954 -12102507 -12001204
36228 -12001204 -11721846 -11304719 -10782775 -10185582 -9547763 -8915263 -8344203 -7890491 -7592721
36219 -7592721 -7455729 -7444652 -7496042 -7543483 -7545133 -7497339 -7425721 -7359450 -7305835 -7241173 -7121187
36208 -7121187 -6901347 -6554841 -6082182 -5512252 -4895457 -4290180 -3747388 -3300919 -2967455
36199 -2967455 -2752097 -2651625 -2651629 -2721711 -2816565 -2886427 -2892006 -2814329 -2653914 -2422297 -2134183
36188 -2134183 -1805539 -1455882 -1109513 -792888 -529780 -337003 -221262 -176257 -181270 -205128
36178 -205128 -217224 -200752 -159446 -113618 -89518 -109133 -183613 -309750 -469911 -637702 -788965
36167 -788965 -912373 -1012621 -1104360 -1202330 -1316072 -1453463 -1628805 -1865840 -2189693 -2612164
36157 -2612164 -3121499 -3684658 -4260547 -4815687 -5333259 -5810748 -6248500 -6638138 -6960958
36148 -6960958 -7198946 -7350509 -7438951 -7507103 -7600530 -7747797 -7947643 -8170305 -8373843 -8528459
36138 -8528459 -8637036 -8741466 -8910874 -9216275 -9702875 -10372430 -11182491 -12060654 -12926195
36129 -12926195 -13710958 -14373336 -14901864 -15309081 -15620626 -15865334 -16068723 -16248955 -16414500
36120 -16414500 -16563878 -16687392 -16769794 -16793747 -16744796 -16617144 -16417001 -16160474 -15866020 -15544965
36110 -15544965 -15195527 -14805019 -14360442 -13861063 -13323600 -12775294 -12238587 -11716161 -11184112
36101 -11184112 -10597235 -9905314 -9073517 -8096458 -6999068 -5826201 -4628775 -3452497 -2330854
36092 -2330854 -1282987 -317663 557981 1330901 1982287 2496316 2872251 3132977 3325524
36083 3325524 3512186 3754115 4093047 4539390 5072461 5651688 6231426 6772111 7245258
36074 7245258 7633597 7927851 8121172 8204154 8165292 7999004 7716692 7352131 6955762 6580455
36064 6580455 6267357 6039707 5906057 5867586 5922400 6063988 6276735 6532867 6792530 7006892
36054 7006892 7125146 7106155 6931549 6613527 6192941 5729207 5286526 4919490 4660972 4517028
36044 4517028 4472248 4502135 4584063 4701453 4842897 4999877 5163279 5317651 5436291 5483322
36034 5483322 5425549 5249527 4975010 4657093 4374470 4207574 4215416 4420751 4808725 5337665
36024 5337665 5955325 6611902 7263770 7869407 8386812 8780737 9036796 9169363 9213729 9206840
36014 9206840 9170107 9103728 8992457 8817961 8572647 8269134 7939357 7622701 7351205 7142506
36004 7142506 7003908 6941020 6962045 7074483 7277793 7557412 7883318 8213572 8502045 8709081
35994 8709081 8812814 8817324 8753103 8667860 8611426 8622924 8726365 8932836 9241859 9638140
35984 9638140 10088845 10549297 10977407 11347891 11656883 11915552 12138486 12333565 12497303
35975 12497303 12616628 12675127 12659337 12561334 12377577 12106507 11746793 11296976 10757717 10137262
35965 10137262 9457347 8754883 8078045 7479505 7008608 6700631 6563036 6565862 6646215 6728982
35955 6728982 6754152 6696533 6568907 6409164 6259544 6148826 6085236 6060488 6059168 6066872 6074243
35944 6074243 6077313 6075280 6066732 6045666 5998845 5905590 5740965 5482602 5118898 4653439 4101849
35933 4101849 3483364 2814222 2107524 1377266 640764 -82920 -775723 -1420644 -1998942
35924 -1998942 -2487712 -2861447 -3098462 -3189190 -3140962 -2975375 -2719636 -2398172 -2030245 -1633472
35914 -1633472 -1227867 -835680 -477389 -168027 82983 269151 384145 420666 370814 227637
35904 227637 -11095 -336023 -718580 -1108605 -1442459 -1660601 -1725945 -1632071 -1396146 -1041437
35894 -1041437 -580957 -12031 676558 1491016 2421196 3437630 4498439 5562639 6601965
35885 6601965 7603232 8559627 9458136 10272827 10967473 11503465 11847784 11979580 11895944
35876 11895944 11615450 11176807 10631686 10033868 9428080 8841710 8281697 7737241 7186881
35867 7186881 6607720 5985292 5322671 4646024 4003589 3457537 3071765 2899899 2976099 3308595
35857 3308595 3874674 4617174 5445909 6249017 6915098 7358646 7536488 7447936 7121962 6601088
35847 6601088 5929475 5146803 4286671 3378983 2455891 1558705 741109 65487 -406831
35838 -406831 -627495 -571235 -242091 324889 1067134 1903346 2746075 3514721 4145652 4597549
35828 4597549 4851822 4908758 4780823 4485096 4037120 3448251 2727993 1890928 964805 -6070
35818 -6070 -966563 -1864235 -2663380 -3350992 -3931269 -4412860 -4797255 -5074632 -5227671 -5239594
35808 -5239594 -5102200 -4821276 -4417531 -3922044 -3367916 -2783049 -2188487 -1601733 -1040129
35799 -1040129 -520626 -56960 342885 678523 959534 1206800 1448621 1710600 2005500
35790 2005500 2331057 2676662 3031389 3385924 3729042 4045648 4321088 4549082 4736630
35781 4736630 4902124 5068661 5257346 5483724 5756954 6080111 6451240 6865803 7319560
35772 7319560 7808700 8325078 8848901 9344542 9763416 10053138 10169207 10085736 9802829 9348384
35762 9348384 8773042 8139973 7514074 6954345 6509019 6210071 6065853 6055922 6134490 6244361
35752 6244361 6335236 6376519 6358985 6287718 6173088 6024604 5848273 5646620 5421315 5178077
35742 5178077 4931058 4702552 4516894 4392314 4336193 4345702 4411474 4520984 4660542 4816461
35732 4816461 4975501 5124207 5247268 5325733 5335859 5249181 5034684 4663274 4113100 3373436
35722 3373436 2446647 1349920 117937 -1195371 -2519547 -3776378 -4892139 -5808397
35714 -5808397 -6487706 -6913934 -7089384 -7030893 -6765825 -6328628 -5759168 -5103361 -4414268 -3750286
35704 -3750286 -3168576 -2714889 -2412912 -2256349 -2206369 -2195841 -2139997 -1951607 -1558077 -917389
35694 -917389 -28628 1067192 2296812 3570925 4800802 5910921 6846070 7573071 8078916
35685 8078916 8368547 8464712 8408629 8256635 8069244 7894667 7754769 7641946 7529019 7385009
35675 7385009 7185798 6914603 6557518 6103370 5550818 4916717 4237931 3564478 2947855
35666 2947855 2429630 2033220 1759701 1587813 1478206 1381977 1252635 1058571 790800 461380
35656 461380 92417 -298187 -705281 -1133871 -1587517 -2055308 -2504597 -2882496 -3125734 -3176462
35646 -3176462 -2998721 -2588063 -1969748 -1188741 -299008 644474 1593723 2517192 3405253
35637 3405253 4265042 5105973 5925674 6705412 7416391 8031609 8536147 8930441 9224650
35628 9224650 9427201 9534150 9525426 9370431 9041863 8533619 7875409 7135348 6406421 5781939
35618 5781939 5331357 5086234 5039055 5151851 5369453 5632587 5887489 6091193 6213717 6238809
35608 6238809 6163942 5999890 5770501 5512194 5271027 5095556 5027304 5093721 5307162 5668939
35598 5668939 6174515 6816439 7583704 8458222 9411322 10404600 11397284 12356527 13262991
35589 13262991 14107050 14878599 15558421 16117226 16522896 16752095 16800606 16687064 16447467
35580 16447467 16122600 15744513 15327449 14864366 14327211 13670776 12842762 11801135 10533400
35571 10533400 9067353 7465763 5807365 4165236 2593686 1126849 -216253 -1426713
35563 -1426713 -2502558 -3444775 -4251460 -4913942 -5419770 -5761862 -5946310 -5991906 -5922034 -5756336
35553 -5756336 -5508172 -5187533 -4805009 -4374148 -3912608 -3442623 -2989277 -2575295 -2214565
35544 -2214565 -1909932 -1658833 -1463658 -1338400 -1305258 -1382918 -1574352 -1861226 -2207355 -2570175
35534 -2570175 -2916510 -3235450 -3539745 -3853344 -4193521 -4560427 -4939765 -5313313 -5668293
35525 -5668293 -6001252 -6317411 -6627321 -6941447 -7263535 -7585465 -7887065 -8142099 -8327489
35516 -8327489 -8430334 -8449532 -8393893 -8280981 -8137928 -8001577 -7915408 -7923432 -8061951 -8349844
35506 -8349844 -8779892 -9316746 -9905159 -10485278 -11007240 -11440157 -11775883 -12028838 -12230684
35497 -12230684 -12418821 -12621687 -12847041 -13077776 -13275922 -13392934 -13383752 -13221371 -12907546 -12475038
35487 -12475038 -11979383 -11482642 -11035678 -10666569 -10380263 -10169170 -10028505 -9966841 -10004699 -10161868
35477 -10161868 -10441772 -10822177 -11255413 -11674934 -12004281 -12167963 -12105151 -11783909 -11210093
35468 -11210093 -10426105 -9500411 -8513788 -7547669 -6675166 -5952173 -5408188 -5040693 -4817231
35459 -4817231 -4684748 -4581707 -4448261 -4232545 -3893324 -3400659 -2736934 -1899689 -905009
35450 -905009 211665 1399497 2600275 3757691 4824575 5765988 6558951 7192191 7667990
35441 7667990 8003482 8227122 8371380 8468568 8553652 8668451 8857713 9155077 9567500 10069339
35431 10069339 10610873 11137628 11611576 12024719 12399562 12778344 13208255 13729274 14366174
35422 14366174 15122527 15975261 16871642 17733056 18468917 18998563 19272012 19278710 19040172 18593046
35412 18593046 17973767 17211949 16332802 15364841 14347944 13335832 12388617 11557433 10870351
35403 10870351 10329112 9918293 9619764 9423911 9333894 9363696 9531012 9845351 10293941 10831754
35393 10831754 11382699 11854700 12164406 12262036 12146152 11862503 11488553 11111373 10807612
35384 10807612 10630540 10604908 10728654 10980251 11329664 11749167 12219959 12732364 13280657
35375 13280657 13856350 14444452 15024802 15576556 16081426 16522649 16880539 17128309 17232023
35366 17232023 17155953 16871237 16363375 15635155 14705596 13608256 12390731 11113233 9843186
35357 9843186 8645997 7575303 6665903 5930729 5362321 4938813 4632694 4418561 4276701
35348 4276701 4192648 4155439 4156530 4189373 4249396 4335809 4456667 4635283 4912284 5338746 5962175
35337 5962175 6812155 7890739 9167029 10573834 12008705 13345173 14456204 15243776
35329 15243776 15663463 15734276 15529531 15151559 14700122 14247374 13827826 13442285 13068611
35320 13068611 12673207 12221026 11683302 11041685 10288751 9427354 8471360 7447453 6395480
35311 6395480 5365070 4408149 3569135 2876842 2342397 1963747 1731316 1627657 1619694 1650482
35301 1650482 1640180 1500411 1157389 573456 -242596 -1240233 -2343270 -3469259 -4544629
35292 -4544629 -5512304 -6332845 -6982227 -7449159 -7733654 -7846754 -7810175 -7654287 -7413599 -7120288
35282 -7120288 -6797965 -6459061 -6108303 -5750904 -5400034 -5077733 -4807962 -4606659 -4476437
35273 -4476437 -4410209 -4400998 -4449861 -4565244 -4754377 -5013636 -5324096 -5652349 -5952773 -6169650
35263 -6169650 -6241386 -6109204 -5729208 -5084364 -4193103 -3111868 -1929217 -751320 317185
35254 317185 1190357 1811507 2156721 2233091 2072658 1722604 1233825 651779 12522 -656415
35244 -656415 -1333377 -2001081 -2647227 -3265779 -3856208 -4418607 -4945667 -5416573 -5799268 -6063033
35234 -6063033 -6195484 -6213188 -6157891 -6079003 -6011340 -5959809 -5898606 -5784221 -5574528 -5244846
35224 -5244846 -4795619 -4251145 -3651391 -3040200 -2454725 -1920699 -1454302 -1066091 -761636
35215 -761636 -538185 -382147 -272484 -189971 -126247 -85237 -74624 -93253 -124086 -138086 -106477
35204 -106477 -15196 122927 261224 322280 215609 -132745 -750726 -1605491 -2610668 -3651817
35194 -3651817 -4618252 -5427466 -6033037 -6416696 -6574278 -6507068 -6222886 -5742521 -5103813 -4359318
35184 -4359318 -3569183 -2794070 -2091737 -1516918 -1120647 -945711 -1018837 -1343743 -1899088 -2642013
35174 -2642013 -3514467 -4448461 -5368406 -6192557 -6837697 -7229236 -7314513 -7074644 -6531107 -5744578
35164 -5744578 -4804252 -3808508 -2843653 -1970853 -1226479 -630846 -194862 81552 216269
35155 216269 248458 231920 217990 235551 279651 316316 301058 200114 3896 -270255 -582611
35144 -582611 -879143 -1102288 -1204124 -1159496 -974700 -688148 -362016 -66670 137742 216210
35134 216210 164332 2199 -239838 -536578 -878218 -1272172 -1736272 -2285871 -2920117 -3613570
35124 -3613570 -4316635 -4963801 -5486745 -5830298 -5969020 -5918936 -5737544 -5510131 -5328296 -5269656
35114 -5269656 -5383643 -5682953 -6139397 -6685867 -7227990 -7666574 -7925855 -7976670 -7843034 -7587721
35104 -7587721 -7283721 -6985736 -6714126 -6455205 -6172913 -5822576 -5359439 -4741436 -3931876
35095 -3931876 -2907188 -1667836 -245099 1301026 2890846 4436189 5851776 7066060
35087 7066060 8029049 8714307 9116583 9250021 9149052 8867885 8472962 8027874 7576758
35078 7576758 7134834 6692106 6229749 5740741 5242360 4773003 4377046 4089123 3926866
35069 3926866 3892271 3975868 4158595 4410626 4689797 4943311 5115321 5159588 5051840 4794553
35059 4794553 4410550 3929031 3372746 2753502 2076860 1350849 591793 -176621 -930294
35050 -930294 -1653366 -2343776 -3012891 -3679468 -4361031 -5066650 -5793908 -6530129 -7255739 -7947534
35040 -7947534 -8581439 -9135672 -9594537 -9951133 -10206814 -10367110 -10436460 -10414746 -10297076 -10075776
35030 -10075776 -9742669 -9290575 -8714620 -8014351 -7196550 -6277512 -5283508 -4249043 -3212882
35021 -3212882 -2212010 -1274626 -415020 366478 1077892 1727361 2316772 2840076 3286294
35012 3286294 3645423 3914526 4100844 4219784 4288615 4319965 4319284 4286656 4219336 4111647 3952686
35001 3952686 3725779 3412952 3003843 2504515 1940248 1349224 770015 230940 -251703
34992 -251703 -666763 -999698 -1229363 -1331888 -1289676 -1102439 -795615 -419021 -31503 322602
34982 322602 630746 911587 1197823 1514878 1868584 2247144 2633311 3017129 3400510 3791817
34972 3791817 4196558 4612308 5030020 5436724 5814114 6134234 6359257 6450179 6380848 6147619
34962 6147619 5767798 5268838 4676282 4006955 3268962 2467388 1613902 735862 -122310
34953 -122310 -909484 -1584648 -2128586 -2542878 -2839171 -3027901 -3113247 -3094839 -2972524 -2750196
34943 -2750196 -2436799 -2045274 -1591598 -1095143 -579440 -71429 401628 816390 1156349
34934 1156349 1411548 1575641 1642936 1607561 1464115 1208081 836616 352252 -230545 -880636
34924 -880636 -1552452 -2195628 -2767581 -3243009 -3615584 -3890387 -4071819 -4157235 -4144217 -4047748
34914 -4047748 -3913008 -3811233 -3818392 -3987844 -4330587 -4811929 -5365878 -5920629 -6422720 -6848148
34904 -6848148 -7196566 -7474429 -7677993 -7785999 -7766443 -7594087 -7268170 -6818263 -6293533 -5741976
34894 -5741976 -5192389 -4648358 -4094616 -3509170 -2873830 -2179802 -1429661 -638467 166073
34885 166073 947455 1669343 2304941 2839711 3265988 3576207 3762207 3820525 3756957 3585717
34875 3585717 3326167 3003483 2654830 2334831 2111599 2050555 2193004 2541942 3063179 3699277
34865 3699277 4386360 5065537 5687294 6211465 6605885 6847355 6928299 6867521 6715694 6545908
34855 6545908 6430581 6418475 6525407 6740352 7037893 7387551 7757065 8112319 8418627 8646768
34845 8646768 8783105 8837729 8843015 8840286 8860563 8909478 8964096 8983224 8926603 8774210 8536255
34834 8536255 8248907 7958298 7701420 7493649 7328824 7191211 7072242 6981695 6945840 6993358
34824 6993358 7138074 7369439 7655279 7952007 8213466 8394362 8452769 8358667 8108660 7737680
34814 7737680 7316948 6935697 6674494 6581971 6663316 6882585 7176094 7471673 7707608 7845658
34804 7845658 7874881 7807076 7668261 7491083 7309759 7155382 7049373 6996665 6983238 6981026
34794 6981026 6958306 6889957 6762452 6572327 6321404 6013549 5654978 5255539 4827365 4381370
34784 4381370 3925678 3468072 3019290 2592919 2202486 1859919 1576946 1366004 1236927
34775 1236927 1190246 1211237 1268148 1315928 1305681 1198148 976202 650119 253387 -166833
34765 -166833 -558196 -868009 -1047037 -1055868 -873743 -505328 19658 655176 1351876 2067433
34755 2067433 2769237 3429566 4018232 4499386 4836614 5005153 5004570 4863412 4631081 4360096
34745 4360096 4088494 3832402 3591990 3365231 3159331 2992576 2887052 2859214 2915954 3058496
34735 3058496 3289542 3616233 4045078 4571899 5174082 5810786 6430988 6984851 7433418
34726 7433418 7754037 7941348 8005256 7968012 7862109 7728674 7614068 7563206 7611478 7779231
34716 7779231 8070593 8474810 8968172 9518083 10091970 10668861 11245710 11832116 12436171
34707 12436171 13051445 13653655 14208005 14682587 15061591 15352191 15580513 15777551 15963171
34698 15963171 16137812 16284341 16374419 16373390 16243716 15950546 15470043 14796661 13945164 12946471
34688 12946471 11839682 10664098 9454458 8240704 7050885 5914256 4861658 3921708
34680 3921708 3113695 2441020 1889896 1434823 1047144 701673 379833 70919 -228110
34671 -228110 -516278 -795793 -1078689 -1387528 -1748477 -2179586 -2679106 -3218707 -3744704 -4187063
34661 -4187063 -4472565 -4538330 -4344331 -3884271 -3191525 -2335268 -1405128 -489026 347462 1072899
34651 1072899 1689282 2219484 2688082 3104320 3455325 3711895 3841271 3817731 3625793 3258572
34641 3258572 2717762 2017900 1190775 284050 -646931 -1549245 -2378437 -3098231 -3676308
34632 -3676308 -4081417 -4286713 -4279767 -4073433 -3709204 -3249182 -2760609 -2300768 -1907877 -1598955
34622 -1598955 -1372806 -1215694 -1107664 -1027837 -957613 -881596 -787118 -664149 -506726 -315124
34612 -315124 -96705 135713 367600 588041 796103 1005447 1241989 1531669 1882914 2274831
34602 2274831 2660315 2983602 3201455 3294468 3262690 3112177 2845524 2464151 1978560 1416807
34592 1416807 825068 261125 -215924 -557528 -737309 -759515 -660970 -504506 -363769 -302786
34582 -302786 -358028 -531555 -797613 -1116464 -1446963 -1754744 -2017899 -2230946 -2404071 -2555125
34572 -2555125 -2697240 -2829475 -2936862 -3000028 -3007745 -2963588 -2882125 -2777482 -2651482 -2487633
34562 -2487633 -2253863 -1914123 -1446036 -857983 -196838 459570 1024368 1430287 1653560
34553 1653560 1721723 1699319 1656581 1636820 1639845 1628841 1554210 1380160 1101429 744828 357734
34542 357734 -9594 -320446 -562094 -748788 -917309 -1115338 -1384714 -1745389 -2187722 -2677473
34532 -2677473 -3170598 -3629162 -4030002 -4363659 -4628032 -4823272 -4950854 -5014757 -5021135 -4975650
34522 -4975650 -4880122 -4730125 -4514478 -4217784 -3826832 -3338168 -2761281 -2114746 -1419336 -694595
34512 -694595 40089 764527 1459989 2111807 2708309 3236863 3681553 4025020 4253209 4361053
34502 4361053 4357908 4270837 4142628 4023262 3957175 3970936 4065729 4217980 4389120 4540869
34492 4540869 4648328 4704343 4714988 4691358 4642762 4572760 4477540 4346644 4166418 3924916
34482 3924916 3615047 3233729 2778788 2248872 1650210 1007422 369501 -196641 -624165
34473 -624165 -866347 -907927 -763658 -468315 -65875 397509 877663 1336335 1744487 2081476
34463 2081476 2329655 2470220 2487192 2378820 2166555 1891405 1597018 1309592 1027167 724421
34453 724421 369280 -58160 -553590 -1087602 -1614504 -2085354 -2458662 -2704628 -2804034 -2747141
34443 -2747141 -2536828 -2194262 -1760963 -1293285 -851825 -492059 -260366 -194047 -320444 -651739
34433 -651739 -1177821 -1864601 -2663187 -3525993 -4417645 -5311729 -6177534 -6971387 -7644131 -8162614
34423 -8162614 -8531070 -8797169 -9037033 -9326596 -9714777 -10211696 -10794089 -11419162 -12036238
34414 -12036238 -12592815 -13039120 -13335167 -13458409 -13406618 -13193946 -12843930 -12384948 -11849779
34405 -11849779 -11276655 -10708557 -10189706 -9760115 -9449558 -9272583 -9226358 -9292165 -9439765 -9633175
34395 -9633175 -9837165 -10024023 -10179253 -10304404 -10415989 -10540248 -10703283 -10917073 -11165392
34386 -11165392 -11397363 -11535517 -11498830 -11232857 -10733689 -10053159 -9280607 -8508610 -7799555
34377 -7799555 -7169312 -6593405 -6028011 -5431736 -4777317 -4051025 -3245800 -2357078 -1386259
34368 -1386259 -348655 722278 1779809 2775366 3668601 4429910 5035898 5463945 5692678
34359 5692678 5710342 5526002 5174593 4710325 4191681 3667747 3173828 2736249 2379218 2126353
34349 2126353 1995661 1994194 2120155 2373554 2766809 3324580 4071131 5014908 6141192 7414290
34339 7414290 8782369 10179726 11528643 12745790 13754027 14495162 14938337 15081823 14949413
34330 14949413 14584253 14042133 13384267 12668697 11941140 11228858 10541296 9877914 9238989
34321 9238989 8633112 8077250 7590587 7187514 6874356 6649329 6502011 6411373 6346948 6277909
34311 6277909 6188384 6090165 6023854 6046385 6211222 6551051 7069501 7741796 8519890 9338695
34301 9338695 10123465 10799856 11306449 11607534 11702655 11628745 11451878 11250117 11094197 11033190
34291 11033190 11087640 11248434 11479733 11725562 11919287 11994671 11898002 11600243 11104618 10443245
34281 10443245 9661801 8799942 7878952 6903331 5874434 4807177 3737983 2716372 1783570
34272 1783570 952342 202541 -504753 -1204700 -1911676 -2615322 -3288389 -3900278 -4430134
34263 -4430134 -4876125 -5259380 -5621080 -6011279 -6471527 -7018573 -7637737 -8289222 -8923022
34254 -8923022 -9494592 -9975215 -10354451 -10635061 -10823266 -10919017 -10910863 -10777522 -10494852 -10044083
34244 -10044083 -9416803 -8615087 -7649615 -6540712 -5323773 -4054409 -2806244 -1658932
34236 -1658932 -681498 80489 608941 909899 1007665 940055 755296 509020 259490 60043
34226 60043 -49861 -50959 55775 254279 517876 808479 1072593 1241194 1238454 997850
34216 997850 479885 -314555 -1339553 -2510954 -3724662 -4881452 -5908826 -6770753 -7462910
34207 -7462910 -7999277 -8399059 -8679095 -8851439 -8924318 -8906278 -8813002 -8673144 -8528164 -8424770
34197 -8424770 -8403761 -8490889 -8692907 -8998105 -9378428 -9790582 -10176290 -10464753 -10580680 -10458410
34187 -10458410 -10058918 -9384058 -8481569 -7436276 -6348953 -5312087 -4394241 -3638099 -3067245
34178 -3067245 -2692301 -2510870 -2502763 -2626347 -2821740 -3022302 -3169809 -3225253 -3169730 -2996727
34168 -2996727 -2702452 -2280837 -1725732 -1038147 -233701 653952 1575043 2469812 3277693
34159 3277693 3948510 4452988 4788088 4974515 5048098 5049511 5016070 4977965 4960099 4987779 5090831
34148 5090831 5300873 5642259 6122772 6729298 7428416 8168685 8883275 9495054 9926531
$$ [...]
##END NTUPLES=NMR SPECTRUM
##END=
