##TITLE=31Pdec_DE-28rm_3h
 
  24 sc
 29.11.2023
##JCAMPDX= 6.0         $$ Bruker NMR JCAMP-DX V2.0
##DATA TYPE= NMR SPECTRUM
##DATA CLASS= NTUPLES
##ORIGIN= UXNMR, Bruker Analytische Messtechnik GmbH
##OWNER= root
$$ XWIN-NMR		Version 3.5
$$ Wed Nov 29 14:59:07 2023 Russian Standard Time (UT+4h)  she@DPX200
##.OBSERVE FREQUENCY= 81.013821
##.OBSERVE NUCLEUS= ^31P
##.ACQUISITION MODE= SIMULTANEOUS
##.ACQUISITION SCHEME= undefined
##.AVERAGES= 24
##.DIGITISER RES= 16
##SPECTROMETER/DATA SYSTEM= spect
##.PULSE SEQUENCE= zgpg30
##.SOLVENT NAME= CDCl3
##.SHIFT REFERENCE= (INTERNAL, CDCl3, 0, 248.564)
##AUDIT TRAIL= $$ (NUMBER, WHEN, WHO, WHERE, WHAT)
$$ ##TITLE= Audit trail, XWIN-NMR		Version 3.5
$$ ##JCAMPDX= 5.01
$$ ##ORIGIN= Bruker BioSpin GmbH
$$ ##OWNER= she
$$ F:/spectra/data/she/nmr/P31/1/pdata/1/auditp.txt
$$ ##AUDIT TRAIL=  $$ (NUMBER, WHEN, WHO, WHERE, WHAT)
(   1,<2023-11-29 14:58:19.64 +0400>,<she>,<DPX200>,
      <created by zg, POWCHK disabled, PULCHK disabled
       configuration hash MD5:
       00 E9 B6 7A A2 85 ED C7 34 08 36 98 17 FE 4E 26
       data hash MD5: 32K
       FA 78 C0 0D 45 7F 0D AF 5D AD BA 22 BA DC 56 56>)
(   2,<2023-11-29 14:58:22.39 +0400>,<she>,<DPX200>,
      <Start of raw data processing
       efp BC_mod = 2 LB = 10 FT_mod = 6 PKNL = 1 PHC0 = -11664.54 PHC1 = -67.90641 SI = 64K 
       data hash MD5: 64K
       6A 60 0E 7B 5C A1 A3 F9 DC 96 26 58 12 24 D6 25>)
(   3,<2023-11-29 14:58:37.98 +0400>,<she>,<DPX200>,
      <pk PHC0 = -18.33706 PHC1 = 0 
       data hash MD5: 64K
       68 2A 00 12 A8 1E 8F 7A 78 A7 E5 F3 EA E2 A4 D6>)
(   4,<2023-11-29 14:58:42.10 +0400>,<she>,<DPX200>,
      <abs ABSG = 5 
       data hash MD5: 64K
       EF 1E B2 F0 1B 7D 3D 99 71 0F 2B A9 35 12 5A C8>)
$$ ##END=
$$ 
$$ hash MD5
$$ 20 81 E2 6C B3 91 AB 72 F5 75 C9 19 FA 42 76 9F
##$RELAX= 
##$RELAX= 
##$RELAX= 
##$RELAX= 
##$RELAX= 
##$RELAX= 
##$RELAX= 
##$RELAX= 
##$RELAX= 
$$ Bruker specific parameters
$$ --------------------------
##$DU= <F:/spectra>
##$EXPNO= 1
##$NAME= <P31>
##$PROCNO= 1
##$TYPE= <nmr>
##$USER= <she>
##$AMP= (0..31)
100 100 100 100 100 100 100 100 100 100 100 100 100 100 100 100 100 100 
100 100 100 100 100 100 100 100 100 100 100 100 100 100 
##$AQSEQ= 0
##$AQ_mod= 1
##$AUNM= <au_zg>
##$AUTOPOS= <>
##$BF1= 81.014009
##$BF2= 200.13
##$BF3= 200.13
##$BF4= 200.13
##$BF5= 200.13
##$BF6= 200.13
##$BF7= 200.13
##$BF8= 200.13
##$BYTORDA= 1
##$CFDGTYP= 0
##$CFRGTYP= 5
##$CHEMSTR= <none>
##$CNST= (0..31)
1 1 145 1 1 1 1 1 1 1 1 1 1 1 1 1 1 1 1 1 1 1 1 1 1 1 1 1 1 1 1 1 
##$CPDPRG= <waltz16>
##$CPDPRG1= <>
##$CPDPRG2= <waltz16>
##$CPDPRG3= <>
##$CPDPRG4= <mlev>
##$CPDPRG5= <mlev>
##$CPDPRG6= <mlev>
##$CPDPRG7= <mlev>
##$CPDPRG8= <mlev>
##$CPDPRGB= <>
##$CPDPRGT= <>
##$D= (0..31)
0 1 0 0 0 0 0 0 0 0 0 0.03 2e-05 3e-06 0 0 0 0 0 0 0 0 0 0 0 0 0 0 0 0 
0 0 
##$DATE= 1701255499
##$DBL= (0..7)
120 120 120 11 120 120 24 19 
##$DBP= (0..7)
150 150 150 150 150 150 150 150 
##$DBP07= 0
##$DBPNAM0= <>
##$DBPNAM1= <>
$$ [...]
##$SUBNAM3= <"">
##$SUBNAM4= <"">
##$SUBNAM5= <"">
##$SUBNAM6= <"">
##$SUBNAM7= <"">
##$SUBNAM8= <"">
##$SUBNAM9= <"">
##$SW= 501.771253377433
##$SWIBOX= (0..15)
0 1 3 0 0 0 0 0 0 0 0 0 0 0 0 0 
##$SW_h= 40650.406504065
##$TD= 32768
##$TD0= 1
##$TE= 0
##$TE2= 300
##$TE3= 300
##$TEG= 300
##$TL= (0..7)
0 120 53 12 22 120 120 120 
##$TP= (0..7)
150 150 150 150 150 150 150 150 
##$TP07= 0
##$TPNAME0= <>
##$TPNAME1= <>
##$TPNAME2= <>
##$TPNAME3= <>
##$TPNAME4= <>
##$TPNAME5= <>
##$TPNAME6= <>
##$TPNAME7= <>
##$TPOAL= (0..7)
0.5 0.5 0.5 0.5 0.5 0.5 0.5 0.5 
##$TPOFFS= (0..7)
0 0 0 0 0 0 0 0 
##$TUNHIN= 0
##$TUNHOUT= 0
##$TUNXOUT= 0
##$USERA1= <user>
##$USERA2= <user>
##$USERA3= <user>
##$USERA4= <user>
##$USERA5= <user>
##$V9= 5
##$VALIST= <valist>
##$VCLIST= <CCCCCCCCCCCCCCC>
##$VD= 0
##$VDLIST= <DDDDDDDDDDDDDDD>
##$VPLIST= <PPPPPPPPPPPPPPP>
##$VTLIST= <TTTTTTTTTTTTTTT>
##$WBST= 1024
##$WBSW= 4
##$XGAIN= (0..3)
0 0 0 0 
##$XL= 0
##$YL= 0
##$YMAX_a= 4770
##$YMIN_a= -6359
##$ZGOPTNS= <>
##$ZL1= 120
##$ZL2= 120
##$ZL3= 120
##$ZL4= 120
##$ABSF1= 248.5645
##$ABSF2= -253.2056
##$ABSG= 5
##$ABSL= 3
##$ALPHA= 0
##$AQORDER= 0
##$ASSFAC= 0
##$ASSFACI= 0
##$ASSFACX= 0
##$ASSWID= 0
##$AUNMP= <proc_1d>
##$AZFE= 0.1
##$AZFW= 0.5
##$BCFW= 0
##$BC_mod= 2
##$BYTORDP= 0
##$COROFFS= 0
##$CY= -3
##$DATMOD= 1
##$DC= 0
##$DFILT= <>
##$DTYPP= 0
##$F1P= 0
##$F2P= 0
##$FCOR= 1
##$FTSIZE= 65536
##$FT_mod= 6
##$GAMMA= 0
##$GB= 0
##$INTBC= 1
##$INTSCL= 6.047779e-11
##$ISEN= 30
##$LB= 10
##$LEV0= 0
##$LPBIN= 0
##$MAXI= 10000
##$MC2= 0
##$MEAN= 0
##$ME_mod= 0
##$MI= 50
##$NCOEF= 0
##$NC_proc= -8
##$NLEV= 6
##$NOISF1= 182.463
##$NOISF2= 159.3651
##$NSP= 0
##$NTH_PI= 0
##$NZP= 0
##$OFFSET= 248.5645
##$PC= 4
##$PHC0= -11682.88
##$PHC1= -67.90641
##$PH_mod= 1
##$PKNL= yes
##$PPARMOD= 0
##$PSCAL= 0
##$PSIGN= 0
##$REVERSE= no
##$SF= 81.0140089999694
##$SI= 65536
##$SIGF1= 159.3651
##$SIGF2= -187.1042
##$SINO= 113.3802
##$SIOLD= 16384
##$SREGLST= <1H.CDCl3>
##$SSB= 0
##$STSI= 65536
##$STSR= 0
##$SW_p= 40650.406504065
##$SYMM= 0
##$S_DEV= 0
##$TDeff= 32768
##$TDoff= 0
##$TI= <>
##$TILT= no
##$TM1= 0
##$TM2= 0
##$TOPLEV= 0
##$USERP1= <user>
##$USERP2= <user>
##$USERP3= <user>
##$USERP4= <user>
##$USERP5= <user>
##$WDW= 1
##$XDIM= 65536
##$YMAX_p= 291221327
##$YMIN_p= -18414568
$$ End of Bruker specific parameters
$$ ---------------------------------
##NTUPLES= NMR SPECTRUM
##VAR_NAME=  FREQUENCY,     SPECTRUM/REAL,   SPECTRUM/IMAG
##SYMBOL=    X,             R,               I
##VAR_TYPE=  INDEPENDENT,   DEPENDENT,       DEPENDENT
##VAR_FORM=  AFFN,          ASDF,            ASDF
##VAR_DIM=   65536,         65536,           65536
##UNITS=     HZ,            ARBITRARY UNITS, ARBITRARY UNITS
##FACTOR=    0.620285442955139, 1,           1
##FIRST=     20137.2065510682, 0,            0
##LAST=      -20513.1999529968, 0,           0
##MIN=       -20513.1999529968, -18414568,   0
##MAX=       20137.2065510682, 291221327,    0
$$ Real data points
##PAGE= N=1
##DATA TABLE= (X++(R..R)), XYDATA
$$ [...]
43135C298402j03745j29456j48959j61996j66842j61608j45804j21258r2139o3914
43125B002681m1303k6031j5967o729N032J9219L2668M1762M4680M1528L3079K0122
43113B150741M223j1218k1235k1259r405J2458L9547O5946Q6114R5636R1676P3459
43101B556683M2490K295m2076q4675j19783j43459j54617j54657j46121j31641
43091A624439j13581r3789p3193n1832k9596o927J5231L5807N3751O8046P8011
43080A506367Q3610Q5011Q1525P1102N1199K0677j8570o1521j01736j34028j56401
43069A427235j70056j77605j80966j80377j74911j63923j48411j31465j17616
43060a8095j11563j16748j33992j60315j88755k10038k15818k01698j68208j19527
$$ plain form
43135 3298402 3194657 3065201 2916242 2754246 2587404 2425796 2279992 2158734 2066595 2002681
43125 2002681 1961378 1935347 1919380 1912651 1917683 1936902 1969570 2011332 2056012 2097540 2130619 2150741
43113 2150741 2154964 2143746 2122511 2101252 2091847 2104305 2143852 2209798 2295912 2391548 2483224 2556683
43101 2556683 2599173 2601468 2559392 2474717 2354934 2211475 2056858 1902201 1756080 1624439
43091 1624439 1510858 1417069 1343876 1292044 1262448 1255521 1270752 1306559 1360310 1428356 1506367
43080 1506367 1589977 1674988 1756513 1827615 1878814 1899491 1880921 1819400 1717664 1583636 1427235
43069 1427235 1257179 1079574 898608 718231 543320 379397 230986 99521 -18095
43060 -18095 -129658 -246406 -380398 -540713 -729468 -939506 -1155324 -1357022 -1525230 -1644757
43050a644757o1306R29O2390J19159J68247K07590K35790K51841K55192K46183
43040a58742K26442J98746J66494J33047J01085P2030M5942K2374J789j3782k1798
43029G73627k1190j3284p00J4823L3557N6853Q5037J15871J44729J66018J74741
43018A530082J67393J42418J00914M7516r641o0975r9069j21454j30576j30863
43008A435745j25183j13246r2844o2886k6005J1047L9623N2449M5956K1014j7085
42997A168585n8916r2319j05758r2553n3292M848P0768J32224J78093K00588J97172
42986A549440J70984J28999P8949K6976k2661o6450j00640j21538j26786j16678
42976A400595r4897o8461m6303l6109m0374n4487o9025p5363p0657n8842m7414
$$ plain form
43050 -1644757 -1706063 -1705134 -1642744 -1523585 -1355338 -1147748 -911958 -660117 -404925 -158742
43040 -158742 67700 266446 432940 565987 667072 739102 785044 807418 809207 795425 773627
43029 773627 752437 739153 738453 753276 786833 843686 928723 1044594 1189323 1355341 1530082
43018 1530082 1697475 1839893 1940807 1988323 1978682 1917707 1818638 1697184 1566608 1435745
43008 1435745 1310562 1197316 1104472 1041586 1015581 1026628 1066251 1118700 1164656 1185670 1168585
42997 1168585 1109669 1017350 911592 819039 765747 770595 841363 973587 1151680 1352268 1549440
42986 1549440 1720424 1849423 1928372 1955348 1932687 1866237 1765597 1644059 1517273 1400595
42976 1400595 1305698 1237237 1190934 1154825 1114451 1059964 990939 915576 844919 786077 738663
42965G38663m2847m7604n9874p5221q8859r7563j00668r9815r7511r5195r2143
42954a58637q6055p5192o0455m5881l7000l8149n0529p2017r8403j24882j47010
42943i94210j61145j64844j57582j41516j21559j04034r4120r3535j00109j09450
42933b242104j17208j20216j16257j03340p9371m2478P867O9108J34133J91713
42923b418153K29529K38667K17106J70445J09766M8157k421l3246m0250k5031
42913a505431N262M0077O9093Q5258Q5595P0186M1016J381m4430r1460j34112
42902a377565j66216j81885j77339j52263j09510n3842Q787P1006J24375J61455
42892a852997J78646J77723J64733J47157J31056J19580J13051J09825J07313
$$ plain form
42965 738663 695816 648212 588338 513117 424258 326695 226027 126212 28701 -66494 -158637
42954 -158637 -244692 -319884 -380339 -426220 -463220 -501369 -551898 -623915 -722318 -847200 -994210
42943 -994210 -1155355 -1320199 -1477781 -1619297 -1740856 -1844890 -1939010 -2032545 -2132654 -2242104
42933 -2242104 -2359312 -2479528 -2595785 -2699125 -2778496 -2820974 -2813107 -2743999 -2609866 -2418153
42923 -2418153 -2188624 -1949957 -1732851 -1562406 -1452640 -1404483 -1406904 -1440150 -1480400 -1505431
42913 -1505431 -1500169 -1460092 -1390999 -1305741 -1220146 -1149960 -1108944 -1107563 -1151993 -1243453 -1377565
42902 -1377565 -1543781 -1725666 -1903005 -2055268 -2164778 -2218620 -2209833 -2138827 -2014452 -1852997
42892 -1852997 -1674351 -1496628 -1331895 -1184738 -1053682 -934102 -821051 -711226 -603913
42883f03913J02755R3854P9418N9961L7935J7180J440p570j1317j3783j9177k9317
42871b92534m2415n4057n9827n7782m9137l6824k3680j1997m408m387j5171l8036
42859f90255p1574j12278j55480j95780k27238k43909k40814k15047j66721r9435
42849b418531k0092O2027J36924J96074K34662K52746K54681K47041K36110K25781
42839e92577K16472K05542J89085J63996J28870Q3998L1722k2567p0578j03758
42829B30205j17324j12597r5773p3882n0543k4390Q628N0466R7386J40280J68492
42818B20948J74317J55807J17423O8792K1813j3202l0771l1546k1485r301l051
42807F49744p027k0451l8482n4596o3011o0473m7025k5449O03K8456N6831Q4713
$$ plain form
42883 -603913 -501158 -407304 -327886 -267925 -229990 -212810 -211370 -218940 -230257 -244040 -263217 -292534
42871 -292534 -334949 -389006 -448833 -506615 -555752 -592576 -616256 -628253 -632661 -637048 -652219 -690255
42859 -690255 -761829 -874107 -1029587 -1225367 -1452605 -1696514 -1937328 -2152375 -2319096 -2418531
42849 -2418531 -2438623 -2376596 -2239672 -2043598 -1808936 -1556190 -1301509 -1054468 -818358 -592577
42839 -592577 -376105 -170563 18522 182518 311388 395386 427108 404541 333963 230205
42829 230205 112881 284 -95489 -169371 -219914 -244304 -235676 -185210 -87824 52456 220948
42818 220948 395265 551072 668495 737287 759100 745898 715127 683581 662096 652795 649744
42807 649744 642717 622266 583784 529188 466177 405704 358679 333230 333833 362289 419120 503833
42795E03833J10005J29340J39374J38643J28420J11548Q9821O2419K7154j6407
42785A424150o4847j11594j49518j73537j82155j77819j65771j51536j38183j25229
42775a6039j09837q9186o2180k9862M990L8419O6131Q4781R3151R2331Q4699P2697
42763B30095N8387M3549K9543J6695M026j0320k8264n1195p9538j12158j45692
42752d4872j74391j90985j88745j64364j20514o6476j5820J8281K7991J3603j7106
42741i23398n2497q1799r8436j00705r0315p0599m5644k0152P18J2028J0033o907
42729a467673l7627p7991j21477j60790j90018k06290k09927k03099j88109j66583
42719c029584j39810j09532p8241m8817k3711m116J0481K2015L2825M4522N7375
$$ plain form
42795 503833 613838 743178 882552 1021195 1149615 1261163 1350984 1413403 1440557 1424150
42785 1424150 1359303 1247709 1098191 924654 742499 564680 398909 247373 109190 -16039
42775 -16039 -125876 -215062 -277242 -307104 -302114 -263695 -197564 -112783 -19632 72699 157398 230095
42763 230095 288482 332031 361574 378269 382295 371975 343711 292516 212978 100820 -44872
42752 -44872 -219263 -410248 -598993 -763357 -883871 -950347 -966167 -947886 -919895 -906292 -923398
42741 -923398 -975895 -1057694 -1156130 -1256835 -1347150 -1417749 -1463393 -1483545 -1482827 -1470799 -1460766 -1467673
42729 -1467673 -1505300 -1583291 -1704768 -1865558 -2055576 -2261866 -2471793 -2674892 -2863001 -3029584
42719 -3029584 -3169394 -3278926 -3357167 -3405984 -3429695 -3433811 -3423330 -3401315 -3368490 -3323968 -3266593
42708c266593P0312Q1172Q7205Q6084P7236O2618M6178L2291K4364K4287L2498
42697b642348M8039O8511R0336J09555J22801J27969J24405J12842R5323P5063
42687a667504N5959M1678L4576L4897M0532M7417N0442M4815K7564j135l7337
42676a328096p3764j01397j11833r9756o4762j1960M9099J07261J53532J83854
42666a297822J99127K02416J95552J77557J45548R6929L1515m6954j30077k05546
42656f31755k59862k82296k68193k19979j45783n6688L6113J23463J99340K60757
42646a244883L06768L37176L51614L49352L29742K93049K41359J79164J13153
42637A256494N1076j5l5513n4375n9331n6053n1469n1610n9890p6498r9199j24959
$$ plain form
42708 -3266593 -3196281 -3115109 -3027904 -2941820 -2864584 -2801966 -2755788 -2723497 -2699133 -2674846 -2642348
42697 -2642348 -2594309 -2525798 -2435462 -2325907 -2203106 -2075137 -1950732 -1837890 -1742567 -1667504
42687 -1667504 -1611545 -1569867 -1535291 -1500394 -1459862 -1412445 -1362003 -1317188 -1289624 -1290759 -1328096
42676 -1328096 -1401860 -1503257 -1615090 -1714846 -1779608 -1791568 -1742469 -1635208 -1481676 -1297822
42666 -1297822 -1098695 -896279 -700727 -523170 -377622 -280693 -249178 -296132 -426209 -631755
42656 -631755 -891617 -1173913 -1442106 -1662085 -1807868 -1864556 -1828443 -1704980 -1505640 -1244883
42646 -1244883 -938115 -600939 -249325 100027 429769 722818 964177 1143341 1256494
42637 1256494 1307570 1307555 1272042 1217667 1158336 1102283 1050814 999204 939314 862816 763617 638658
42625F38658j51306j76707j99850k18628k29716k29129k13684j82744j39419r0440
42615a192965m4605j0545N304L08k3088n7065r0319j12306j17761j08432r0837
42604a842311p1953n6042m4230l5759k8943k1027q070J3755M5653Q4356J22816
42593a841755J53269J70540J73311J62937J41446J10706P3209L3113m076l3321
42583h60621n1781n8917n5329m1970k0767M259K7077M1373M2867L0918R032j5798
42571i49657l5079m1921l3816j3321J3767M1347O5395Q5062J02498J21353J44246
42560e00126J70492J95707K13804K20001K12809J94016J67039J35260J01416O8139
42550A178557L8332J4433k914j5396k6048l7518n0729o4694p7511q8172r8015
$$ plain form
42625 638658 487352 310645 110795 -107833 -337549 -566678 -780362 -963106 -1102525 -1192965
42615 -1192965 -1237570 -1248115 -1242811 -1242503 -1265591 -1322656 -1412975 -1525281 -1643042 -1751474 -1842311
42604 -1842311 -1914264 -1970306 -2014536 -2050295 -2079238 -2100265 -2108335 -2094580 -2048927 -1964571 -1841755
42593 -1841755 -1688486 -1517946 -1344635 -1181698 -1040252 -929546 -856337 -823224 -827300 -860621
42583 -860621 -912402 -971319 -1026648 -1068618 -1089385 -1085126 -1058049 -1016676 -973809 -942891 -933859 -949657
42571 -949657 -984736 -1026657 -1060473 -1073794 -1060027 -1018680 -953285 -868223 -765725 -644372 -500126
42560 -500126 -329634 -133927 79877 299878 512687 706703 873742 1009002 1110418 1178557
42550 1178557 1216889 1231322 1228408 1213012 1186964 1149446 1098717 1034023 956512 868340 770325
42539G70325j10397j28332j51865j77373j99317k12818k15073k04999j82149j46329
42529i58327r8371m1223K0121P9897J32764J73871J98777K04699J92598J67657
42519G2463J36821J05218P4498M4046J3226j7473m6969p4741j01277j27423j53375
42508g4986j78413k01489k21851k38922k51741k58849k58762k50306k32336k03244
42498b370899j60926j03567l1179N2670J39928K18986K77532L06086L00675K63784
42488a106910K03523J31342N9020m085n2376q3754r8611r9237q9966p7158o7736
42477a285948o6186p1817p8486p7489o1820k9477J5748O5817J11363J44723J61868
42466a171704J62878J51396J33578J16462J05544J02330J03639J03440R6363Q0571
$$ plain form
42539 770325 659928 531596 379731 202358 3041 -209777 -424850 -629849 -811998 -958327
42529 -958327 -1056698 -1097921 -1077800 -997903 -865139 -691268 -492491 -287792 -95194 72463
42519 72463 209284 314502 389000 433046 446272 428799 381830 307089 205812 78389 -74986
42508 -74986 -253399 -454888 -676739 -915661 -1167402 -1426251 -1685013 -1935319 -2167655 -2370899
42498 -2370899 -2531825 -2635392 -2666571 -2613901 -2473973 -2254987 -1977455 -1671369 -1370694 -1106910
42488 -1106910 -903387 -772045 -713025 -717110 -769486 -853240 -951851 -1051088 -1141054 -1218212 -1285948
42477 -1285948 -1352134 -1423951 -1502437 -1579926 -1641746 -1671223 -1655475 -1589658 -1478295 -1333572 -1171704
42466 -1171704 -1008826 -857430 -723852 -607390 -501846 -399516 -295877 -192437 -96074 -15503
42456a5503N8394L4595J3620k351j3577k1443k7093l0987l3344l4487l4627l3220
42444a40023k8815j9755n272J4116L7364O3900R3497J24915J54911J79087J94115
42433F68040J99361J96546J87906J74482J55670J30019R6429N5075P905m1031
42423A830402q5801j19833j38186j39324j25038r8477o1986j6255L8933J02926
42413A187361J72317K40154K97221L34941L48121L35780L00252K45947J78634
42404C640728J05082L2514l2175q3542j18975j39854j51250j59733j70245j83902
42394B738648j97901k07412k08378j99894j84992j69373j58688j55982j60758
42385A095270j69793j78791j83523j80251j65949j38841r9317n0698O96M6606
$$ plain form
42456 -15503 42891 77486 91106 88755 75178 53735 26642 -4345 -37689 -72176 -106803 -140023
42444 -140023 -168838 -188593 -193865 -179749 -142385 -78485 15012 139927 294838 473925 668040
42433 668040 867401 1063947 1251853 1426335 1582005 1712024 1808453 1863528 1871433 1830402
42423 1830402 1744601 1624768 1486582 1347258 1222220 1123743 1061757 1045502 1084435 1187361
42413 1187361 1359678 1599832 1897053 2231994 2580115 2915895 3216147 3462094 3640728
42404 3640728 3745810 3778324 3746149 3662607 3543632 3403778 3252528 3092795 2922550 2738648
42394 2738648 2540747 2333335 2124957 1925063 1740071 1570698 1412010 1256028 1095270
42385 1095270 925477 746686 563163 382912 216963 78122 -21195 -71893 -71197 -24591
42375b4591P9179R3785R0582P3759M9127K2030l080k2204l1965l0924k0924o881
42363B67893N477J2948J7086K3471L8182O3894R8292J35433J68368J91073J99351
42352A221468J91442J68536J34580R5020N5293J9965p360k4056k8947k2799q262
42341A794880J0677K9160M1800M3597L1762P469k4075n5683q1074r6774j02476
42330A599263j00455r4620q9286q7624r0497r6316j02075j05051j04419j01992
42320F26928j01494j06513j18214j34239j49349j57355j53256j34769j02867o1299
42310e92427j5577K8365O5576R3427J12195J24396J33171J40697J47401J51918
42300C89142J51668J44007J27457J02089O8737K8128j8817o9779j20563j66288
$$ plain form
42375 -24591 54588 148373 238955 312714 361841 383871 380791 358587 326622 295698 274774 267893
42363 267893 273370 286318 303404 326875 365057 428951 527243 662676 831044 1022117 1221468
42352 1221468 1412910 1581446 1716026 1811046 1866339 1886304 1878944 1854888 1825941 1803142 1794880
42341 1794880 1805557 1834717 1876517 1920114 1951876 1959345 1935270 1879587 1798513 1701739 1599263
42330 1599263 1498808 1404188 1314902 1227278 1136781 1040465 938390 833339 728920 626928
42320 626928 525434 418921 300707 166468 17119 -140236 -293492 -428261 -531128 -592427
42310 -592427 -608004 -579639 -514063 -420636 -308441 -184045 -50874 89823 237224 389142
42300 389142 540810 684817 812274 914363 983100 1011228 992411 922632 802069 635781
42290F35781k03545k31851k53467k71659k88478l03337l13122l13651l01508k75486
42280b120323k37183j90401j39361q6829l3800J8878O8621J11087J41911J58391
42270b309009J59858J47346J23907R5282O9500N4480N4868P0458R7247J29878
42260a306185J63332J93024K14451K23801K19361K02362J76366J45686J14111
42251C46309Q4658N9936M2277L3233L2853L9578N0996O4665P8012Q7608Q9146
42240A009271P9267N8215L1047N915r506j0803K672K8716O2875R8453J27266J42118
42228A625506J39906J23284R9640P7993O5490O5247P6405R5744J19269J42556
42218B631040J60388J67083J58186J32650R4111N0466J1647j3854k2454j7151
$$ plain form
42290 635781 432236 200385 -53082 -324741 -613219 -916556 -1229678 -1543329 -1844837 -2120323
42280 -2120323 -2357506 -2547907 -2687268 -2774097 -2807897 -2789019 -2720398 -2609311 -2467400 -2309009
42270 -2309009 -2149151 -2001805 -1877898 -1782616 -1713116 -1658636 -1603768 -1533310 -1436063 -1306185
42260 -1306185 -1142853 -949829 -735378 -511577 -292216 -89854 86512 232198 346309
42251 346309 430967 490903 533180 566413 599266 638844 689840 754505 832517 920125 1009271
42240 1009271 1088538 1146753 1177800 1183715 1174209 1163406 1166078 1194794 1257669 1356122 1483388 1625506
42228 1625506 1765412 1888696 1988336 2066329 2131819 2197066 2273471 2369215 2488484 2631040
42218 2631040 2791428 2958511 3116697 3249347 3343458 3393924 3405571 3391717 3369263 3352112
42208C352112o234O18l074j7586l7019n2168n4641m0143r768L0666P2362J05767
42196C340892J22766J18486R2283M7615r110p0218j28290j77204k12966k34431
42186B889823k43541k44461k41954k39914k40390k42850k43861k38249k21883
42177G32720j94282j58730j19932q1315m4016p467K9381O6881J03570J35589J57293
42166F19692J63295J51158J23534Q8383N6657L8089L7168N1774P5258J00398J22402
42155A627808J39230J49916J53001J46540J29423J02454O8239L0151q651m5391
42145B492720p7182j00469j11214j06080q4133m8144m596L7910P1420R1553R9155
42134B260940R9580R9633J03718J11395J17873J17010J04756Q0703M7251P799
$$ plain form
42208 3352112 3345878 3346496 3343422 3325836 3288817 3236649 3182008 3141865 3132097 3162763 3235125 3340892
42196 3340892 3463658 3582144 3674427 3722042 3712932 3642714 3514424 3337220 3124254 2889823
42186 2889823 2646282 2401821 2159867 1919953 1679563 1436713 1192852 954603 732720
42177 732720 538438 379708 259776 178461 134445 126978 156359 223240 326810 462399 619692
42166 619692 782987 934145 1057679 1146062 1202719 1240808 1277976 1329750 1405008 1505406 1627808
42155 1627808 1767038 1916954 2069955 2216495 2345918 2448372 2516611 2546762 2538111 2492720
42145 2492720 2415538 2315069 2203855 2097775 2013642 1965498 1960902 1998812 2070232 2161785 2260940
42134 2260940 2360520 2460153 2563871 2675266 2793139 2910149 3014905 3095608 3142859 3150658
42124C150658l4145p4675j09287j33961j46828j48788j42273j29264j10246q4750
42114B036441n2709j5413K4321O2396R3830J13331J16257R9765O4001J3013m5013
42103B510220r9205j39253j59061j58405j41571j14332q1715m7661j5929R273
42093A562361K3628K3894R321j7432n0440q2047j05401j16973j17467j10272r8303
42082I20869q1494n6885k1242K5866Q0575J35595J82499K14280K27140K21224
42072A848427J99947J68251J30418Q8729M3714m461n4602j03992j48596j83555
42062A984280k03994k06316j89712j57087j14836p1502l5565j3050n924j2144
42052I74150k7152m5585o2299p3016p5280o9400n8380m6345l6487k9955k6193
$$ plain form
42124 3150658 3116513 3041838 2932551 2798590 2651762 2502974 2360701 2231437 2121191 2036441
42114 2036441 1983732 1968319 1992640 2055036 2148866 2262197 2378454 2478219 2542220 2555233 2510220
42103 2510220 2411015 2271762 2112701 1954296 1812725 1698393 1616678 1569017 1553088 1562361
42093 1562361 1585989 1609883 1619204 1601772 1551332 1469285 1363884 1246911 1129444 1019172 920869
42082 920869 839375 782490 761248 787114 867689 1003284 1185783 1400063 1627203 1848427
42072 1848427 2048374 2216625 2347043 2435772 2479486 2475025 2420423 2316431 2167835 1984280
42062 1984280 1780286 1573970 1384258 1227171 1112335 1040833 1005268 992218 986294 974150
42052 974150 946998 901413 839114 766098 690818 621418 563038 516693 480206 450251 424058
42041D24058k3986k2108j9334j4359o046O197K2371M2131O4678Q8169J09332J23980
42029G95083J28044J18275R2477M9952p620p5533j46643k12837k66630l02392
42019A72176l17405l12447k91050k57380k14317j63581j07772n2222m538K8030
42009a520506M1523L6731J8837m113k3250l1166k4051l011K6375N6403Q0433R5248
41997a250547J01425J02034J00672R9769R9550R8011R1975P8871N8383L3015P285
41986c79557j4141k8437l5483l7276l6492l5451l5815l8451m3170m8882n4538
41975g87693o0139o6688p5178q6076j00006j18624j43969j76121k11181k41674
41965b067349k59308k57888k34434j88823j23643m4639L9563J19466J87378K38742
$$ plain form
42041 424058 400072 377964 358630 344271 338225 344422 366793 408924 473602 561771 671103 795083
42029 795083 923127 1041402 1133879 1183831 1176211 1100678 954035 741198 474568 172176
42019 172176 -145229 -457676 -748726 -1006106 -1220423 -1384004 -1491776 -1543998 -1548536 -1520506
42009 -1520506 -1478983 -1442252 -1423415 -1427528 -1450778 -1481944 -1505995 -1509006 -1482631 -1426228 -1345795 -1250547
41997 -1250547 -1149122 -1047088 -946416 -846647 -747097 -649086 -557111 -478240 -419857 -386842 -379557
41986 -379557 -393698 -422135 -457618 -494894 -531386 -566837 -602652 -641103 -684273 -733155 -787693
41975 -787693 -847832 -914520 -989698 -1075774 -1175780 -1294404 -1438373 -1614494 -1825675 -2067349
41965 -2067349 -2326657 -2584545 -2818979 -3007802 -3131445 -3176084 -3136521 -3017055 -2829677 -2590935
41955b590935K71604K85688K82232K64209K35990K02289J67088J33067J01544
41946f47224P2862M7095K4965Q403L93L933K0249M6968P7424J02140J12237J03082
41934b7473P6158L8314q57l1943m7907m5406k5319P600M6169Q2852J11553J28400
41922C12141J31763J22193J02479P7060N0073K2748p734m6063r4343j48502j98520
41911C23295k32367k40896k21014j76105j14460m6569J7785P1854J12886J41509
41901c64082J60005J70594J74750J73661J68935J62534J55784J48301J37624J19906
41891A208012R1532N1343K369m8088r0405j15501j17267r4107m9595Q060O8023
41880I14376J19630J54661J68430J60055J32442R1900M7049P050k0480l1386k6071
$$ plain form
41955 -2590935 -2319331 -2033643 -1751411 -1487202 -1251212 -1048923 -881835 -748768 -647224
41946 -647224 -574362 -527267 -502302 -493899 -493506 -489573 -469324 -422356 -344932 -242792 -130555 -27473
41934 -27473 48685 86999 86142 54199 6292 -39114 -64433 -56833 -10664 72188 183741 312141
41922 312141 443904 566097 668576 745636 795709 818457 810723 764660 670317 521815 323295
41911 323295 90928 -149968 -370982 -547087 -661547 -708116 -690331 -618477 -505591 -364082
41901 -364082 -204077 -33483 141267 314928 483863 646397 802181 950482 1088106 1208012
41891 1208012 1299544 1350887 1353256 1305168 1214763 1099262 981995 887888 838293 846353 914376
41880 914376 1034006 1188667 1357097 1517152 1649594 1741494 1788543 1795593 1775113 1743727 1717656
41869A717656r228J1723K8736L5184K7711P453k0324m8703p2552r0667j05278
41858A481711j19636j35603j52469j67097j74846j70975j52252j18421p2835k1712
41848A95865K7899P0644J04766J32484J58539J87378K20197K53310K79049K88885
41838A919016K77161K43446J92671J33510P6072K9553K41r670k106J7721M2396
41827B920011O3517P3587O8383M8557J9115j2964m1409o2201p3989p7913p7076
41816B847618p5580p7176q4204r7260j15477j36644j56844j70234j70173j51702
41806A612324j13702n9017P151P8404J46539K00608K28238K20100J75142J03032
41796B598819K1573m9926r7806j17901j14467r5725o9194l9206p041K7180O2277
$$ plain form
41869 1717656 1708428 1720151 1748887 1784071 1811782 1819235 1798911 1750208 1677656 1586989 1481711
41858 1481711 1362075 1226472 1074003 906906 732060 561085 408833 290412 217577 195865
41848 195865 223764 294408 399174 531658 690197 877575 1097772 1351082 1630131 1919016
41838 1919016 2196177 2439623 2632294 2765804 2841876 2871429 2871670 2862000 2859894 2877615 2920011
41827 2920011 2983528 3057115 3125498 3174055 3193170 3180206 3138797 3076596 3002607 2924694 2847618
41816 2847618 2772038 2694862 2610658 2513398 2397921 2261277 2104433 1934199 1764026 1612324
41806 1612324 1498622 1439605 1446756 1525160 1671699 1872307 2100545 2320645 2495787 2598819
41796 2598819 2620392 2570466 2472660 2354759 2240292 2144567 2075373 2036167 2029126 2056306 2118583
41785B118583R4855J20140J34229J35893J26399J07785Q1407M7993Q727l3934
41775B942077p6299j14033j42875j59256j60689j45861j14635o8262r916N4952
41765B005203J18988J74208K13977K34842K37377K25432K04219J78365J50875
41756C743486J22989R4531O4355L1010o440m7555q9874j28901j59109j75627j75849
41745C273016j59962j30545r1691m8036l696L8794P8911J17629J56042J93804
41735C424266K28036K53532K64384K56484K29544J87659J38206Q9551M8412J8136
41725E138210j217j1225j3185p234P204L0224O0246R3434J23992J45172J50679
41714E716300J36406J02367N3935Q92m5875p8289r3201r2240q0578o5501n4481
$$ plain form
41785 2118583 2213438 2333578 2467807 2603700 2730099 2837884 2919291 2967284 2976011 2942077
41775 2942077 2865778 2751745 2608870 2449614 2288925 2143064 2028429 1960167 1950251 2005203
41765 2005203 2124191 2298399 2512376 2747218 2984595 3210027 3414246 3592611 3743486
41756 3743486 3866475 3961006 4025361 4056371 4049931 4002376 3912502 3783601 3624492 3448865 3273016
41745 3273016 3113054 2982509 2890818 2842782 2839086 2877880 2956791 3074420 3230462 3424266
41735 3424266 3652302 3905834 4170218 4426702 4656246 4843905 4982111 5071662 5120074 5138210
41725 5138210 5136993 5125768 5112583 5105349 5112553 5142777 5203023 5296457 5420449 5565621 5716300
41714 5716300 5852706 5955073 6009008 6009900 5964025 5885736 5792535 5700295 5619717 5554216 5499735
41703E499735n2489n9715p1356q0049p9546o7478m5721j8441J0663M0039O9975
41692E145617J01089J33198J65743J99106K34891K74189L14884L50534L72101
41683G291352L71239L43017K87257K08797J16844K2797o3086j34388j88883k26615
41673H028331k47741k51670k37823k07124j63126j12131o2038k0336P960K1484
41663F755786K2035J2751l935k7061n6360r1097j29726j70467k11777k52124k89320
41652E558705l20142l40453l45929l33366l02394k56747k03886j52587j09517
41643C193684p6984n3371l5780k2577j3767r275p299m562J872J3140K8774M7980
41631C061835P0370R5434J21446J45061J62087J68888J63449J45760J17853Q3819
$$ plain form
41703 5499735 5447246 5387531 5316175 5236126 5156580 5089102 5043381 5024940 5035603 5075642 5145617
41692 5145617 5246706 5379904 5545647 5744753 5979644 6253833 6568717 6919251 7291352
41683 7291352 7662591 8005608 8292865 8501662 8618506 8641303 8578217 8443829 8254946 8028331
41673 8028331 7780590 7528920 7291097 7083973 6920847 6808716 6746678 6726342 6734302 6755786
41663 6755786 6777821 6790572 6786637 6759576 6703216 6612119 6482393 6311926 6100149 5848025 5558705
41652 5558705 5238563 4898110 4552181 4218815 3916421 3659674 3455788 3303201 3193684
41643 3193684 3116700 3063329 3027549 3004972 2991205 2981930 2974631 2970069 2971941 2985081 3013855 3061835
41631 3061835 3132205 3227639 3349085 3494146 3656233 3825121 3988570 4134330 4252183 4336002
41621D336002M9304J9868j336j4924k4348l3340m3569n3861o0805o0230m9316
41610D063445k8624k872K0523L4204L3262J6111j6029o0222j12756j69318k24544
41599C553180k71770l04116l16540l07537k79284k36399j84278j27908p1468j8535
41589A435345K7843O5712R4854J16230J30037J34129J25053J01401O6745K9200
41579B326549k430k3048l2904l5751l5573l4397l2002k6561j5702J799K4047M5546
41567B159573N9548O1805N2820L6786J8489P16j6462l4775n6010q0271j05031
41556B097188j25599j37000j36177j23184j00707p2627m2760j4399R711K7437
41546A381883L7407L8917L1587J5251r591m0994p5286j07722j33817j50331j55466
$$ plain form
41621 4336002 4385306 4405174 4403838 4388914 4364566 4331226 4287657 4233796 4172991 4112761 4063445
41610 4063445 4034821 4031949 4052472 4086676 4119938 4136049 4120020 4059798 3947042 3777724 3553180
41599 3553180 3281410 2977294 2660754 2353217 2073933 1837534 1653256 1525348 1453880 1435345
41589 1435345 1463188 1528900 1623754 1739984 1870021 2004150 2129203 2230604 2297349 2326549
41579 2326549 2324119 2301071 2268167 2232416 2196843 2162446 2130444 2103883 2088181 2089980 2114027 2159573
41567 2159573 2219121 2280926 2333746 2370532 2389021 2389737 2373275 2338500 2282490 2202219 2097188
41556 2097188 1971589 1834589 1698412 1575228 1474521 1401894 1359134 1344735 1354446 1381883
41546 1381883 1419290 1458207 1489794 1505045 1495454 1454460 1379174 1271452 1137635 987304 831838
41535H31838j48619j30438j03111p0224l5835l481K4109M4920N7871O3439O3846
41524E94315O2382O2120O4831P0426P7020Q1614Q1350P5079O4562N4527N1055
41513A339281N8907P9197J08613J40313J65905J77983J72539J50075J14582P1179
41503B578574K4450k1591o2819r4958j14456j19515j10787r1399o5889l8286j0665
41492A872659J6727M4283P2301J01215J31754J64099J96567K25043K43910K48234
41482C316792K36077K09408J72564J29115P9726K2868m2379j13894j86300k52538
41472C571439l05755l40640l54048l45111l14916k65871k01203j24913m2197M0210
41462A316995J14332J72143K07356K17206K03516J72288J31618Q8748M8112J1544
$$ plain form
41535 831838 683219 552781 449670 379446 343611 340130 364239 409159 467030 530469 594315
41524 594315 656697 718817 783648 854074 931094 1012708 1094058 1169137 1233699 1288226 1339281
41513 1339281 1398188 1477385 1585998 1726311 1892216 2070199 2242738 2392813 2507395 2578574
41503 2578574 2603024 2581433 2518614 2423656 2309200 2189685 2078898 1987499 1921610 1883324 1872659
41492 1872659 1889386 1933669 2005970 2107185 2238939 2403038 2599605 2824648 3068558 3316792
41482 3316792 3552869 3762277 3934841 4063956 4143682 4166550 4124171 4010277 3823977 3571439
41472 3571439 3265684 2925044 2570996 2225885 1910969 1645098 1443895 1318982 1276785 1316995
41462 1316995 1431327 1603470 1810826 2028032 2231548 2403836 2535454 2624202 2672314 2683858
41452B683858j9954m4857o1500o9637p1323o9914o7791o4710n8438m7230l1966
41441B076538j5809j884Q457J4981J6686J1401k249k2409m3585n8553o1096m7976
41429A874502j9773J8999O0381R4265J10660J02838P0340K0091l5785q4957j19947
41418B091614j40310j51004j58452j66819j76234j83344j83478j73203j52014
41409F06756j22382q8368n3922k2004N066K4859L4880L3818K2994O560r954k1759
41397D16544k6386k4166j7805j1111p053o032n588j952P776K4388M6862P3393
41385D68870J02250J32218J62498J91934K17820K35523K40052K29017K04855J74364
41375B359401J45791J25358J15314J14004J17530J21881J24623J25290J24474
$$ plain form
41452 2683858 2663904 2619047 2557547 2487910 2416587 2346673 2278882 2214172 2155734 2108504 2076538
41441 2076538 2060729 2058845 2067302 2082283 2098969 2110370 2108121 2085712 2042127 1983574 1922478 1874502
41429 1874502 1854729 1873728 1934109 2028374 2139034 2241872 2312212 2332303 2296518 2211561 2091614
41418 2091614 1951304 1800300 1641848 1475029 1298795 1115451 931973 758770 606756
41409 606756 484374 396006 342084 320080 325146 350005 384885 418703 441697 448257 438303 416544
41397 416544 390158 365992 348187 337076 330023 323991 318403 316451 324227 348615 395477 468870
41385 468870 571120 703338 865836 1057770 1275590 1511113 1751165 1980182 2185037 2359401
41375 2359401 2505192 2630550 2745864 2859868 2977398 3099279 3223902 3349192 3473666
41366C473666J22469J18753J12716J04790R6842R1330Q9731R1039R1010Q2710
41356D475056N8685J4184n0079j27194k05838k73383l18779l34362l16961k68784
41346B652545j97931j17377m1935J5978M9802O0047N3128L8592K5597J9661K1126
41335B579233K6489L1831L5931M0661M8749O1095P5873Q9764J00085J06369J10677
41324C306757J16357J25842J38733J51637J59986J60221J50707J31422J03862
41315D545524P1640M0701J7852Q048J2245K7002M5678O0570O5508N8181M1066
41304D994015K0216K441p503q316j775Q672J9401K7481L0947K8801K0947P872
41292E143199r988l2970o2280r9034j42582j89351k33462k68948k92118l02326
$$ plain form
41366 3473666 3596135 3714888 3827604 3932394 4029236 4120566 4210297 4301336 4392346 4475056
41356 4475056 4533741 4547925 4497846 4370652 4164814 3891431 3572652 3238290 2921329 2652545
41346 2652545 2454614 2337237 2295302 2311280 2361082 2421129 2474257 2512849 2538446 2558107 2579233
41335 2579233 2605722 2637553 2673484 2714145 2762894 2823989 2899862 2989626 3089711 3196080 3306757
41324 3306757 3423114 3548956 3687689 3839326 3999312 4159533 4310240 4441662 4545524
41315 4545524 4617164 4657865 4675717 4683765 4696010 4723012 4768690 4829260 4894768 4952949 4994015
41304 4994015 5014231 5016672 5009169 5000853 4999078 5007750 5027151 5054632 5085579 5114380 5135327 5143199
41292 5143199 5133211 5100241 5037961 4938927 4796345 4606994 4373532 4104584 3812466 3510140
41282C510140l01029k90298k71834k46656k15172j77799j36019r3233n4504k5180
41272A698416r256q207k0466m1519o4904q4079r4545r4971q6724p2214n3586l2693
41260A035252j2156M187J2559J1663L961n512j2024j3385j0166m367K009P828
41248A019849J3263K0130L1744N1874Q2926J24226J71260K16422K51109K68394
41238B251197K65122K42366K04328J56652J05116N4801R484k8872o0108q5204
41228C114882j05146j19696j26627j22084j02490o7182j9992L1357P7539J10094
41218B670655J23275J15161Q7943M6981r78m9299r1937j23387j39165j36965j17780
41207B384504q6166m9278j4868J1023K5397K7947J9686K051k3008n2588q2920
$$ plain form
41282 3510140 3209111 2918813 2646979 2400323 2185151 2007352 1871333 1778100 1723596 1698416
41272 1698416 1689160 1680953 1660487 1618968 1554064 1469985 1375440 1280469 1193745 1121531 1067945 1035252
41260 1035252 1023096 1027283 1039842 1051505 1055466 1049954 1037930 1024545 1014379 1010012 1012021 1019849
41248 1019849 1033112 1053242 1084986 1136860 1219786 1344012 1515272 1731694 1982803 2251197
41238 2251197 2516319 2758685 2963013 3119665 3224781 3279582 3289066 3260194 3200086 3114882
41228 3114882 3009736 2890040 2763413 2641329 2538839 2471657 2451665 2483022 2560561 2670655
41218 2670655 2793930 2909091 2997034 3044015 3043037 2993738 2901801 2778414 2639249 2502284 2384504
41207 2384504 2298338 2249060 2234192 2245215 2270612 2298559 2318245 2320296 2297288 2244700 2161780
41196B161780j09795j28900j36258j29096j06853p1573k7605J9079O1818R4736
41186A627333J14596J21943J20671J16065J12517J12108J14650J18675J22464
41177B681022J24385J22878J16843J06642R5011Q6724Q6543R6186J12252J27158
41167C755644J33233J27338J12413R4604P8490O4099M7444K3377j1270n5492j03481
41156D266399j45908j73200j79501j65256j36915j04171p6559o1024o0729p4492
41146C088644r6734j18681j31082j27526j06379p0344k4272K6921P8820J26797
41136B646164J65438J89344J94866J81441J51727J11025O6605K6749r73j1882
41126C720504n798J2626L5021N1758N5293M3082J8490j0954l6744n2324n4736
$$ plain form
41196 2161780 2051985 1923085 1786827 1657731 1550878 1479305 1451700 1470779 1532597 1627333
41186 1627333 1741929 1863872 1984543 2100608 2213125 2325233 2439883 2558558 2681022
41177 2681022 2805407 2928285 3045128 3151770 3246781 3333505 3420048 3516234 3628486 3755644
41167 3755644 3888877 4016215 4128628 4223232 4301722 4365821 4413265 4436642 4425372 4369880 4266399
41156 4266399 4120491 3947291 3767790 3602534 3465619 3361448 3284889 3223865 3163136 3088644
41146 3088644 2991910 2873229 2742147 2614621 2508242 2437898 2413626 2440547 2519367 2646164
41136 2646164 2811602 3000946 3195812 3377253 3528980 3640005 3706610 3733359 3732386 3720504
41126 3720504 3714706 3727332 3762353 3814111 3869404 3912486 3930976 3920022 3883278 3830954 3776218
41115C776218m5040k7824r999J073j72j5514m2224p4291j05054j29575j45252
41104C182346j50675j44396j25243r4142n5516j6323J7048M1550N7622O6970P0575
41093B849816O8929O3965O0384O4492Q0832J08756J41346J67676J77052J62772
41083C946020J23814O4598o189p7284j37184j76969j92807j86998j66884j42114
41073C048003j21610j11617j14937j30566j53477j75522j88241j86421j70137
41064A695475j43961j14348q7101o6136n3544n0140n5748o9071q7738j09156j31627
41053G26905j54482j76744j95631k06621k05437j90530j64498j33630j05889q8084
41043h94641q3311q9824j01790j11537j12309j00438p6197m2996n516L2096O7084
$$ plain form
41115 3776218 3731178 3703354 3693355 3694428 3694256 3678742 3636518 3562227 3457173 3327598 3182346
41104 3182346 3031671 2887275 2762032 2667890 2612374 2596051 2613099 2654649 2712271 2779241 2849816
41093 2849816 2918745 2982710 3043094 3107586 3188418 3297174 3438520 3606196 3783248 3946020
41083 3946020 4069834 4134432 4128243 4050959 3913775 3736806 3543999 3357001 3190117 3048003
41073 3048003 2926393 2814776 2699839 2569273 2415796 2240274 2052033 1865612 1695475
41064 1695475 1551514 1437166 1350065 1283929 1230385 1180245 1124497 1055426 967688 858532 726905
41053 726905 572423 395679 200048 -6573 -212010 -402540 -567038 -700668 -806557 -894641
41043 -894641 -977952 -1067776 -1169566 -1281103 -1393412 -1493850 -1570047 -1613043 -1618559 -1586463 -1519379
41032a519379R8026J24380J46106J63621J78193J92319K09297K31584K58978K88194
41022C71319L14200L32192L38974L33441L16327K89063K52429K06260J51119R0424
41012B995748L0588k1326o0543q5904r9311j04304j04528j02280r7585q8189p0518
41001B191848m1203J151N4331J11994J65110K05172K27746K34441K32178K29877
40991C612645K34106K46167K62072K74944K77725K64957K33679J84128J20019
40982E710442M7800k5083r1880j47343j87605k09784k12153j94955j61208j16582
40972D411649o8057k2401J4552L7887M4000L1916M442l2402p1718j08159j38873
40961D102836j62844j79842j89707j91857j84976j67380j38171r8231m9969L926
$$ plain form
41032 -1519379 -1421353 -1296973 -1150867 -987246 -809053 -616734 -407437 -175853 83125 371319
41022 371319 685519 1017711 1356685 1690126 2006453 2295516 2547945 2754205 2905324 2995748
41012 2995748 3026336 3005010 2944467 2858563 2759252 2654948 2550420 2448140 2350555 2262366 2191848
41001 2191848 2150645 2151796 2206127 2318121 2483231 2688403 2916149 3150590 3382768 3612645
40991 3612645 3846751 4092918 4354990 4629934 4907659 5172616 5406295 5590423 5710442
40982 5710442 5758242 5733159 5641279 5493936 5306331 5096547 4884394 4689439 4528231 4411649
40972 4411649 4343592 4321191 4335743 4373630 4417630 4449546 4453988 4421586 4349868 4241709 4102836
40961 4102836 3939992 3760150 3570443 3378586 3193610 3026230 2888059 2789828 2739859 2743785
40951B743785O1330J20271J77865K30041K72607L02923L20974L29365L32364L34838
40941E226363L41247L54650L75617M01610M27699M48626M61308M66436M68517
40932H972073M74340M90469N20637N63997O14828O63499O98204P06782O78208
40923A4383037O03838M78984L05575R5006j31436l46769n26341o55365p31887
40914A3474642p64257p65521p48087p20590o87340o49678o08035n63379n17362
40905G450393m71559m26532l81478l34565k84075k29891j74632j23389q2121n5563
40895D886588m6012n3306p5501j09338j50284j92455k29070k53585k61201k50129
40885C265707k22253j82877j39405r8844o5178l8264j5330O105K6341M4059N8160
$$ plain form
40951 2743785 2805115 2925386 3103251 3333292 3605899 3908822 4229796 4559161 4891525 5226363
40941 5226363 5567610 5922260 6297877 6699487 7127186 7575812 8037120 8503556 8972073
40932 8972073 9446413 9936882 10457519 11021516 11636344 12299843 12998047 13704829 14383037
40923 14383037 14986875 15465859 15771434 15866440 15735004 15388235 14861894 14206529 13474642
40914 13474642 12710385 11944864 11196777 10476187 9788847 9139169 8531134 7967755 7450393
40905 7450393 6978834 6552302 6170824 5836259 5552184 5322293 5147661 5024272 4942151 4886588
40895 4886588 4840576 4787270 4711769 4602431 4452147 4259692 4030622 3777037 3515836 3265707
40885 3265707 3043454 2860577 2721172 2622328 2557150 2518886 2503556 2509661 2536002 2580061 2638221
40874B638221O8670P5907P9104P6194O5126M5565J9578r257l7679o4242q9466
40863B867721j14624j40036j64211j84318j97811k04080k05053k03935k02543
40854A251110j98995j87782j62857j21816o8124r910M3547Q5116J11338J22338
40844H63965J21065J12286J01226R1787Q5093P9377P1763O0840M8031L6455K8199
40833A700087K2376J5586M328j2456l2445n1201o4713p1223p0877o3800m8786
40822A326876k4125J0395N2390R7360J39851J74334J95954K01501J90475J65494
40812B530505J31731R5318O1362L2654J0122n399j2008p472Q861L4846O5942R6568
40800C043030J21642J37969J45071J44810J39888J32442J23884J15564J08826
$$ plain form
40874 2638221 2706891 2782798 2861902 2938096 3003222 3048787 3068365 3059108 3021429 2957187 2867721
40863 2867721 2753097 2613061 2448850 2264532 2066721 1862641 1657588 1453653 1251110
40854 1251110 1052115 864333 701476 579660 511536 501626 545173 630289 741627 863965
40844 863965 985030 1097316 1198542 1290329 1375422 1454799 1526562 1587402 1635433 1671888 1700087
40833 1700087 1722463 1738049 1742377 1729921 1697476 1646275 1581562 1510339 1439462 1375662 1326876
40822 1326876 1302751 1313146 1365536 1462896 1602747 1777081 1973035 2174536 2365011 2530505
40812 2530505 2662236 2757554 2818916 2851570 2861692 2856293 2844285 2836813 2845674 2880520 2946462 3043030
40800 3043030 3164672 3302641 3447712 3592522 3732410 3864852 3988736 4104300 4213126
40791D213126J03998R9514R2718Q2287P0454O2996O6711Q5819J19395J60968K00261
40780E358247K26500K32453K17662J88908J56938J30943J14050J02636Q9511O8572
40770F886420L7957J95l9839p7374j09045j32935j48236j55295j56037j53797
40760E952014j52100j52774j54899j55485j51229j39574j18429q5861m1144J3225
40750D813744P0684J22240J59796J79320J82546J76542J70864J72969J84109J98399
40740F431213K05790J97115J68160J20908O1987j13n7329j03086j32636j43607
40730F748402j36862j16944r1572p0380o3164p7408j15275j71562k34593k90377
40720E380265l27861l42341l35559l13342k82534k48767k15648j85079j58016
$$ plain form
40791 4213126 4317124 4416638 4509356 4591643 4662097 4725093 4791804 4877623 4997018 5157986 5358247
40780 5358247 5584747 5817200 6034862 6223770 6380708 6511651 6625701 6728337 6817848 6886420
40770 6886420 6924377 6924572 6884733 6807359 6698314 6565379 6417143 6261848 6105811 5952014
40760 5952014 5799914 5647140 5492241 5336756 5185527 5045953 4927524 4841663 4800519 4813744
40750 4813744 4884428 5006668 5166464 5345784 5528330 5704872 5875736 6048705 6232814 6431213
40740 6431213 6637003 6834118 7002278 7123186 7185173 7185060 7127731 7024645 6892009 6748402
40730 6748402 6611540 6494596 6403024 6332644 6269480 6192072 6076797 5905235 5670642 5380265
40720 5380265 5052404 4710063 4374504 4061162 3778628 3529861 3314213 3129134 2971118
40711B971118j34926j15935j00949q9915q2721p8434p4517o7136n2832l0341j192
40700B142220L1270O3681R4177J22978J51803J82342K14743K47115K76374K99632
40690C826335L15063L21684L18314L02684K71649K22877J57059P9095k689p8849
40680E733222j41438j86020k12497k24388k26637k23078k15104k02140j83032
40671C918888j56987j23834q4212m0032N304M7634Q3395J10684J29485J41234
40661D031559J48168J52461J55260J56323J54930J51686J49502J52208J61200
40652E413297J72701J78280J69127J41563J00059N5552K0006M33m262k095l254
40641F241407j4497l5659o0049p8127q2197o9686m3685j0810K2174N1030P4549
$$ plain form
40711 2971118 2836192 2720257 2619308 2529393 2446672 2368238 2293721 2226585 2173753 2143412 2142220
40700 2142220 2173490 2237171 2331348 2454326 2606129 2788471 3003214 3250329 3526703 3826335
40690 3826335 4141398 4463082 4781396 5084080 5355729 5578606 5735665 5814760 5812071 5733222
40680 5733222 5591784 5405764 5193267 4968879 4742242 4519164 4304060 4101920 3918888
40671 3918888 3761901 3638067 3553855 3513823 3519127 3566761 3650156 3760840 3890325 4031559
40661 4031559 4179727 4332188 4487448 4643771 4798701 4950387 5099889 5252097 5413297
40652 5413297 5585998 5764278 5933405 6074968 6175027 6230579 6250585 6251018 6246756 6244661 6241407
40641 6241407 6226910 6191251 6131202 6053075 5970878 5901192 5857507 5846697 5868871 5919901 5994450
40630E994450R3170J07370J17147J22536J24221J23754J23492J26136J33716J46288
40620G212280J61456J75494J85424J90340J90782J86829J76849J58485J31292
40611H769231R8754O7679M5067L4706L5804M4250N5059O4013O7729O3192M8439
40600I393923K4612k484k3465k9169j4637J9440O8243J25415J84694K40447K88269
40589A0275288L26096L55054L78878M02049M27893M57851M91969N29902N71395
40580A4216375O15679O60166O99903P28853P42844P42162P31978P20409P15431
40571B0573800P22130P41440P70987Q07847Q51831R07141R81233J081560J212160
40562B8650129J372302J557843J764215J988701K230500K489368K764518L054544
$$ plain form
40630 5994450 6087620 6194990 6312137 6434673 6558894 6682648 6806140 6932276 7065992 7212280
40620 7212280 7373736 7549230 7734654 7924994 8115776 8302605 8479454 8637939 8769231
40611 8769231 8867985 8935664 8980731 9015437 9051241 9095491 9150550 9214563 9282292 9345484 9393923
40600 9393923 9418535 9416051 9392586 9363417 9348780 9368220 9436463 9561878 9746572 9987019 10275288
40589 10275288 10601384 10956438 11335316 11737365 12165258 12623109 13115078 13644980 14216375
40580 14216375 14832054 15492220 16192123 16920976 17663820 18405982 19137960 19858369 20573800
40571 20573800 21295930 22037370 22808357 23616204 24468035 25375176 26356409 27437969 28650129
40562 28650129 30022431 31580274 33344489 35333190 37563690 40053058 42817576 45872120
40554D5872120L357174L667824L977253M269279M518830M690027M734918M595026
40546G9682451M208986L529017K544567J303925q1004j456624k670365l613171
40538H3447782m240331m564744m633865m507085m242427l891422l496865l090699
40530E0780344k692703k311687j949236j604202j275591r63241o67409l89113
40522C8927162j31629R7835K87602M22939M89540M78401L90616K39828N0900j45045
40512D1108149l17388m42460n07646n12035m63563l74175k55192j14341M5182
40503C8166531K24098M25226O50992R01108J171301J453483J736711K007895K251509
40494D8988854K448328K574091K599162K490636K218136J763858J134741L71145
$$ plain form
40554 45872120 49229294 52897118 56874371 61143650 65662480 70352507 75087425 79682451
40546 79682451 83891437 87420454 89965021 91268946 91187942 89731318 87060953 83447782
40538 83447782 79207451 74642707 70008842 65501757 61259330 57367908 53871043 50780344
40530 50780344 48087641 45775954 43826718 42222516 40946925 39983684 39316275 38927162
40522 38927162 38795533 38893368 39180970 39603909 40093449 40571850 40962466 41202294 41253194 41108149
40512 41108149 40790761 40348301 39840655 39328620 38865057 38490882 38235690 38121349 38166531
40503 38166531 38390629 38815855 39466847 40367955 41539256 42992739 44729450 46737345 48988854
40494 48988854 51437182 54011273 56610435 59101071 61319207 63083065 64217806 64588951
40486F4588951m54821j254053j943207k465236k799105k956966k973223k891311
40478D6851029k752239k587186k415078k244664k078731j917891j762637j614093
40470B9478510j474014j344319j226282j119816j023427r34857q51975p73348
40462B0730472o98339o26886n59478m97351m42379l96019l57507l22384k82829
40453A6547300k30226j59019o9764L0608J31696K23866L01055L60747M01974M23310
40443A7961547M22309L96373L44311K67594J70809O1430n0791j54695k38998k94124
40433A8885765l14263k99272k55662j95749j34296q3478m8707k7931j4825l695
40423A7507887P188J5890K0225K1464K5542M1177P6484J36100K19480L20378M27696
$$ plain form
40486 64588951 64134130 62880077 60936870 58471634 55672529 52715563 49742340 46851029
40478 46851029 44098790 41511604 39096526 36851862 34773131 32855240 31092603 29478510
40470 29478510 28004496 26660177 25433895 24314079 23290652 22355795 21503820 20730472
40462 20730472 20032133 19405247 18845769 18348418 17906039 17510020 17152513 16830129 16547300
40453 16547300 16317074 16158055 16088291 16118899 16250595 16474461 16775516 17136263 17538237 17961547
40443 17961547 18383856 18780229 19124540 19392134 19562943 19624373 19573582 19418887 19179889 18885765
40433 18885765 18571502 18272230 18016568 17820819 17686523 17603045 17554338 17526407 17511582 17507887
40423 17507887 17515075 17530965 17551190 17572654 17598196 17639373 17715857 17851957 18071437 18391815 18819511
40412A8819511N27743O07191O55426O65874O36484N69382M69522L43047J96847
40403B3491027L9656j16822k58806l73627m53273m96134n06088m89828m54132
40394B0381973m04286l44049k76546k05037j32607o0783J1485Q6656J65338K43465
40384A9465609L12518L62647L86333L80964L50316L04852K59696K29892K25202
40375B2278029K47571K92241L50571M12415M67580N06904N23008N09995M62412
40366B6050726L75002K45050P6627j16497l12634m88541o26504p17916p62177
40357B3723136p63171p26260o57303n63246m52880l36440k23780j22135l4940
40348A9842981L7762R7962J48314J91179K28133K59998K87378L11381L33832L56793
$$ plain form
40412 18819511 19347254 19954445 20609871 21275745 21912229 22481611 22951133 23294180 23491027
40403 23491027 23530683 23413861 23155055 22781428 22328155 21832021 21325933 20836105 20381973
40394 20381973 19977687 19633638 19357092 19152055 19019448 18958665 18970150 19056806 19222144 19465609
40384 19465609 19778127 20140774 20527107 20908071 21258387 21563239 21822935 22052827 22278029
40375 22278029 22525600 22817841 23168412 23580827 24048407 24555311 25078319 25588314 26050726
40366 26050726 26425728 26670778 26747405 26630908 26318274 25829733 25203229 24485313 23723136
40357 23723136 22959965 22233705 21576402 21013156 20560276 20223836 20000056 19877921 19842981
40348 19842981 19880743 19978705 20127019 20318198 20546331 20806329 21093707 21405088 21738920 22095713
40338B2095713L81808M09635M40694M75623N15360N60786O12408O70125P32667
40329B6894819P96836Q57670R10389R53439R90302J027980J072136J121440J164860
40320C5789871J184160J160533J081645R45477P59931N39529L01365O1995j63940
40311D1660566l63825n27162o46747p20537p52807p53375p34889p09267o84649
40302C5767308o64156o46745o29366o08960n83390n51226n10863m59669l93933
40293C0719000l10125k06970q7036M3288J75466L01338M15454N16399O06828O92365
40283C2866007P79917Q76061R85795J111736J253739J408971J572414J737663
40275D2592303J897636K044706K170508K266338K325478K347531K342746K333068
$$ plain form
40338 22095713 22477521 22887156 23327850 23803473 24318833 24879619 25492027 26162152 26894819
40329 26894819 27691655 28549325 29459714 30413153 31403455 32431435 33503571 34625011 35789871
40320 35789871 36974031 38134564 39216209 40161686 40921617 41461146 41762511 41824506 41660566
40311 41660566 41296741 40769579 40122832 39402295 38649488 37896113 37161224 36451957 35767308
40302 35767308 35103152 34456407 33827041 33218081 32634691 32083465 31572602 31112933 30719000
40293 30719000 30408875 30201905 30114869 30158157 30333623 30634961 31050415 31566814 32173642 32866007
40283 32866007 33645924 34521985 35507780 36619516 37873255 39282226 40854640 42592303
40275 42592303 44489939 46534645 48705153 50971491 53296969 55644500 57987246 60320314
40267F0320314K347838K415583K556064K776259L070986L426707L826887M258068
40259H4998706M715042N202879N734521O325164O986468P723255Q533625R411100
40251A39630760J0345885J1323059J2317453J3286639J4163158J4847226J5202592
40244B31116772J5059845J4231889J2546721R900962O326147K038991k564817
40237B88656510o992912j0787084j3639855j5443914j6266872j6283951j5708861
40230A93533061j4745695j3564798j2295890j1030283r826255q715013p707123
40223A15648004o799159n979468n232290m540749l889620l267932k670454k096956
40215H1171376j549270j027622n28565m5636M28541R00574J375933J859719K358206
$$ plain form
40267 60320314 62668152 65083735 67639799 70416058 73487044 76913751 80740638 84998706
40259 84998706 89713748 94916627 100651148 106976312 113962780 121686035 130219660 139630760
40251 139630760 149976645 161299704 173617157 186903796 201066954 215914180 231116772
40244 231116772 246176617 260408506 272955227 282856189 289182336 291221327 288656510
40237 288656510 281663598 270876514 257236659 241792745 225525873 209241922 193533061
40230 193533061 178787366 165222568 152926678 141896395 132070140 123355127 115648004
40223 115648004 108848845 102869377 97637087 93096338 89206718 85938786 83268332 81171376
40215 81171376 79622106 78594484 78065919 78020283 78448824 79349398 80725331 82585050 84943256
40206H4943256K880327L437392M039936M693019N392611O124254O862976P572948
40198A25946719Q206568Q702977Q986176Q963984Q531965P588268O063521L961566
40190A86951744J393735j417658m180962o609922q496973r751537j0393326j0516004
40182A36979097j0244993r705358r003984q223442p423077o643247n909663n236658
40174G4588675m629720m088145l608307l186946k823019k516796k266775k066682
40166D9402285j905208j769134j648255j538900j443855j368553j315953j283035
40158C7129392j260834j237627j203366j153064j087526j011653r31615q52694
40150B8391013p78251p09548o45707n83939n20389m51786l77299k99294k22302
$$ plain form
40206 84943256 87823583 91260975 95300911 99993930 105386541 111510795 118373771 125946719
40198 125946719 134153287 142856264 151842440 160806424 169338389 176926657 182990178 186951744
40190 186951744 188345479 186927821 182746859 176136937 167639964 157888427 147495101 136979097
40182 136979097 126734104 117028746 108024762 99801320 92378243 85734996 79825333 74588675
40174 74588675 69958955 65870810 62262503 59075557 56252538 53735742 51468967 49402285
40166 49402285 47497077 45727943 44079688 42540788 41096933 39728380 38412427 37129392
40158 37129392 35868558 34630931 33427565 32274501 31186975 30175322 29243707 28391013
40150 28391013 27612762 26903214 26257507 25673568 25153179 24701393 24324094 24024800 23802498
40141B3802498j50491q5351k4937L5153J00184J75146K64119L69668M91983O28117
40131B5606089P72121R16241J052758J175591J281167J368413J437909J490372
40123C5100661J524938J538108J523957J475277J384941J246920J057280Q15801
40115D5667883N28182K07675j25586m48443p40595r89542j191918j350646j469851
40106D0087159j550777j590924j586379j535306j440304j308716j151559r81917
40098B8941277q12862o54887n13586l88969k77051j72568p1179K9696J30536K28990
40088B6439397L19164L92299M39442M54883M38350L94762L31922K57176J74631
40079B9642026Q4494j4514j20977k27885l23690l96954m41429m58019m52527m31062
$$ plain form
40141 23802498 23652007 23566656 23541719 23576872 23677056 23852202 24116321 24485989 24977972 25606089
40131 25606089 26378210 27294451 28347209 29522800 30803967 32172380 33610289 35100661
40123 35100661 36625599 38163707 39687664 41162941 42547882 43794802 44852082 45667883
40115 45667883 46196065 46403740 46278154 45829711 45089116 44099574 42907656 41557010 40087159
40106 40087159 38536382 36945458 35359079 33823773 32383469 31074753 29923194 28941277
40098 28941277 28128415 27473528 26959942 26570973 26293922 26121354 26050175 26079871 26210407 26439397
40088 26439397 26758561 27150860 27590302 28045185 28483535 28878297 29210219 29467395 29642026
40079 29642026 29726520 29712006 29591029 29363144 29039454 28642500 28201071 27743052 27290525 26859463
40069B6859463l96613l49078k88038k15460j35923n4422K6328J07182J91750K84098
40059B6029287L86339M97555O14507P33266Q50659R65000J076307J185799J294373
40050C3633092J400401J497993J576472J621031J614513J541297J393783J179606
40042D5458188R24829O69287M54830L12397K54686K76704L61295M85012O22106
40033D9819334P47038Q36577Q71485Q37651P26659N36127K69931o1427m40154
40024E4143221q40920j232446j581928j861240k052330k149538k158615k093906
40016D0172298j975293j825039j663974j507343j362027j226973j096508r64368
40008B8550773q26428o81820n33073l85405k44868j15772J285J09438K13727L18468
$$ plain form
40069 26859463 26462850 26113772 25825734 25610274 25474351 25419929 25446257 25553439 25745189 26029287
40059 26029287 26415626 26913181 27527688 28260954 29111613 30076613 31152920 32338719 33633092
40050 33633092 35033493 36531486 38107958 39728989 41343502 42884799 44278582 45458188
40042 45458188 46383017 47052304 47507134 47819531 48074217 48350921 48712216 49197228 49819334
40033 49819334 50566372 51402949 52274434 53112085 53838744 54374871 54644802 54583375 54143221
40024 54143221 53302301 52069855 50487927 48626687 46574357 44424819 42266204 40172298
40016 40172298 38197005 36371966 34707992 33200649 31838622 30611649 29515141 28550773
40008 28550773 27724345 27042525 26509452 26124047 25879179 25763407 25764692 25874130 26087857 26406325
39998B6406325M25182N31777O33032P21977P91532Q36085Q53124Q45289Q22229
39989C2866552Q00575Q00624Q40359R29737J068245J246534J450434J664626J873833
39980D3541519K061230K205750K280814K255805K099888J787849J308808O77253
39972E8218916n9275q24060j529597k102699k503002k726475k795977k747239
39964D2930592k617432k438731k235900k026272j820793j625716j444701j280907
39956B7440140j138132j020330r29946q66603q27212q07214q01799q06371q16488
39947A9426045q27794q35994q36652q25246p98029p53688o94528o26026n54829
39938A2673259m86368m23315l65178l09181k52109j92503j32012p4917k6081J1426
$$ plain form
39998 26406325 26831507 27363284 27996316 28718293 29509825 30345910 31199034 32044323 32866552
39989 32866552 33667127 34467751 35308110 36237847 37306092 38552626 40003060 41667686 43541519
39980 43541519 45602749 47808499 50089313 52345118 54445006 56232855 57541663 58218916
39972 58218916 58159641 57335581 55805984 53703285 51200283 48473808 45677831 42930592
39964 42930592 40313160 37874429 35638529 33612257 31791464 30165748 28721047 27440140
39956 27440140 26302008 25281678 24351732 23485129 22657917 21850703 21048904 20242533 19426045
39947 19426045 18598251 17762257 16925605 16100359 15302330 14548642 13854114 13228088 12673259
39938 12673259 12186891 11763576 11398398 11089217 10837108 10644605 10512593 10437676 10411595 10423021
39928A0423021L7465N4272O4949P2312P8743Q6567R8144J15402J39138J68577
39918A1338590K01495K34967K66567K95562L23495L53938L91601M41105N05657
39909A4352977N86073O80395P84321Q92170R98254J098159J189461J271453J344017
39900B3197280J405834J451995J471484J446095J352600J168482Q79703M88237
39892C2861710J6913m91054r79932j395368j698779j875720j935512j904117j814057
39883B0784084j694834j566465j437890j309841j179592j044864r05801p65270
39875A0879527o27968m98801l81617k79153j93773j27794q2811n8660n2809o0614
39865H515527p6334r4639j11845j25977j36031j41782j44794j49225j60511j82004
$$ plain form
39928 10423021 10460486 10514758 10579707 10652019 10730762 10817329 10915473 11030875 11170013 11338590
39918 11338590 11540085 11775052 12041619 12337181 12660676 13014614 13406215 13847320 14352977
39909 14352977 14939050 15619445 16403766 17295936 18294190 19392349 20581810 21853263 23197280
39900 23197280 24603114 26055109 27526593 28972688 30325288 31493770 32373473 32861710
39892 32861710 32878623 32387569 31407637 30012269 28313490 26437770 24502258 22598141 20784084
39883 20784084 19089250 17522785 16084895 14775054 13595462 12550598 11644797 10879527
39875 10879527 10251559 9752758 9371141 9091988 8898215 8770421 8687610 8628950 8576141 8515527
39865 8515527 8439193 8344554 8232709 8106732 7970701 7828919 7684125 7534900 7374389 7192385
39855G192385k12157k44631k71194k85100k82714k63171k27317j77211j16250
39846E112640m8970K0047Q7388J50692K06915K50881K76281K79111K61001K29560
39836F825546J95425J67944J52198J48450J53409J61813J67702J65783J53248
39827H291518J31076J03119P3036M1479O111l5782q4815j39204j96111k52753
39817G937674l06297l53375l90057m12366m16711l99996l60040k96856k14327
39808D787649j20664k6535N8266J27455J78629K11792K27360K25020K04020J64914
39798F037906J11299M9716j2862p1818j25334j72287k10154k35355k45610k41960
39788D883541k28639k11044j93232j76492j59659j40765j18889r4878p0594m7520
$$ plain form
39855 7192385 6980228 6735597 6464403 6179303 5896589 5633418 5406101 5228890 5112640
39846 5112640 5063670 5083717 5171105 5321797 5528712 5779593 6055874 6334985 6595986 6825546
39836 6825546 7020971 7188915 7341113 7489563 7642972 7804785 7972487 8138270 8291518
39827 8291518 8422594 8525713 8598749 8640228 8646339 8610557 8525742 8386538 8190427 7937674
39817 7937674 7631377 7278002 6887945 6475579 6058868 5658872 5298832 5001976 4787649
39808 4787649 4666985 4640450 4698716 4826171 5004800 5216592 5443952 5668972 5872992 6037906
39798 6037906 6149205 6198921 6186059 6114241 5988907 5816620 5606466 5371111 5125501 4883541
39788 4883541 4654902 4443858 4250626 4074134 3914475 3773710 3654821 3559943 3489349 3441829
39778C441829k5868m867J6299L7719N8416P6303Q8243R0682Q1177O0247L2316
39767C952496M870j3780j6850o01L5240Q7529J49894K13401K68324L06764L24523
39756E311810L20771K95886K49828J82743R7082j094j03129k00437k86948l59831
39746E506681m18260m61026m84686m83947m54424l96082l14609k19427j19824
39737B154396k2103P0224J53865K23356K71227K90939K80593K44833J93690J39239
39727D000259R1871N7750L7933K9111K5439K0729J0142q908l6439o9872j04556
39716D053459j34955j56221j65249j60869j43307j13569p3260k5068K6408P4444
39706C181813J11365J30945J30748J13099Q4102N1170K0261n710k6478m2752n4656
$$ plain form
39778 3441829 3415961 3411094 3427393 3465112 3523528 3599831 3688074 3778756 3859933 3920180 3952496
39767 3952496 3957366 3943586 3926736 3926135 3961375 4048904 4198798 4412199 4680523 4987287 5311810
39756 5311810 5632581 5928467 6178295 6361038 6458120 6457026 6353897 6153460 5866512 5506681
39746 5506681 5088421 4627395 4142709 3658762 3204338 2808256 2493647 2274220 2154396
39737 2154396 2132293 2202517 2356382 2579738 2850965 3141904 3422497 3667330 3861020 4000259
39727 4000259 4092130 4149880 4187813 4216924 4242363 4263092 4273234 4264326 4227887 4158015 4053459
39716 4053459 3918504 3762283 3597034 3436165 3292858 3179289 3106029 3080961 3107369 3181813
39706 3181813 3293178 3424123 3554871 3667970 3752072 3803242 3823503 3817793 3791315 3748563 3693907
39695C693907o1344o1562n4477m0357k0814J568K3943M3409N6464N8684M5914
39684C685335J6615k6313p5745j22286j56764j72281j65564j37547r3038l9210
39674B713202J6711O9765J18244J62607K02884K36449K57934K61296K42533K01295
39664D482920J40849O6956j3295r2453j63588k21264k62348k86168k93904k87577
39654C070128k69293k41093k05255j64547j22019q0517m2106p741K2698M9898
39644B010153P4289R5516J12726J25321J33269J36708J35548J29633J18984J03404
39634C175551Q1790N2541J5426k6268o5352r2956j02336r2052o6575l4121l348
39623B842300J9094K9396K6540J2006j0708l7218o3664q7717j08448j25137j35783
$$ plain form
39695 3693907 3632563 3571001 3516524 3476167 3455353 3456921 3480864 3524273 3580737 3639421 3685335
39684 3685335 3701950 3675637 3599892 3477606 3320842 3148561 2982997 2845450 2752412 2713202
39674 2713202 2729913 2799678 2917922 3080529 3283413 3519862 3777796 4039092 4281625 4482920
39664 4482920 4623769 4690725 4677430 4584977 4421389 4200125 3937777 3651609 3357705 3070128
39654 3070128 2800835 2559742 2354487 2189940 2067921 1987404 1945298 1937557 1960255 2010153
39644 2010153 2084442 2179958 2292684 2418005 2551274 2687982 2823530 2953163 3072147 3175551
39634 3175551 3257341 3309882 3325308 3299040 3233688 3140732 3038396 2946344 2879769 2845648 2842300
39623 2842300 2861394 2890790 2917330 2929336 2918628 2881410 2817746 2730029 2621581 2496444 2360661
39612B360661j36837j24897r9380o3778k4125J4030M7694P6523J01807J25509
39602B277207J49470J74515J99620K21733K36362K38568K24038J90071J36427
39593D048011O5999j4887r6850j68972k21560k49094k51836k34917k05138j67228
39583B503528j21690o5579M302Q7884J80189K72337L54298M17901M58962M78182
39573D570314M80612M73703M64343M56092M48094M36374M16627L86634L46957
39564H479750K99885K47799J91823J31044O2465j7993j13126k21604l36415m46015
39554H277613n38048o03552o39221o46606o29341n90804n33882m62299l81812
39545C252048k99987k24883j63583j20856r7898r1536r4904r9816r9745r1766
$$ plain form
39612 2360661 2223824 2098927 1999547 1935769 1911644 1925674 1973368 2049891 2151698 2277207
39602 2277207 2426677 2601192 2800812 3022545 3258907 3497475 3721513 3911584 4048011
39593 4048011 4114010 4099123 4002273 3833301 3611741 3362647 3110811 2875894 2670756 2503528
39583 2503528 2381838 2316259 2320561 2408445 2588634 2860971 3215269 3633170 4092132 4570314
39573 4570314 5050926 5524629 5988972 6445064 6893158 7329532 7746159 8132793 8479750
39564 8479750 8779635 9027434 9219257 9350301 9412766 9394773 9281647 9060043 8723628 8277613
39554 8277613 7739565 7136013 6496792 5850186 5220845 4630041 4096159 3633860 3252048
39545 3252048 2952061 2727178 2563595 2442739 2344841 2253305 2158401 2058585 1958840 1867074
39535A867074p6682n7915m0131k8041k5171l2594m8376o8575q9322j08287j24342
39524A167638j36222j42081j40522j31712j17206r8968p8992n9585m3272l1854
39514A87224k5544k3072k2302k0496j4421r74K1589N2801R0175J30075J68492
39503E43547K01474K25274K36596K33108K14228J82141J42329J03033P3321O0141
39493B215192O5485Q5254J10889J33074J45093J43755J28038R7806N4165P20n6344
39482C123127j10212j55870j90984k14593k25171k19952j96450j55115j01096
39473A553684m3569P129M2624N8253N3240L0299m885m4631q0978j07386j19646
39462A344134j16056r7689o8659l5585n881J4179K0675J2541q169l6703o7127
$$ plain form
39535 1867074 1790392 1732477 1692346 1664305 1639134 1606540 1558164 1489589 1400267 1291980 1167638
39524 1167638 1031416 889335 748813 617101 499895 400927 321935 262350 219078 187224
39514 187224 161680 138608 116306 95810 81389 80415 102004 154805 244980 375055 543547
39503 543547 745021 970295 1206891 1439999 1654227 1836368 1978697 2081730 2155051 2215192
39493 2215192 2280677 2365931 2476820 2609894 2754987 2898742 3026780 3124586 3178751 3179471 3123127
39482 3123127 3012915 2857045 2666061 2451468 2226297 2006345 1809895 1654780 1553684
39473 1553684 1510115 1517244 1559868 1618121 1671361 1701660 1696775 1652144 1571166 1463780 1344134
39462 1344134 1228078 1130389 1061730 1026145 1020264 1034443 1055118 1067659 1059490 1022787 955660
39451I55660r4289j14486j24828j23000j08724q5397n9475l7408k2804j5854j4569
39440A54826j6130j7579j6524j2045n396J55L70q149k5793m8700o9712q1538p9964
39427b26179o4880l8832n127L2750P0568J03409J27168J40604J46113J48523J52878
39416E86995J62505J78083J97540K16627K30162K33837K25974K08298J85256J62132
39406B587409J42814J28192J15884J01570Q1326N3627J9823j6887n2687q3642
39396C077429j06043j17774j20029j17453j15648j17880j23771j30631j35494
39387A992706j36127j31097j19866j02820q0594n2828j7657K7131Q1972J44030
39377A604850K07399K64733L09113L35100L38841L17796K71013K00302J11739
$$ plain form
39451 955660 861371 746885 622057 499057 390333 304936 245461 208053 185249 169395 154826
39440 154826 138696 121117 104593 92548 87152 87307 87677 79528 53735 5035 -64677 -146215 -226179
39427 -226179 -291059 -329891 -335018 -302268 -231700 -128291 -1123 139481 285594 434117 586995
39416 586995 749500 927583 1125123 1341750 1571912 1805749 2031723 2240021 2425277 2587409
39406 2587409 2730223 2858415 2974299 3075869 3157195 3210822 3230645 3213758 3161071 3077429
39396 3077429 2971386 2853612 2733583 2616130 2500482 2382602 2258831 2128200 1992706
39387 1992706 1856579 1725482 1605616 1502796 1422202 1369374 1351717 1378848 1460820 1604850
39377 1604850 1812249 2076982 2386095 2721195 3060036 3377832 3648845 3849147 3960886
39368C960886J6153p2473j40743j80033j89060j73508j43293j09155q0026o1660
39358B827088n6214o2394p5948r0732j00438j00715r0749p3353n3572l6641k6237
39347B060095k3389k6402l2115l8258m5192n5413p1047r1648j14024j33658j46043
39336A282906j47171j33882j04697o0991p544M7926R6554J30919J47442J47325
39326A398787J35739J19985J07463J03729J10982J27694J49794J72612J92308
39317B619093K06305K13145K12341K04351J90614J73544J56169J41276J30376
39308D247214J23180J17888J12105J04116R4136Q4621P8912P8812Q3120Q8357
39298E212461R0732Q7354P6057N5079K3735j6434o1634j07365j50312j88668k20690
$$ plain form
39368 3960886 3977039 3904566 3763823 3583790 3394730 3221222 3077929 2968774 2888748 2827088
39358 2827088 2770874 2708480 2632532 2541800 2441362 2340647 2249898 2176545 2122973 2086332 2060095
39347 2060095 2036706 2010304 1978189 1939931 1894739 1839326 1768279 1676631 1562607 1428949 1282906
39336 1282906 1135735 1001853 897156 836165 828621 876547 973101 1104020 1251462 1398787
39326 1398787 1534526 1654511 1761974 1865703 1976685 2104379 2254173 2426785 2619093
39317 2619093 2825398 3038543 3250884 3455235 3645849 3819393 3975562 4116838 4247214
39308 4247214 4370394 4488282 4600387 4704503 4798639 4883260 4962172 5040984 5124104 5212461
39298 5212461 5303193 5390547 5466604 5521683 5545418 5528984 5467350 5359985 5209673 5021005 4800315
39287D800315k43171k51708k42711k15337j71809j16312n3619J1994P7512J41375
39277C736529K02540K58597L04358L32475L36145L12244K62771J93612J11648
39268F050919K2354p0764j65325k59139l49821m34637n10350n73413o20682o50055
39258B439087o60388o50821o20283n67731m93194l99312k92488j82400p9603P500
39248a499633P4542J21469J51942J72276J89234K06891K24379K36471K36836K21788
39238C36195J92406J54256J14930Q0576N3391L1782J2842n214k2520l8602n3390
39227H56652o7269q0504r2593j01819j05369j00213q4479n8720k6474O303L3186
39216A78701N0126N7334N8744N9449O3176P1164Q2120R2559R7781R3811P9405
$$ plain form
39287 4800315 4557144 4305436 4062725 3847388 3675579 3559267 3505648 3517642 3595154 3736529
39277 3736529 3939069 4197666 4502024 4834499 5170644 5482888 5745659 5939271 6050919
39268 6050919 6073273 6002509 5837184 5578045 5228224 4793587 4283237 3709824 3089142 2439087
39258 2439087 1778699 1127878 507595 -60136 -553330 -952642 -1245130 -1427530 -1507133 -1499633
39248 -1499633 -1425091 -1303622 -1151680 -979404 -790170 -583279 -358900 -122429 114407 336195
39238 336195 528601 682857 797787 878363 931754 963536 976378 971164 948644 910042 856652
39227 856652 789383 708879 616286 514467 409098 308885 224406 165686 139212 145515 178701
39216 178701 228827 286161 344905 404354 467530 538694 620814 713373 811154 904965 984370
39205I84370N6975L2113J2282N005J5538M4778Q8566J39021J87212K25868K51204
39194B042932K63445K66224K65432K67900K79799L04604L41379L84682M26490
39185D842887M59034M76919M77850M61979M30278L82771L17932K34236J33058
39176H216944K0792r1559j91145k66807l11882l25556l12560k81153k40049j95669
39166F021356j51159j07402o4745k4172J2270M1556O0194O5231N5351L1197n157
39155E934520n0830j02283j55328k05543k48927k82205l02684l08251k97996k73289
39145C707184k38335j99314j62195j30543j04790q3147o3034m2109j9060N445
39135B670102K8268M4670N0290M2967K3494m506l5227o2044p9606q5670q1408
$$ plain form
39205 984370 1041345 1073458 1085740 1090745 1106283 1151061 1239627 1378648 1565860 1791728 2042932
39194 2042932 2306377 2572601 2838033 3105933 3385732 3690336 4031715 4416397 4842887
39185 4842887 5301921 5778840 6256690 6718669 7148947 7531718 7849650 8083886 8216944
39176 8216944 8237736 8146177 7955032 7688225 7376343 7050787 6738227 6457074 6217025 6021356
39166 6021356 5870197 5762795 5698050 5673878 5686148 5727704 5787898 5853129 5908480 5939677 5934520
39155 5934520 5883690 5781407 5626079 5420536 5171609 4889404 4586720 4278469 3980473 3707184
39145 3707184 3468849 3269535 3107340 2976797 2872007 2788860 2725826 2683717 2664657 2670102
39135 2670102 2698370 2743040 2793330 2836297 2859791 2855285 2820058 2758014 2678408 2592738 2511330
39124B511330o9913n4128l5707j5387N760K5498M0561M7576M3968K8569J944l3500
39112B496571p3766j13760j47732j69659j74137j58037j22345p2826j8992K8330
39102A473647N9712O9389N6565K5538j5467n6505q8537j05504j05236q9101o0927
39091A163574k5806J0960M4543P0962Q7198R1495Q3798O5895M0841J1988j7442
39080A628006m3975o3389p1085o3638m0666n900L3660P0441R9281J18635J29125
39069A790495J31158J24166J08188Q5845O2285M2906L0859K6136K6429K8492K9067
39058B486026K5404J5799K13j9459l9942n7868p1090p9220q3294q4842q5001q3963
39046A922763q0716p3358o0192m1447k0620m036J811o374k6850n3649p9131r6528
$$ plain form
39124 2511330 2441417 2387289 2351582 2336195 2341955 2367453 2408014 2455590 2499558 2528127 2530071 2496571
39112 2496571 2422805 2309045 2161313 1991654 1817517 1659480 1537135 1464309 1445317 1473647
39102 1473647 1533359 1602748 1659313 1684851 1669384 1612879 1524342 1418838 1313602 1224501 1163574
39091 1163574 1137768 1148728 1193271 1264233 1351431 1442926 1526724 1592619 1633460 1645448 1628006
39080 1628006 1584031 1520642 1449557 1385919 1345253 1339353 1373013 1443454 1542735 1661370 1790495
39069 1790495 1921653 2045819 2154007 2239852 2302137 2345043 2375902 2402038 2428467 2456959 2486026
39058 2486026 2511430 2527229 2527442 2507983 2468041 2410173 2339083 2259863 2176569 2091727 2006726 1922763
39046 1922763 1842047 1768689 1708497 1667050 1646430 1642394 1644205 1637831 1610981 1557332 1478201 1381673
39034A381673j01679r3931p6257n4133l3419j8228r976p705r087j1353j1881q282
39022I45742J660J9624M5737P7629J10704J39911J61980J76626J86016J92956
39012B058585J98936K03158K02942J95094J77303J48900J10857O5167J4138l9937
39002C335143r4465j45899j89659k21001k36677k36282k22334j98753j68552j32243
38992A489278q8105l3972L0728J03771J79967K52042L12465L55691L79655L85686
38982C367206L77408L59436L36084L09839K80349K45149K02017J50997R4436L5591
38972E758512k2210p5006j17503j43763j49263j32904r7714n0064K034N0840R0378
38961E113337J17126J30008J30054J20007J03675Q4760O5332M4818K0231j2312
$$ plain form
39034 1381673 1279994 1186063 1109806 1055673 1022254 1004026 994050 986345 977258 965905 954024 945742
39022 945742 947402 967026 1012763 1090392 1201096 1341007 1502987 1679613 1865629 2058585
39012 2058585 2257521 2460679 2663621 2858715 3036018 3184918 3295775 3360942 3375080 3335143
39002 3335143 3240678 3094779 2905120 2684119 2447442 2211160 1988826 1790073 1621521 1489278
38992 1489278 1401173 1367201 1397929 1501700 1681667 1933709 2246174 2601865 2981520 3367206
38982 3367206 3744614 4104050 4440134 4749973 5030322 5275471 5477488 5628485 5722921 5758512
38972 5758512 5736302 5661296 5543793 5400030 5250767 5117863 5020149 4970085 4972119 5022959 5113337
38961 5113337 5230463 5360471 5490525 5610532 5714207 5798967 5864299 5909117 5929348 5917036
38951E917036n5480j09176j70289k33877k94870l49176l93635m25512m42423m42982
38941B999616m27507l98070l57927l10784k60336k10083j63075j21552q6702n8930
38931F04650l8432k5332j9100j7995j9582k2025k4714k7354k8562k5715j6472
38920C39367p51J8392L5579M5248M4086L2469J3978o710k5871m1506n2706n8682
38908C42893n8042m8552k7742N121M6283Q6225J12183J13969Q9487M5997l652
38897G04170m6812p5099q5163p7209n3059j4799L5519R4975J58161K16279K58330
38886A115293K74362K59069K13796J46120O7681q660p1453j12849j30081j25616
38876A627662j05548p6765m4564j1989J9300M7944P2352R0438R9423R6261P9121
$$ plain form
38951 5917036 5861556 5752380 5582091 5348214 5053344 4704168 4310533 3885021 3442598 2999616
38941 2999616 2572109 2174039 1816112 1505328 1244992 1034909 871834 750282 663580 604650
38931 604650 566218 540886 521786 503791 484209 462184 437470 410116 381554 355839 339367
38920 339367 338616 357008 392587 437835 481921 514390 528368 521658 495787 454281 401575 342893
38908 342893 284851 236299 208557 213678 259961 346186 458369 572338 661825 707822 704170
38897 704170 657358 582259 497096 419887 366828 352029 387548 482523 640684 856963 1115293
38886 1115293 1389655 1648724 1862520 2008640 2076321 2067661 1996208 1883359 1753278 1627662
38876 1627662 1522114 1445349 1400785 1388796 1408096 1456040 1528392 1618830 1718253 1814514 1893635
38865A893635M8926R296l5128q0358j23111j59698j85505j95829j87378j59357
38855H25493j13867n5913P273O7753J18954J57110J81485J93514J95599J89972
38845A767373J78036J60556J38649J14526R1035P0272N2538L6411J9438j229k7904
38834B599701o0687r5999j27050j46792j51375j41522j21072r4140o3088k8485
38824A569491R422M9246Q8246J23422J52744J75321J90462J96716J92053J75318
38814B922441J47888J14068P9484M8351K1583l043k8990n8982r3991j33263j74737
38803B840809k15234k50213k73617k78873k61594k22714j69562j13546o5552l1838
38793I58066j2466k471N206J6523L3979N6011P8090R4848J02065R7726Q2040N7009
$$ plain form
38865 1893635 1942561 1951857 1916729 1836371 1713260 1553562 1368057 1172228 984850 825493
38855 825493 711626 655713 662986 730739 849693 1006803 1188288 1381802 1577401 1767373
38845 1767373 1945409 2105965 2244614 2359140 2450175 2520447 2572985 2609396 2628834 2627605 2599701
38834 2599701 2539014 2443015 2315965 2169173 2017798 1876276 1755204 1661064 1597976 1569491
38824 1569491 1578913 1628159 1716405 1839827 1992571 2167892 2358354 2555070 2747123 2922441
38814 2922441 3070329 3184397 3263881 3312232 3333815 3330772 3301782 3242800 3148809 3015546 2840809
38803 2840809 2625575 2375362 2101745 1822872 1561278 1338564 1169002 1055456 989904 958066
38793 958066 945600 943129 948335 964858 998837 1054848 1132938 1227786 1329851 1427577 1509617 1566626
38781A566626K6298m627k8997m0536l6071j7230J0117L8768O3799Q4761J05240
38770A768148J30224J63148K04295K51011K98950L43469L80731M08530M26751
38761D375257M37578M45288M55415M73006N00320N34986N69716N93773N95565
38752H980904N65255M96703L88532K44670P4523j07503k84024m38461n59304o42568
38742H718727o90780p09138p01328o67931o08453n25456m27530l28375k42214
38733C817522j78457j39012j19032j09750j01631q7275o3756l3308j604K5313
38723C009010M3161M9433M2523K1748j1531n2769r4382j27402j44269j41694j22018
38712B471810r2030n9883l2000j1799k38K967j319j1305k3671l3982l8500l6255
$$ plain form
38781 1566626 1592924 1588297 1559300 1518764 1482693 1465463 1475580 1514348 1578147 1662908 1768148
38770 1768148 1898372 2061520 2265815 2516826 2815776 3159245 3539976 3948506 4375257
38761 4375257 4812835 5258123 5713538 6186544 6686864 7221850 7791566 8385339 8980904
38752 8980904 9546159 10042862 10431394 10676064 10750587 10643084 10359060 9920599 9361295 8718727
38742 8718727 8027947 7318809 6617481 5949550 5341097 4815641 4388111 4059736 3817522
38733 3817522 3639065 3500053 3381021 3271271 3169640 3082365 3018609 2985301 2983697 3009010
38723 3009010 3052171 3101604 3144127 3165875 3154344 3101575 3007193 2879791 2735522 2593828 2471810
38712 2471810 2379780 2319897 2287897 2276098 2275860 2278827 2277508 2266203 2242532 2208550 2170050 2133795
38700B133795k9563k2430j8335j9203k5700l7971n5992p9552j08095j40265j73443
38689A423246k03784k27258k41082k44506k38560k25170k06264j82933j54664
38680e00975j19215p3603j6179N1521J24239J93993K51865K89920L02978K89975
38670G94519K54329K02942J44276Q6388L5563m459l2765n0897o1660o7498o9398
38659A231340o7174o0657n0780l9769l0673k6632k9838m0256n5113p0013q1184
38648F79251q7013q7917q5366q1074p6297p0799o2336m7809k5767J888L0506N5062
38636A42329P2453Q2372Q6650Q7921Q8659R1134R7702J10273J28802J50169J68793
38625A307257J78650J75235J56379J22267P5518K1598l0894p1041q8107p5305
$$ plain form
38700 2133795 2104232 2081802 2063467 2044264 2018564 1980593 1924601 1845049 1736954 1596689 1423246
38689 1423246 1219462 992204 751122 506616 268056 42886 -163378 -346311 -500975
38680 -500975 -620190 -693793 -709972 -658451 -534212 -340219 -88354 201566 504544 794519
38670 794519 1048848 1251790 1396066 1482454 1518017 1513558 1480793 1429896 1368236 1300738 1231340
38659 1231340 1164166 1103509 1052729 1012960 982287 955655 925817 885561 830448 760435 679251
38648 679251 592238 504321 418955 337881 261584 190785 128449 80640 54873 56761 87267 142329
38636 142329 214782 297154 383804 471725 560384 651518 749220 859493 988295 1138464 1307257
38625 1307257 1485907 1661142 1817521 1939788 2015306 2036904 2006010 1934969 1846862 1771557
38615A771557l3042L0388J01183J64208K07153K23648K14619J87279J51652J16189
38605C134834Q5009N8197L4144J1592r899l0489n0249o8683q4187r4248r6151
38594B889870q7692o7609l5960N579N3892J05111J55258K00169K35065K54813
38584C708496K55174K34175J92612J33751O2926j2716q4928j45859j89687k13337
38574C940607k16173j99349j65601j19206o5318q619M7567J00708J47645J84170
38564C646431K06544K13372K05950J87000J59606J27274R4143O4094L9289J9451
38554D963154K354j5305l7121o6229j04536j52107k06818k64125l17208l57789
38544C444270l77444l69001l28065k55045j56680m5155O5686J64675K45266L04543
$$ plain form
38615 1771557 1738515 1768903 1870086 2034294 2241447 2465095 2679714 2866993 3018645 3134834
38605 3134834 3219843 3278040 3312184 3323776 3313877 3283388 3233139 3164456 3080269 2986021 2889870
38594 2889870 2802178 2734569 2698609 2704188 2758080 2863191 3018449 3218618 3453683 3708496
38584 3708496 3963670 4197845 4390457 4524208 4587134 4574418 4489490 4343631 4153944 3940607
38574 3940607 3724434 3525085 3359484 3240278 3174960 3166341 3213908 3314616 3462261 3646431
38564 3646431 3852975 4066347 4272297 4459297 4618903 4746177 4840320 4904414 4943703 4963154
38554 4963154 4965508 4950203 4913082 4846853 4742317 4590210 4383392 4119267 3802059 3444270
38544 3444270 3066826 2697825 2369760 2114715 1958035 1912880 1978566 2143241 2388507 2693050
38534B693050L41338L55510L48420L23495K85991K42071J97769J58211J27103
38525E072958J06323R5688R3214R5720R9232R8947Q9746O8059L4446n315m1964
38514E807054o6500p3744o3979m2223j5741Q858K7437L8506M2663M2447M2460
38503E747238M8533O5385R4170J31895J73279K13524K50068K82625L12209L40062
38493G658988L66836L92107M14647M33834M51450M72212N02129N45469O02354
38484A1840026O68256P35166P93529Q34219Q50337Q38526P99281P35694O50826
38475A8745860N44790M13555K51083N4554j70229m06796o31300q19735r55194
38466A7026588j031598j052720j028206r69468q87478p92438o94157o02102n24701
$$ plain form
38534 2693050 3034388 3389898 3738318 4061813 4347804 4589875 4787644 4945855 5072958
38525 5072958 5179281 5274969 5368183 5463903 5563135 5662082 5751828 5819887 5854333 5849018 5807054
38514 5807054 5740554 5666810 5602831 5560608 5544867 5553725 5581162 5619668 5662331 5704778 5747238
38503 5747238 5795771 5861156 5955326 6087221 6260500 6474024 6724092 7006717 7318926 7658988
38493 7658988 8025824 8417931 8832578 9266412 9717862 10190074 10692203 11237672 11840026
38484 11840026 12508282 13243448 14036977 14871196 15721533 16560059 17359340 18095034 18745860
38475 18745860 19290650 19704205 19955288 20009842 19839613 19432817 18801517 17981782 17026588
38466 17026588 15994990 14942270 13914064 12944596 12057118 11264680 10570523 9968421 9443720
38457I443720m67995m33975m19533m17234m18266m16024m08162l96065l82687
38448E683779l70230l58719l45807l28028l02916k70440k32528j91284j47944
38439C135883j03521o0144k1397Q576K6446L0795K2676N459j6222l7842n5898
38428B934811o8307p4793p7305p9492q4814r4394j06275j16524j21179j17857
38418A993871j06741r0729p4473o2408n6921n8111o5199p8038r6858j20555j45472
38407A038366j66581j80377j86962j89483j91654j95641k01568k08355k14745
38398f97000k19937k23722k26116k26610k23386k12897j90319j51109r3541k0843
38388b485480N8716J34347J96310K38320K58046K56345K36202K01755J57667J08979
$$ plain form
38457 9443720 8975725 8541750 8122217 7704983 7286717 6870693 6462531 6066466 5683779
38448 5683779 5313549 4954830 4609023 4280995 3978079 3707639 3475111 3283827 3135883
38439 3135883 3032362 2972218 2950821 2959397 2985843 3016638 3039314 3044773 3028551 2990709 2934811
38428 2934811 2866504 2791711 2714406 2634914 2550100 2455706 2349431 2232907 2111728 1993871
38418 1993871 1887130 1796401 1721928 1659520 1602599 1544488 1479289 1401251 1304393 1183838 1038366
38407 1038366 871785 691408 504446 314963 123309 -72332 -273900 -482255 -697000
38398 -697000 -916937 -1140659 -1366775 -1593385 -1816771 -2029668 -2219987 -2371096 -2464637 -2485480
38388 -2485480 -2426764 -2292417 -2096107 -1857787 -1599741 -1343396 -1107194 -905439 -747772 -638793
38378f38793O1003J8481j5854m2116o2412p8989r2857j03695j10531j12461j09149
38367a287373j01179r0089p8081o7368n9528n4889n2183m8641m0761k5575j762
38356a907429L0333P0036J18013J76387K46450L25332M04430M71020N12164N19044
38346I65780M89976M31296L55343K75959K03625J43130R4636N6372K6579L967
38336C046663j2278k2310k5674k2242j3622l863J169m448k4493n8599j01147j41841
38324B617315j68323j70293j43285r0147j9471N7860J31978J95767K45162K78841
38314B935404K97758L04586L02887K96052K86214K73489K56275K32697K02302
38305E387664J66449J27049Q4815L8718j2979p1091j34531k00496k65293l24929
$$ plain form
38378 -638793 -577790 -559309 -575163 -617279 -679691 -758680 -851537 -955232 -1065763 -1178224 -1287373
38367 -1287373 -1388552 -1478641 -1556722 -1624090 -1683618 -1738507 -1790690 -1839331 -1880092 -1905667 -1907429
38356 -1907429 -1877096 -1807060 -1689047 -1512660 -1266210 -940878 -536448 -65428 446736 965780
38346 965780 1455756 1887052 2242395 2518354 2721979 2865109 2959745 3016117 3042696 3046663
38336 3046663 3034385 3012075 2986401 2964159 2950537 2946674 2947843 2943395 2918902 2860303 2759156 2617315
38324 2617315 2448992 2278699 2135414 2045267 2025796 2083656 2215634 2411401 2656563 2935404
38314 2935404 3233162 3537748 3840635 4136687 4422901 4696390 4952665 5185362 5387664
38305 5387664 5554113 5681162 5765977 5804695 5791716 5720625 5586094 5385598 5120305 4795376
38295D795376l75049m10863m28337m26684m10176l87128l66105l51835l43329
38286A295870l34895l18902k89102k43311j84552j20362o0787j5750P813Q613
38276b55365p933l1415n0494n7015m7933k4551R553N0173R2728J31675J60619
38265b9958J74222J71038J54905J33183J12592R5435P8771N6937K5444j6402o5514
38254H90653j16913j65649k07747k40529k62949k75657k80420k79284k74344k68092
38244a480931k63473k63043k67786k76260k84270k85152k71216k36329j78497
38235c806957j00831j0613Q2671J69496K42508K98227L37068L61279L72374L70298
38225a684480L54839L27673K93047K56757K24182J98615J80569J68322J59122
$$ plain form
38295 4795376 4420327 4009464 3581127 3154443 2744267 2357139 1991034 1639199 1295870
38286 1295870 960975 642073 352971 109660 -74892 -195254 -256041 -271791 -263978 -255365
38276 -255365 -263298 -294713 -345207 -402222 -450155 -474706 -465153 -414980 -322252 -190577 -29958
38265 -29958 144264 315302 470207 603390 715982 811417 890188 947125 972569 956167 890653
38254 890653 773740 608091 400344 159815 -103134 -378791 -659211 -938495 -1212839 -1480931
38244 -1480931 -1744404 -2007447 -2275233 -2551493 -2835763 -3120915 -3392131 -3628460 -3806957
38235 -3806957 -3907788 -3918401 -3835730 -3666234 -3423726 -3125499 -2788431 -2427152 -2054778 -1684480
38225 -1684480 -1329641 -1001968 -708921 -452164 -227982 -29367 151202 319524 478646
38216D78646J50229J39234J24011J02789P4415L8555m288n2876j05404j59691
38206G85620k12957k61299k99455l21723l23680l03486k61953k01804j27036m2827
38196a570600M4424J27458J99340K55177K93539L16505L28264L33249L35000L35756
38186I98112L36425L36527L34513L28370L16043K95348K63854K19380J61196R1064
38176C680832J3371o5807j39904k02758k49307k76498k84247k75510k54875k26380
38166A718917j92369j54195j14052p5930m4545k3051j1633q167j0078j5329k1976
38155A047592k7581k9748k7219k0293j0549r55L807j632k0425n0766q5895j16958
38143F59378j36493j40336j27892j01611o6264k7856P893L7076N8481P3175Q2941
$$ plain form
38216 478646 628875 768109 892120 994909 1069324 1107879 1103591 1050715 945311 785620
38206 785620 572663 311364 11909 -309814 -633494 -936980 -1198933 -1400737 -1527773 -1570600
38196 -1570600 -1526176 -1398718 -1199378 -944201 -650662 -334157 -5893 327356 662356 998112
38186 998112 1334537 1671064 2005577 2333947 2649990 2945338 3209192 3428572 3589768 3680832
38176 3680832 3694203 3628396 3488492 3285734 3036427 2759929 2475682 2200172 1945297 1718917
38166 1718917 1526548 1372353 1258301 1182371 1137826 1114775 1103142 1094975 1084897 1069568 1047592
38155 1047592 1020011 990263 963044 942751 932202 931247 935054 933422 912997 862231 776336 659378
38143 659378 522885 382549 254657 153046 86782 58926 66819 103895 162376 235551 318492
38132C18492Q8446Q8361P9949O0554K9160j2545n9994j06736j46442j74773j90034
38121b5562j92418j82892j62964j35007j02326o8430l6062o901J7908L6874M7715
38110h10065M7776L5365J1330k0246n2878p9518r4341r3942p8127n0405j7406
38099a202457J2946L3667L9966K9177K67m6074j06664j75011k41368k94314l23751
38088b273616l24098k95938k45216j80606j10847m3352J5824O1617R0123R9347
38078c206762Q9779O4251K7448j4398n4011q4526j01864j06359j02049r3808q4417
38067c666716p3557n9071l9193j4196J3282L9076N8942P0044P1936O6758N8756
38056c473939N3527N7082P4403J07306J52612K02151K45551K74419K85523K80970
$$ plain form
38132 318492 406938 495299 575248 635802 664962 652417 592423 485687 339245 164472 -25562
38121 -25562 -217980 -400872 -563836 -698843 -801169 -869599 -905661 -912562 -894654 -857780 -810065
38110 -810065 -762289 -726924 -715594 -735840 -788718 -868236 -962577 -1056519 -1134646 -1185051 -1202457
38099 -1202457 -1189511 -1155844 -1115878 -1086701 -1086434 -1132508 -1239172 -1414183 -1655551 -1949865 -2273616
38088 -2273616 -2597714 -2893652 -3138868 -3319474 -3430321 -3473673 -3457849 -3396232 -3306109 -3206762
38078 -3206762 -3116983 -3052732 -3025284 -3039682 -3093693 -3178219 -3280083 -3386442 -3488491 -3582299 -3666716
38067 -3666716 -3740273 -3799344 -3838537 -3852733 -3839451 -3800375 -3741433 -3671389 -3599453 -3532695 -3473939
38056 -3473939 -3420412 -3363330 -3288927 -3181621 -3029009 -2826858 -2581307 -2306888 -2021365 -1740395
38046a740395K65761K44707K20692J94779J67217J38413J09486Q2639O1112M8427
38036b07162M6880N6032P2127Q8948R9810R9601Q6092O0244K6098r605l8693n4019
38024C26353n2226l4852p050K4900N5283P9062R1299Q7224O3429J9578m0717j10354
38012E01929j80199k40732k83671l03914l01322k80958k50943k18727j88125j58704
38002a905366j27573r2104n1825q395L5790P8906J19934J58253J93479K25600
37992a373301K54440K78376K93726K96095K83137K56581K21837J85643J53479
37983H50013J28282J10468R8553Q9783Q0632O7259M6077J4688k6708p4199j20581
37972A264267j57934j81202j90537j90951j89702j93028k03868k21016k39442
$$ plain form
38046 -1740395 -1474634 -1229927 -1009235 -814456 -647239 -508826 -399340 -316701 -255589 -207162
38036 -207162 -160282 -104250 -32123 56825 156635 256236 342328 402572 428670 419065 380372 326353
38024 326353 274127 239275 232225 257125 312408 391470 482769 569993 633422 653000 612283 501929
38012 501929 321730 80998 -202673 -506587 -807909 -1088867 -1339810 -1558537 -1746662 -1905366
38002 -1905366 -2032939 -2125043 -2176868 -2185263 -2149473 -2070567 -1950633 -1792380 -1598901 -1373301
37992 -1373301 -1118861 -840485 -546759 -250664 32473 289054 510891 696534 850013
37983 850013 978295 1088763 1187316 1277099 1357731 1424990 1471067 1485755 1459047 1384848 1264267
37972 1264267 1106333 925131 734594 543643 353941 160913 -42955 -263971 -503413
37963e03413k51500k49035k26293j82668j23510n8264K974N2484Q6395J04788
37953a348042J11010J10384J08426J09066J13651J20974J28234J32489J32027
37944b81781J27210J20352J14764J13383J17546J26474J37392J46140J48231J40277
37934A009988J21427R3850O1837L0384M281j2299j6797r948L333J5300J8572R027
37922A328955j3131m4144p8151j08666j30038j38919j35295j22377j05347q9668
37912C63219p9796p8665q7621j06447j33180j63897j92998k14545k24233k20610
37902a138773k04591j77881j42019r8639n0127L88M9573R4156J30775J55956J66911
37891a214271J63159J48132J29223J15307J12740J22618J41214J62936J83247
$$ plain form
37963 -503413 -754913 -1003948 -1230241 -1412909 -1536419 -1594683 -1591709 -1539225 -1452830 -1348042
37953 -1348042 -1237032 -1126648 -1018222 -909156 -795505 -674531 -546297 -413808 -281781
37944 -281781 -154571 -34219 80545 193928 311474 437948 575340 721480 869711 1009988
37934 1009988 1131415 1225265 1287102 1317486 1321767 1309468 1292671 1282723 1286056 1301356 1319928 1328955
37922 1328955 1315824 1271680 1193529 1084863 954825 815906 680611 558234 452887 363219
37912 363219 283423 204758 117137 10690 -122490 -286387 -479385 -693930 -918163 -1138773
37902 -1138773 -1343364 -1521245 -1663264 -1761903 -1812030 -1811642 -1762069 -1667913 -1537138 -1381182 -1214271
37891 -1214271 -1051112 -902980 -773757 -658450 -545710 -423092 -281878 -118942 64305
37882F4305J99852K12395K21606K28180K31593K29394K17872J93769J56005J06338
37872B061309M8931j0623o6439j13584j49078j72085j83173j83403j74214j58027
37862H99614j38497j19632j04195r2543q2767p2012n8220m1184k2266l344J3972
37851A78926K8232L7842M1364L8314K9671J7656N092n094j0002o878O319K9618
37839C91060N9787R0566J14852J27447J26377J12285Q7453N5701K2817m057j8711
37828A165577j8598n888J4009L5405N4640P0604Q3926R5888J07473J18552J27619
37817A849207J32533J31891J25857J15827J03546R0547P8089O7162N8354N1559
37807B804572M5763L9166K9827J6857J498j2542j9997j6030J315K9571O2277R1439
$$ plain form
37882 64305 264157 476552 698158 926338 1157931 1387325 1605197 1798966 1954971 2061309
37872 2061309 2110240 2099617 2033178 1919594 1770516 1598431 1415258 1231855 1057641 899614
37862 899614 761117 641485 537290 444747 361980 289968 231748 190564 168298 164954 178926
37851 178926 207158 245000 286364 324678 354349 372005 377097 372003 362001 355123 361442 391060
37839 391060 450847 541413 656265 783712 910089 1022374 1109827 1165528 1188345 1184288 1165577
37828 1165577 1146979 1141091 1155100 1190505 1245145 1315749 1399675 1495563 1603036 1721588 1849207
37817 1849207 1981740 2113631 2239488 2355315 2458861 2549408 2627497 2694659 2753013 2804572
37807 2804572 2850335 2889501 2919328 2936185 2937683 2925141 2905144 2889114 2890429 2920000 2982277 3073716
37795C073716J10611J16889J11267R7640Q1164O6444N6058N0013M6338M2442L6481
37784C889063K7977J7493N676p518k2628l9437n5413o5228o2239m1542k708M9566
37772C693062J07112J60900K03011K27649K31858K16344J85765J47681J10300
37763E283682Q0194O1152N4247N8375P0777Q7752J05445J20270J28783J27682
37753F178359J14601Q9093N2724Q221m0983r0145j32617j60872j69219j56448
37743E692714j26574q7403m8128j7212r29k200j9749m8239p9876j06695j22341
37732E033368j23012j08051q0315m5681j1483J5190K8576K4909L294l3574p9733
37721D623488j27377j68586j96592k06676j96809j67960j23763o9484j0572M8563
$$ plain form
37795 3073716 3184327 3301216 3412483 3510123 3591287 3657731 3713789 3763802 3810140 3852582 3889063
37784 3889063 3917040 3934533 3940209 3932691 3910063 3870626 3815213 3749985 3687746 3646204 3643496 3693062
37772 3693062 3800174 3961074 4164085 4391734 4623592 4839936 5025701 5173382 5283682
37763 5283682 5363876 5425028 5479275 5537650 5608427 5696179 5801624 5921894 6050677 6178359
37753 6178359 6292960 6382053 6434777 6442998 6402015 6311870 6179253 6018381 5849162 5692714
37743 5692714 5566140 5478737 5430609 5413397 5412468 5410268 5390519 5342280 5262404 5155709 5033368
37732 5033368 4910356 4802305 4721990 4676309 4664826 4680016 4708592 4733501 4736795 4703221 4623488
37721 4623488 4496111 4327525 4130933 3924257 3727448 3559488 3435725 3366241 3355669 3404232
37711C404232J04811J55650J98395K30459K50469K59071K58535K51565K40281
37702E353468K26172K10750J96008J83877J74932J67645J59323J48300J35778
37693F956253J25672J22239J26716J35197J39562J31345J06000O4666J2714m3204
37683G877160r7472j46622j89533k27008k60593k91090l17637l37996l49812l51714
37673E307683l43489l25390k97646k60945k17400j71007j27030r0748o5997n3777
37663C354254n1341n2492m9344l5039o341L4773Q1391J24168J55061J70159J69774
37652C895023J56231J31262R5083M7846p677o4591j13549j47026j62914j64494
37642C665194j57035j44193j26727j03619p3950l8045K286M4072Q3651J17204
$$ plain form
37711 3404232 3509043 3664693 3863088 4093547 4344016 4603087 4861622 5113187 5353468
37702 5353468 5579640 5790390 5986398 6170275 6345207 6512852 6672175 6820475 6956253
37693 6956253 7081925 7204164 7330880 7466077 7605639 7736984 7842984 7907650 7920364 7877160
37683 7877160 7779688 7633066 7443533 7216525 6955932 6664842 6347205 6009209 5659397 5307683
37673 5307683 4964194 4638804 4341158 4080213 3862813 3691806 3564776 3474028 3408031 3354254
37663 3354254 3302913 3250421 3201077 3166038 3159697 3194470 3275861 3400029 3555090 3725249 3895023
37652 3895023 4051254 4182516 4277599 4325445 4317768 4253177 4139628 3992602 3829688 3665194
37642 3665194 3508159 3363966 3237239 3133620 3059670 3021625 3023911 3067983 3151634 3268838
37632C268838J41592J55190J58106J51515J37031J16966R4866P4885N9915N0417
37622D409321M5408M4643M9497O1616Q0796J04239J27755J47909J63629J76536
37612E411349J90034K07598K30795K57836K83515L01051L05014K93351K66963
37603G747506K27540J75812J11956L7487m3357j24125j98028k59550l04921l31841
37593G038479l39418l28652l02680k66176k24004j80136j37575r8982o7133m4474
37583E049249l2009k8511l1123l7171m5900n8581p6780j00246j26123j49953j67690
37572D195162j77519j80730j81253j83740j90941k01813k11631k13837k02483
37563B451215j74287j30178p5721j9568K9922O7885R3559J08261J13065J08298
$$ plain form
37632 3268838 3410430 3565620 3723726 3875241 4012272 4129238 4224104 4298989 4358904 4409321
37622 4409321 4454729 4499372 4548869 4610485 4691281 4795520 4923275 5071184 5234813 5411349
37612 5411349 5601383 5808981 6039776 6297612 6581127 6882178 7187192 7480543 7747506
37603 7747506 7975046 8150858 8262814 8300301 8256944 8132819 7934791 7675241 7370320 7038479
37593 7038479 6699061 6370409 6067729 5801553 5577549 5397413 5259838 5160856 5093723 5049249
37583 5049249 5017240 4988729 4957606 4920435 4874535 4815954 4739174 4638928 4512805 4362852 4195162
37572 4195162 4017643 3836913 3655660 3471920 3280979 3079166 2867535 2653698 2451215
37563 2451215 2276928 2146750 2071029 2051461 2081383 2149268 2242827 2351088 2464153 2572451
37553B572451R4724P4689N2069L1112J5106N522K150L989J0148K0058L2921M7201
37541B962140O0684P1084P6708P6695P0656N7986L7780J0024k2489n3388p4506
37530C273374p9322o5465l4549R856O3948J24097J86734K48812L08569L65436
37520D401490M18852M67290N08667N41892N68051N90269O12426O37574O66667
37511I413178O97846P26386P45346P46792P23305O69335N81835M59881L04105
37502A5068009J17447r2314l10153n14605o82690p96546q47956q39056p80198
37493A0321938o86771n75951m63650l62121k78789k16398j73971j48049j33916
37484G282322j26635j21895j16597j09116r9173q7484p5664o6395o3121o8615
$$ plain form
37553 2572451 2667175 2741864 2793933 2825045 2840151 2845673 2847823 2851812 2861960 2882018 2914939 2962140
37541 2962140 3022824 3093908 3170616 3247311 3317967 3375953 3413733 3423757 3401268 3347880 3273374
37530 3273374 3194052 3128587 3094038 3103894 3167842 3291939 3478673 3727485 4036054 4401490
37520 4401490 4820342 5287632 5796299 6338191 6906242 7496511 8108937 8746511 9413178
37511 9413178 10111024 10837410 11582756 12329548 13052853 13722188 14304023 14763904 15068009
37502 15068009 15185456 15093142 14782989 14268384 13585694 12789148 11941192 11102136 10321938
37493 10321938 9635167 9059216 8595566 8233445 7954656 7738258 7564287 7416238 7282322
37484 7282322 7155687 7033792 6917195 6808079 6708906 6621422 6545758 6479363 6416242 6347627
37474F347627q3011j02904j22657j37201j44326j44746j40020j30394j14682r2471
37464E135215o6236m0857k0618o542L656J3526K5871M2039O2222Q5844J11759
37453E345879J38060J61643J78213J83357J74265J50887J15895P4095L1965l044
37443F551215k4008k6593j0421K0959O1433J04290J44107J77868K04949K26151
37433G429950K42327K53326K57645K52865K36638K07697J66834J17754O7428K5029
37423I257493q10n439R705L7600O8459R3455J07658J11093J07721J02931J00717
37412I990583J01872J04290J05401J05002J05978J12038J24714J42827J64836
37403A1057541J91386K25178K68258L19062L71490M16559M45610M53394M39249
$$ plain form
37474 6347627 6264616 6161712 6039055 5901854 5757528 5612782 5472762 5342368 5227686 5135215
37464 5135215 5068979 5028122 5007504 5000962 5004618 5018144 5044015 5086054 5148276 5234120 5345879
37453 5345879 5483939 5645582 5823795 6007152 6181417 6332304 6448199 6522294 6554259 6551215
37443 6551215 6527207 6500614 6490193 6511152 6572585 6676875 6820982 6998850 7203799 7429950
37433 7429950 7672277 7925603 8183248 8436113 8672751 8880448 9047282 9165036 9232464 9257493
37423 9257493 9256683 9251244 9260949 9298549 9367008 9460463 9568121 9679214 9786935 9889866 9990583
37412 9990583 10092455 10196745 10302146 10407148 10513126 10625164 10749878 10892705 11057541
37403 11057541 11248927 11474105 11742363 12061425 12432915 12849474 13295084 13748478 14187727
37394A4187727M05869L56967K95640K24239J45051O0593k6790j15591k05324k95629
37384A5032752l84744m68498n40895n96041o29927o41108o30605o01809n60396
$$ plain form
37394 14187727 14593596 14950563 15246203 15470442 15615493 15676086 15649296 15533705 15328381 15032752
37384 15032752 14648008 14179510 13638615 13042574 12412647 11771539 11140934 10539125 9978729
$$ [...]
##END NTUPLES=NMR SPECTRUM
##END=
