##TITLE=31Pdec_DE-28oil_TFA
 CDCl3
  64 sc
 10.1.2024
##JCAMPDX= 6.0         $$ Bruker NMR JCAMP-DX V2.0
##DATA TYPE= NMR SPECTRUM
##DATA CLASS= NTUPLES
##ORIGIN= UXNMR, Bruker Analytische Messtechnik GmbH
##OWNER= root
$$ XWIN-NMR		Version 3.5
$$ Wed Jan 10 14:58:03 2024 Russian Standard Time (UT+4h)  she@DPX200
##.OBSERVE FREQUENCY= 81.013821
##.OBSERVE NUCLEUS= ^31P
##.ACQUISITION MODE= SIMULTANEOUS
##.ACQUISITION SCHEME= undefined
##.AVERAGES= 64
##.DIGITISER RES= 16
##SPECTROMETER/DATA SYSTEM= spect
##.PULSE SEQUENCE= zgpg30
##.SOLVENT NAME= DMSO
##.SHIFT REFERENCE= (INTERNAL, DMSO, 0, 248.564)
##AUDIT TRAIL= $$ (NUMBER, WHEN, WHO, WHERE, WHAT)
$$ ##TITLE= Audit trail, XWIN-NMR		Version 3.5
$$ ##JCAMPDX= 5.01
$$ ##ORIGIN= Bruker BioSpin GmbH
$$ ##OWNER= she
$$ F:/spectra/data/she/nmr/P31/1/pdata/1/auditp.txt
$$ ##AUDIT TRAIL=  $$ (NUMBER, WHEN, WHO, WHERE, WHAT)
(   1,<2024-01-10 14:56:49.71 +0400>,<she>,<DPX200>,
      <created by zg, POWCHK disabled, PULCHK disabled
       configuration hash MD5:
       00 E9 B6 7A A2 85 ED C7 34 08 36 98 17 FE 4E 26
       data hash MD5: 32K
       FE BE F0 83 DF 5F F0 D0 AC C5 52 42 A3 06 03 86>)
(   2,<2024-01-10 14:56:52.31 +0400>,<she>,<DPX200>,
      <Start of raw data processing
       efp BC_mod = 2 LB = 10 FT_mod = 6 PKNL = 1 PHC0 = -12246.96 PHC1 = 292.2938 SI = 64K 
       data hash MD5: 64K
       81 5B 90 B9 D6 BC 8D 67 5E B6 C5 43 A7 9F 27 A7>)
(   3,<2024-01-10 14:57:28.12 +0400>,<she>,<DPX200>,
      <pk PHC0 = 48.26206 PHC1 = -78.20016 
       data hash MD5: 64K
       00 EF 4E 71 33 97 2B 75 0F 04 CD 11 B4 87 D2 7D>)
$$ ##END=
$$ 
$$ hash MD5
$$ D7 E2 C6 6F A1 6E 7A 98 8E EB CB 1A E2 09 05 D3
##$RELAX= 
##$RELAX= 
##$RELAX= 
##$RELAX= 
##$RELAX= 
##$RELAX= 
##$RELAX= 
##$RELAX= 
##$RELAX= 
$$ Bruker specific parameters
$$ --------------------------
##$DU= <F:/spectra>
##$EXPNO= 1
##$NAME= <P31>
##$PROCNO= 1
##$TYPE= <nmr>
##$USER= <she>
##$AMP= (0..31)
100 100 100 100 100 100 100 100 100 100 100 100 100 100 100 100 100 100 
100 100 100 100 100 100 100 100 100 100 100 100 100 100 
##$AQSEQ= 0
##$AQ_mod= 1
##$AUNM= <au_zg>
##$AUTOPOS= <>
##$BF1= 81.014009
##$BF2= 200.13
##$BF3= 200.13
##$BF4= 200.13
##$BF5= 200.13
##$BF6= 200.13
##$BF7= 200.13
##$BF8= 200.13
##$BYTORDA= 1
##$CFDGTYP= 0
##$CFRGTYP= 5
##$CHEMSTR= <none>
##$CNST= (0..31)
1 1 145 1 1 1 1 1 1 1 1 1 1 1 1 1 1 1 1 1 1 1 1 1 1 1 1 1 1 1 1 1 
##$CPDPRG= <waltz16>
##$CPDPRG1= <>
##$CPDPRG2= <waltz16>
##$CPDPRG3= <>
##$CPDPRG4= <mlev>
##$CPDPRG5= <mlev>
##$CPDPRG6= <mlev>
##$CPDPRG7= <mlev>
##$CPDPRG8= <mlev>
##$CPDPRGB= <>
##$CPDPRGT= <>
##$D= (0..31)
0 1 0 0 0 0 0 0 0 0 0 0.03 2e-05 3e-06 0 0 0 0 0 0 0 0 0 0 0 0 0 0 0 0 
0 0 
##$DATE= 1704884209
##$DBL= (0..7)
120 120 120 11 120 120 24 19 
##$DBP= (0..7)
150 150 150 150 150 150 150 150 
##$DBP07= 0
##$DBPNAM0= <>
##$DBPNAM1= <>
##$DBPNAM2= <>
##$DBPNAM3= <>
##$DBPNAM4= <>
##$DBPNAM5= <>
##$DBPNAM6= <>
##$DBPNAM7= <>
##$DBPOAL= (0..7)
0.5 0.5 0.5 0.5 0.5 0.5 0.5 0.5 
$$ [...]
##$SUBNAM2= <"">
##$SUBNAM3= <"">
##$SUBNAM4= <"">
##$SUBNAM5= <"">
##$SUBNAM6= <"">
##$SUBNAM7= <"">
##$SUBNAM8= <"">
##$SUBNAM9= <"">
##$SW= 501.771253377433
##$SWIBOX= (0..15)
0 1 3 0 0 0 0 0 0 0 0 0 0 0 0 0 
##$SW_h= 40650.406504065
##$TD= 32768
##$TD0= 1
##$TE= 0
##$TE2= 300
##$TE3= 300
##$TEG= 300
##$TL= (0..7)
0 120 53 12 22 120 120 120 
##$TP= (0..7)
150 150 150 150 150 150 150 150 
##$TP07= 0
##$TPNAME0= <>
##$TPNAME1= <>
##$TPNAME2= <>
##$TPNAME3= <>
##$TPNAME4= <>
##$TPNAME5= <>
##$TPNAME6= <>
##$TPNAME7= <>
##$TPOAL= (0..7)
0.5 0.5 0.5 0.5 0.5 0.5 0.5 0.5 
##$TPOFFS= (0..7)
0 0 0 0 0 0 0 0 
##$TUNHIN= 0
##$TUNHOUT= 0
##$TUNXOUT= 0
##$USERA1= <user>
##$USERA2= <user>
##$USERA3= <user>
##$USERA4= <user>
##$USERA5= <user>
##$V9= 5
##$VALIST= <valist>
##$VCLIST= <CCCCCCCCCCCCCCC>
##$VD= 0
##$VDLIST= <DDDDDDDDDDDDDDD>
##$VPLIST= <PPPPPPPPPPPPPPP>
##$VTLIST= <TTTTTTTTTTTTTTT>
##$WBST= 1024
##$WBSW= 4
##$XGAIN= (0..3)
0 0 0 0 
##$XL= 0
##$YL= 0
##$YMAX_a= 1860
##$YMIN_a= -1816
##$ZGOPTNS= <>
##$ZL1= 120
##$ZL2= 120
##$ZL3= 120
##$ZL4= 120
##$ABSF1= 0
##$ABSF2= 0
##$ABSG= 0
##$ABSL= 0
##$ALPHA= 0
##$AQORDER= 0
##$ASSFAC= 0
##$ASSFACI= 0
##$ASSFACX= 0
##$ASSWID= 0
##$AUNMP= <proc_1d>
##$AZFE= 0.1
##$AZFW= 0.5
##$BCFW= 0
##$BC_mod= 2
##$BYTORDP= 0
##$COROFFS= 0
##$CY= -3
##$DATMOD= 1
##$DC= 0
##$DFILT= <>
##$DTYPP= 0
##$F1P= 0
##$F2P= 0
##$FCOR= 1
##$FTSIZE= 65536
##$FT_mod= 6
##$GAMMA= 0
##$GB= 0
##$INTBC= 1
##$INTSCL= 6.047779e-11
##$ISEN= 30
##$LB= 10
##$LEV0= 0
##$LPBIN= 0
##$MAXI= 10000
##$MC2= 0
##$MEAN= 0
##$ME_mod= 0
##$MI= 50
##$NCOEF= 0
##$NC_proc= -10
##$NLEV= 6
##$NOISF1= 182.463
##$NOISF2= 159.3651
##$NSP= 0
##$NTH_PI= 0
##$NZP= 0
##$OFFSET= 248.5645
##$PC= 4
##$PHC0= -12198.7
##$PHC1= 214.0936
##$PH_mod= 1
##$PKNL= yes
##$PPARMOD= 0
##$PSCAL= 0
##$PSIGN= 0
##$REVERSE= no
##$SF= 81.0140089999694
##$SI= 65536
##$SIGF1= 159.3651
##$SIGF2= -187.1042
##$SINO= 113.3802
##$SIOLD= 16384
##$SREGLST= <1H.CDCl3>
##$SSB= 0
##$STSI= 65536
##$STSR= 0
##$SW_p= 40650.406504065
##$SYMM= 0
##$S_DEV= 0
##$TDeff= 32768
##$TDoff= 0
##$TI= <>
##$TILT= no
##$TM1= 0
##$TM2= 0
##$TOPLEV= 0
##$USERP1= <user>
##$USERP2= <user>
##$USERP3= <user>
##$USERP4= <user>
##$USERP5= <user>
##$WDW= 1
##$XDIM= 65536
##$YMAX_p= 290500101
##$YMIN_p= -105874879
$$ End of Bruker specific parameters
$$ ---------------------------------
##NTUPLES= NMR SPECTRUM
##VAR_NAME=  FREQUENCY,     SPECTRUM/REAL,   SPECTRUM/IMAG
##SYMBOL=    X,             R,               I
##VAR_TYPE=  INDEPENDENT,   DEPENDENT,       DEPENDENT
##VAR_FORM=  AFFN,          ASDF,            ASDF
##VAR_DIM=   65536,         65536,           65536
##UNITS=     HZ,            ARBITRARY UNITS, ARBITRARY UNITS
##FACTOR=    0.620285442955139, 1,           1
##FIRST=     20137.2065510682, 0,            0
##LAST=      -20513.1999529968, 0,           0
##MIN=       -20513.1999529968, -105874879,  0
##MAX=       20137.2065510682, 290500101,    0
$$ Real data points
##PAGE= N=1
##DATA TABLE= (X++(R..R)), XYDATA
$$ [...]
42907c733715J133835J073068R63041Q21216O71052N34831M30006L68598L55906
42898B617838L87435M47569N13336N62514N82227N73713N49372N21380M88500
42889G243884M32927L32571J79809r168k01304l62570m70892n20426n18912m82243
42879E623676m29190l77177l37922l12712k90635k54390j92237j07162j5109O6021
42869C373163J26963J69732K03314K38333K84667L51468M46419N72202P21225
42860F487486Q72208R92498J047139J011006Q77271O57125L72308M7212k94778
42851A2069475o33035r53823j254302j538485j803630k028242k175244k210574
42843e27860k122879j929788j669010j383573j110756q77395o98509n75663m94651
$$ y = [-3733715, -2599880, -1526812, -563771, 257445, 928497, 1463328, 1893334, 2261932, 2617838, 3005273, 3452842, 3966178, 4528692, 5110919, 5684632, 6234004, 6755384, 7243884, 7676811, 8009382, 8189191, 8180023, 7978719, 7616149, 7145257, 6624831, 6105919, 5623676, 5194486, 4817309, 4479387, 4166675, 3876040, 3621650, 3429413, 3322251, 3307142, 3373163, 3500126, 3669858, 3873172, 4111505, 4396172, 4747640, 5194059, 5766261, 6487486, 7359694, 8352192, 9399331, 10410337, 11287608, 11944733, 12317041, 12364253, 12069475, 11436440, 10482617, 9228315, 7689830, 5886200, 3857958, 1682714, -527860, -2650739, -4580527, -6249537, -7633110, -8743866, -9621261, -10319770, -10895433, -11390084]
42834a1390084m25804l30395j72926O5556L79062P36338J088314J381073J570685
42825g098181J635021J577539J420714J191599R06781N66080J60488l10235q23691
42816g73885j336439j799206k171776k425530k535647k475660k224441j783669
42808a7526253j193670n33954R6758O12043R61879J135820J149261J029135Q09719
42799a3459262N34308K52852J3077j49589k18456j97330j07386K1327J61356K96892
42789a2852211M26558N59959P10319Q85589J080724J273839J428046J499493J450682
42780c537002J264606R51992N46819R4333l59144p70360j101016j321367j414079
42771e645218j375361j214588r55365o36728l09462k5415J76109K77418K82592
$$ y = [-11390084, -11815888, -12146283, -12319209, -12253653, -11874591, -11138253, -10049939, -8668866, -7098181, -5463160, -3885621, -2464907, -1273308, -366527, 199553, 360041, 49806, -773885, -2110324, -3909530, -6081306, -8506836, -11042483, -13518143, -15742584, -17526253, -18719923, -19253877, -19157119, -18545076, -17583197, -16447377, -15298116, -14268981, -13459262, -12924954, -12672102, -12659025, -12808614, -13027070, -13224400, -13331786, -13310459, -13149103, -12852211, -12425653, -11865694, -11155375, -10269786, -9189062, -7915223, -6487177, -4987684, -3537002, -2272396, -1320404, -773585, -679252, -1038396, -1808756, -2909772, -4231139, -5645218, -7020579, -8235167, -9190532, -9827260, -10136722, -10162137, -9986028, -9708610, -9426018]
42762i426018K10812Q9957m5422j55966k06665j82270r6894J2210J02208J39938
42752i558110J07653L715j56147l39695n07838o32585p12251p70667q37007r17972
42742a4320904r82347r71060q27672n29661j02200L90101Q65277J248437J490444
42733a3739585J576094J519811J351899J104029Q02576M70686J31592j93350m89460
42724g465708p48565r61516j110730j171523j122538r57669o92058l60241q478
42715a4599026L15883N75028P48046Q32725Q41464P93824P10212O10295N14908
42706h656641M45158M13934M13645M11672L62462K32921K5697k16193m27871n52032
42696g547248n59702m51584k45886L2925L56577O90668R96148J237723J395078
$$ y = [-9426018, -9215206, -9125249, -9170671, -9326637, -9533302, -9715572, -9812466, -9800256, -9698048, -9558110, -9450457, -9446742, -9602889, -9942584, -10450422, -11083007, -11795258, -12565925, -13402932, -14320904, -15303251, -16274311, -17101983, -17631644, -17733844, -17343743, -16478466, -15230029, -13739585, -12163491, -10643680, -9291781, -8187752, -7385176, -6914490, -6782898, -6976248, -7465708, -8214273, -9175789, -10286519, -11458042, -12580580, -13538249, -14230307, -14590548, -14599026, -14283143, -13708115, -12960069, -12127344, -11285880, -10492056, -9781844, -9171549, -8656641, -8211483, -7797549, -7383904, -6972232, -6609770, -6376849, -6351152, -6567345, -6995216, -7547248, -8106950, -8558534, -8804420, -8771495, -8414918, -7724250, -6728102, -5490379, -4095301]
42687d095301J470372J487705J484915J501314J565927J689061J857968K037105
42679H999066K173865K210043K097343J812736J367726Q05924J88361m26398r96067
42670A8232599j496193j913670k242049k483261k649421k755116k800744k761502
42662h69357k597198k280727j824269j282945p34807k53099J13797L50395M72407
42653h905803N17235N29026N44484N85926O62337P73212R10634J059896J201822
42644b121231J318078J397437J439476J453162J450591J438852J414928J367048
42636I158341J281351J148238R63922P29183M51369J50514j38097l72780n22954
42627A2849087n82727n69985n11638m25643l12530j62787K5185K31399M17444
$$ y = [-4095301, -2624929, -1137224, 347691, 1849005, 3414932, 5103993, 6961961, 8999066, 11172931, 13382974, 15480317, 17293053, 18660779, 19466703, 19655064, 19228666, 18232599, 16736406, 14822736, 12580687, 10097426, 7448005, 4692889, 1892145, -869357, -3466555, -5747282, -7571551, -8854496, -9589303, -9842402, -9728605, -9378210, -8905803, -8388568, -7859542, -7315058, -6729132, -6066795, -5293583, -4382949, -3323053, -2121231, -803153, 594284, 2033760, 3486922, 4937513, 6376365, 7791293, 9158341, 10439692, 11587930, 12551852, 13281035, 13732404, 13882918, 13744821, 13372041, 12849087, 12266360, 11696375, 11184737, 10759094, 10446564, 10283777, 10308962, 10540361, 10957805]
42618A0957805N44469N90822N56102M52346K93093Q9136j48642m04417o55686
42609A2275028q76684j045076j147946j184269j163463j100880j011364r03610
42601C841736p78961o35761m75747l07450j44329J285J24952K33025L38453M51534
42591B648737N72141O88329P80717Q29852Q25196P73257O98720O34580O06627
42582I058156O23471O77112P48482Q10504Q28894P67145N99149L24124k6625l97527
42572A4012885p27098r65334j081818j066235r27868o95643m14249j33369J06227
42563H107498K83410M00472M78898N47643O27924P22627Q17195Q90769R28966
42554A3805402R29879R01162Q52115P86078O96533N68066L82478J29709j79818
$$ y = [10957805, 11502274, 12093096, 12649198, 13101544, 13394637, 13483773, 13335131, 12930714, 12275028, 11398344, 10353268, 9205322, 8021053, 6857590, 5756710, 4745346, 3841736, 3062775, 2427014, 1951267, 1643817, 1499488, 1500773, 1625725, 1858750, 2197203, 2648737, 3220878, 3909207, 4689924, 5519776, 6344972, 7118229, 7816949, 8451529, 9058156, 9681627, 10358739, 11107221, 11917725, 12746619, 13513764, 14112913, 14437037, 14410412, 14012885, 13285787, 12320453, 11238635, 10172400, 9244532, 8548889, 8134640, 8001271, 8107498, 8390908, 8791380, 9270278, 9817921, 10445845, 11168472, 11985667, 12876436, 13805402, 14735281, 15636443, 16488558, 17274636, 17971169, 18539235, 18921713, 19051422, 18871604]
42545A8871604n08852q00336r97894j070121j025371r09151p86258p16595p34440
42536A1322586q37419r87649j125411j192745j158496j031449q52321o69180n12727
42527B955189l86449k73996j55078j9228J28909K73881L99499M97368N67948O14672
42517D602715O37279O29473N80873M80322L19849J00650j59850m25536o49531
42508F116244p91243q32909p85147o79141n52248m36133l52234l13784l29835
42499A043570m05861n38142p05592q67443r72314r75278q53374o12174k82762
42490e169370Q6797M41507P29596R13210R78900R43412Q48796P45773O72713O41263
42480A832597O34651O16525N44209L81046J05133k85895p72432j311907j841642
$$ y = [18871604, 18362752, 17562416, 16564522, 15494401, 14469030, 13559879, 12773621, 12057026, 11322586, 10485167, 9497518, 8372107, 7179362, 6020866, 4989417, 4137096, 3467916, 2955189, 2568740, 2294744, 2139666, 2120438, 2249347, 2523228, 2922727, 3420095, 3988043, 4602715, 5239994, 5869467, 6450340, 6930662, 7250511, 7351161, 7191311, 6765775, 6116244, 5325001, 4492092, 3706945, 3027804, 2475556, 2039423, 1687189, 1373405, 1043570, 637709, 99567, -606025, -1473468, -2445782, -3421060, -4274434, -4886608, -5169370, -5082573, -4641066, -3911470, -2998260, -2019360, -1075948, -227152, 518621, 1191334, 1832597, 2467248, 3083773, 3627982, 4009028, 4114161, 3828266, 3055834, 1743927, -97715]
42471i7715k289591k592162k711176k640946k404146k042997j611867j170669
42463a7561269p74863m62314k43929j05329j9580L7338P8444J09465J39764J89863
42453a8612410K87091M50907O79135R46054J212596J440202J601194J684834J698685
42444h611712J662308J594256J502420J387433J254680J119737R99743R00137
42436A809002Q10633P12571N88619M28070K29249K255k29330m31749n70028o18870
42426B730422n70641m37674k49248m5040J33207K50732K87635K42255J27771l6097
42416B433322k30609m39845o47027q30314r63456j022338r93123q76636o87006
42407d257032m46725j80953Q7431L40899N67027P54892Q90385R53302R18339P62211
$$ y = [-97715, -2387306, -4979468, -7690644, -10331590, -12735736, -14778733, -16390600, -17561269, -18336132, -18798446, -19042375, -19147704, -19167284, -19129946, -19051502, -18942037, -18802273, -18612410, -18325319, -17874412, -17195277, -16249223, -15036627, -13596425, -11995231, -10310397, -8611712, -6949404, -5355148, -3852728, -2465295, -1210615, -90878, 908865, 1809002, 2619635, 3332206, 3920825, 4348895, 4578144, 4580399, 4351069, 3919320, 3349292, 2730422, 2159781, 1722107, 1472859, 1427819, 1561026, 1811758, 2099393, 2341648, 2469419, 2433322, 2202713, 1762868, 1115841, 285527, -677929, -1700267, -2693390, -3570026, -4257032, -4703757, -4884710, -4797279, -4456380, -3889353, -3134461, -2244076, -1290774, -372435, 389776]
42397C89776M77398Q6583l54117p70140j094002j284315j328116j231425j009764
42388f118122o85557k90712J31999N34440Q75467J132027J298993J377531J364491
42379c79443J254768J053851P86320M91369K10144k4828j93915k90652l20112
42370B587502k94826k28769j32795j4523J18128K53298L73803M58120M83354M30827
42360D034119K94026Q5538j62121m04057n96123p08155p32669o86314o02772n18783
42350B689m59093m28211m13237l95451l63416l20542k84138k77427l18542m10772
42340c668140n38154o69443p69548q11566p81041o71959m83314k24029P8062L75652
42330h163480O15421P57037P84480P04677N39009L15410O4182j84208m02128n69582
$$ y = [389776, 867174, 953757, 599640, -170500, -1264502, -2548817, -3876933, -5108358, -6118122, -6803679, -7094391, -6962392, -6427952, -5552485, -4420458, -3121465, -1743934, -379443, 875325, 1929176, 2715496, 3206865, 3417009, 3392181, 3198266, 2907614, 2587502, 2292676, 2063907, 1931112, 1916589, 2034717, 2288015, 2661818, 3119938, 3603292, 4034119, 4328145, 4413683, 4251562, 3847505, 3251382, 2543227, 1810558, 1124244, 521472, 2689, -456404, -884615, -1297852, -1693303, -2056719, -2377261, -2661399, -2938826, -3257368, -3668140, -4206294, -4875737, -5645285, -6456851, -7237892, -7909851, -8393165, -8617194, -8539132, -8163480, -7548059, -6791022, -6006542, -5301865, -4762856, -4447446, -4383264, -4567472, -4969600, -5539182]
42320e539182o79131p37972p65226p84500q13752q56251q98013r15335q89213
42311a2878575q16928p12058n93387m72124l47342k12101o3782R0647K38352L68053
42301a5399245M72615N45062N75507N56056M90443L97998L06711K41426K17068
42292a1596359K40734L18380M59710O77600R81885J369856J817873K279079K689908
42283g61334K983433L104338L020729K730990K265229J680340J048424M42143
42275A6514292p7132m65585p00339p83069p42184o28870n05184m27452m30773
42266A1753704n21088o79734q79103j098679j328477j557951j762774j903945
42258B021953j941521j852639j641873j339387r90185o40854l29063p7736J06108
$$ y = [-5539182, -6218313, -6956285, -7721511, -8506011, -9319763, -10176014, -11074027, -11989362, -12878575, -13695503, -14407561, -15000948, -15473072, -15820414, -16032515, -16096297, -16005650, -15767298, -15399245, -14926630, -14381568, -13806061, -13250005, -12759562, -12361564, -12054853, -11813427, -11596359, -11355625, -11037245, -10577535, -9899935, -8918050, -7548194, -5730321, -3451242, -761334, 2222099, 5326437, 8347166, 11078156, 13343385, 15023725, 16072149, 16514292, 16437160, 15971575, 15271236, 14488167, 13745983, 13117113, 12611929, 12184477, 11753704, 11232616, 10552882, 9673779, 8575100, 7246623, 5688672, 3925898, 2021953, 80432, -1772207, -3414080, -4753467, -5743652, -6384506, -6713569, -6791305, -6685197]
42249f685197K27459K94513L09482K67285J65642J8931j36970k54246k90714k25056
42239f308871o3811J60610L99347O00823P24170P48879O79803N47008L98351K84218
42229a829473K39304K70172L54306M49879N10631M99404L96189K00655o7661l69853
42219F53553o52410q61283r62696r58417q83450p85935p01950o40263n84442n08661
42209f885954l95904k46349p1466J18528L20281N30501P35643R11959J039113
42200c943648J115933J163637J212818J283961J375206J464057J518891J511291
42192F702146J423530J251649J006509P12630M03397J13467j28934l08460m27272
42183A0748662n04473n65744o25676o75008o85016o27975m98626l20870j36252
$$ y = [-6685197, -6457738, -6163225, -5853743, -5586458, -5420816, -5401885, -5538855, -5793101, -6083815, -6308871, -6372682, -6212072, -5812725, -5211902, -4487732, -3738853, -3059050, -2512042, -2113691, -1829473, -1590169, -1319997, -965691, -515812, -5181, 494223, 890412, 1091067, 1023406, 653553, 1143, -860140, -1822836, -2781253, -3664703, -4450638, -5152588, -5792851, -6377293, -6885954, -7281858, -7528207, -7599673, -7481145, -7160864, -6630363, -5894720, -4982761, -3943648, -2827715, -1664078, -451260, 832701, 2207907, 3671964, 5190855, 6702146, 8125676, 9377325, 10383834, 11096464, 11499861, 11613328, 11484394, 11175934, 10748662, 10244189, 9678445, 9052769, 8377761, 7692745, 7064770, 6566144, 6245274, 6109022]
42174F109022J5748J11979J47757J30515P2860j1728j13209k30655l73453n51571
42164E307265p58968r64450j120339j184048j137365r92252p82909n50724l28939
42155b512729j32159M5682K23884M21785O47118Q92608J141495J375602J578371
42146C681657J732168J816812J815511J725157J561852J356954J147689R68281
42138A5806081Q42345P74841P46425P16875O39518M79380K25010j09396m88099
42129A9632980q61019j175138j390461j494620j507350j472025j440214j457126
42121H835027j550610j723522j952239k196073k415513k587082k702449k752906
42113i045367k714556k549620k224940j733976j106435l99654L21385J002147
$$ y = [6109022, 6124770, 6236749, 6384506, 6515021, 6587881, 6576153, 6462944, 6232289, 5858836, 5307265, 4548297, 3583847, 2463508, 1279460, 142095, -850157, -1633066, -2183790, -2512729, -2644888, -2599206, -2375322, -1953537, -1306419, -413811, 727684, 2103286, 3681657, 5413825, 7230637, 9046148, 10771305, 12333157, 13690111, 14837800, 15806081, 16648426, 17423267, 18169692, 18886567, 19526085, 20005465, 20230475, 20121079, 19632980, 18771961, 17596823, 16206362, 14711742, 13204392, 11732367, 10292153, 8835027, 7284417, 5560895, 3608656, 1412583, -1002930, -3590012, -6292461, -9045367, -11759923, -14309543, -16534483, -18268459, -19374894, -19774548, -19453163, -18451016]
42105a8451016J604824K102879K473430K697788K771021K710523K552352K334514
42097G96315K077996J778736J415887R71137M47878j20073o73916j145239j473432
42088D075289j619462j574071j359012j019865o12713j92453J90964M90879O65535
42079i54909O86738N49572K75050r4866n04054q87909j181645j334964j328423
42070d775410j179580r31196o27272k93643O3414M41954Q26752J183413J467210
42061c824358J639203J679790J593949J407276J155294Q70673N73993K72552l2597
42052E335775l36369o23273q68865j046994j138004j134950j047073q98781p22351
42043b480885n47611l96396k85062k27665k30369k79877l40335l67864l34360
$$ y = [-18451016, -16846192, -14743313, -12269883, -9572095, -6801074, -4090551, -1538199, 796315, 2874311, 4653047, 6068934, 7040071, 7487949, 7367876, 6693960, 5548721, 4075289, 2455827, 881756, -477256, -1497121, -2109834, -2302287, -2111323, -1620444, -954909, -268171, 281401, 556451, 461585, -42469, -930378, -2112023, -3446987, -4775410, -5954990, -6886186, -7513458, -7807101, -7743687, -7301733, -6474981, -5291568, -3824358, -2185155, -505365, 1088584, 2495860, 3651154, 4521827, 5095820, 5368372, 5335775, 4999406, 4376133, 3507268, 2460274, 1322270, 187320, -859753, -1758534, -2480885, -3028496, -3424892, -3709954, -3937619, -4167988, -4447865, -4788200, -5156064, -5490424]
42034e490424k42744j23883j9787L5829L0936k1894r3790j54797j87227j89173
42024f456954j66927j22395m4919Q5250K81939N36305Q12167J059636J238367
42015b777531J334253J360359J346407J326534J329643J370385J440481J506124
42007H236655J518077J433086J235173R43240O00846K56735n0310k95883m68151
41998A3409468n67514o09512o25680o57411p43462r06235j142418j421875j696166
41989E039195j914583k041145k064231j993913j849931j649620j404288j124449
41981i002965q26081n30493k58367k4618J61639K94262L69073L86747L58653L12691
41971h759459K93441L50651N16956P86696J110760J412683J618059J683683J614506
$$ y = [-5490424, -5733168, -5857051, -5876838, -5841009, -5810073, -5831967, -5925757, -6080554, -6267781, -6456954, -6623881, -6746276, -6791195, -6705945, -6424006, -5887701, -5075534, -4015898, -2777531, -1443278, -82919, 1263488, 2590022, 3919665, 5290050, 6730531, 8236655, 9754732, 11187818, 12422991, 13366231, 13967077, 14223812, 14173502, 13877619, 13409468, 12841954, 12232442, 11606762, 10949351, 10205889, 9299654, 8157236, 6735361, 5039195, 3124612, 1083467, -980764, -2974677, -4824608, -6474228, -7878516, -9002965, -9829046, -10359539, -10617906, -10642524, -10480885, -10186623, -9817550, -9430803, -9072150, -8759459, -8466018, -8115367, -7598411, -6811715, -5700955, -4288272, -2670213, -986530, 627976]
41962F27976J460700J293789J172543J118410J115049J128538J130640J109859
41954A0157504J068278J011502R39554Q43495P10626N37336L42071J66628N9673
41945A5836667M9986J26847K41302L27065L26666K08154l1887l73085p77473j196494
41935A4737748j581095j892899k109779k222057k224529k113261j889237j562176
41927h57285j148718o68333j44470L88885Q83731J284931J545535J642467J584840
41918D511583J410497J170179R06080O37543L63297P6328k22158n18994p92981
41909G541374j019346j172722j231965j188343j053393q61335o63887n18204m70261
41900f38082n38471p05237r23634j138283j308717j419942j474320j474590j414785
$$ y = [627976, 2088676, 3382465, 4555008, 5673418, 6788467, 7917005, 9047645, 10157504, 11225782, 12237284, 13176838, 14020333, 14730959, 15268295, 15610366, 15776994, 15836667, 15886653, 16013500, 16254802, 16581867, 16908533, 17116687, 17084800, 16711715, 15934242, 14737748, 13156653, 11263754, 9153975, 6931918, 4707389, 2594128, 704891, -857285, -2006003, -2674336, -2818806, -2429921, -1546190, -261259, 1284276, 2926743, 4511583, 5922080, 7092259, 7998339, 8635882, 8999179, 9075507, 8853349, 8334355, 7541374, 6522028, 5349306, 4117341, 2928998, 1875605, 1014270, 350383, -167821, -638082, -1176553, -1881790, -2805424, -3943707, -5252424, -6672366, -8146686, -9621276, -11036061]
41891a1036061j287185j097119q69839o41478m41194k78684j44643j9817J16068
41882a5699952K78403M71960O85360Q91789J059559J165416J199179J158073J041864
41873g748349Q58306O33850M15046K53191J80729J96139K67996L54958M27613
41864d160521M77864N12069N36973N51448N49176N26913M90310M54070M37589
41855C75891M58005N22712O24918P44448Q51539R09378Q75987P12219L99763l8062
41845F436798n28630r67011j254052j336942j229623j001108p38905n10239l43506
41836a473218k36151j75617j53444j63568j92928k19235k21437j93788j50298
41827c179684j16500j17225j69378k79772m43465o42754q50841j039618j184447
$$ y = [-11036061, -12323246, -13420365, -14290204, -14931682, -15372876, -15651560, -15796203, -15816020, -15699952, -15421549, -14949589, -14264229, -13372440, -12312881, -11147465, -9948286, -8790213, -7748349, -6890043, -6256193, -5841147, -5587956, -5407227, -5211088, -4943092, -4588134, -4160521, -3682657, -3170588, -2633615, -2082167, -1532991, -1006078, -515768, -61698, 375891, 833896, 1356608, 1981526, 2725974, 3577513, 4486891, 5362878, 6075097, 6474860, 6436798, 5908168, 4941157, 3687105, 2350163, 1120540, 119432, -619473, -1129712, -1473218, -1709369, -1884986, -2038430, -2201998, -2394926, -2614161, -2835598, -3029386, -3179684, -3296184, -3413409, -3582787, -3862559, -4306024, -4948778, -5799619, -6839237, -8023684]
41818h023684j262089j247224j115689q54885m74480j1715M70267Q91953J175678
41809a0451868J268282J158093Q77804M93237Q4289k75496n35876o78757p15711
41800h776003o76045n92069m88240l77557k65274j57655p0349k9687o3894j89283
41790a1686056m00835o72240r62051j219983j393132j437011j331784j094576
41782b0197668p77319m49874j78437q300M7399J2656n7822j00552p2981K7542
41772b1755356J69154L10781M28456N25302O22312P40692Q89094J060817J237193
41763a5771555J392060J497187J530679J486177J376389J227729J070265R29530
41755e261539Q22704P57095P29601P28277P36962P41581P35286P19983P03376
$$ y = [-8023684, -9285773, -10532997, -11648686, -12503571, -12978051, -12989766, -12519499, -11627546, -10451868, -9183586, -8025493, -7147689, -6654452, -6570163, -6845659, -7381535, -8060292, -8776003, -9452048, -10044117, -10532357, -10909914, -11175188, -11332843, -11403192, -11432879, -11496773, -11686056, -12086891, -12759131, -13721182, -14941165, -16334297, -17771308, -19103092, -20197668, -20974987, -21424861, -21603298, -21611598, -21564199, -21551543, -21609365, -21709917, -21782898, -21755356, -21586202, -21275421, -20846965, -20321663, -19699351, -18958659, -18069565, -17008748, -15771555, -14379495, -12882308, -11351629, -9865452, -8489063, -7261334, -6191069, -5261539, -4438835, -3681740, -2952139, -2223862, -1486900, -745319, -10033, 709950, 1413326]
41746A413326O92981O90379O88529O72366O22259N21171L64995J69945l1049k03052
41736E601850l24263l90988m12619m04647l84216l66602l61985l75587m11773
41727B169170m76798n76053p08969q67354j037471j202255j343107j443883j496162
41718f982882j501182j467493j409439j349183j316549j339087j424264j545860
41710a8335939j645666j651769j505042j182111p05103j34470M50740R74821J379747
41701b2354792J628957J704819J605665J345293R54455M82671k776m26200p24913
41692a5786821q75607r07105q84389q70395q92001r33053r53543r14971p94837
41683b3812722n88390l04949L5950M07455P76953J106292J353551J480368J464755
$$ y = [1413326, 2106307, 2796686, 3485215, 4157581, 4779840, 5301011, 5666006, 5835951, 5804902, 5601850, 5277587, 4886599, 4473980, 4069333, 3685117, 3318515, 2956530, 2580943, 2169170, 1692372, 1116319, 407350, -460004, -1497475, -2699730, -4042837, -5486720, -6982882, -8484064, -9951557, -11360996, -12710179, -14026728, -15365815, -16790079, -18335939, -19981605, -21633374, -23138416, -24320527, -25025630, -25160100, -24709360, -23734539, -22354792, -20725835, -19021016, -17415351, -16070058, -15115603, -14632932, -14635708, -15061908, -15786821, -16662428, -17569533, -18453922, -19324317, -20216318, -21149371, -22102914, -23017885, -23812722, -24401112, -24706061, -24670111, -24262656, -23485703, -22379411, -21025860, -19545492, -18080737]
41674a8080737J313304J065207P84531N42776L97221L72274M51048N81584O96299
41665a1876493P37321O78195N34127L56421K11632J53267J99713L29520M94009
41656h182288O37097P12870O98361O00948M56144L12529K10384J67928J82462
41647d203565K40587L26993M28545N36523O47319P58248Q59607R31584R52521
41638A478362R13168Q24117P09853N95287M94703M07127L16167J93690R592k53202
41628E688864n85614r49199j284564j527104j625261j557465j341906j031886
41620d214135o95754l92084j55030M689R1386J19679J14403J07619J28342J90375
41610d700510K86130L88593M58696M56361L54148J48422j38754m67625p91921
$$ y = [-18080737, -16767433, -15702226, -14917695, -14374919, -13977698, -13605424, -13154376, -12572792, -11876493, -11139172, -10460977, -9926850, -9570429, -9358797, -9205530, -9005817, -8676297, -8182288, -7545191, -6832321, -6133960, -5533012, -5076868, -4764339, -4553955, -4386027, -4203565, -3962978, -3635985, -3207440, -2670917, -2023598, -1265350, -405743, 525841, 1478362, 2391530, 3215647, 3925500, 4520787, 5015490, 5422617, 5738784, 5932474, 5942066, 5688864, 5103250, 4154051, 2869487, 1342383, -282878, -1840343, -3182249, -4214135, -4909889, -5301973, -5457003, -5452314, -5360928, -5241249, -5126846, -5019227, -4890885, -4700510, -4414380, -4025787, -3567091, -3110730, -2756582, -2608160, -2746914, -3214539, -4006460]
41601d006460j067563j260143j353105j352622j282783j172204j040968q96352
41593a3432200p38258n68442l95375k29460p1822R1466K79614M96183P14769Q85689
41583a2967836R60349R15920P64801N46889L14080J17261j691j6569P6350K56425
41573i034021M86536P26967R45927J122329J244257J306221J304916J235794J096879
41564D35805Q99629O74587M61277K88739J63635P2567r280j10609k55445m51704
41554B169201o84321r21007j127411j280842j376486j426733j453360j472178
41546g573137j477508j440404j326024j117785q29152m95967j59073J48412M03927
41537a3866711N93385P11047P62720P68074P57936P67031Q26701R60898J183923
$$ y = [-4006460, -5074023, -6334166, -7687271, -9039893, -10322676, -11494880, -12535848, -13432200, -14170458, -14738900, -15134275, -15363735, -15435557, -15344091, -15064477, -14568294, -13853525, -12967836, -12007487, -11091567, -10326766, -9779877, -9465797, -9348536, -9350227, -9366796, -9290446, -9034021, -8547485, -7820518, -6874591, -5752262, -4508005, -3201784, -1896868, -661074, 435805, 1335434, 2010021, 2471298, 2760037, 2923672, 2996239, 2986959, 2876350, 2620905, 2169201, 1484880, 563873, -563538, -1844380, -3220866, -4647599, -6100959, -7573137, -9050645, -10491049, -11817073, -12934858, -13764010, -14259977, -14419050, -14270638, -13866711, -13273326, -12562279, -11799559, -11031485, -10273549, -9506518, -8679817, -7718919, -6534996]
41528f534996J495868J875144K273784K622775K848702K894555K734944K380579
41520A2591355J873189J274001O48268M9793m87872r48424j321254j591940j743661
41511A0343455j768390j678370j508617j308354j126233r96606r32325r25906
41503I8654r57313j004275j051085j093433j138430j199997j290462j411025j545354
41494a0592720j660361j715140j674453j520398j257003r07348n07044r7516K81663
41485a9650320O03221Q61988J075318J269743J461506J645263J798230J894188
41477i040863J916457J862846J741761J562914J329621J039980O97186L19676
41469A429578n8375l95753o54695q09746q56886q20579p49986p00377p09485p83729
$$ y = [-6534996, -5039128, -3163984, -890200, 1732575, 4581277, 7475832, 10210776, 12591355, 14464544, 15738545, 16386813, 16436606, 15948734, 15000310, 13679056, 12087116, 10343455, 8575065, 6896695, 5388078, 4079724, 2953491, 1956885, 1024560, 98654, -858659, -1862934, -2914019, -4007452, -5145882, -6345879, -7636341, -9047366, -10592720, -12253081, -13968221, -15642674, -17163072, -18420075, -19327423, -19834467, -19931983, -19650320, -19047099, -18185111, -17109793, -15840050, -14378544, -12733281, -10935051, -9040863, -7124406, -5261560, -3519799, -1956885, -627264, 412716, 1109902, 1429578, 1371203, 975450, 320755, -488991, -1345877, -2166456, -2916442, -3616819, -4326304, -5110033]
41459e110033q99773j015400j082036j056492r11680o44262k76165J50840N85272
41450a0259729R76735J283764J477672J544042J482678J304826J027702O70991
41442d91319K59826j68752n65715q82329j089000j186594j200274j159157j077196
41433g560510r50118p69096n36741k70966K675K58253M69353O07202O45009N68196
41423g536743L83380J20529j72994m44761o51172p66576p85332p21268o08084
41414a1183021m96138m38227m66675n75090p17411q25299q34641p08981m50593
41405a6696076r6226K97635O71017R72136J164440J231282J178251J031716Q33252
41396i412573O30768M67507L71004L46232L77517M39844N13393N90779O70315
$$ y = [-5110033, -6009806, -7025206, -8107242, -9163734, -10075414, -10719676, -10995841, -10845001, -10259729, -9282994, -7999230, -6521558, -4977516, -3494838, -2190012, -1162310, -491319, -231493, -400245, -965960, -1848289, -2937289, -4123883, -5324157, -6483314, -7560510, -8510628, -9279724, -9816465, -10087431, -10084756, -9826503, -9357150, -8749948, -8104939, -7536743, -7153363, -7032834, -7205828, -7650589, -8301761, -9068337, -9853669, -10574937, -11183021, -11679159, -12117386, -12584061, -13159151, -13876562, -14701861, -15536502, -16245483, -16696076, -16792302, -16494667, -15823650, -14851514, -13687074, -12455792, -11277541, -10245825, -9412573, -8781805, -8314298, -7943294, -7597062, -7219545, -6779701, -6266308, -5675529, -5005214]
41387e005214P40477P70817P20867N62613K99163l3861l83072o96921r39935j097359
41377e062425j170774j168632j098328r65009p76006n44349k86308j4944K63211
41368a0823564N43959Q17456J065253J266620J408576J490483J520829J511942
41360a198446J477159J427976J367065J280245J136061Q98146N45650R0390m19705
41351F604541r13724j320784j590702j703123j664394j497889j233775r02427
41343d222277n34096j64117J63015L99574N12264N01469M07216K94315K23434
41334b419203K24814K89983L85071M75099N42741N91185O33219O76582P15233
41325B114724P30134O97900O02975M47894K55926O2673j00755k23355l17995m10693
$$ y = [-5005214, -4264737, -3493920, -2773053, -2210440, -1911277, -1945138, -2328210, -3025131, -3965066, -5062425, -6233199, -7401831, -8500159, -9465168, -10241174, -10785523, -11071831, -11086775, -10823564, -10279605, -9462149, -8396896, -7130276, -5721700, -4231217, -2710388, -1198446, 278713, 1706689, 3073754, 4353999, 5490060, 6388206, 6933856, 7024246, 6604541, 5690817, 4370033, 2779331, 1076208, -588186, -2086075, -3319850, -4222277, -4756373, -4920490, -4757475, -4357901, -3845637, -3344168, -2936952, -2642637, -2419203, -2194389, -1904406, -1519335, -1044236, -501495, 89690, 722909, 1399491, 2114724, 2844858, 3542758, 4145733, 4593627, 4849553, 4912226, 4811471, 4588116, 4270121, 3859428]
41315C859428n23851o65383q29238j003332j177571j347489j512907j673258j821978
41306f695579j943337k014147k010047j912903j715428j421938j047615o18777
41298a9379771j72956K45190N93802Q45033R90753J040113J012962R34610Q33409
41289a3056855P37513O67173O24571N89701N30208M22667K70916J06765k7736
41280i135077j02271j08410n3829N0722J99554L89561O10727Q39242J041400J187719
41270e080662J266922J287722J266230J210367J116361R81052Q17488O56696N31666
41261D053842M56913M20676L93719L45117K54650J20139l8011j77790k48224k13644
41251E367387p7746J08794K65072L13826K14846j8451l25543o23717q40303r39312
$$ y = [3859428, 3335577, 2670194, 1840956, 837624, -339947, -1687436, -3200343, -4873601, -6695579, -8638916, -10653063, -12663110, -14576013, -16291441, -17713379, -18760994, -19379771, -19552727, -19307537, -18713735, -17868702, -16877949, -15837836, -14824874, -13890264, -13056855, -12319342, -11652169, -11027598, -10437897, -9907689, -9485022, -9214106, -9107341, -9135077, -9237348, -9345758, -9399587, -9348865, -9149311, -8759750, -8149023, -7309781, -6268381, -5080662, -3813740, -2526018, -1259788, -49421, 1066940, 2047992, 2865480, 3522176, 4053842, 4510755, 4931431, 5325150, 5670267, 5924917, 6045056, 6007045, 5829255, 5581031, 5367387, 5289641, 5398435, 5663507, 5977333, 6192179, 6173728, 5848185, 5224468, 4384165, 3444853]
41241C444853r31006q59499p75339p10125o68505o39124o12340n90736n87677
41232b929498o18463o90999q00043r26559j042010j116155j125730j062165r37201
41223a1248823p83267o43734n52644n13958m95881m46768l22030j03527J98317
41214a4912315N54313R26534J272757J548415J712650J740561J635672J432180
41206d089233J182029R33523P14666N28823L60236J83724k3786k71622n48758
41197a030398q26818j070411j247523j335853j326419j225612j053668q38248
41189i954950o05587l73186j46108Q2101L22440N78480Q35509J059164J207331
41180f994806J250184J186488J045131Q69925O97688N44182M05277K69007J28923
$$ y = [3444853, 2513847, 1654348, 879009, 168884, -499621, -1138745, -1751085, -2341821, -2929498, -3547961, -4238960, -5039003, -5965562, -7007572, -8123727, -9249457, -10311622, -11248823, -12032090, -12675824, -13228468, -13742426, -14238307, -14685075, -15007105, -15110632, -14912315, -14358002, -13431468, -12158711, -10610296, -8897646, -7157085, -5521413, -4089233, -2907204, -1973681, -1259015, -730192, -369956, -186232, -210018, -481640, -1030398, -1857216, -2927627, -4175150, -5511003, -6837422, -8063034, -9116702, -9954950, -10560537, -10933723, -11079831, -10997730, -10675290, -10096810, -9261301, -8202137, -6994806, -5744622, -4558134, -3513003, -2643078, -1945390, -1401208, -995931, -726924, -598001]
41171e98001p908j20838j84253j81929j18605j9424Q3730J69635K36836K98888
41161d41869L69578M48872N20481N62984N64187N25250M53251L54549K38808J27646
41151C723737N3773M7223J20562K65613M61619O85918R20895J156848J390587
41142H826775J617778J820339J957524J970939J805159J433262Q71797J77154
41134B0480727n72071j295337j924530k410915k726644k862860k825993k634755
41126C227622k319259j920626j487672j069369p05450m19103k14521q0074L777
41117d984675N4994Q3477R0791P4591L3102l2939j19002k14040k99506l55534
41107e668741l73320l63695l52318l62653l97498m30565m14031l01400p6438K30006
$$ y = [-598001, -605909, -726747, -911000, -1092929, -1211534, -1230958, -1147228, -977593, -740757, -441869, -72291, 376581, 897062, 1460046, 2024233, 2549483, 3002734, 3357283, 3596091, 3723737, 3777510, 3824733, 3945295, 4210908, 4672527, 5358445, 6279340, 7436188, 8826775, 10444553, 12264892, 14222416, 16193355, 17998514, 19431776, 20303573, 20480727, 19908656, 18613319, 16688789, 14277874, 11551230, 8688370, 5862377, 3227622, 908363, -1012263, -2499935, -3569304, -4274754, -4693857, -4908378, -4988452, -4984675, -4929681, -4846204, -4755413, -4680822, -4647720, -4680659, -4799661, -5013701, -5313207, -5668741, -6042061, -6405756, -6758074, -7120727, -7518225, -7948790, -8362821, -8664221, -8740659, -8510653]
41097h510653N51250Q20362J004585J112885J174771J212166J227237J211165
41089a96232J161625J092722J029537R92098R82178R83707R75404R43663Q85919
41080H850621Q06165P11794O16369N42518N15622N47518O22341O99269P33607
41071A4645824P00168O00048M47907K54661K1589k52106n58376q75679j171891
41062A3812145j411069j561419j604617j544782j410203j240979j066487q89824
41054C082765o94221m66416k15311K9057K29802L55322L84492L10950J48584o7893
41044C097131k90987m72137n71515n66545m60096k82762q2571R5504K28918L25557
41034A020497M16994N40060P14574R28784J141784J301202J364110J308997J135829
$$ y = [-8510653, -7959403, -7139041, -6134456, -5021571, -3846800, -2634634, -1407397, -196232, 965393, 2058115, 3087652, 4079750, 5061928, 6045635, 7021039, 7964702, 8850621, 9656786, 10368580, 10984949, 11527467, 12043089, 12590607, 13212948, 13912217, 14645824, 15345992, 15946040, 16393947, 16648608, 16670197, 16418091, 15859715, 14984036, 13812145, 12401076, 10839657, 9235040, 7690258, 6280055, 5039076, 3972589, 3082765, 2388544, 1922128, 1706817, 1735874, 1965676, 2320998, 2705490, 3016440, 3165024, 3097131, 2806144, 2334007, 1762492, 1195947, 735851, 453089, 370518, 466022, 694940, 1020497, 1437491, 1977551, 2692125, 3620909, 4762693, 6063895, 7428005, 8737002, 9872831]
41025I872831Q59104N00247Q3691l62268q02334j194574j497876j683601j743786
41016D031434j690184j544923j329198j057563p41311l96376m6073K86916N93651
41007a893627Q84911J183479J508339J861897K227334K575174K873746L097983
40999A4319236L233339L275014L224466L084618K854819K529391K104825J594075
40991C6219783J035859M85988p319m25284p78934j088061j357587j570523j700384
40982C0813538j730065j662695j520265j335167j140340r60002q02612o59838
40974B1002554n14165l51444j70259J7560J94076L43949M58674N34708N69199
40965B2084852N59222N06299M21469L24276K34452J61889J02549M4412j9378q0106
$$ y = [9872831, 10731935, 11232182, 11315873, 10953605, 10151271, 8956697, 7458821, 5775220, 4031434, 2341250, 796327, -532871, -1590434, -2331745, -2728121, -2774194, -2487278, -1893627, -1008716, 174763, 1683102, 3544999, 5772333, 8347507, 11221253, 14319236, 17552575, 20827589, 24052055, 27136673, 29991492, 32520883, 34625708, 36219783, 37255642, 37741630, 37734311, 37309027, 36530093, 35442032, 34084445, 32513922, 30813538, 29083473, 27420778, 25900513, 24565346, 23425006, 22465004, 21662392, 21002554, 20488389, 20136945, 19966686, 19984246, 20178322, 20522271, 20980945, 21515653, 22084852, 22644074, 23150373, 23571842, 23896118, 24130570, 24292459, 24395008, 24439420, 24420042, 24339936]
40955B4339936j16148j08511n5459K7935J23705K23091L25617M29186N22354N85105
40945B6296811N97571N52851M66734L75593L20615L28312M00128N14221O33585
40936C0486421P16181P27253O51563M98572K96490P9442j24069k96867m33222
40927C2601764n35921o13222o77403p43429q24599r25695j039359j150395j245450
40918B4846291j320046j377558j422492j455362j474216j480362j480915j483462
40910A3351878j486453j473524j416218j282956j050010p12126k90219J68633
40902E809005O02528R54070J187710J295474J289253J187233J005316P58572M67399
40893A4556560J58251j44564m28244o91144r31347j135078j277473j336540j308043
$$ y = [24339936, 24223788, 24115277, 24059818, 24087753, 24211458, 24434549, 24760166, 25189352, 25711706, 26296811, 26894382, 27447233, 27913967, 28289560, 28610175, 28938487, 29338615, 29852836, 30486421, 31202602, 31929855, 32581418, 33079990, 33376480, 33455922, 33331853, 33034986, 32601764, 32065843, 31452621, 30775218, 30031789, 29207190, 28281495, 27242136, 26091741, 24846291, 23526245, 22148687, 20726195, 19270833, 17796617, 16316255, 14835340, 13351878, 11865425, 10391901, 8975683, 7692727, 6642717, 5930591, 5640372, 5809005, 6411533, 7365603, 8553313, 9848787, 11138040, 12325273, 13330589, 14089161, 14556560, 14714811, 14570247, 14142003, 13450859, 12519512, 11384434, 10106961, 8770421, 7462378]
40884G462378j208157j062608q92928p10076n16023l07896q2138J60066M06702
40875C249320O32504Q03194Q84720Q53579P04952M55906J42283j88459m84123
40866G053876o93703p75980p11213n08870k04397J52717N10622Q21636J046660
40857F691348J161662J164684J077673R39299P90234O57489N45925M41930L26650
40848A3796894J89613L3709j30033k90338m36868n54029o17004n99117m86701
40839A0906126k88014k8605K60951N55439Q41009J117763J395706J681433J963754
40830A8405562K211846K388246K463906K423762K264445J991691J618478J160800
40822C4928736O33652N3997n49099j127134j617719j963390k133565k136521k013817
$$ y = [7462378, 6254221, 5191613, 4298685, 3588609, 3072586, 2764690, 2682552, 2842618, 3249320, 3881824, 4685018, 5569738, 6423317, 7128269, 7584175, 7726458, 7537999, 7053876, 6360173, 5584193, 4872980, 4364110, 4159713, 4312430, 4823052, 5644688, 6691348, 7853010, 9017694, 10095367, 11034666, 11824900, 12482389, 13028314, 13470244, 13796894, 13986507, 14020216, 13890183, 13599845, 13162977, 12608948, 11991944, 11392827, 10906126, 10618112, 10589507, 10850458, 11405897, 12246906, 13364669, 14760375, 16441808, 18405562, 20617408, 23005654, 25469560, 27893322, 30157767, 32149458, 33767936, 34928736, 35562388, 35616385, 35067286, 33940152, 32322433, 30359043, 28225478, 26088957, 24075140]
40813B4075140j820647j604711j395076j202607j025689q56588o88686n24198
40805A4956938l77451k69318k15425k16284k55983l09808l55943l84840m01450
40796A2170436m19392m50591m96531n46185n81704n88073n60683n06817m41435
40787G579025l80439l34042l01716k70486k18949j26888J3531J91439L79991N47113
40777G078579O67948P31430P38273O94992O11395N03560L96567L19364K90965
40768A2033073L05885L30273L14203K14588J5107k67462n90674r00518j146946
40759A0307529j299204j356447j345435j303373j257259j215153j173227j128456
40751B28975j085379j053989j042354j048173j053424j026864r35902p61660n07248
$$ y = [24075140, 22254493, 20649782, 19254706, 18052099, 17026410, 16169822, 15481136, 14956938, 14579487, 14310169, 14094744, 13878460, 13622477, 13312669, 12956726, 12571886, 12170436, 11751044, 11300453, 10803922, 10257737, 9676033, 9087960, 8527277, 8020460, 7579025, 7198586, 6864544, 6562828, 6292342, 6073393, 5946505, 5960036, 6151475, 6531466, 7078579, 7746527, 8477957, 9216230, 9911222, 10522617, 11026177, 11422744, 11742108, 12033073, 12338958, 12669231, 12983434, 13198022, 13213129, 12945667, 12354993, 11454475, 10307529, 9008325, 7651878, 6306443, 5003070, 3745811, 2530658, 1357431, 228975, -856404, -1910393, -2952747, -4000920, -5054344, -6081208, -7017110, -7778770, -8286018]
40742h286018j94280J47864M90747Q08047J071405J248232J307117J229804J022702
40733a154380P20259L77035N1646k10047l84773m71561m84215m42523l65917k70294
40723b634770j67743o8918J5157P6319J17485J57939K27179L48230N21483P20758
40713f86881R04092J031862J081164J049509R48669P95509O06273L95661J77774
40704F303632l3991k28614l99889n48467o81617q09323r37813j064123j174831
40695D24964j249541j268127j220001j111970r68946q23926p01201o03388n11210
40686h033346l95219k30838q924K59735N45249Q06224J004844J122876J167426
40677c761973J162010J131322J092183J054324J024131J003893R86978R55445
$$ y = [-8286018, -8480298, -8332434, -7841687, -7033640, -5962235, -4714003, -3406886, -2177082, -1154380, -434121, -57086, -5440, -215487, -600260, -1071821, -1556036, -1998559, -2364476, -2634770, -2802513, -2871431, -2856274, -2779955, -2662470, -2504531, -2277352, -1929122, -1407639, -686881, 217211, 1249073, 2330237, 3379746, 4328415, 5123924, 5730197, 6125858, 6303632, 6269641, 6041027, 5641138, 5092671, 4411054, 3601731, 2663918, 1599795, 424964, -824577, -2092704, -3312705, -4424675, -5393621, -6217547, -6918748, -7522136, -8033346, -8428565, -8659403, -8668327, -8408592, -7863343, -7057119, -6052275, -4929399, -3761973, -2599963, -1468641, -376458, 677866, 1701997, 2705890, 3692868, 4648313]
40669D648313Q85818P62094N88797L95301K27786J32792J40346K53402M47381
40660H482030O80182R07925J097192J227366J285795J263910J157768R69716P07984
40651A7779868L85555K0068l66570p50026j105261j407511j635041j774403j823182
40642I323497j785923j668028j476998j231878r69473p36316n68911m76955m42088
40633c3073m31557m14735l70856k87075j55201K5995K45568M80594P05037R01441
40623F66138J066221J204947J321972J412856J465646J470299J429438J362840
40615A1400357J302774J282749J324944J431798J585770J757470J917301K044398
40607B4047561K130266K178485K201636K215194K230136K248648K265518K272190
$$ y = [4648313, 5534131, 6296225, 6885022, 7280323, 7508109, 7640901, 7781247, 8034649, 8482030, 9162212, 10070137, 11167329, 12394695, 13680490, 14944400, 16102168, 17071884, 17779868, 18165423, 18185491, 17818921, 17068895, 15963634, 14556123, 12921082, 11146679, 9323497, 7537574, 5869546, 4392548, 3160670, 2191197, 1454881, 885970, 409015, -33073, -464630, -879365, -1250221, -1537296, -1692497, -1666502, -1420934, -940340, -235303, 666138, 1732359, 2937306, 4259278, 5672134, 7137780, 8608079, 10037517, 11400357, 12703131, 13985880, 15310824, 16742622, 18328392, 20085862, 22003163, 24047561, 26177827, 28356312, 30557948, 32773142, 35003278, 37251926, 39517444, 41789634]
40599D1789634K258824K213496K121644J968433J744523J454371J124756Q08039
40591E5483720N74417M92971O09450R31658J429197K046917K725280L417339M093953
40582G1804902M736414N324660N831069O222735O467429O538098O415981O094794
40574A19436082N585513M918452M140535L308418K479427J702618J013329M33910
40566A43018284k0935l39838n16380n56043m83518l45499k07388j45445k36661
40557A40166577n46279j110783j917217k888495l889742m762595n375931n668091
40549A14007444n659746n433902n096219m735266m398255m088653l782327l452052
40541G7361024l088110k706104k340327k028327j795385j645100j557778j495993
$$ y = [41789634, 44048458, 46261954, 48383598, 50352031, 52096554, 53550925, 54675681, 55483720, 56058137, 56551108, 57160558, 58092216, 59521413, 61568330, 64293610, 67710949, 71804902, 76541316, 81865976, 87697045, 93919780, 100387209, 106925307, 113341288, 119436082, 125021595, 129940047, 134080582, 137389000, 139868427, 141571045, 142584374, 143018284, 142997349, 142657511, 142141131, 141585088, 141101570, 140756071, 140548683, 140403238, 140166577, 139620298, 138509515, 136592298, 133703803, 129814061, 125051466, 119675535, 114007444, 108347698, 102913796, 97817577, 93082311, 88684056, 84595403, 80813076, 77361024, 74272914, 71566810, 69226483, 67198156, 65402771, 63757671, 62199893, 60703900]
40533F0703900j416001j282074j078211q11845n07640j94281J09244L99672O83256
40524E6606020R61835J223436J445702J607613J697528J712183J652783J526107
40516F8433207J350461J159021R94112Q93035Q73358R28258J036674J181175J359382
40507G8208683J580792J854284K177658K535490K903588L255181L563805L799273
40499I9878754L918586L861928L564592K983775K125127J052948j20276j258376
40491A16007058k231434k944545l357856l490068l403780l181152k901915k629596
40483I1866712k403782k235607k108811j990390j848969j671967j472308j281858
40475G6853020j135948j057053j045677j082357j138035j185470j207018j199907
$$ y = [60703900, 59287899, 58005825, 56927614, 56115769, 55608129, 55413848, 55523092, 55922764, 56606020, 57567855, 58791291, 60236993, 61844606, 63542134, 65254317, 66907100, 68433207, 69783668, 70942689, 71936801, 72829836, 73703194, 74631452, 75668126, 76849301, 78208683, 79789475, 81643759, 83821417, 86356907, 89260495, 92515676, 96079481, 99878754, 103797340, 107659268, 111223860, 114207635, 116332762, 117385710, 117265434, 116007058, 113775624, 110831079, 107473223, 103983155, 100579375, 97398223, 94496308, 91866712, 89462930, 87227323, 85118512, 83128122, 81279153, 79607186, 78134878, 76853020, 75717072, 74660019, 73614342, 72531985, 71393950, 70208480, 69001462, 67801555]
40467F7801555j180493j183252j248646j402976j643153j937433k240017k508068
40459E4457517k712018k838176k886314k863911k778758k633784k427933k162435
40451C3154188j847191j501900j151166q17563n17175k59150m7157J19837K47972
40442B7380695L48827M38502N34880O52733P97284R59656J118978J252307J346533
40433C4830395J403400J433643J445094J434328J388423J295775J157805R91565
40425D5380428Q18925O48992M68210K48495l1119l66060p24915j064069j345377
40416D4033510j545906j659058j692099j662539j592101j498215j386826j250745
40408C1746021j074772q45680n63231k46949O6433L35339N29688O42703O92937
$$ y = [67801555, 66621062, 65437810, 64189164, 62786188, 61143035, 59205602, 56965585, 54457517, 51745499, 48907323, 46021009, 43157098, 40378340, 37744556, 35316623, 33154188, 31306997, 29805097, 28653931, 27836368, 27319193, 27060043, 27012886, 27132723, 27380695, 27729522, 28168024, 28702904, 29355637, 30152921, 31112577, 32231555, 33483862, 34830395, 36233795, 37667438, 39112532, 40546860, 41935283, 43231058, 44388863, 45380428, 46199353, 46848345, 47316555, 47565050, 47533931, 47167871, 46442956, 45378887, 44033510, 42487604, 40828546, 39136447, 37473908, 35881807, 34383592, 32996766, 31746021, 30671249, 29825569, 29262338, 29015389, 29081822, 29417161, 29946849, 30589552, 31282489]
40399C1282489P16295P51321Q23334R34324J063575J178627J251380J272884J260348
40390D0534577J250906J282369J371489J504594J646429J758497J813844J802934
40382E2965639J733126J624565J503883J398737J335864J340315J430665J611124
40374F4943918J868696K180340K524691K888836L267779L662090M078256M529619
40366H9944225N032931N599694O227304O896899P580632Q254506Q909484R555690
40358A48001365J0218906J0930154J1708627J2540040J3357526J4034728J4395934
40351B35187280J4240110J3373061J1646652R006627N541169J505202k709004
40344B87791097o661023r978179j2443505j4017787j4798841j4952013j4647871
$$ y = [31282489, 31998784, 32750105, 33573439, 34507763, 35571338, 36749965, 38001345, 39274229, 40534577, 41785483, 43067852, 44439341, 45943935, 47590364, 49348861, 51162705, 52965639, 54698765, 56323330, 57827213, 59225950, 60561814, 61902129, 63332794, 64943918, 66812614, 68992954, 71517645, 74406481, 77674260, 81336350, 85414606, 89944225, 94977156, 100576850, 106804154, 113701053, 121281685, 129536191, 138445675, 148001365, 158220271, 169150425, 180859052, 193399092, 206756618, 220791346, 235187280, 249427390, 262800451, 274447103, 283453730, 288994899, 290500101, 287791097, 281130074, 271151895, 258708390, 244690603, 229891762, 214939749, 200291878]
40337B00291878j4025705j3184038j2190360j1098894r964843q847409p801548
40330A23179081o865176o050101n341189m703678m095925l483995k852266k203528
40322H7583223j546898q82023j92863N43158J338467K184327L051480L898892
40314I5977763M684610N376058N958490O439104O844373P211200P574999P957423
40306A48024020Q354829Q729001R002812R063456Q773432P988959O588365M513341
40298B11038215J815773j314039m566151p583289j0058260j1810119j2807731
40291A64714399j3142192j2972813j2473375j1793760j1040660j0275222r523362
40284H3493015q791812q080339p383046o682021n946407n147001m280099l381499
$$ y = [200291878, 186266173, 173082135, 160891775, 149792881, 139828038, 130980629, 123179081, 116313905, 110263804, 104922615, 100218937, 96123012, 92639017, 89786751, 87583223, 86036325, 85154302, 84961439, 85504597, 86843064, 89027391, 92078871, 95977763, 100662373, 106038431, 111996921, 118436025, 125280398, 132491598, 140066597, 148024020, 156378849, 165107850, 174110662, 183174118, 191947550, 199936509, 206524874, 211038215, 212853988, 211539949, 206973798, 199390509, 189332249, 177522130, 164714399, 151572207, 138599394, 126126019, 114332259, 103291599, 93016377, 83493015, 74701203, 66620864, 59237818, 52555797, 46609390, 41462389, 37182290, 33800791]
40276C3800791k516669j751780j124180o30171k36013R5983L83686O19361P83484
40267B9424492Q63315Q58897P73717O03553L37650k7816m76030r66554j444016
40258B9947208j852419k148430k308907k329454k214539j966596j585034j079386
40250A4462443m87683J16061O35250R81012J104392J013679P67610M48636J32423
40241A9173823j29187l07267l87439l67045k59284r4950Q5707K47161L68888M46557
40231A8776964M87548N06566N21832N48411N88544O25968O31760N80293M64293
40222B3732179K98457J10922o9204k20140l29469l92548m10212l87535l33792
40213B1998658k62070j85626j10683l0742P0534K07564L81583N80249P88103R97651
$$ y = [33800791, 31284122, 29532342, 28408162, 27777991, 27541978, 27637961, 28021647, 28641008, 29424492, 30287807, 31146704, 31920421, 32523974, 32861624, 32833808, 32357778, 31391224, 29947208, 28094789, 25946359, 23637452, 21307998, 19093459, 17126863, 15541829, 14462443, 13974760, 14090821, 14726071, 15707083, 16811475, 17825154, 18592764, 19041400, 19173823, 19044636, 18737369, 18349930, 17982885, 17723601, 17628651, 17714358, 17961519, 18330407, 18776964, 19264512, 19771078, 20292910, 20841321, 21429865, 22055833, 22687593, 23267886, 23732179, 24030636, 24141558, 24072354, 23852214, 23522745, 23130197, 22719985, 22332450, 21998658, 21736588, 21550962, 21440279, 21409537, 21480071, 21687635, 22069218, 22649467, 23437570, 24435221]
40203B4435221J212232J441641J696475J983601K301425K635628K959193L238230
40195D1903646L440638L543562L537090L422173L202400K874692K427629J850817
40187F6202647J148704L48786m99743j333914k086974k697552l116558l312919
40179E4652477l280961l048282k676153k245535j833780j496276j261925j138353
40171C7671212j117649j179191j292143j420245j529328j595964j613162j587867
40163B6335663j530341j444274j327202j180198j015866q56186p22743o28003
40155A7630850n72335n45105n26541m90038m06759k53245j9276K88657O50610
40146A5756818J040729J434506J813548K168504K500286K817741L131608L448403
$$ y = [24435221, 25647453, 27089094, 28785569, 30769170, 33070595, 35706223, 38665416, 41903646, 45344284, 48887846, 52424936, 55847109, 59049509, 61924201, 64351830, 66202647, 67351351, 67700137, 67200394, 65866480, 63779506, 61081954, 57965396, 54652477, 51371516, 48323234, 45647081, 43401546, 41567766, 40071490, 38809565, 37671212, 36553563, 35374372, 34082229, 32661984, 31132656, 29536692, 27923530, 26335663, 24805322, 23361048, 22033846, 20853648, 19837782, 18981596, 18258853, 17630850, 17058515, 16513410, 15986869, 15496831, 15090072, 14836827, 14817551, 15106208, 15756818, 16797547, 18232053, 20045601, 22214105, 24714391, 27532132, 30663740, 34112143]
40138C4112143L768293M086376M393266M673085M902481N055718N115695N083212
40130G1190269M974763M806745M575861M250576L780731L119045K242425J166012
40122A00106427n1166j310768k493952l492396m238048m715022m948728m983638
40114G3872709m866112m639272m344985m024988l718945l461867l282230l198585
40106D2335725l213493l307979l442124l564695l629455l611423l515019l368896
40098A4682641l209631l063374k935112k809284k659458k462222k209294j911220
40090f576954j590389j269559r65421o89396m48853k44038o5418J01721K67040
40081a1481267M27907N70723O78867P42095P63037P57817P50462P64891Q19107
$$ y = [34112143, 37880436, 41966812, 46360078, 51033163, 55935644, 60991362, 66107057, 71190269, 76165032, 80971777, 85547638, 89798214, 93578945, 96697990, 98940415, 100106427, 100055261, 98744493, 96250541, 92758145, 88520097, 83805075, 78856347, 73872709, 69006597, 64367325, 60022340, 55997352, 52278407, 48816540, 45534310, 42335725, 39122232, 35814253, 32372129, 28807434, 25177979, 21566556, 18051537, 14682641, 11473010, 8409636, 5474524, 2665240, 5782, -2456440, -4665734, -6576954, -8167343, -9436902, -10402323, -11091719, -11540572, -11784610, -11850028, -11748307, -11481267, -11053360, -10482637, -9803770, -9061675, -8298638, -7540821, -6790359, -6025468, -5206361]
40072e206361R22002J070623J249192J433873J602074J738081J829420J859306
40064F498210J805904J652116J398751J070683P11553L70591Q9387j04931j98951
40055A3293313j88860p8647J16743L66001O20198Q21755R23181R06187P87870
40046A7567741O07629M02247J85560n3965l37669o76208j059617j462804j857269
40037A3315645k216451k512111k710412k776278k685377k435921k052143j575909
40029e648957j050229n05956L6928N54375J004938J333242J490411J457857J260289
40020f7102R61394O43121L76753K00590J16918J07142J49735K26076L13081L74596
40010C402304L64626K45612J1732k99942o21122q80789j031699j059608r74659
$$ y = [-5206361, -4284359, -3213736, -1964544, -530671, 1071403, 2809484, 4638904, 6498210, 8304114, 9956230, 11354981, 12425664, 13137217, 13507808, 13597195, 13492264, 13293313, 13104453, 13025806, 13142549, 13508550, 14128748, 14950503, 15873684, 16779871, 17567741, 18175370, 18577617, 18763177, 18709212, 18371543, 17695335, 16635718, 15172914, 13315645, 11099194, 8587083, 5876671, 3100393, 415016, -2020905, -4073048, -5648957, -6699186, -7205142, -7168214, -6613839, -5608901, -4275659, -2785248, -1327391, -67102, 894292, 1537413, 1914166, 2114756, 2231674, 2338816, 2488551, 2714627, 3027708, 3402304, 3766930, 4012542, 4024274, 3724332, 3103210, 2222421, 1190722, 131114, -843545]
40001h43545p96123n42195k29888J18143M68191P79280J015901J161118J220771
39992B351653J216772J174671J112129J033379R32137Q01174O41989M67507K96838
39983A0028249J47784L3272l7562n7486k1936O7716K01091L58319N13242O39883
39973A1872572P20356P50565P40376P07485O66876O18507N38388L82279J08928
39964A7106332k85957p50406j191583j517551j673876j651199j467956j149977
39956G417827p22739k16172L28033Q57085J318994J677475J915959K027024K000737
39947A6604223J828062J517763J108772O64519K53439p0736k80184l75311l80546
39938B0870001l35955k86936k73776l21903m34300n89389p47085q62400r01837
$$ y = [-843545, -1639668, -2181863, -2411751, -2293608, -1825417, -1046137, -30236, 1130882, 2351653, 3568425, 4743096, 5855225, 6888604, 7820741, 8621915, 9263904, 9731411, 10028249, 10176033, 10209305, 10171743, 10114257, 10092321, 10160037, 10361128, 10719447, 11232689, 11872572, 12592928, 13343493, 14083869, 14791354, 15458230, 16076737, 16615125, 16997404, 17106332, 16820375, 16069969, 14878386, 13360835, 11686959, 10035760, 8567804, 7417827, 6695088, 6478916, 6806949, 7664034, 8983028, 10660503, 12576462, 14603486, 16604223, 18432285, 19950048, 21058820, 21723339, 21976778, 21906042, 21625858, 21250547, 20870001, 20534046, 20247110, 19973334, 19651431, 19217131, 18627742, 17880657, 17018257, 16116420]
39929A6116420q55412p37919n79127m10772k60399j54335j21862j91440l78024
39920A2427130o69268j020752j366167j639751j798995j833252j753386j572677
39912G72882j296011r26167m81146p680M21440P27343Q51978P77621N30092J66517
39902A536869k44911o43676r86106j242708j390850j414458j313599j112654q53492
39893g665585n74774k93562m079L06613O38853R70507J263122J479497J600212
39884b279196J627432J574954J454955J272558J030270P35841M06961P0062k46837
39875E647000n25044p64007r80495j196034j420034j640331j827565j949087j982511
39866f638108j921886j777260j571916j338660j112555r19707p68203o48633n44018
$$ y = [16116420, 15261008, 14523089, 13943962, 13533190, 13272791, 13118456, 12996594, 12805154, 12427130, 11757862, 10737110, 9370943, 7731192, 5932197, 4098945, 2345559, 772882, -523129, -1449296, -1930442, -1938122, -1516682, -789339, 62639, 840260, 1370352, 1536869, 1291958, 648282, -337824, -1580532, -2971382, -4385840, -5699439, -6812093, -7665585, -8240359, -8533921, -8538000, -8231387, -7592534, -6622027, -5358905, -3879408, -2279196, -651764, 923190, 2378145, 3650703, 4680973, 5416814, 5823775, 5893837, 5647000, 5121956, 4357949, 3377454, 2181420, 761386, -878945, -2706510, -4655597, -6638108, -8559994, -10337254, -11909170, -13247830, -14360385, -15280092, -16048295, -16696928, -17240946]
39857a7240946m40695l32372k17896r8076K5731J52786K84489M24563N77086P43850
39847a6121480R21333J096221J242153J325534J323583J243859J127646J031255
39839f809896R98761J045652J160125J313263J467171J579369J609146J528818
39831C892409J334736J049407P11676L61351K8008k71584n30637p48822r29120
39822D897424j073621j178763j232937j219247j123876r46843p07991m40924j75579
39813c202357P8673L35238O15072R25422J247255J537881J745723J829854J776284
39804F889045J604362J360454J101877Q77861P14688O10345N40820M74664L87739
39795A4561855K70695J28260k5464j72154k94784l83665m40166m74514m97489
$$ y = [-17240946, -17681641, -18014013, -18231909, -18329985, -18304254, -18151468, -17866979, -17442416, -16865330, -16121480, -15200147, -14103926, -12861773, -11536239, -10212656, -8968797, -7841151, -6809896, -5811135, -4765483, -3605358, -2292095, -824924, 754445, 2363591, 3892409, 5227145, 6276552, 6988228, 7349579, 7377587, 7106003, 6575366, 5826544, 4897424, 3823803, 2645040, 1412103, 192856, -931020, -1877863, -2585854, -3026778, -3202357, -3123684, -2788446, -2173374, -1247952, -697, 1537184, 3282907, 5112761, 6889045, 8493407, 9853861, 10955738, 11833599, 12548287, 13158632, 13699452, 14174116, 14561855, 14832550, 14960810, 14935346, 14763192, 14468408, 14084743, 13644577, 13170063, 12672574]
39786A2672574n10413m99643m39720l04737q2554K16112N59038R03371J209238
39777A3723266J448357J604066J665426J622251J467023J203357Q53584M56932
39769B4044262N7278l11071o29254q89033j084343j208013j256048j234925j165280
39760A6323573j078378j006396r71285r77797j013633j055609j078827j066069
39752H075579j014885r39415q64902q16312q06546q30546q68613q96367q94548
39743A43445q53369p72872o64042n50158m60871m16247m11872m20915m14511l83339
39733e204751l42041l14593l13532l27169l21861k58791j17087R0893L23233N28799
39723f256900O69437P30059P14745O37211N14742L67793K20947J00332K8100J9656
$$ y = [12672574, 12162161, 11662518, 11222798, 10918061, 10835507, 11051619, 11610657, 12514028, 13723266, 15171623, 16775689, 18441115, 20063366, 21530389, 22733746, 23587330, 24044262, 24101540, 23790469, 23161215, 22272182, 21187839, 19979826, 18723778, 17488853, 16323573, 15245195, 14238799, 13267514, 12289717, 11276084, 10220475, 9141648, 8075579, 7060694, 6121279, 5256377, 4440065, 3633519, 2802973, 1934360, 1037993, 143445, -709924, -1482796, -2146838, -2696996, -3157867, -3574114, -3985986, -4406901, -4821412, -5204751, -5546792, -5861385, -6174917, -6502086, -6823947, -7082738, -7199825, -7108932, -6785699, -6256900, -5587463, -4857404, -4142659, -3505448, -2990706, -2622913, -2401966, -2301634, -2273534, -2253878]
39713b253878Q5922K34718M63896P49492J042237J281282J418340J436038J349845
39704E807892J195536J012051Q29671O68209N42426M65970M46718M76398N26122
39695A1970993N56300N35556M53127L14543J26224j15118m18563p85799j201314
39686A1435949j632670k037493k371653k597275k691693k655114k511894k302496
39678g364339k069325j843636j639631j456174j281307j095568q75597o01919
39670a8227496k69253J08674N04636Q88465J233268J514571J707479J787395J735523
39661i016738J547482J240966Q55724M42219M6276k96626n53634o86866o60898
39652g082095m62697j15731L24520P88340J209191J534118J729522J785084J714394
$$ y = [-2253878, -2167956, -1933238, -1469342, -719850, 322387, 1603669, 3022009, 4458047, 5807892, 7003428, 8015479, 8845150, 9513359, 10055785, 10521755, 10968473, 11444871, 11970993, 12527293, 13062849, 13515976, 13830519, 13956743, 13841625, 13423062, 12637263, 11435949, 9803279, 7765786, 5394133, 2796858, 105165, -2549949, -5061843, -7364339, -9433664, -11277300, -12916931, -14373105, -15654412, -16749980, -17625577, -18227496, -18496749, -18388075, -17883439, -16994974, -15761706, -14247135, -12539656, -10752261, -9016738, -7469256, -6228290, -5372566, -4930347, -4884071, -5180697, -5734331, -6421197, -7082095, -7544792, -7660523, -7336003, -6547663, -5338472, -3804354, -2074832, -289748, 1424646]
39643A424646J550311J336222J116386R27323P90631P07959O59960O11527N23473
39634I648438L66866J33289j64142m98379q38851j158387j434130j644374j766129
39625B644201j778374j672046j461368j187261r07681o78735n36194m84727m96851
39616f559036n21065m98126l81461j53299J71514N55280R54198J332946J670575
39607c428474J956360K180449K327907K381843K331744K177280J923296J573020
39599A3423425J129170O03451K5830n54023j073765j471089j699441j741861j615143
39590G026554j360502j026972o58857k92754L9466L08044M86471N57035N19647
39581E598132L99188K44327J14864O3043J17690K75996N03289P41048R23489R98231
$$ y = [1424646, 2974957, 4311179, 5427565, 6354888, 7145519, 7853478, 8513438, 9124965, 9648438, 10015304, 10148593, 9984451, 9486072, 8647221, 7488834, 6054704, 4410330, 2644201, 865827, -806219, -2267587, -3454848, -4362529, -5041264, -5577458, -6062185, -6559036, -7080101, -7578227, -7959688, -8112987, -7941473, -7386193, -6431995, -5099049, -3428474, -1472114, 708335, 3036242, 5418085, 7749829, 9927109, 11850405, 13423425, 14552595, 15156046, 15181876, 14627853, 13554088, 12082999, 10383558, 8641697, 7026554, 5666052, 4639080, 3980223, 3687469, 3726935, 4034979, 4521450, 5078485, 5598132, 5997320, 6241647, 6356511, 6419554, 6537244, 6813240, 7316529, 8057577, 8981066, 9979297]
39571I979297R41621P61696M90014J69455j56044m47642o73916q11160q44545
39562I408776p71612o05323l72029j04162J66400M08896N90859O80345O56848
39553A0058998N23605L09580N7556j93307m18374o06957p54863q57879r10747
39544G207612r11039q64121p85050o95727o19045n73254n68499o06127o80850
39535I03900p84525r07666j035837j144711j202575j183130j079560r07473o95100
39526h036677m71000k58514p5535O7388J72141K55510L43387M58260O07151P76957
39516f160932R39107J060794J118137J107348J050035R88317R68186J017076J128144
39507C216212J261156J359405J373160J279004J088159Q40571N86134L61427J75033
$$ y = [9979297, 10920918, 11682614, 12172628, 12342083, 12186039, 11738397, 11064481, 10253321, 9408776, 8637164, 8031841, 7659812, 7555650, 7722050, 8130946, 8721805, 9402150, 10058998, 10582603, 10892183, 10949739, 10756432, 10338058, 9731101, 8976238, 8118359, 7207612, 6296573, 5432452, 4647402, 3951675, 3332630, 2759376, 2190877, 1584750, 903900, 119375, -788291, -1824128, -2968839, -4171414, -5354544, -6434104, -7341577, -8036677, -8507677, -8766191, -8841726, -8774338, -8602197, -8346687, -8003300, -7545040, -6937889, -6160932, -5221825, -4161031, -3042894, -1935546, -885511, 102806, 1070992, 2088068, 3216212, 4477368, 5836773, 7209933, 8488937, 9577096, 10417667, 11003801, 11365228, 11540261]
39498A1540261R957j60162l53257n70001p95526j006054j175189j279557j306199
39489D904273j260321j166385j057153r55780q65053p73328o71458n64946m71336
39480b881487m07271l77326l71929l72744l60088l18736k40552j23423L2300K25613
39470e195643M51229O92851R21976J108336J236396J312956J356218J374159J351840
39461D610318J259996J077119Q05350M68466R8543k73849o19594r08128j110726
39452E407495j209726j205606j116367r71568q06005o53784n40116m71233m28968
39443a995878l77410k81419j26487P3624K86322M78148O27738P28057P82545Q01458
39433I96698P98660P86799P73006P59663P49443P47777P57807P70847P59999O83012
$$ y = [11540261, 11550218, 11390056, 11036799, 10466798, 9671272, 8665218, 7490029, 6210472, 4904273, 3643952, 2477567, 1420414, 464634, -400419, -1173747, -1845205, -2410151, -2881487, -3288758, -3666084, -4038013, -4410757, -4770845, -5089581, -5330133, -5453556, -5421256, -5195643, -4744414, -4051563, -3129587, -2021251, -784855, 528101, 1884319, 3258478, 4610318, 5870314, 6947433, 7752783, 8221249, 8319792, 8045943, 7426349, 6518221, 5407495, 4197769, 2992163, 1875796, 904228, 98223, -555561, -1095677, -1566910, -1995878, -2373288, -2654707, -2781194, -2707570, -2421248, -1943100, -1315362, -587305, 195240, 996698, 1795358, 2582157, 3355163, 4114826, 4864269, 5612046, 6369853, 7140700, 7900699, 8583711]
39423H583711M95816J72458k78316q10596j355567j843718k222197k461001k550383
39414b269793k495128k310086k018554j651543j243763q25219m14308j9528L51490
39405a2896432O85908R70236J201499J393171J568693J746111J924470K080958
39397a325386K180264K190093K094134J897041J621063J297389R56625O23164
39389A1534387L15874N2494j48383k70676l06033k55721j29103N6970K76139M92511
39379A1618459O68161P76850Q14595P97936P50263O86755O08984N10431L84950
39370A7617384K30695M9631j52573l63954n63100p19121p97540p72761o43126
39361A3885535m39250k16856l5379O5088P4823J0107r9238k21380l29597m06027
$$ y = [8583711, 9079527, 9251985, 8973669, 8163073, 6807506, 4963788, 2741591, 280590, -2269793, -4764921, -7075007, -9093561, -10745104, -11988867, -12814086, -13228394, -13247922, -12896432, -12210524, -11240288, -10038789, -8645618, -7076925, -5330814, -3406344, -1325386, 854878, 3044971, 5139105, 7036146, 8657209, 9954598, 10911223, 11534387, 11850261, 11902755, 11754372, 11483696, 11177663, 10921942, 10792839, 10849809, 11125948, 11618459, 12286620, 13063470, 13878065, 14676001, 15426264, 16113019, 16722003, 17232434, 17617384, 17848079, 17897710, 17745137, 17381183, 16818083, 16098962, 15301422, 14528661, 13885535, 13446285, 13229429, 13194050, 13259138, 13333961, 13344068, 13244830, 13023450, 12693853, 12287826]
39351A2287826m43276m43871m17987l80574l48339l36257l54434m07634m98459
39342H656995o31506q14050j050813j334886j640487j924311k138078k246182
39334c123318k236125k114522j895035j591460j221003q10048l93275o342L21282
39325a3069846N69439P27196P91281P64537O56746M88058K90391J01489m6675
39316h727384j37083j68970j53103j05909m4917J4358O0189Q5738R0893Q4886
39306i001302Q6691J19478J98437L16927M40526N17056N00603L75514J65508p4920
39296f355482k78232l82617l49551j76842J00518M25556P42578J014889J229087
39287d030096J387068J491603J534373J495771J358469J124071Q18353M81593
$$ y = [12287826, 11844550, 11400679, 10982692, 10602118, 10253779, 9917522, 9563088, 9155454, 8656995, 8025489, 7211439, 6160626, 4825740, 3185253, 1260942, -877136, -3123318, -5359443, -7473965, -9369000, -10960460, -12181463, -12991511, -13384786, -13391128, -13069846, -12500407, -11773211, -10981930, -10217393, -9560647, -9072589, -8782198, -8680709, -8727384, -8864467, -9033437, -9186540, -9292449, -9337366, -9323008, -9262819, -9177081, -9086188, -9001302, -8914611, -8795133, -8596696, -8279769, -7839243, -7322187, -6821584, -6446070, -6280562, -6355482, -6633714, -7016331, -7365882, -7542724, -7442206, -7016650, -6274072, -5259183, -4030096, -2643028, -1151425, 382948, 1878719, 3237188, 4361259, 5179612, 5661205]
39279E661205J53516j36903l74279n54676o80425p54146p75596p43215o58681
39270A136800n32057l85823k54776j78116j84739k79407m37474o09930p36865
39261b462387p67154o79019m90551k51190j7646J70395L00261L79205M19013M24731
39251b974342L94889L30195K40268J40962M6015l7144j03790j47016j59334j40572
39241b409869j05088q1586j03387j92789l47884n40654p28133q68997r35619r17923
39231g231929q21868o65756m74868k75304q9738O3027J66297K05160J69606N9924
39221h895449j09220l09648n06687o69756p81227q38652q49381q21929p61077
39212a4543026o70250n56844m32744l08385j87422o8387M9317J62477K65519L51528
$$ y = [5661205, 5814721, 5677818, 5303539, 4748863, 4068438, 3314292, 2538696, 1795481, 1136800, 604743, 218920, -35856, -213972, -398711, -678118, -1115592, -1725522, -2462387, -3229541, -3908560, -4399111, -4650301, -4667947, -4497552, -4197291, -3818086, -3399073, -2974342, -2579453, -2249258, -2008990, -1868028, -1822013, -1859157, -1962947, -2109963, -2269297, -2409869, -2514957, -2596543, -2699930, -2892719, -3240603, -3781257, -4509390, -5378387, -6314006, -7231929, -8053797, -8719553, -9194421, -9469725, -9559463, -9496436, -9330139, -9124979, -8955373, -8895449, -9004669, -9314317, -9821004, -10490760, -11271987, -12110639, -12960020, -13781949, -14543026, -15213276, -15770120, -16202864, -16511249, -16698671, -16767058, -16717741, -16555264, -16289745, -15938217]
39202a5938217M11523M36804M26192L91234L52270L28568L32185L69158M42397
39193a2447886N50215O81255Q11184R05151R26453Q48219O62387L80901L0160
39184f651961l54981p33185j057866j284202j382564j350462j214123j018263
39176a5047607q10775o30000m97397m14406l62877l10671k23032p6774J28265
39167a8245274L65742N90420P55226Q29248Q05192O92533N05693K59989k3418
39158a3464649l14563n81669q02298r67018j073101j117436j097539j018985q99761
39149b1337019p64911o34440n13722l93569k58985r9981Q1473K69905M39502N61923
39139b2649824O18484O13039N78136N66960O30333P89026J018900J260652J449124
$$ y = [-15938217, -15526694, -15089890, -14663698, -14272464, -13920194, -13591626, -13259441, -12890283, -12447886, -11897671, -11216416, -10405232, -9500081, -8573628, -7725409, -7063022, -6682121, -6651961, -7006942, -7740127, -8797993, -10082195, -11464759, -12815221, -14029344, -15047607, -15858382, -16488382, -16985779, -17400185, -17763062, -18073733, -18296765, -18373539, -18245274, -17879532, -17289112, -16533886, -15704638, -14899446, -14206913, -13701220, -13441231, -13464649, -13779212, -14360881, -15163179, -16130197, -17203298, -18320734, -19418273, -20437258, -21337019, -22101930, -22736370, -23250092, -23643661, -23902646, -24002627, -23921154, -23651249, -23211747, -22649824, -22031340, -21418301, -20840165, -20273205, -19642872, -18853846, -17834946, -16574294, -15125170]
39130a5125170J543292J540260J470319J381056J319221J315240J373539J471414
39122c710829J567256J616238J588474J481865J321740J146677R89748Q67282
39114F868451P79116P14969O60601O02271N30578M43121L43953K39399J32242
39105A1314701J8338j10709k59374m21128n79483p16680q21748q91500r26365
39096F606052r27142q94558q28879p27981n86376l98336j64706J00197L65615
39087B543886N87474P17423P15783N64991K79017r6341m94862q50248j116899
39078B850224j282150j365239j404264j436811j482433j535333j571012j562238
39070h789256j493204j362693j176859r41062o59758l43900j7085K87060N35303
$$ y = [-15125170, -13581878, -12041618, -10571299, -9190243, -7871022, -6555782, -5182243, -3710829, -2143573, -527335, 1061139, 2543004, 3864744, 5011421, 6001169, 6868451, 7647567, 8362536, 9023137, 9625408, 10155986, 10599107, 10943060, 11182459, 11314701, 11333039, 11222330, 10962956, 10541828, 9962345, 9245665, 8423917, 7532417, 6606052, 5678910, 4784352, 3955473, 3227492, 2641116, 2242780, 2078074, 2178271, 2543886, 3131360, 3848783, 4564566, 5129557, 5408574, 5312233, 4817371, 3967123, 2850224, 1568074, 202835, -1201429, -2638240, -4120673, -5656006, -7227018, -8789256, -10282460, -11645153, -12822012, -13763074, -14422832, -14766732, -14783817, -14496757, -13961454]
39061a3961454P06041P95634Q18131P98744P62939P26585O94222O66642O49729
39052g342787O54418O86749P38355P88935Q21307Q37041Q58165R11524J007211
39043c9082J127671J234425J285054J247706J107094Q65010N40487J69748j98149
39034G339964n12149p32433q38367q27599p11475n14867k80964p1286M8400L2650
39024B931874j23753l83396o81125r46122j121913j180574j128686j000854q39663
39015d474212o71584m95371k91767m5269K41301N49379Q56664J144061J392268
39006a794530J575076J659236J614019J426024J110981P15777L08351m1038k80537
38997F293359l92442l98170l49241l06297l14823l88622n08259o34106p26986
$$ y = [-13961454, -13255413, -12459779, -11641648, -10842904, -10079965, -9353380, -8659158, -7992516, -7342787, -6688369, -6001620, -5263265, -4474330, -3653023, -2815982, -1957817, -1046293, -39082, 1088589, 2323014, 3608068, 4855774, 5962868, 6827878, 7368365, 7538113, 7339964, 6827815, 6095382, 5257015, 4429416, 3717941, 3203074, 2922110, 2850824, 2899224, 2931874, 2808121, 2424725, 1743600, 797478, -324435, -1505009, -2633695, -3634549, -4474212, -5145796, -5641167, -5932934, -5978203, -5736902, -5187523, -4330859, -3186798, -1794530, -219454, 1439782, 3053801, 4479825, 5590806, 6306583, 6614934, 6573896, 6293359, 5900917, 5502747, 5153506, 4847209, 4532386, 4143764, 3635505, 3001399, 2274413]
38988B274413p65763p52711p05671o45595n89733n52011n43791n69715o21856
38979c472433o79629p18852p26182p10310p00983p32622q20292r44036j053759
38970a0559098j092297j021688q37608n66869k53148N9400L36549N56026P04926
38961a2673807P78534P82636P35155O61578N84082N11754M40364L62571K79885
38952g537248K05905J58877J51082J83432K46171L21401L85387M13146L86615
38943e085232L02497J74096K5582j17606k37323l26720l87536m21112m19263l64575
38933f857192k43581o3013J46370L43076M93367N79992N99200N55426M59735L28201
38923c658419J76193J2759j58110l30336m90618o19841o97780p05849o27110m47226
$$ y = [2274413, 1508650, 755939, 50268, -595327, -1185060, -1737071, -2280862, -2850577, -3472433, -4152062, -4870914, -5597096, -6307406, -7008389, -7741011, -8561303, -9505339, -10559098, -11651395, -12673083, -13510691, -14077560, -14330708, -14271308, -13934759, -13378733, -12673807, -11895273, -11112637, -10377482, -9715904, -9131822, -8620068, -8179704, -7817133, -7537248, -7331343, -7172466, -7021384, -6837952, -6591781, -6270380, -5884993, -5471847, -5085232, -4782735, -4608639, -4583057, -4700663, -4937986, -5264706, -5652242, -6073354, -6492617, -6857192, -7100773, -7163786, -7017416, -6674340, -6180973, -5600981, -5001781, -4446355, -3986620, -3658419, -3482226, -3469467, -3627577, -3957913, -4448531, -5068372, -5766152, -6472001, -7099111, -7546337]
38913g546337j60462K18581O43041J032505J290290J335075J130672O98048J05452
38904a253135n55404j194732j741678k149375k391931k461189k366659k133672
38896a6247775j794414j376325q99471l86922J22820N76247R20632J123648J184318
38887a6777242J132214J018424R01600Q31693Q36729R18642J058271J222772J369989
38878g486908J451939J423462J256885R56073N61667J43696k16628m50213n19906
38869b879933m28724k13990O7497L55204N97077P58371Q27700Q18164P60473O88624
38859A350463O24419N70136N13801M41881L48101K32706R7480n4425k13060l58885
38849C552617m68712n26532n30182m89429m18457l27675k17909p8660J07750L56106
$$ y = [-7546337, -7706799, -7488218, -6845177, -5812672, -4522382, -3187307, -2056635, -1358587, -1253135, -1808539, -3003271, -4744949, -6894324, -9286255, -11747444, -14114103, -16247775, -18042189, -19418514, -20317985, -20704907, -20582087, -20005840, -19085208, -17961560, -16777242, -15645028, -14626604, -13725004, -12893311, -12056582, -11137940, -10079669, -8856897, -7486908, -6034969, -4611507, -3354622, -2398549, -1836882, -1693186, -1909814, -2360027, -2879933, -3308657, -3522647, -3455150, -3099946, -2502869, -1744498, -916798, -98634, 661839, 1350463, 1974882, 2545018, 3058819, 3500700, 3848801, 4081507, 4178987, 4124562, 3911502, 3552617, 3083905, 2557373, 2027191, 1537762, 1119305, 791630, 573721, 495061, 602811, 958917]
38839I58917O66007J013952J355152J635498J808413J848370J755192J549613
38831A2591114J265774R45617O34176L70716J74977L6950p8384k09791l75372
38822A5355777n62706p39678q76087r60250j002068j024348j049525j088734j137851
38813F914530j182369j208443j213218j206616j201965j202113j192884j150294
38805b643372j055800r07143p18067n10746l07876j27070K2898J43021K41151
38796e863004L28054M15599N15185O31902P56361Q63518R24036R21028Q58392
38787C51071P54247O25977M79299L09106J09727j15088l51274n82563p98734r95617
38777b13849j168092j304760j390280j412679j369041j266544j119958r46780
$$ y = [958917, 1624924, 2638876, 3994028, 5629526, 7437939, 9286309, 11041501, 12591114, 13856888, 14802505, 15436681, 15807397, 15982374, 16019324, 15940940, 15731149, 15355777, 14793071, 14053393, 13177306, 12217056, 11214988, 10190640, 9141115, 8052381, 6914530, 5732161, 4523718, 3310500, 2103884, 901919, -300194, -1493078, -2643372, -3699172, -4606315, -5324382, -5835128, -6143004, -6270074, -6247176, -6104155, -5863004, -5534950, -5119351, -4604166, -3972264, -3215903, -2352385, -1428349, -507321, 351071, 1105318, 1731295, 2210594, 2519700, 2629427, 2514339, 2163065, 1580502, 781768, -213849, -1381941, -2686701, -4076981, -5489660, -6858701, -8125245, -9245203, -10191983]
38769a0191983p60209n62876l47285j05758J56239M14633O34890P88471Q66303
38760i107575Q81570Q61658Q34551Q16982Q10229Q04829P88957P52757O85725
38751a870317N71819L90022J23685k25431o27138j024434j347900j536635j555981
38742g102310j404893j111781p22790k88929J42784N33287Q53752J088844J238939
38733f773097J317209J341553J326522J279903J204378J101751R77051Q39433
38725B614703O97936N55095M05723K44423P6140p9821j95586k45392k14971j07037
38715C751213N6894K38358L88002M56394M08965K40887j6102l01544n47261p01680
38705C974126p46194o97531n96708m91100m18876m02286m48037n47643o74963
$$ y = [-10191983, -10952192, -11515068, -11862353, -11968111, -11811872, -11397239, -10762349, -9973878, -9107575, -8226005, -7364347, -6529796, -5712814, -4902585, -4097756, -3308799, -2556042, -1870317, -1298498, -908476, -784791, -1010222, -1637360, -2661794, -4009694, -5546329, -7102310, -8507203, -9618984, -10341774, -10630703, -10487919, -9954632, -9100880, -8012036, -6773097, -5455888, -4114335, -2787813, -1507910, -303532, 798219, 1775270, 2614703, 3312639, 3867734, 4273457, 4517880, 4594020, 4514199, 4318613, 4073221, 3858250, 3751213, 3808107, 4046465, 4434467, 4890861, 5299826, 5540713, 5524611, 5223067, 4675806, 3974126, 3227932, 2530401, 1933693, 1442593, 1023717, 621431, 173394, -374249, -1049212]
38696a049212p86822q34257p82979o32178m19813k10177o8963l6970j14208k60963
38686e196542m14407n13072n20046m36994l03280j78186j12436j23956j93202
38677g992121k80670l52374l93743m04467l83853l21677k01011q769K53499N63846
38667i521340Q82350J162029J363437J464632J462043J365193J191506R63662
38659C33512P07653M49777K13337J6545j27983k12811k34946j95301r8757M4857
38649H95883K19500M02793N68364O90261P47736P29220O35956M84950L08395J46612
38639E829670L5956k425L2021J20926K34606L43731M30654M93740N41349N80317
38629H640545O08153O13559N82169N01809L64596J66724r2359m09602p75265j167469
$$ y = [-1049212, -1836034, -2670291, -3453270, -4085448, -4505261, -4715438, -4784401, -4821371, -4935579, -5196542, -5610949, -6124021, -6644067, -7081061, -7384341, -7562527, -7674963, -7798919, -7992121, -8272791, -8625165, -9018908, -9423375, -9807228, -10128905, -10329916, -10338685, -10085186, -9521340, -8638990, -7476961, -6113524, -4648892, -3186849, -1821656, -630150, 333512, 1041165, 1490942, 1704279, 1720824, 1592841, 1380030, 1145084, 949783, 851026, 895883, 1115383, 1518176, 2086540, 2776801, 3524537, 4253757, 4889713, 5374663, 5683058, 5829670, 5865626, 5863201, 5895222, 6016148, 6250754, 6594485, 7025139, 7518879, 8060228, 8640545, 9248698, 9862257, 10444426, 10946235, 11310831, 11477555, 11385196, 10975594, 10200329, 9032860]
38619I032860j548048j864789k062245k097969j957476j661286j260344q20840
38611d240137m04475n3273K14325L97094N01849N38525N19716M59587L68622K46747
38601a451420Q1835j41405m24686p42642j044902j276138j401615j420214j356839
38592i178026j242301j096264r23272p20928m91737k49213j3693J98666L84668
38583a3332100N53210P15203Q72563J015278J128658J203329J237293J227367
38575e379199J159841J013314P74732M55508R3654k59631n59168p79906r20110
38566d400965r93317j013846r85112q99354p49539n44720l16866j12423K7549
38557i988593Q6034P4735K2243m4663j13669j86964k70267l58072m25505m35588
$$ y = [9032860, 7484812, 5620023, 3557778, 1459809, -497667, -2158953, -3419297, -4240137, -4644612, -4697885, -4483560, -4086466, -3584617, -3046092, -2526376, -2066789, -1698167, -1451420, -1369585, -1510990, -1935676, -2678318, -3723220, -4999358, -6400973, -7821187, -9178026, -10420327, -11516591, -12439863, -13160791, -13652528, -13901741, -13915434, -13716768, -13332100, -12778890, -12063687, -11191124, -10175846, -9047188, -7843859, -6606566, -5379199, -4219358, -3206044, -2431312, -1975804, -1882150, -2141781, -2700949, -3480855, -4400965, -5394282, -6408128, -7393240, -8292594, -9042133, -9586853, -9903719, -10016142, -9988593, -9902559, -9827824, -9805581, -9850244, -9963913, -10150877, -10421144, -10779216, -11204721, -11640309]
38547a1640309l59437j93951L7436K98448N53247P71101R28321J014173J036311
38538g554660J016865R79765R39671R00649Q62777Q28493Q02220P83873P63396
38529C23049P23794O52280N50440M34686L27119K43838J86767J41214P9769k7969
38519C634987k03366m49704p48909j063607j343631j536568j600138j512099j274559
38510f097594r12696m69242L743M53172Q30570J095846J223297J210834J085917
38501a576153Q99467P07388N50128M42816L79374L43520L17704K87290K43221
38492B594755J85254J23285P3701N2694P1702J36705K48011L97942N69188P37669
38482E190906Q78396R69098R91019R32137P94804O00190L80726J63848l8287k23742
$$ y = [-11640309, -11999746, -12193697, -12156261, -11857813, -11304566, -10533465, -9605144, -8590971, -7554660, -6537795, -5558030, -4618359, -3717710, -2854933, -2026440, -1224220, -440347, 323049, 1046843, 1699123, 2249563, 2684249, 3011368, 3255206, 3441973, 3583187, 3662956, 3634987, 3431621, 2981917, 2233008, 1169401, -174230, -1710798, -3310936, -4823035, -6097594, -7010290, -7479532, -7475789, -7022617, -6192047, -5096201, -3872904, -2662070, -1576153, -676686, 30702, 580830, 1023646, 1403020, 1746540, 2064244, 2351534, 2594755, 2780009, 2903294, 2976995, 3029689, 3101391, 3238096, 3486107, 3884049, 4453237, 5190906, 6069302, 7038400, 8029419, 8961556, 9756360, 10356550, 10737276, 10901124, 10862837, 10639095]
38472A0639095l87120n12172n76986n65832m78534l33155j61688k39J22063J89677
38462G935109K00698J63860R5842J7512n2971j07257j48608j87194k32900k90046
38452G394045l55636m21080m76183n12618n25182n12718m80968m44656m23745
38443C241259m34492m82309n60667o52787p32457p67066p27218n99357l92604
38434b107698j36374J26550L47829M84641N15329M52164L39891K37019J89426
38425D48777K10718K78254L44759L58974K86240J21050j12222l68848n98802p62067
38415B06833q39216q32865p58938o33725m66979k66518m8833J55339L05927L65370
38405b813605L11455J48450q6024l24770m90414n24750m12357j85079R3226L51213
$$ y = [10639095, 10251975, 9739803, 9162817, 8596985, 8118451, 7785296, 7623608, 7623369, 7745432, 7935109, 8135807, 8299667, 8395509, 8413021, 8360050, 8252793, 8104185, 7916991, 7684091, 7394045, 7038409, 6617329, 6141146, 5628528, 5103346, 4590628, 4109660, 3665004, 3241259, 2806767, 2324458, 1763791, 1111004, 378547, -388519, -1115737, -1715094, -2107698, -2244072, -2117522, -1769693, -1285052, -769723, -317559, 22332, 259351, 448777, 659495, 937749, 1282508, 1641482, 1927722, 2048772, 1936550, 1567702, 968900, 206833, -632383, -1465248, -2224186, -2857911, -3324890, -3591408, -3640241, -3484902, -3178975, -2813605, -2502150, -2353700, -2439724, -2764494, -3254908, -3779658, -4192015, -4377094, -4283868, -3932655]
38395c932655N32445O09455N87756M99869L91178L02059K52870K37864K30849
38386b88310K00423J27925J9261r5707j76072j88549j22345P169J67462L25072
38376b3671M58635N60095O24536O39711N87347M57110K61115L5731j71279l18635
38366C110695l83403l62523k66975j14438P5001K79810M77904O50034P84141Q77140
38356E127386R33192R60540R68662R65455R54453R33182Q93188Q21554P04380
38347A3261992N32601L07439M1238k46384n32068p88723r85478j093384j096905
38338I400328j005099q54961p02472o02367n85503o47203p53442q57523r13791
38329B477967q83771p41374m82203j30702K64854O49794R81417J236295J404830
$$ y = [-3932655, -3400210, -2790755, -2202999, -1703130, -1311952, -1009893, -757023, -519159, -288310, -87887, 40038, 59299, -36408, -212480, -401029, -523374, -516205, -348743, -23671, 434964, 995059, 1619595, 2259306, 2846653, 3303763, 3564878, 3600609, 3429330, 3110695, 2727292, 2364769, 2097794, 1983356, 2058357, 2338167, 2816071, 3466105, 4250246, 5127386, 6060578, 7021118, 7989780, 8955235, 9909688, 10842870, 11736058, 12557612, 13261992, 13794593, 14102032, 14143270, 13896886, 13364818, 12576095, 11590617, 10497233, 9400328, 8395229, 7540268, 6837796, 6235429, 5649926, 5002723, 4249281, 3391758, 2477967, 1594196, 852822, 370619, 239917, 504771, 1154565, 2135982, 3372277, 4777107]
38320D777107J481555J460756J339252J120684Q15469M36875j749m85190r90967
38311I953792j483818j914479k226704k372728k330855k115999j778306j390796
38303e659893j028898p46188n55517m27144l07403j47603P3112L41181O18659
38294g839694Q62821J044562J155652J202898J196853J144006J044785Q95281
38286G07164O92595M43616J71592q7525k98760m42130n17686n40517n30222m99798
38276i01671m49105l67881k48403r9889M6059J43569J49215L7094j95471n31637
38266b418120r41367j384162j809177k158915k379291k431964k303352k008458
38258a7834806j589918j110951o40724k35325P7552L01894M61989N81932O68202
$$ y = [4777107, 6258662, 7719418, 9058670, 10179354, 10994823, 11431698, 11429949, 10944759, 9953792, 8469974, 6555495, 4328791, 1956063, -374792, -2490791, -4269097, -5659893, -6688791, -7434979, -7990496, -8417640, -8725043, -8872646, -8799534, -8458353, -7839694, -6976873, -5932311, -4776659, -3573761, -2376908, -1232902, -188117, 707164, 1399759, 1843375, 2014967, 1927442, 1628682, 1186552, 668866, 128349, -401873, -901671, -1350776, -1718657, -1967060, -2066949, -2020890, -1877321, -1728106, -1691012, -1886483, -2418120, -3359487, -4743649, -6552826, -8711741, -11091032, -13522996, -15826348, -17834806, -19424724, -20535675, -21176399, -21411724, -21334172, -21032278, -20570289, -19988357, -19320155]
38249a9320155P07355O81017N86964M49106L07527J95754J22917P4189K7521k8345
38239a6196150q8565j40067j71656j77303j54180j02581k9721M8293J11914J49077
38229a6750939J63395J73402K03949K76053M00169N73446P79641R91128J172239
38220a2017517J282527J281028J136157Q42381M34151j7462m29387p39647r29807
38211i157576j025947j079460j137328j216464j296572j335416j295120j161774
38203a8705657r50139o97542m53380k65522j64241j49902j92762k46152k64624
38194b2089921k16384q6527J23852L97166O99121R85043J213173J355777J399319
38185a6219381J336778J164291Q88769N39516J71262j46556l48661l91011k59514
$$ y = [-19320155, -18612800, -17931783, -17344819, -16895713, -16588186, -16392432, -16269515, -16195326, -16167805, -16196150, -16284715, -16424782, -16596438, -16773741, -16927921, -17030502, -17060223, -17011930, -16900016, -16750939, -16587544, -16414142, -16210193, -15934140, -15533971, -14960525, -14180884, -13189756, -12017517, -10734990, -9453962, -8317805, -7475424, -7041273, -7058735, -7488122, -8227769, -9157576, -10183523, -11262983, -12400311, -13616775, -14913347, -16248763, -17543883, -18705657, -19655796, -20353338, -20806718, -21072240, -21236481, -21386383, -21579145, -21825297, -22089921, -22306305, -22392832, -22268980, -21871814, -21172693, -20187650, -18974477, -17618700, -16219381, -14882603, -13718312, -12829543, -12290027, -12118765, -12265321, -12613982, -13004993, -13264507]
38176a3264507L0320M39232R11416J381313J781361K052312K154648K076478J833604
38167f03823J461829J006619N15708L6052l88071p18534r27518j000170r36111
38158a554019p51060m77181j58360J60077M42207O67291Q29594R35694J001617
38149A095860J047960J090446J127978J136688J078306R21771O65070L41911Q614
38140H514604k78775m82418n88775o06668n63532n00497m62416m82800n71450
38131C977273p13672q81054j044422j180222j270506j303004j275310j200810
38123d891727j109940j042112j029445j080787j176427j276495j335524j313666
38115a4256123j182757r31109n67644j21480L63651Q35376J236532J511589J620343
$$ y = [-13264507, -13234187, -12794955, -11883539, -10502226, -8720865, -6668553, -4513905, -2437427, -603823, 858006, 1864625, 2380333, 2416385, 2028314, 1309780, 382262, -617908, -1554019, -2305079, -2782260, -2940620, -2780543, -2338336, -1671045, -841451, 94243, 1095860, 2143820, 3234266, 4362244, 5498932, 6577238, 7499009, 8164079, 8505990, 8514604, 8235829, 7753411, 7164636, 6557968, 5994436, 5493939, 5031523, 4548723, 3977273, 3263601, 2382547, 1338125, 157903, -1112603, -2415607, -3690917, -4891727, -6001667, -7043779, -8073224, -9154011, -10330438, -11606933, -12942457, -14256123, -15438880, -16369989, -16937633, -17059113, -16695462, -15860086, -14623554, -13111965, -11491622]
38106a1491622J554186J343021J044891P22170M17533J43567j08695l49876n76037
38097g300862p66329q92341r29572q64472o97486m44537j36610J84550M74667
38088a1372992O96460Q26971Q60725Q08497O92988N43430L91635K70596K13544
38079f068146K48967L90027O23773R09362J189876J413195J551358J608296J611087
38070C477795J588752J551430J484404J360830J162248Q90979N67293K16716j41853
38061A2158594m99672q52209j189168j489246j725396j877441j942290j933889
38053F49283j873889j780515j662440j518738j341838j121678q52684n44291k29120
38044a0275910M1298K16811K74327K31308J37471N1462J8217N8019J66510L18068
$$ y = [-11491622, -9937436, -8594415, -7549524, -6827354, -6409821, -6266254, -6374949, -6724825, -7300862, -8067191, -8959532, -9889104, -10753576, -11451062, -11895599, -12032209, -11847659, -11372992, -10676532, -9849561, -8988836, -8180339, -7487351, -6943921, -6552286, -6281690, -6068146, -5819179, -5429152, -4805379, -3896017, -2706141, -1292946, 258412, 1866708, 3477795, 5066547, 6617977, 8102381, 9463211, 10625459, 11516438, 12083731, 12300447, 12158594, 11658922, 10806713, 9617545, 8128299, 6402903, 4525462, 2583172, 649283, -1224606, -3005121, -4667561, -6186299, -7528137, -8649815, -9502499, -10046790, -10275910, -10234612, -10017801, -9743474, -9512166, -9374695, -9323233, -9305016, -9246997, -9080487, -8762419]
38034h762419M68601N61791N44712L90123J12892k31315n65570q18724r47323
38025i247232r44973q38115o72450m97326l54139k69287k49200k78064l23095
38016a3673881l49590l39335l00924k64715k64753l17518m08725m95389n22949
38007a6937779m49300k63487J0645L26693O35909R04141J118736J285366J418978
37998a1950098J533418J633568J712841J756323J746896J671134J524150J313762
37990I41994J062542Q04697N76849M05800K98744K40645K01031J48699O8242l0828
37980D718415j19577j68558j68779j39419j15707j26533j79954k65683l66120
37971C068085m61469n26264n28296m38796k48721K2251L31089O25974Q60313J000801
$$ y = [-8762419, -8293818, -7732027, -7187315, -6797192, -6684300, -6915615, -7481185, -8299909, -9247232, -10192205, -11030320, -11702770, -12200096, -12554235, -12823522, -13072722, -13350786, -13673881, -14023471, -14362806, -14663730, -14928445, -15193198, -15510716, -15919441, -16414830, -16937779, -17387079, -17650566, -17639921, -17313228, -16677319, -15773178, -14654442, -13369076, -11950098, -10416680, -8783112, -7070271, -5313948, -3567052, -1895918, -371768, 941994, 2004536, 2809233, 3386082, 3791882, 4090626, 4331271, 4532302, 4681001, 4749243, 4718415, 4598838, 4430280, 4261501, 4122082, 4006375, 3879842, 3699888, 3434205, 3068085, 2606616, 2080352, 1552056, 1113260, 864539, 886790, 1217879, 1843853, 2704166, 3704967]
37961C704967J030735R51252P80035N44783K72340j9626l20820o17140q80609
37952E445917j071378j153122j111944r65747p57538n37266l44267k00456j14383
37943h10184q7571j15340j82444k60217l11245l02038k18146p2775R7934K51895
37933b010131L60346M17803M38196M41775M41335M34904M08088L44205K35506
37924A512027Q8207q0355k47511l88591m78431m96176m34874l09858j57963k6098
37914a019623M4515L1343o2210k06500l54998m63329n09525n02257m71789m52164
37904c966537m67755n29228o35037p73930r28162j077890j205194j296080j340962
37895a2220775j334401j273949j158763r90629p77992n38438k94240o2596J50536
$$ y = [3704967, 4735702, 5686954, 6466989, 7011772, 7284112, 7264486, 6943666, 6326526, 5445917, 4374539, 3221417, 2109473, 1143726, 386188, -151078, -495345, -695801, -810184, -897755, -1013095, -1195539, -1455756, -1767001, -2069039, -2287185, -2359960, -2262026, -2010131, -1649785, -1231982, -793786, -352011, 89324, 524228, 932316, 1276521, 1512027, 1600234, 1519879, 1272368, 883777, 405346, -90830, -525704, -835562, -993525, -1019623, -975108, -943765, -1005975, -1212475, -1567473, -2030802, -2540327, -3042584, -3514373, -3966537, -4434292, -4963520, -5598557, -6372487, -7300649, -8378539, -9583733, -10879813, -12220775, -13555176, -14829125, -15987888, -16978517, -17756509, -18294947, -18589187, -18651783, -18501247]
37886a8501247L46214N21196O60178P38900P36052O45446M81580K77284P5963
37877a4018434p9233j57914j53363q5167J1534J05967J87098K62728L44571M33567
37867a3148646N17568N81307O19402O43230O77217P45880Q59322J007479J166647
37858f330594J310325J414241J455775J416161J288109J081556Q21597N42367
37850B999537K82808Q2566k7183l5879L9986J60857K75431L34389L04020J75969
37840D592501l2347k87238n50476p85345r57541j037854j009454q74652o54514
37831a596920l80836q6605J98551M47019O31568P29934P35893O68676N70859M92456
37821B410595M69355N08189N85055O57156O80405O24622M80364K56576k6957l46846
$$ y = [-18501247, -18155033, -17633837, -16973659, -16234759, -15498707, -14853261, -14371681, -14094397, -14018434, -14097667, -14255581, -14408944, -14494111, -14482577, -14376610, -14189512, -13926784, -13582213, -13148646, -12631078, -12049771, -11430369, -10787139, -10109922, -9364042, -8504720, -7497241, -6330594, -5020269, -3606028, -2150253, -734092, 554017, 1635573, 2457170, 2999537, 3282345, 3364911, 3337728, 3301849, 3341835, 3502692, 3778123, 4112512, 4416532, 4592501, 4560154, 4272916, 3722440, 2937095, 1979554, 941700, -67754, -942406, -1596920, -1977756, -2064361, -1865810, -1418791, -787223, -57289, 678604, 1347280, 1918139, 2410595, 2879950, 3388139, 3973194, 4630350, 5310755, 5935377, 6415741, 6672317, 6645360, 6298514]
37811F298514o80423j007798j312760j581998j802454j959412k038579k031724
37803f116634j940695j775185j545438j256524r10052n12912q6091L34379P06545
37794a3102607R96589J189962J295058J339268J359271J388688J448390J544527
37786b540854J673279J825008J982505K117176K192012K173792K046784J817987
37778A3287689J511553J157855P83631M05461K6415l62608p74030j208747j643980
37769A3183239k034284k327365k484735k494288k369952k142833j850273j526007
37761d046498j193510q65703n52544k71920n4406O4905O4328m9196k39628m57304
37751g601476o58942q18462r24196r69582r47271q50591o79204m43983j68951
$$ y = [6298514, 5618091, 4610293, 3297533, 1715535, -86919, -2046331, -4084910, -6116634, -8057329, -9832514, -11377952, -12634476, -13544528, -14057440, -14143531, -13809152, -13102607, -12106018, -10916056, -9620998, -8281730, -6922459, -5533771, -4085381, -2540854, -867575, 957433, 2939938, 5057114, 7249126, 9422918, 11469702, 13287689, 14799242, 15957097, 16740728, 17146189, 17172604, 16809996, 16035966, 14827219, 13183239, 11148955, 8821590, 6336855, 3842567, 1472615, -670218, -2520491, -4046498, -5240008, -6105711, -6658255, -6930175, -6984581, -6919676, -6855348, -6904544, -7144172, -7601476, -8260418, -9078880, -10003076, -10972658, -11919929, -12770520, -13449724, -13893707, -14062658]
$$ [...]
##END NTUPLES=NMR SPECTRUM
##END=
