##TITLE=31Pdec_DE-28oil
 
  24 sc
 29.11.2023
##JCAMPDX= 6.0         $$ Bruker NMR JCAMP-DX V2.0
##DATA TYPE= NMR SPECTRUM
##DATA CLASS= NTUPLES
##ORIGIN= UXNMR, Bruker Analytische Messtechnik GmbH
##OWNER= root
$$ XWIN-NMR		Version 3.5
$$ Thu Nov 30 14:17:24 2023 Russian Standard Time (UT+4h)  she@DPX200
##.OBSERVE FREQUENCY= 81.013821
##.OBSERVE NUCLEUS= ^31P
##.ACQUISITION MODE= SIMULTANEOUS
##.ACQUISITION SCHEME= undefined
##.AVERAGES= 24
##.DIGITISER RES= 16
##SPECTROMETER/DATA SYSTEM= spect
##.PULSE SEQUENCE= zgpg30
##.SOLVENT NAME= CD2Cl2
##.SHIFT REFERENCE= (INTERNAL, CD2Cl2, 0, 248.564)
##AUDIT TRAIL= $$ (NUMBER, WHEN, WHO, WHERE, WHAT)
$$ ##TITLE= Audit trail, XWIN-NMR		Version 3.5
$$ ##JCAMPDX= 5.01
$$ ##ORIGIN= Bruker BioSpin GmbH
$$ ##OWNER= she
$$ F:/spectra/data/she/nmr/P31/1/pdata/1/auditp.txt
$$ ##AUDIT TRAIL=  $$ (NUMBER, WHEN, WHO, WHERE, WHAT)
(   1,<2023-11-30 14:14:11.03 +0400>,<she>,<DPX200>,
      <created by zg, POWCHK disabled, PULCHK disabled
       configuration hash MD5:
       00 E9 B6 7A A2 85 ED C7 34 08 36 98 17 FE 4E 26
       data hash MD5: 32K
       C0 90 70 AA EF 59 96 9D A3 D8 24 9F 97 60 A5 FA>)
(   2,<2023-11-30 14:15:57.96 +0400>,<she>,<DPX200>,
      <Start of raw data processing
       efp BC_mod = 2 LB = 10 FT_mod = 6 PKNL = 1 PHC0 = -11685.56 PHC1 = -67.90641 SI = 64K 
       data hash MD5: 64K
       97 43 16 88 A4 30 EF B3 3D B9 EB DC 2B E8 B9 72>)
(   3,<2023-11-30 14:16:12.92 +0400>,<she>,<DPX200>,
      <pk PHC0 = 5.240478 PHC1 = 0 
       data hash MD5: 64K
       65 73 A7 6D 25 7E 04 45 DD 29 A8 BC C4 D3 74 9C>)
(   4,<2023-11-30 14:16:15.90 +0400>,<she>,<DPX200>,
      <abs ABSG = 5 
       data hash MD5: 64K
       56 06 B5 6A 0F F7 7C BF 7B 3F 26 4C 97 4A DA FF>)
$$ ##END=
$$ 
$$ hash MD5
$$ 97 5D 8E 48 CD B0 01 1B E4 AA EC E4 3E 07 F0 0D
##$RELAX= 
##$RELAX= 
##$RELAX= 
##$RELAX= 
##$RELAX= 
##$RELAX= 
##$RELAX= 
##$RELAX= 
##$RELAX= 
$$ Bruker specific parameters
$$ --------------------------
##$DU= <F:/spectra>
##$EXPNO= 1
##$NAME= <P31>
##$PROCNO= 1
##$TYPE= <nmr>
##$USER= <she>
##$AMP= (0..31)
100 100 100 100 100 100 100 100 100 100 100 100 100 100 100 100 100 100 
100 100 100 100 100 100 100 100 100 100 100 100 100 100 
##$AQSEQ= 0
##$AQ_mod= 1
##$AUNM= <au_zg>
##$AUTOPOS= <>
##$BF1= 81.014009
##$BF2= 200.13
##$BF3= 200.13
##$BF4= 200.13
##$BF5= 200.13
##$BF6= 200.13
##$BF7= 200.13
##$BF8= 200.13
##$BYTORDA= 1
##$CFDGTYP= 0
##$CFRGTYP= 5
##$CHEMSTR= <none>
##$CNST= (0..31)
1 1 145 1 1 1 1 1 1 1 1 1 1 1 1 1 1 1 1 1 1 1 1 1 1 1 1 1 1 1 1 1 
##$CPDPRG= <waltz16>
##$CPDPRG1= <>
##$CPDPRG2= <waltz16>
##$CPDPRG3= <>
##$CPDPRG4= <mlev>
##$CPDPRG5= <mlev>
##$CPDPRG6= <mlev>
##$CPDPRG7= <mlev>
##$CPDPRG8= <mlev>
##$CPDPRGB= <>
##$CPDPRGT= <>
##$D= (0..31)
0 1 0 0 0 0 0 0 0 0 0 0.03 2e-05 3e-06 0 0 0 0 0 0 0 0 0 0 0 0 0 0 0 0 
0 0 
##$DATE= 1701339250
##$DBL= (0..7)
120 120 120 11 120 120 24 19 
##$DBP= (0..7)
150 150 150 150 150 150 150 150 
##$DBP07= 0
##$DBPNAM0= <>
##$DBPNAM1= <>
$$ [...]
##$SUBNAM3= <"">
##$SUBNAM4= <"">
##$SUBNAM5= <"">
##$SUBNAM6= <"">
##$SUBNAM7= <"">
##$SUBNAM8= <"">
##$SUBNAM9= <"">
##$SW= 501.771253377433
##$SWIBOX= (0..15)
0 1 3 0 0 0 0 0 0 0 0 0 0 0 0 0 
##$SW_h= 40650.406504065
##$TD= 32768
##$TD0= 1
##$TE= 0
##$TE2= 300
##$TE3= 300
##$TEG= 300
##$TL= (0..7)
0 120 53 12 22 120 120 120 
##$TP= (0..7)
150 150 150 150 150 150 150 150 
##$TP07= 0
##$TPNAME0= <>
##$TPNAME1= <>
##$TPNAME2= <>
##$TPNAME3= <>
##$TPNAME4= <>
##$TPNAME5= <>
##$TPNAME6= <>
##$TPNAME7= <>
##$TPOAL= (0..7)
0.5 0.5 0.5 0.5 0.5 0.5 0.5 0.5 
##$TPOFFS= (0..7)
0 0 0 0 0 0 0 0 
##$TUNHIN= 0
##$TUNHOUT= 0
##$TUNXOUT= 0
##$USERA1= <user>
##$USERA2= <user>
##$USERA3= <user>
##$USERA4= <user>
##$USERA5= <user>
##$V9= 5
##$VALIST= <valist>
##$VCLIST= <CCCCCCCCCCCCCCC>
##$VD= 0
##$VDLIST= <DDDDDDDDDDDDDDD>
##$VPLIST= <PPPPPPPPPPPPPPP>
##$VTLIST= <TTTTTTTTTTTTTTT>
##$WBST= 1024
##$WBSW= 4
##$XGAIN= (0..3)
0 0 0 0 
##$XL= 0
##$YL= 0
##$YMAX_a= 12516
##$YMIN_a= -14578
##$ZGOPTNS= <>
##$ZL1= 120
##$ZL2= 120
##$ZL3= 120
##$ZL4= 120
##$ABSF1= 248.5645
##$ABSF2= -253.2056
##$ABSG= 5
##$ABSL= 3
##$ALPHA= 0
##$AQORDER= 0
##$ASSFAC= 0
##$ASSFACI= 0
##$ASSFACX= 0
##$ASSWID= 0
##$AUNMP= <proc_1d>
##$AZFE= 0.1
##$AZFW= 0.5
##$BCFW= 0
##$BC_mod= 2
##$BYTORDP= 0
##$COROFFS= 0
##$CY= -3
##$DATMOD= 1
##$DC= 0
##$DFILT= <>
##$DTYPP= 0
##$F1P= 0
##$F2P= 0
##$FCOR= 1
##$FTSIZE= 65536
##$FT_mod= 6
##$GAMMA= 0
##$GB= 0
##$INTBC= 1
##$INTSCL= 6.047779e-11
##$ISEN= 30
##$LB= 10
##$LEV0= 0
##$LPBIN= 0
##$MAXI= 10000
##$MC2= 0
##$MEAN= 0
##$ME_mod= 0
##$MI= 50
##$NCOEF= 0
##$NC_proc= -9
##$NLEV= 6
##$NOISF1= 182.463
##$NOISF2= 159.3651
##$NSP= 0
##$NTH_PI= 0
##$NZP= 0
##$OFFSET= 248.5645
##$PC= 4
##$PHC0= -11680.32
##$PHC1= -67.90641
##$PH_mod= 1
##$PKNL= yes
##$PPARMOD= 0
##$PSCAL= 0
##$PSIGN= 0
##$REVERSE= no
##$SF= 81.0140089999694
##$SI= 65536
##$SIGF1= 159.3651
##$SIGF2= -187.1042
##$SINO= 113.3802
##$SIOLD= 16384
##$SREGLST= <1H.CDCl3>
##$SSB= 0
##$STSI= 65536
##$STSR= 0
##$SW_p= 40650.406504065
##$SYMM= 0
##$S_DEV= 0
##$TDeff= 32768
##$TDoff= 0
##$TI= <>
##$TILT= no
##$TM1= 0
##$TM2= 0
##$TOPLEV= 0
##$USERP1= <user>
##$USERP2= <user>
##$USERP3= <user>
##$USERP4= <user>
##$USERP5= <user>
##$WDW= 1
##$XDIM= 65536
##$YMAX_p= 309886743
##$YMIN_p= -35017176
$$ End of Bruker specific parameters
$$ ---------------------------------
##NTUPLES= NMR SPECTRUM
##VAR_NAME=  FREQUENCY,     SPECTRUM/REAL,   SPECTRUM/IMAG
##SYMBOL=    X,             R,               I
##VAR_TYPE=  INDEPENDENT,   DEPENDENT,       DEPENDENT
##VAR_FORM=  AFFN,          ASDF,            ASDF
##VAR_DIM=   65536,         65536,           65536
##UNITS=     HZ,            ARBITRARY UNITS, ARBITRARY UNITS
##FACTOR=    0.620285442955139, 1,           1
##FIRST=     20137.2065510682, 0,            0
##LAST=      -20513.1999529968, 0,           0
##MIN=       -20513.1999529968, -35017176,   0
##MAX=       20137.2065510682, 309886743,    0
$$ Real data points
##PAGE= N=1
##DATA TABLE= (X++(R..R)), XYDATA
$$ [...]
42772e476026k05840j14561j4466R0779J93566K84483L56338M06801M37384M50228
42762c591314M45944M24408L87344L39952K89766K43500K04241J70832J39416
42753i45911J05884O8188K7896r577l6473m5244l0902P607O6690J37612K07154
42742d47076K60550K86343K80651K47952J97982J41063Q5031L5222l855k7608
42732A056255l2748k0234K635K3368K9246J3838j8638n3935p3270o0919j0596
42721H55002P1773J69412K59302L18358L29581K87429K01368R5404J350n3320
42711B535659n7350k0212L3806P8238R6197Q5183N3632J2760l0668p6246j26217
42700B584782j80069k32521k76402l07471l26915l40086l53199l70351l91764
$$ y = [-5476026, -5681866, -5796427, -5810893, -5720114, -5526548, -5242065, -4885727, -4478926, -4041542, -3591314, -3145370, -2720962, -2333618, -1993666, -1703900, -1460400, -1256159, -1085327, -945911, -840027, -771839, -743943, -753520, -789993, -835237, -866139, -858532, -791842, -654230, -447076, -186526, 99817, 380468, 628420, 826402, 967465, 1052496, 1087718, 1083863, 1056255, 1023507, 1003273, 1005908, 1029276, 1058522, 1072360, 1053722, 999787, 926517, 865598, 855002, 926775, 1096187, 1355489, 1673847, 2003428, 2290857, 2492225, 2587629, 2588979, 2535659, 2478309, 2458097, 2491903, 2570141, 2666338, 2751521, 2805153, 2817913, 2787245, 2710999, 2584782, 2404713, 2172192, 1895790, 1588319, 1261404, 921318, 568119, 197768, -193996]
42691a93996m13582m29498m33647m22579l94610l47576k78115j84158o8813N7703
42681c108871J79899K81529L50253L80274L72373L32539K70842K00663J36606
42672f03893Q9996O4080N3016M6554L7494K6432K0617K8483N4281R6201J48098
42661F1359K02391K51970K90805L14278L20076L09278K86646K59437K34777K16525
42651B747542K03148J87968J61796J16686M9087l8327j36373k30803l05720l48246
42641B406758l52595l21797k66552k01854j42481r8551p2786o0978n5479m9694
42631G83991m0825k9679j8507q846q53N844J1027J3739J3120Q963J022j2196l3207
42618F93593o3209r9379j34342j58857j66096j54892j30147j00355p4107n7785
$$ y = [-193996, -607578, -1037076, -1470723, -1893302, -2287912, -2635488, -2913603, -3097761, -3166574, -3108871, -2928972, -2647443, -2297190, -1916916, -1544543, -1212004, -941162, -740499, -603893, -513897, -449817, -396801, -350247, -312753, -286321, -265704, -237221, -182940, -86739, 61359, 263750, 515720, 806525, 1120803, 1440879, 1750157, 2036803, 2296240, 2531017, 2747542, 2950690, 3138658, 3300454, 3417140, 3466227, 3427900, 3291527, 3060724, 2755004, 2406758, 2054163, 1732366, 1465814, 1263960, 1121479, 1022928, 950142, 889164, 833685, 783991, 743166, 713487, 694980, 686134, 685281, 691125, 702152, 715891, 729011, 737974, 738996, 726800, 693593, 630384, 531005, 396663, 237806, 71710, -83182, -213329, -313684, -387791, -445576]
42608d45576n5407o9325r9619j42092j87300k22886k38454k29522j97976j49705
42598b037862r2209l4159J3809L9422L2174j0940q0757j56411k12266k28135j97042
42587b964376j26599l4434N8845J35734J85626K05963K01022J78918J48401J16829
42577a894071Q9602P0100N9554N7153O1346P2027R1983J25535J74408K33674K91476
42566e67213L33462L48910L34498K94274K37558J76401J22924Q6333P0771P5511
42556A513429R6917J30188J69764K09589K44695K73466K98359L23501L50650L76611
42546C987169L94224L96167L78647L42464K91363K29643J60937Q8511J6019n2283
42536F232861j11901j58797j90343k06434k10233k07353k03105j99201j92306
$$ y = [-445576, -500983, -570308, -669927, -812019, -999319, -1222205, -1460659, -1690181, -1888157, -2037862, -2130071, -2164230, -2150421, -2110999, -2078825, -2089765, -2170522, -2326933, -2539199, -2767334, -2964376, -3090975, -3125409, -3066564, -2930830, -2745204, -2539241, -2338219, -2159301, -2010900, -1894071, -1804469, -1734369, -1674815, -1617662, -1556316, -1484289, -1392306, -1266771, -1092363, -858689, -567213, -233751, 115159, 449657, 743931, 981489, 1157890, 1280814, 1367147, 1437918, 1513429, 1610346, 1740534, 1910298, 2119887, 2364582, 2638048, 2936407, 3259908, 3610558, 3987169, 4381393, 4777560, 5156207, 5498671, 5790034, 6019677, 6180614, 6269125, 6285144, 6232861, 6120960, 5962163, 5771820, 5565386, 5355153, 5147800, 4944695, 4745494, 4553188]
42527D553188j75735j43197r2141k5091N1272J28314J97744K52841K88219K99196
42517E334610K82405K37905J70867R0874R038o4988j24697j67400j94355k09952
42507E364307k19536k27236k35844k48824k71717l10247l65662m31249m93671
42498B560321n38927n59026n54795n33438n03135m68641m30192l85321l31461
42489a744615k67622j94853j15923l4662M4731J18088J81180K29503K58576K64789
42479a260808K46305K03642J40062O1887k1706j00011j63053k03870k19987k13795
42469a531334j91909j63542j38025j21822j16039j15762j12384r8253p1221l6328
42459b696619l862J4795J1642j4537n6879j02187j35540j45620j28141q5925k6298
$$ y = [4553188, 4377453, 4234256, 4142115, 4117024, 4168296, 4296610, 4494354, 4747195, 5035414, 5334610, 5617015, 5854920, 6025787, 6116661, 6125699, 6060711, 5936014, 5768614, 5574259, 5364307, 5144771, 4917535, 4681691, 4432867, 4161150, 3850903, 3485241, 3053992, 2560321, 2021394, 1462368, 907573, 374135, -129000, -597641, -1027833, -1413154, -1744615, -2012237, -2207090, -2323013, -2357675, -2312944, -2194856, -2013676, -1784173, -1525597, -1260808, -1014503, -810861, -670799, -608912, -630618, -730629, -893682, -1097552, -1317539, -1531334, -1723243, -1886785, -2024810, -2146632, -2262671, -2378433, -2490817, -2589070, -2660291, -2696619, -2700481, -2685686, -2674044, -2688581, -2745460, -2847647, -2983187, -3128807, -3256948, -3342873, -3369171]
42448c369171M2410J13274J80819K39312K81738L01704K97442K74427K43720K16764
42438a177561K00246J94325J94812J97094J99047K01487K06776K17131K33676
42429F67033K56065K82441L09643L33809L51045L57957L52211L33246L02602K63183
42419C809235K17502J65988J06394L5105m9891j45595k42549l27140l86985m16038
42409B766026m16380l96202l65863l33918l04101k74266k38403j91489j34441
42400A10963p5628k7644j442j242k2596n4025q1202r1615p7735l7753K5259J04711
42388b29949J92031K78528L56830M20815M64418M81352M66924M20726L47681K56457
42378C455813J56161N3305m9284j50584k47471l31964l92776m20739m13813l77632
$$ y = [-3369171, -3326761, -3213487, -3032668, -2793356, -2511618, -2209914, -1912472, -1638045, -1394325, -1177561, -977315, -782990, -588178, -391084, -192037, 9450, 216226, 433357, 667033, 923098, 1205539, 1515182, 1848991, 2200036, 2557993, 2910204, 3243450, 3546052, 3809235, 4026737, 4192725, 4299119, 4334224, 4284333, 4138738, 3896189, 3569049, 3182064, 2766026, 2349646, 1953444, 1587581, 1253663, 949562, 675296, 436893, 245404, 110963, 35335, 7691, 6249, 5007, -17589, -71614, -152816, -244431, -322166, -359919, -334660, -229949, -37918, 240610, 597440, 1018255, 1482673, 1964025, 2430949, 2851675, 3199356, 3455813, 3611974, 3665279, 3615995, 3465411, 3217940, 2885976, 2493200, 2072461, 1658648, 1281016]
42368A281016l21418k52817j75284q9263M080R9292J86425K55305L01452L28285
42358A617073L42984L49446L44761L22654K80562K24019J64523J12580P1360L5740
42348C865702k654m8463r9077j46770j83735k05520k11068k01028j76817j40619
42338B449951r5292m3682J1846O9027J24916J75585K16589K43488K52072K38817
42328C643317K02778J48482Q6981L2345n376k5226l3888l8573m0355l3120q383
42317C928982L8208J03009J74998K39671K83581K97216K76212K21973J42132M9474
42307E755456m1679j20252j81534k26878k60836k87585l08351l20755l20389l03541
42297C383656k69287k19884j60022r6076l5523J3886M5337N4320M0104P176l4529
$$ y = [1281016, 959598, 706781, 531497, 442234, 446314, 545606, 732031, 987336, 1288788, 1617073, 1960057, 2309503, 2654264, 2976918, 3257480, 3481499, 3646022, 3758602, 3829962, 3865702, 3863048, 3814585, 3715508, 3568738, 3385003, 3179483, 2968415, 2767387, 2590570, 2449951, 2354659, 2310977, 2322823, 2391850, 2516766, 2692351, 2908940, 3152428, 3404500, 3643317, 3846095, 3994577, 4081558, 4113903, 4108527, 4083301, 4049413, 4010840, 3970485, 3937365, 3928982, 3967190, 4070199, 4245197, 4484868, 4768449, 5065665, 5341877, 5563850, 5705982, 5755456, 5713777, 5593525, 5411991, 5185113, 4924277, 4636692, 4328341, 4007586, 3687197, 3383656, 3114369, 2894485, 2734463, 2638387, 2602864, 2616750, 2662087, 2716407, 2756511, 2763687, 2729158]
42286B729158p1900r2941r0628o4010j6682M5688J17479J94511K74368L55090
42276C380133M32677M99278N43945N55840N27982M59609L56571K30040R4031l8004
42266G042102j56319k55956l35071l92022m23888m27675m02641l51336k78777
42257D018417j91136r5444j66Q4623J48480J83260J86238J62081J22318Q2019
42247D700690N5059M9781O6682R8850J35092J64515J80321J80483J65091J32881
42237E929445Q0579O424q4816j80134k62054l15408l31980l10556k54100j67595
42227D109805n7877O5478J90005L01439L85835M32047M33869L91014L08831J97158
42217F757604O8680o3034j85435k88163l63086m03820m05682l66573k88579j79425
$$ y = [2729158, 2657258, 2564317, 2473689, 2409679, 2392997, 2438685, 2556164, 2750675, 3025043, 3380133, 3812810, 4312088, 4856033, 5411873, 5939855, 6399464, 6756035, 6986075, 7080106, 7042102, 6885783, 6629827, 6294756, 5902734, 5478846, 5051171, 4648530, 4297194, 4018417, 3827281, 3731837, 3731671, 3816294, 3964774, 4148034, 4334272, 4496353, 4618671, 4700690, 4755749, 4805530, 4872212, 4971062, 5106154, 5270669, 5450990, 5631473, 5796564, 5929445, 6010024, 6016448, 5931632, 5751498, 5489444, 5174036, 4842056, 4531500, 4277400, 4109805, 4051928, 4117406, 4307411, 4608850, 4994685, 5426732, 5860601, 6251615, 6560446, 6757604, 6826284, 6763250, 6577815, 6289652, 5926566, 5522746, 5117064, 4750491, 4461912, 4282487]
42207D282487n2613P4849J86972K73458L31518L63601L72975L60843L27030K73049
42197F794169K04589J31383O4608J3252j8893l4470m1616n1112p2589j10834j63501
42186F714986k21486k72330l05186l14524l00700k68056k22788j71990j23404
42177D514522q4665o1685n7101o9869r6027j29753j64202j92770k11344k20343
42167C226763k24050k26462k26291k15430j82912j22409l8589N2101J27494J69481
42157B339696J71648J40377Q9777L4515j5519n7142r2777j27408j65215k07496
42147B110456k52539k96489l34434l61609l74781l73153l58140l32333k98434
42138h71456k58544k13943j65687j15808o7626k3797J6723N9302J09809J68578
$$ y = [4282487, 4229874, 4304723, 4491695, 4765153, 5096671, 5460272, 5833247, 6194090, 6521120, 6794169, 6998758, 7130141, 7194749, 7208001, 7189108, 7154638, 7113022, 7061910, 6989321, 6878487, 6714986, 6493500, 6221170, 5915984, 5601460, 5300760, 5032704, 4809916, 4637926, 4514522, 4429857, 4368172, 4311071, 4241202, 4145175, 4015422, 3851220, 3658450, 3447106, 3226763, 3002713, 2776251, 2549960, 2334530, 2151618, 2029209, 1990620, 2042721, 2170215, 2339696, 2511344, 2651721, 2741498, 2776013, 2760494, 2703352, 2610575, 2483167, 2317952, 2110456, 1857917, 1561428, 1226994, 865385, 490604, 117451, -240689, -573022, -871456, -1130000, -1343943, -1509630, -1625438, -1693064, -1716861, -1700138, -1640836, -1531027, -1362449]
42128a362449K27195K71270K87377K69396K20527J51143P5000N816m5716p4784
42118B4775q4169q2934q1649q6412r5292r9447q8155n4743j47O7446J36215J95320
42106b49192K38187K63165K72147K68610K56304K38546K17585J94112J67715J38350
42096B005529J07565P7905N0556K3287r007n0961j02897j59268k10300k45596
42086A486813k57691k44299k08732j58395j02046m7528j122L2072M8507M7549
42076E95128L2315Q810j5846l4619m1230l1050j989M5565J09693J87042K71503
42065A125322L53297M21051M66249M86443M84156M62338M20706L56099K66275
42056D841936J53865K7975r7182k05773k84903l28396l37900l20736k86289k43311
$$ y = [-1362449, -1135254, -863984, -576607, -307211, -86684, 64459, 139459, 145275, 99559, 24775, -59394, -142328, -223977, -310389, -405681, -505128, -593283, -648026, -648173, -580727, -444512, -249192, -11005, 252160, 524307, 792917, 1049221, 1287767, 1505352, 1699464, 1867179, 2005529, 2113094, 2190999, 2241555, 2264842, 2255835, 2204874, 2101977, 1942709, 1732409, 1486813, 1229122, 984823, 776091, 617696, 515650, 468122, 467000, 499072, 547579, 595128, 627443, 636253, 620407, 585788, 544558, 513508, 511519, 557084, 666777, 853819, 1125322, 1478619, 1899670, 2365919, 2852362, 3336518, 3798856, 4219562, 4575661, 4841936, 4995801, 5023776, 4926594, 4720821, 4435918, 4107522, 3769622, 3448886, 3162597, 2919286]
42046B919286j98854j57575j20408q3127l6654K9598J21865K36280L57184M61631
42036C529226N28475N46662N18070M54028L69096K76405J86370J07290M5039Q86
42026F561547l0699o1103j02352j60173k29884k98148l49660l74490l71838l48831
42016D234369l16394k85434k64677k59173k68486k85660k99259k98626k79027
42007A677633k42566j94500j38687p6548j0103N4570J07385J38532J43833J27280
41997A586829R9159P1480N3523M9098N5679O5433O8267N6162K6503j7522o9498
41986B045113j23262j75092k23315k65863k97983l12672l04179k71951k21780
41977a50984j63818j09289o7371m2467l2671l1085k9780k3731j2236K064J5180
$$ y = [2919286, 2720432, 2562857, 2442449, 2359322, 2322668, 2352266, 2474131, 2710411, 3067595, 3529226, 4057701, 4604363, 5122433, 5576461, 5945557, 6221962, 6408332, 6515622, 6560661, 6561547, 6530848, 6469745, 6367393, 6207220, 5977336, 5679188, 5329528, 4955038, 4583200, 4234369, 3917975, 3632541, 3367864, 3108691, 2840205, 2554545, 2255286, 1956660, 1677633, 1435067, 1240567, 1101880, 1025332, 1015229, 1069799, 1177184, 1315716, 1459549, 1586829, 1685988, 1757468, 1810991, 1860089, 1915768, 1981201, 2049468, 2105630, 2132133, 2114611, 2045113, 1921851, 1746759, 1523444, 1257581, 959598, 646926, 342747, 70796, -150984, -314802, -424091, -491462, -533929, -566600, -597685, -627465, -651196, -663432, -661368, -646188]
41966f46188K4336L0740M0430O1181R6849J43531J90526K25051K37167K22214
41956F25837J80395J14810L0059o7499j68722k62270l37593l88416m13938m16961
41946a104298m00958l68536l22117k65354k03527j42279q5835l6174O033L9200
41936b883845N8816N7689K9350k7292j05892j95257k84236l64457m28977m69098
41926d613199m73390m31008l37966k02266m3685J12634K44895L40049L93620M06254
41916d604062L80819L21831K36657J36724L6952m7208j03523j25091j10337o2840
41906c940078P983Q7400J59336K12526K44418K60055K67294K72034K76293K79546
41896a873193K81662K84905K93364L10514L37179L71465M09948M48241M80206
$$ y = [-646188, -621852, -591112, -550682, -489501, -392652, -249121, -58595, 166456, 403623, 625837, 806232, 921042, 951101, 883602, 714880, 452610, 115017, -273399, -687337, -1104298, -1505256, -1873792, -2195909, -2461263, -2664790, -2807069, -2892904, -2929078, -2923045, -2883845, -2825029, -2767340, -2737990, -2765282, -2871174, -3066431, -3350667, -3715124, -4144101, -4613199, -5086589, -5517597, -5855563, -6057829, -6101514, -5988880, -5743985, -5403936, -5010316, -4604062, -4223243, -3901412, -3664755, -3528031, -3491079, -3538287, -3641810, -3766901, -3877238, -3940078, -3932095, -3844695, -3685359, -3472833, -3228415, -2968360, -2701066, -2429032, -2152739, -1873193, -1591531, -1306626, -1013262, -702748, -365569, 5896, 415844, 864085, 1344291]
41887A344291M97173M89415M50385L81399K93234K03073J28623Q2734P0701R0159
41877D031187J32345J83878K29081K53361K47318K09752J47100O9228j5493j02313
41867E385444j88701k71610l45914m04983m42833m56471m46608m15947l66500
41858B045877k98716k13432j14722j0639Q8903J75536K44739K95648L28585L42197
41848B883976L32639K95972K32169J47661N4393l3844j05591j54129j77479j76834
41838C298933j54951j15478o3045l353N6886J10030J47764J62261J48493J06904
41828C694444M4998k3234q0488j11572j09056p6067k4226L2027Q1026J16542J37637
41817C682031J47092J49301J47927J44241J37426J26808J14219J04399J02518
$$ y = [1344291, 1841464, 2330879, 2781264, 3162663, 3455897, 3658970, 3787593, 3870327, 3941028, 4031187, 4163532, 4347410, 4576491, 4829852, 5077170, 5286922, 5434022, 5503250, 5487757, 5385444, 5196743, 4925133, 4579219, 4174236, 3731403, 3274932, 2828324, 2412377, 2045877, 1747161, 1533729, 1419007, 1408368, 1497271, 1672807, 1917546, 2213194, 2541779, 2883976, 3216615, 3512587, 3744756, 3892417, 3946810, 3912966, 3807375, 3653246, 3475767, 3298933, 3143982, 3028504, 2965459, 2962106, 3018992, 3129022, 3276786, 3439047, 3587540, 3694444, 3739442, 3716208, 3635720, 3524148, 3415092, 3339025, 3314799, 3346826, 3427852, 3544394, 3682031, 3829123, 3978424, 4126351, 4270592, 4408018, 4534826, 4649045, 4753444, 4855962]
41808D855962J09943J21043J24137J07260O5293L366o5925j29000j76890k07094
41798D808095k21703k23912k15215j94816j61015j13184n3004J5151Q4831J49236
41788C874464K03540K46076K77350K98031L07839L05674K89946K58645K10092
41779F271657J44846O7704j1953q2230j32617j57666j58054j37932j00682m6717
41769E656356K4625J11074K04854K93454L62986M02009M04332L70201L05762K20990
41759H356643J26481L0372o3049j52235k35712l10154l70385m10925m27547m17982
41749F125507l82077l22071k43085j53079o1406K3536R5950J52651J92147K13938
41739E642011K17869K02930J66540J06382K4371p0737j65012k44279k98564l23746
$$ y = [4855962, 4965905, 5086948, 5211085, 5318345, 5383638, 5387004, 5321079, 5192079, 5015189, 4808095, 4586392, 4362480, 4147265, 3952449, 3791434, 3678250, 3625246, 3640397, 3725228, 3874464, 4078004, 4324080, 4601430, 4899461, 5207300, 5512974, 5802920, 6061565, 6271657, 6416503, 6484207, 6472254, 6390024, 6257407, 6099741, 5941687, 5803755, 5703073, 5656356, 5680981, 5792055, 5996909, 6290363, 6653349, 7055358, 7459690, 7829891, 8135653, 8356643, 8483124, 8513496, 8450447, 8298212, 8062500, 7752346, 7381961, 6971036, 6543489, 6125507, 5743430, 5421359, 5178274, 5025195, 4963789, 4987325, 5083275, 5235926, 5428073, 5642011, 5859880, 6062810, 6229350, 6335732, 6360103, 6289366, 6124354, 5880075, 5581511, 5257765]
41729E257765l20809k94128k49713j93984j33619p5894k8373K967J6216J4942
41719C995370P159J856M851J6469L2397M6574N3633M9791L3118M342l2339o9607
41707D143614r8865j12555j06038p8588l3534K2374Q0167J30320J64673J78122
41697D289690J69072J38390Q8126K1947n2694j23202j74218j93602j78245j35491
41687C849773p9201k3189K3938O0525R0804J22450J63590K19499K89769L67321
41677E085279M40291M96038N25448N25496M99173M53325L95887L33890K72623
41668I027450K15395J63424J16234P2875L3141k371l3272n9837q2037r8634j08306
41657I244062j12438j16796j30108j60304k10765k78193l52740m20693m69261
$$ y = [5257765, 4936956, 4642828, 4393115, 4199131, 4065512, 3989618, 3961245, 3964212, 3980428, 3995370, 4002529, 4004385, 4009236, 4025705, 4058102, 4104676, 4158309, 4208100, 4241218, 4245560, 4213221, 4143614, 4044749, 3932194, 3826156, 3747568, 3714034, 3736408, 3816575, 3946895, 4111568, 4289690, 4458762, 4597152, 4685278, 4707225, 4654531, 4531329, 4357111, 4163509, 3985264, 3849773, 3770572, 3747383, 3771321, 3831846, 3922650, 4045100, 4208690, 4428189, 4717958, 5085279, 5525570, 6021608, 6547056, 7072552, 7571725, 8025050, 8420937, 8754827, 9027450, 9242845, 9406269, 9522503, 9595378, 9628519, 9626148, 9592876, 9533039, 9451002, 9352368, 9244062, 9131624, 9014828, 8884720, 8724416, 8513651, 8235458, 7882718, 7462025, 6992764]
41648F992764m91337m87284m62992m26350l84946l45549l13747k92666k81606
41639C506287k76307k70896k59996k39526k06421j58818r7444k7265M2677J02070
41629B114361J43392J64282J66576J52946J24451Q1512K7756k7080o8855q5266
41619B794075p2250l5566J3592O5173J14220J60110K02826K39222K61806K60924
41609D004132K29486J67221Q1430j6197j13664k00609k67979l07920l15649k92186
41599B968065k45500j88434j33936r0098n7979l3589j2337P543K4995L8736M9878
41588B327344O2300Q0548J06781J38921J71031J95477K05469J97261J71766J34807
41578C791705R4874N8834K8298o49l4163p6107j24828j72788k09554k27075k24142
$$ y = [6992764, 6501427, 6014143, 5551151, 5124801, 4739855, 4394306, 4080559, 3787893, 3506287, 3229980, 2959084, 2699088, 2459562, 2253141, 2094323, 1996879, 1969614, 2012291, 2114361, 2257753, 2422035, 2588611, 2741557, 2866008, 2947520, 2975276, 2948196, 2879341, 2794075, 2721825, 2686259, 2699851, 2765024, 2879244, 3039354, 3242180, 3481402, 3743208, 4004132, 4233618, 4400839, 4482269, 4466072, 4352408, 4151799, 3883820, 3575900, 3260251, 2968065, 2722565, 2534131, 2400195, 2310097, 2252118, 2218529, 2206192, 2213735, 2238730, 2277466, 2327344, 2389644, 2470192, 2576973, 2715894, 2886925, 3082402, 3287871, 3485132, 3656898, 3791705, 3886579, 3945413, 3973711, 3973062, 3938899, 3862792, 3737964, 3565176, 3355622, 3128547, 2904405]
41567B904405k06596j82794j57744j30578r7225n5851j0642K8951N2866N5619
41557B200411L8860J0628j7576l4664l4069j6668R544L3918M9330N5868N9501
41546B355083O7158Q2195J03373J26946J49236J67348J78469J79590J68541J45540
41536C723479J13875P9588N0272L2958L1348M3713O3191Q0592Q8292Q3289O8102
41525D458699M8980L2073K0121J2374P934R007K0705M7550R0251J45153K05831
41514E098678K64727L14156L47369L60174L52382L28078K94018K56734K19920
41505G836236J84005J48173J12831Q0129N2331L0301J3728K397l475m196j511
41494H450949J746K550k003j4991l9403p6739j25469j80751k35729k83734l20543
$$ y = [2904405, 2697809, 2515015, 2357271, 2226693, 2129468, 2073617, 2062975, 2091926, 2144792, 2200411, 2239271, 2249899, 2232323, 2197659, 2163590, 2146922, 2156466, 2190384, 2239714, 2295582, 2355083, 2422241, 2504436, 2607809, 2734755, 2883991, 3051339, 3229808, 3409398, 3577939, 3723479, 3837354, 3916942, 3967214, 4000172, 4031520, 4075233, 4138424, 4219016, 4307308, 4390597, 4458699, 4507679, 4539752, 4559873, 4572247, 4580181, 4589188, 4609893, 4657443, 4747694, 4892847, 5098678, 5363405, 5677561, 6024930, 6385104, 6737486, 7065564, 7359582, 7616316, 7836236, 8020241, 8168414, 8281245, 8361374, 8413705, 8444006, 8457734, 8460131, 8456656, 8452460, 8450949, 8452695, 8455245, 8453242, 8438251, 8398848, 8322109, 8196640, 8015889, 7780160, 7496426, 7175883]
41483G175883l46304l66025l87367m15767m49634m79215m90509m71877m19501
41474C349684l39074k43288j46595n9558J4460P8500J37668J94233K45495K85842
41464C517367L11277L22758L25765L26588L28313L29222L24056L06829K73938
41455F366113K26667J72228J22505R0661Q6789J14206J67822K35540L02481L55823
41445H240835L87413L93262L71784L23020K48909J53344M1534q0210k03634l17670
41435I558587m09364m67377m86749m71937m35481l92435l54068l25223l06461
41426E909492k97995l01583l19083l49378l86222m18713m34509m24446l85860
41417B591703l22710k42880j55049o7034J4090Q1291J27428J46440J35910R9865
$$ y = [7175883, 6829579, 6463554, 6076187, 5660420, 5210786, 4731571, 4241062, 3769185, 3349684, 3010610, 2767322, 2620727, 2561169, 2575629, 2654129, 2791797, 2986030, 3231525, 3517367, 3828644, 4151402, 4477167, 4803755, 5132068, 5461290, 5785346, 6092175, 6366113, 6592780, 6765008, 6887513, 6978174, 7064963, 7179169, 7346991, 7582531, 7885012, 8240835, 8628248, 9021510, 9393294, 9716314, 9965223, 10118567, 10160101, 10079891, 9876257, 9558587, 9149223, 8681846, 8195097, 7723160, 7287679, 6895244, 6541176, 6215953, 5909492, 5611497, 5309914, 4990831, 4641453, 4255231, 3836518, 3402009, 2977563, 2591703, 2268993, 2026113, 1871064, 1804030, 1818120, 1899411, 2026839, 2173279, 2309189, 2409054]
41407B409054M9657J075l1920m3509l8096k6387j8200j7461k2556l0330l9115
41396B192212m8232n5492n6020m4147j7294K1042O1842R4938J14390J20891J19462
41385B503592J14395J05177Q5957M8909j0472q9275j77042k59695l24785l64919
41375A631842l78353l67491l36432k88836k27659j57020q4120j8696L0011N6632
41365a40122O1718N2203L9900L7408N2561Q5077J27676J70361K04478K24820K30124
41354A146204K22632K07010J89250J76082J74254J88464K18469K57935K96799
41345C077099L25898L40826L42906L37503L31194L29258L34342L46658L65231
41336F130915L89131M17506M48545M78678N03345N18826N23400N16730M98102
$$ y = [2409054, 2458711, 2459786, 2427866, 2384357, 2346261, 2319874, 2301674, 2284213, 2261657, 2231327, 2192212, 2143980, 2088488, 2032468, 1988321, 1971027, 1992069, 2053911, 2148849, 2263239, 2384130, 2503592, 2617987, 2723164, 2809121, 2858030, 2847558, 2758283, 2581241, 2321546, 1996761, 1631842, 1253489, 885998, 549566, 260730, 33071, -123949, -208069, -226765, -196754, -140122, -78404, -26201, 13699, 51107, 103668, 188745, 316421, 486782, 691260, 916080, 1146204, 1368836, 1575846, 1765096, 1941178, 2115432, 2303896, 2522365, 2780300, 3077099, 3402997, 3743823, 4086729, 4424232, 4755426, 5084684, 5419026, 5765684, 6130915, 6520046, 6937552, 7386097, 7864775, 8368120, 8886946, 9410346, 9927076, 10425178]
41327A0425178M65064M13363L38043K35331J04785m8968k15543l79509n22580
41318A0815164o27174o80641o78606o26241n37381m31975l31990k55898k13538
41309F431720k04222k19517k48637k82577l15031l41127l56355l56603l38742
41300C768909l01260k45591j78219j11756o2492m4111o0912j05062j59729k06404
41290B293373k32508k35527k21818k01080j80240j60434j38012j07704o5630j1452
41280G38968N0376J10910J59168J85992J87406J65816J29055Q7979N3510L3672
41270A902852L1300M3202O1585P7578Q5689Q6860Q8225R9256J26247J68529K18996
41259B990319K68963L14080L56732M02689M53997N03407N34930N30679M79615
$$ y = [10425178, 10890242, 11303605, 11641648, 11876979, 11981764, 11932796, 11717253, 11337744, 10815164, 10187990, 9507349, 8828743, 8202502, 7665121, 7233146, 6901156, 6645258, 6431720, 6227498, 6007981, 5759344, 5476767, 5161736, 4820609, 4464254, 4107651, 3768909, 3467649, 3222058, 3043839, 2932083, 2869591, 2825480, 2764568, 2659506, 2499777, 2293373, 2060865, 1825338, 1603520, 1402440, 1222200, 1061766, 923754, 816050, 750420, 738968, 789344, 900254, 1059422, 1245414, 1432820, 1598636, 1727691, 1815670, 1869180, 1902852, 1934152, 1977354, 2038939, 2116517, 2202206, 2289066, 2377291, 2476547, 2602794, 2771323, 2990319, 3259282, 3573362, 3930094, 4332783, 4786780, 5290187, 5825117, 6355796, 6835411]
41250F835411L82633K51251J02002m8871j87344l00715l77021m06854l86715l21096
41240E542681k21600j03713J6613J25542K13224K75231L12781L30949L35247L28698
41230G155653L11353K82441K43031J96528J46416R3530L5984k7971r7014j66628
41220H173323k31650k88792l37407l78439m12467m37388m47094m32947l88581
41211D818558l15222k23371j29041m7052J4190N3772P6028Q7566R5310J05423
41201D536161J22141J46259J74246J99168K13344K11312J91179J53826J01379
41192F049015L6626l6298j11203j80219k35069k68811k77864k63730k32929j94474
41182D285044j56307j22773r3899o5727l1875J3092O9510J30749J85533K22806
$$ y = [6835411, 7218044, 7469295, 7571297, 7522426, 7335082, 7034367, 6657346, 6250492, 5863777, 5542681, 5321081, 5217368, 5233981, 5359523, 5572747, 5847978, 6160759, 6491708, 6826955, 7155653, 7467006, 7749447, 7992478, 8189006, 8335422, 8428952, 8464936, 8436965, 8339951, 8173323, 7941673, 7652881, 7315474, 6937035, 6524568, 6087180, 5640086, 5207139, 4818558, 4503336, 4279965, 4150924, 4103872, 4118062, 4171834, 4247862, 4335428, 4430738, 4536161, 4658302, 4804561, 4978807, 5177975, 5391319, 5602631, 5793810, 5947636, 6049015, 6085641, 6049343, 5938140, 5757921, 5522852, 5254041, 4976177, 4712447, 4479518, 4285044, 4128737, 4005964, 3912065, 3846338, 3814463, 3827555, 3897065, 4027814, 4213347, 4436153]
41172D436153K35740K23043J87877J35398P0515k471p7757j45810j94378k13114
41162D655196j98347j53800q7030n073Q6728J82184K71238L40445L77905L79286
41152E848732L50235L03591K53994K13635J90618J88776K07604K42410K85580
41143H085175L29180L67659L98959M23179M39581M44129M29673L89472L22302
41134A1629309K35712J44461O4272M824l3158n5394o9234q1000r6557j22531j65314
41123A1455390k28063l07926l95361m75855n33602n56537n41113m94312m31245
41114G491376l69157l20871k90860k75605k67413k59174k47331k31971k15244
41105E013750j99766j87770j80574j78030j78193j77651j72922j62522j48454
$$ y = [4436153, 4671893, 4894936, 5082813, 5218211, 5288726, 5286255, 5208498, 5062688, 4868310, 4655196, 4456849, 4303049, 4216019, 4210946, 4297674, 4479858, 4751096, 5091541, 5469446, 5848732, 6198967, 6502558, 6756552, 6970187, 7160805, 7349581, 7557185, 7799595, 8085175, 8414355, 8782014, 9180973, 9604152, 10043733, 10487862, 10917535, 11307007, 11629309, 11865021, 12009482, 12073754, 12078578, 12045420, 11990026, 11920792, 11839792, 11743235, 11620704, 11455390, 11227327, 10919401, 10524040, 10048185, 9514583, 8958046, 8416933, 7922621, 7491376, 7122219, 6801348, 6510488, 6234883, 5967470, 5708296, 5460965, 5228994, 5013750, 4813984, 4626214, 4445640, 4267610, 4089417, 3911766, 3738844, 3576322, 3427868]
41096C427868j35483j28375j29361j37946j52137j68635j81735j83565j67061
41087B043570j29731p5113j1669M9095R4824J15780J09220Q1804M7654K2975K0475
41076B368884M5981R7266J64494K32385K84725L10424L08250K87000K60394K39762
41066D599565K29307K26714K27649K30006K34457K41550K48743K50584K41961
41057F730536K21119J89837J51424J09283O7327L0997P056J834J9142N8865J16350
41046G703770J82374K43773K85464K94411K64548K00262J16018L1650l4568p1960
41036I215742p9955o6428m3401k2708j3268j9701m1841p5830j17214j64161k17629
41025H353606k78046l41797m00978m46191m69734m67494m39569l89680l22752
$$ y = [3427868, 3292385, 3164010, 3034649, 2896703, 2744566, 2575931, 2394196, 2210631, 2043570, 1913839, 1838726, 1827057, 1876152, 1970976, 2086756, 2195976, 2277780, 2325434, 2348409, 2368884, 2414865, 2512131, 2676625, 2909010, 3193735, 3504159, 3812409, 4099409, 4359803, 4599565, 4828872, 5055586, 5283235, 5513241, 5747698, 5989248, 6237991, 6488575, 6730536, 6951655, 7141492, 7292916, 7402199, 7469526, 7500523, 7507579, 7509413, 7528555, 7587420, 7703770, 7886144, 8129917, 8415381, 8709792, 8974340, 9174602, 9290620, 9322270, 9287702, 9215742, 9135787, 9069359, 9025958, 9003250, 8989982, 8970281, 8928440, 8852610, 8735396, 8571235, 8353606, 8075560, 7733763, 7332785, 6886594, 6416860, 5949366, 5509797, 5120117, 4797365]
41016D797365k41854j47322l9811P5171J85734K77045L37092L60307L47399L03227
41006F254353K35306J53182O7593j0840p2446j08535j11996p9486j4024P4252
40996F387359J69888K55543L16043L42277L33673K97354K44019J83545J23527
40987H653228P0999L4197K1574L8315Q3227J48650K23329K96013L57299L99280
40977A0326111M14569L96594L41522K50505J31026l273j34273k42667l12550l35811
40967A0831753l14156k57640j80874r9323k7204K3687M5431L5903k54n2646j08051
40956I896626j53909j81131j85259j66003j26192p1546j1151M3193Q0092R2451
40946I217171P8973M2468j2390p9004j47249k03319k32703k24776j76529r3960
$$ y = [4797365, 4555511, 4408189, 4368378, 4443549, 4629283, 4906328, 5243420, 5603727, 5951126, 6254353, 6489659, 6642841, 6710434, 6699594, 6627148, 6518613, 6406617, 6327131, 6313107, 6387359, 6557247, 6812790, 7128833, 7471110, 7804783, 8102137, 8346156, 8529701, 8653228, 8724227, 8758424, 8779998, 8818313, 8901540, 9050190, 9273519, 9569532, 9926831, 10326111, 10740680, 11137274, 11478796, 11729301, 11860327, 11857054, 11722781, 11480114, 11167564, 10831753, 10517597, 10259957, 10079083, 9979760, 9952556, 9976243, 10021674, 10057577, 10057323, 10004677, 9896626, 9742717, 9561586, 9376327, 9210324, 9084132, 9012586, 9001435, 9044628, 9124720, 9217171, 9296144, 9338612, 9326222, 9247218, 9099969, 8896650, 8663947, 8439171, 8262642, 8168682]
40936H168682R261J15763K09960K82538L31638L60379L72622L69607L49286L08767
40926A0878503K48471J75185J01590M2341R268Q514M0117R8670J73652K49984
40916A2026295L10414L40329L32922K91349K26019J48733O7587j4497r7495j80449
40906A3451207k58722l24079l67334l81524l63315l12535k31539j25646l479J24508
40896A1207542K48688L61780M58150N32526N79772N95448N75943N18561M23121
40887A5501531K94989J46991k501j35059k38299l09155l52887l78891l95879m08779
40877A3722061m18174m21883m17842m07177l95635l91670m01788m26155m57400
40868I984337m82691m87255m58124l87978k78434j40994N243J38386K39237K96008
$$ y = [8168682, 8177943, 8293706, 8503666, 8786204, 9117842, 9478221, 9850843, 10220450, 10569736, 10878503, 11126974, 11302159, 11403749, 11446090, 11455358, 11463872, 11503989, 11602659, 11776311, 12026295, 12336709, 12677038, 13009960, 13301309, 13527328, 13676061, 13743648, 13729151, 13631656, 13451207, 13192485, 12868406, 12501072, 12119548, 11756233, 11443698, 11212159, 11086513, 11083034, 11207542, 11456230, 11818010, 12276160, 12808686, 13388458, 13983906, 14559849, 15078410, 15501531, 15796520, 15943511, 15941010, 15805951, 15567652, 15258497, 14905610, 14526719, 14130840, 13722061, 13303887, 12882004, 12464162, 12056985, 11661350, 11269680, 10867892, 10441737, 9984337, 9501646, 9014391, 8556267, 8168289, 7889855, 7748861, 7754104, 7892490, 8131727, 8427735]
40858H427735L06797K78567K22988J51503P2287r999r2330j70789k39171k90343
40848H657245l19980l29331l24194l10752k91882k66108k28463j72178r1614J3533
40838F336276J35223K58221L65293M42964M84444M89332M61933M09976L43725
40829I727387K74316K10734J56693J09881O4704J6792l3872q3147j25325j55712
40819A0162451j71377j70042j48696j03767l3388N9424J64841K67032L47865L92393
40809A0766736L94017L57115K95857K29783J78068J54379J63440J99950K50198
40800A2989543K96204L21260L14954K75881K11076J32931N5130j0880n8356q6217
40790A4441526r8090r9671r6188r1755r0275r5771j10738j33810j59166j78538
$$ y = [8427735, 8734532, 9013099, 9236087, 9387590, 9459877, 9449878, 9357548, 9186759, 8947588, 8657245, 8337265, 8007934, 7683740, 7372988, 7081106, 6814998, 6586535, 6414357, 6322743, 6336276, 6471499, 6729720, 7095013, 7537977, 8022421, 8511753, 8973686, 9383662, 9727387, 10001703, 10212437, 10369130, 10479011, 10543715, 10560507, 10526635, 10443488, 10318163, 10162451, 9991074, 9821032, 9672336, 9568569, 9535181, 9594605, 9759446, 10026478, 10374343, 10766736, 11160753, 11517868, 11813725, 12043508, 12221576, 12375955, 12539395, 12739345, 12989543, 13285747, 13607007, 13921961, 14197842, 14408918, 14541849, 14596979, 14586099, 14527743, 14441526, 14343436, 14243765, 14147577, 14055822, 13965547, 13869776, 13759038, 13625228, 13466062, 13287524]
40780A3287524j84438j72480j41932r5254l7862K1528P1216R8919R6163O2538
40770A3005922P195n3695j02893j29003j30636j14837r0267n9915j8890M1408
40760A2354389J26236K32422L47467M52436N27289N57046N36567M71720L76374
40751A5981946K67130J58678O1766j6562p2107j03545j13301j07836r6052q6288
40741A5873829q3615q8882r9412j10084j14176j04627p6393k8913L3661J05222
40731A5306610J81158K59316L38260M15600M88349N54004O10209O53133O76785
40722A9483424O74472O41745N79673M97207M10602L38234K92271K72327K65489
40713B3455444K52527K16299J48232N1137o1910j72079k61357l19206l47020l57941
$$ y = [13287524, 13103086, 12930606, 12788674, 12693420, 12655558, 12677086, 12748302, 12847221, 12943384, 13005922, 13013117, 12959422, 12856529, 12727526, 12596890, 12482053, 12391786, 12331871, 12312981, 12354389, 12480625, 12713047, 13060514, 13512950, 14040239, 14597285, 15133852, 15605572, 15981946, 16249076, 16407754, 16469520, 16452958, 16380851, 16277306, 16164005, 16056169, 15960117, 15873829, 15790214, 15701332, 15601920, 15491836, 15377660, 15273033, 15196640, 15167727, 15201388, 15306610, 15487768, 15747084, 16085344, 16500944, 16989293, 17543297, 18153506, 18806639, 19483424, 20157896, 20799641, 21379314, 21876521, 22287123, 22625357, 22917628, 23189955, 23455444, 23707971, 23924270, 24072502, 24123639, 24061729, 23889650, 23628293, 23309087, 22962067, 22604126]
40703B2604126l70782l99868m46358m97004n31493n33542m98769m35313l58071
40694A8532926k81011k12473j55409j10351p7295n5187m1441l3505l1200l6678
40684A7498376n1401p2862r3882j04841r6934o4950q915O5286J46437K19870K71070
40673A7707254K90280K76066K35338J79566J19965O5204K2364j518k58K8323P9436
40662A9002020J41468J99629K41535K61662K62120K49031K27126J96771J55696
40653B0937058J03390M3651j6901p2498j20546j60978j93619k15669k20945k01567
40643A9881376j51566p0440L5414J54126K71588L74733M53688N02644N19845N07649
40633B2479057M72970M27366L85387L60912L63073L94180M50369N23817O04683
$$ y = [22604126, 22233344, 21833476, 21387118, 20890114, 20358621, 19825079, 19326310, 18890997, 18532926, 18251915, 18039442, 17884033, 17773682, 17696387, 17641200, 17599759, 17566254, 17535054, 17498376, 17446975, 17374113, 17280231, 17175390, 17078456, 17013506, 17004591, 17069877, 17216314, 17436184, 17707254, 17997534, 18273600, 18508938, 18688504, 18808469, 18873673, 18896037, 18894519, 18894261, 18922584, 19002020, 19143488, 19343117, 19584652, 19846314, 20108434, 20357465, 20584591, 20781362, 20937058, 21040448, 21084099, 21067198, 20994700, 20874154, 20713176, 20519557, 20303888, 20082943, 19881376, 19729810, 19659370, 19694784, 19848910, 20120498, 20495231, 20948919, 21451563, 21971408, 22479057, 22952027, 23379393, 23764780, 24125692, 24488765, 24882945, 25333314, 25857131, 26461814]
40624B6461814O82008P44311P81082P85385P56368O99772O25760N45444M68366
40615C2550310M02258L54412L32697L44474L93201M74670N76141O80169P71404
40606C6879736Q41746Q90551R20742R34705R32601R12919Q73971Q15710P41517
40597D4744198O58558N75342M97454M24597L51270K70211J75793O5503o0168j98574
40587D7504184l46050m99054o54283q06965r48321j064571j139226j157823j112528
40578C9775363j004490q43653o46995m36165k34706o4551N8651J30162J58126
40569C6891742J60536J58157J67717J99216K57188L42527M52638N80822P17294
40560C9927837Q52076R77937J091323J191038J275723J341594J381632J386883
$$ y = [26461814, 27143822, 27888133, 28669215, 29454600, 30210968, 30910740, 31536500, 32081944, 32550310, 32952568, 33306980, 33639677, 33984151, 34377352, 34852022, 35428163, 36108332, 36879736, 37721482, 38612033, 39532775, 40467480, 41400081, 42313000, 43186971, 44002681, 44744198, 45402756, 45978098, 46475552, 46900149, 47251419, 47521630, 47697423, 47762926, 47702758, 47504184, 47158134, 46659080, 46004797, 45197832, 44249511, 43184940, 42045714, 40887891, 39775363, 38770873, 37927220, 37280225, 36844060, 36609354, 36544803, 36603454, 36733616, 36891742, 37052278, 37210435, 37378152, 37577368, 37834556, 38177083, 38629721, 39210543, 39927837, 40779913, 41757850, 42849173, 44040211, 45315934, 46657528, 48039160, 49426043]
40552D9426043J349742J268151J149092J009346Q72162P59745O84427O43213O19484
40543E7781405N91338N41488M62782L57049K29842Q6036p0280k32223l86766n15841
40533E8844830o02438o37614o23225n69044m87841l92543k96016k11175j49710
40524E4875224j19858j24051j56899k04420k46199k61213k35567j68741p4978
40515E3283298K1831R8329J42050J56048J55554J59756J84012K35421L11600M01740
40505E5149639M89716N58948N97323N99935N68186N05924M15309K95564J45434
40496E9325978l3063k32996m43955o54505q52979j026141j157479j228004j221020
40487E2475836j129296r59885p32161m69666j91873Q7934L58522O06355Q16920
$$ y = [49426043, 50775785, 52043936, 53193028, 54202374, 55074536, 55834281, 56518708, 57161921, 57781405, 58372743, 58914231, 59377013, 59734062, 59963904, 60049940, 59979660, 59747437, 59360671, 58844830, 58242392, 57604778, 56981553, 56412509, 55924668, 55532125, 55236109, 55024934, 54875224, 54755366, 54631315, 54474416, 54269996, 54023797, 53762584, 53527017, 53358276, 53283298, 53305129, 53403458, 53545508, 53701556, 53857110, 54016866, 54200878, 54436299, 54747899, 55149639, 55639355, 56198303, 56795626, 57395561, 57963747, 58469671, 58884980, 59180544, 59325978, 59292915, 59059919, 58615964, 57961459, 57108480, 56082339, 54924860, 53696856, 52475836, 51346540, 50386655, 49654494, 49184828, 48992955, 49080889, 49439411, 50045766, 50862686]
40478E0862686R81197J101299J189840J263634J336733J417222J507954J608745
40470F1269310J717774J831674J944985K050008K137844K200233K231016K226558
40462G7609402K185671K109439K000641J862604J698886J514647J318147J119750
40454I1419187R28334P47819N76058M06174K29436L9132j66141l81891n99954
40445I3198154q10538j001703j158346j264549j309252j290200j211692j077815
40437H4074059q87691o38009l32095J0883L53773O49337Q54988R47773R33469
40428H5966487Q46302P39019O66163O66806P53563R11865J108503J304974J470642
40419I4434324J591745J673709J735903J800758J881996J977802K072428K144743
$$ y = [50862686, 51843883, 52945182, 54135022, 55398656, 56735389, 58152611, 59660565, 61269310, 62987084, 64818758, 66763743, 68813751, 70951595, 73151828, 75382844, 77609402, 79795073, 81904512, 83905153, 85767757, 87466643, 88981290, 90299437, 91419187, 92347521, 93095340, 93671398, 94077572, 94307008, 94346140, 94179999, 93798108, 93198154, 92387616, 91385913, 90227567, 88963018, 87653766, 86363566, 85151874, 84074059, 83186368, 82548359, 82216264, 82227147, 82580920, 83230257, 84085245, 85033018, 85966487, 86812789, 87551808, 88217971, 88884777, 89638340, 90550205, 91658708, 92963682, 94434324, 96026069, 97699778, 99435681, 101236439, 103118435, 105096237, 107168665, 109313408]
40411A09313408K178499K169140K125072K064427K009105J978220J983102K025345
40403A25846318K097763K186908K276331K350228K396434K407420K379124K309294
40395A44249820K196593K040384J840858J599881J322541J017438O93816L56421
40387A55317752J660l81725q07354j283642j806563k354344k885317l340803l654913
40378A38804751l770209l653492l303989k750406k040700j232218l86812M30568
40370A22097493J154146J723678K094566K248660K201098J999188J712395J415914
40362A36647138J172788J019786R61903R77498J032092J094377J147213J189232
40354A45242027J227251J264043J288298J273427J187066J007088P35967M06814
$$ y = [109313408, 111491907, 113661047, 115786119, 117850546, 119859651, 121837871, 123820973, 125846318, 127944081, 130130989, 132407320, 134757548, 137153982, 139561402, 141940526, 144249820, 146446413, 148486797, 150327655, 151927536, 153250077, 154267515, 154961331, 155317752, 155319412, 154937687, 154130333, 152846691, 151040128, 148685784, 145800467, 142459664, 138804751, 135034542, 131381050, 128077061, 125326655, 123285955, 122053737, 121666925, 122097493, 123251639, 124975317, 127069883, 129318543, 131519641, 133518829, 135231224, 136647138, 137819926, 138839712, 139801615, 140779113, 141811205, 142905582, 144052795, 145242027, 146469278, 147733321, 149021619, 150295046, 151482112, 152489200, 153225167, 153631981]
40346A53631981P8687j77403k97870k46161k6402L14075O95497J027050J231308
40337A56230762J262587J113864Q13730M18457J742l59359o02481o96205o45753
40328A57537344m84817k59478j4244K14167L97004N12435N46026M92459L57896
40319A59298792J63049n4342k41511l40622l04940j13813K20842O58715J142620
40310A60428790J613019K022104K343860K575884K730883K821592K847882K794414
40302A80178428K640418K374972K007727J568571J097346O29732J86155k31910
40294A90451439o36514j041395j450599j855064k237664k579110k857198l041592
40286A74752303l094260k981379k689983k235906j656324r93225k80786M55208
$$ y = [153631981, 153710668, 153533265, 153235395, 152989234, 152962832, 153276907, 153972404, 154999454, 156230762, 157493349, 158607213, 159420943, 159839400, 159841142, 159481783, 158879302, 158183097, 157537344, 157052527, 156793049, 156778805, 156992972, 157389976, 157902411, 158448437, 158940896, 159298792, 159461841, 159407499, 159165988, 158825366, 158520426, 158406613, 158627455, 159286170, 160428790, 162041809, 164063913, 166407773, 168983657, 171714540, 174536132, 177384014, 180178428, 182818846, 185193818, 187201545, 188770116, 189867462, 190497194, 190683349, 190451439, 189814925, 188773530, 187322931, 185467867, 183230203, 180651093, 177793895, 174752303, 171658043, 168676664, 165986681, 163750775, 162094451, 161101226, 160820440, 161275648]
40278A61275648J188742J885905K506779L016744L399048L660120L825768L932168
40270A84690922M015766M103609M205577M312037M398973M437730M403919M282629
40262B18851162M070516L774418L404430K962505K434397J793989J020774J20715
40254B38432906q62110j848721k740604l440868l876220m015269l876973l523751
40246B14248390l040369k508607j990059j521856j120344p85300n02984k51522
40238B02527349r754K35091M87107P48849J028239J336444J675832K027338K349336
40229B12405831K591700K717217K718033K619944K474593K342987K274883K290795
40221B32435983K375014K484374K569107K595704K561215K493105K435055K424626
$$ y = [161275648, 162464390, 164350295, 166857074, 169873818, 173272866, 176932986, 180758754, 184690922, 188706688, 192810297, 197015874, 201327911, 205726884, 210164614, 214568533, 218851162, 222921678, 226696096, 230100526, 233063031, 235497428, 237291417, 238312191, 238432906, 237570796, 235722075, 232981471, 229540603, 225664383, 221649114, 217772141, 214248390, 211208021, 208699414, 206709355, 205187499, 204067155, 203281855, 202778871, 202527349, 202517595, 202752686, 203239793, 203988642, 205016881, 206353325, 208029157, 210056495, 212405831, 214997531, 217714748, 220432781, 223052725, 225527318, 227870305, 230145188, 232435983, 234810997, 237295371, 239864478, 242460182, 245021397, 247514502, 249949557, 252374183]
40213B52374183K472177K550441K600440K552571K354368J991979J495440R27363
40205B69318962L63589j24916m85527o93581p57166p13728o18230n28358m93241
40196B65267804n47019p03991r54129j263356j583700j871007k099162k260051
40188B53985389k350116k356846k258882k040731j709756j301949q72914m80399
40180B40613796j66736N3568J97960L08979M36543O16112Q53991J127774J399943
40171B45441930J634720J808620J911561J940785J891403J747910J482479J064418
40163B58923826M78044k61283j102801j968344k765479l400438l792536l892762
40155B42218227l700734l267019k674300k007008j328975o80604q9629M19482
$$ y = [252374183, 254846360, 257396801, 259997241, 262549812, 264904180, 266896159, 268391599, 269318962, 269682551, 269557635, 269072108, 268378527, 267621361, 266907633, 266289403, 265761045, 265267804, 264720785, 264016794, 263062665, 261799309, 260215609, 258344602, 256245440, 253985389, 251635273, 249278427, 247019545, 244978814, 243269058, 241967109, 241094195, 240613796, 240447060, 240500628, 240698588, 241007567, 241444110, 242060222, 242914213, 244041987, 245441930, 247076650, 248885270, 250796831, 252737616, 254629019, 256376929, 257859408, 258923826, 259401870, 259140587, 258037786, 256069442, 253303963, 249903525, 246110989, 242218227, 238517493, 235250474, 232576174, 230569166, 229240191, 228559587, 228469958, 228889440]
40147B28889440Q25505J115482J287243J348576J317996J228282J126272J061680
40139B38200476J066964J140455J245211J325608J332183J242062J067389Q50807
40131B47471155O50420N18164M78259N14818N75634N91716N04264K87943l8028
40122B51554345m15103p66236j025769j165199j200657j177431j141889j118314
40114B43543747j101085j059506r47355p14253l21017K42552R46119J722547K486895
40105B44798644L160108L685054M030169M185345M157519L968428L651175L243554
40097B74879996K781593K298449J827706J404214J058222Q06896O50731N77154
40089B86284961N66913N98677O52162P12464P75272Q48317R45229J073870J226540
$$ y = [228889440, 229714945, 230830427, 232117670, 233466246, 234784242, 236012524, 237138796, 238200476, 239267440, 240407895, 241653106, 242978714, 244310897, 245552959, 246620348, 247471155, 248121575, 248639739, 249117998, 249632816, 250208450, 250800166, 251304430, 251592373, 251554345, 251139242, 250373006, 249347237, 248182038, 246981381, 245803950, 244662061, 243543747, 242442662, 241383156, 240435801, 239721548, 239400531, 239643083, 240589202, 242311749, 244798644, 247958752, 251643806, 255673975, 259859320, 264016839, 267985267, 271636442, 274879996, 277661589, 279960038, 281787744, 283191958, 284250180, 285057076, 285707807, 286284961, 286851874, 287450551, 288102713, 288815177, 289590449, 290438766, 291383995, 292457865, 293684405]
40080B93684405J378824J497934J555900J541480J465808J358203J252312J169098
40072C04903964J107551J048737R67612Q41203O48556L69120j1620m89727j034513
40063C08350883j594679k118141k572970k955634l282595l573694l839183m075552
40055B84338435m266991m388407m410155m306333m064099l687674l194363k607685
40047B53412728j955813j276804o23030n5475L73172O37935P52518P66329P49404
40038B52780964P70799Q77225J078764J346659J623659J842367J945271J901000
40030B64166708J713090J418357J074238P38891M52240K26822N2235r1047k17665
40021B69533869l29958m17227m58226m26145k98796p3709K19426N19298P49376
$$ y = [293684405, 295063229, 296561163, 298117063, 299658543, 301124351, 302482554, 303734866, 304903964, 306011515, 307060252, 308027864, 308869067, 309517623, 309886743, 309875123, 309385396, 308350883, 306756204, 304638063, 302065093, 299109459, 295826864, 292253170, 288413987, 284338435, 280071444, 275683037, 271272882, 266966549, 262902450, 259214776, 256020413, 253412728, 251456915, 250180111, 249557081, 249501606, 249874778, 250512713, 251265231, 252031560, 252780964, 253551763, 254428988, 255507752, 256854411, 258478070, 260320437, 262265708, 264166708, 265879798, 267298155, 268372393, 269111284, 269563524, 269790346, 269842581, 269751534, 269533869, 269203911, 268786684, 268328458, 267902313, 267603517, 267529808, 267749234, 268268532, 269017908]
40012B69017908Q42188P58500M93483P1472m63448j055625j644954k175154k602122
40003B63242248k897968l049034l052922k920727k683441k393630k115243j904368
39995B42224915j791396j772904j814105j858274j840714j706398j428177j018234
39987B28994713n25774j9803M36398Q08987J106574J377426J690424K105715K646875
39978B38621535L287153L955326M556818N000111N219424N188268M920766M460136
39970B75209537L858242L155684K372987J516890N95355l70374j343555k276398
39962B82718368l113357l791537m244942m418929m289845l875483l226573k405969
39954B53351733j473159m85527M90344J374619K087549K573415K819144K857200
$$ y = [269017908, 269860096, 270618596, 271112079, 271183551, 270720103, 269664478, 268019524, 265844370, 263242248, 260344280, 257295246, 254242324, 251321597, 248638156, 246244526, 244129283, 242224915, 240433519, 238660615, 236846510, 234988236, 233147522, 231441124, 230012947, 228994713, 228468939, 228449136, 228885534, 229694521, 230801095, 232178521, 233868945, 235974660, 238621535, 241908688, 245864014, 250420832, 255420943, 260640367, 265828635, 270749401, 275209537, 279067779, 282223463, 284596450, 286113340, 286708695, 286338321, 284994766, 282718368, 279605011, 275813474, 271568532, 267149603, 262859758, 258984275, 255757702, 253351733, 251878574, 251393047, 251883391, 253258010, 255345559, 257918974, 260738118, 263595318]
39946B63595318K753639K588395K434815K344219K339726K419371K562874K736221
39938B83774578K894480K987849K972276K818319K511836K048214J428862O65073
39930C02101487k14944j163518k117402l003651l744807m267135m516100m474876
39922B78599054m174241l685809l102400k517120k009298j636773j429919j386309
39914B58657185j470113j620923j771248j864799j866245j759448j540981j218242
39906B45545186q14067l69699O2632M36702P28422R40980J097342J226261J349416
39897B50203175J474160J593034J689107J744652J749625J706898J633176J555689
39889B63349516J504533J501080J545742J611819J651168J610756J452323J165980
$$ y = [263595318, 266348957, 268937352, 271372167, 273716386, 276056112, 278475483, 281038357, 283774578, 286669058, 289656907, 292629183, 295447502, 297959338, 300007552, 301436414, 302101487, 301886543, 300723025, 298605623, 295601972, 291857165, 287590030, 283073930, 278599054, 274424813, 270739004, 267636604, 265119484, 263110186, 261473413, 260043494, 258657185, 257187072, 255566149, 253794901, 251930102, 250063857, 248304409, 246763428, 245545186, 244731119, 244361420, 244424052, 244860754, 245589176, 246530156, 247627498, 248853759, 250203175, 251677335, 253270369, 254959476, 256704128, 258453753, 260160651, 261793827, 263349516, 264854049, 266355129, 267900871, 269512690, 271163858, 272774614, 274226937, 275392917]
39881B75392917P73309L21058j30999n24852q18575r96488j071484j078620j063662
39872B70802604j072707j146183j314537j590852j961376k382228k789705l120904
39864B55424112l331400l398977l315414l078972k697671k200082j640612j089706
39856B34671278o12689k50139r360J32548K18610K98027M11205N79462Q04599
39847B36243541J076502J380227J696965K001841K264255K450990K528020K460637
39839B52102978K216934J777704J148014L62476n18267j415815k243073k915297
39831B50515654l365482l560966l512033l265581k886475k437681j969432j518990
39823B27999014j114694p77648n20401l46633k54071k36947k82788l64986m41178
$$ y = [275392917, 276166226, 276487284, 276356285, 275831433, 275012858, 274016370, 272944886, 271866266, 270802604, 269729897, 268583714, 267269177, 265678325, 263716949, 261334721, 258545016, 255424112, 252092712, 248693735, 245378321, 242299349, 239601678, 237401596, 235760984, 234671278, 234058589, 233808450, 233799090, 233931638, 234150248, 234448275, 234859480, 235438942, 236243541, 237320043, 238700270, 240397235, 242399076, 244663331, 247114321, 249642341, 252102978, 254319912, 256097616, 257245630, 257608106, 257089839, 255674024, 253430951, 250515654, 247150172, 243589206, 240077173, 236811592, 233925117, 231487436, 229518004, 227999014, 226884320, 226106672, 225586271, 225239638, 224985567, 224748620, 224465832, 224100846, 223659668]
39814B23659668m66004m13806k94552j49390k8221L4961L4603q847o0687q6420
39804B22221305o4727M570J00873J91633K45321K42636J82832Q4875j6994q4905
39794B23107419r4786n1356J0390M0799o64j27414l20831n35852p12243p89806
39784B20525656p25640n06773j50739L04963Q14587J327962J787799K130352K296636
39775B27804803K250811J994093J564142J020012M23021j74795p31437j211857
39767B32938793j589116j849523j994209k032349j971102j811742j555467j213022
39759B18922263q10280l87358P083L25227N33257O24536O25139N86391N67232
39750B20993490O14841P50468R63550J215549J453956J631897J723122J723419
$$ y = [223659668, 223193664, 222779858, 222485306, 222335916, 222307695, 222342656, 222377259, 222368412, 222307725, 222221305, 222156578, 222161148, 222262021, 222453654, 222698975, 222941611, 223124443, 223209318, 223192324, 223107419, 223012633, 222961277, 222971667, 223012466, 223011802, 222884388, 222563557, 222027705, 221315462, 220525656, 219800016, 219293243, 219142504, 219447467, 220262054, 221590016, 223377815, 225508167, 227804803, 230055614, 232049707, 233613849, 234633861, 235056882, 234882087, 234150650, 232938793, 231349677, 229500154, 227505945, 225473596, 223502494, 221690752, 220135285, 218922263, 218111983, 217724625, 217731708, 218056935, 218590192, 219214728, 219839867, 220426258, 220993490, 221608331, 222358799, 223322349, 224537898, 225991854, 227623751, 229346873, 231070292]
39742B31070292J640122J481271J254797R76053O72178L74886J06188j30092l43442
39733B37102253n44433p37708r26028j118549j332413j583978j876916k197086
39725B26785142k517568k808289l042709l199808l266348l243524l154452l043390
39717B02509054k961425k943820k991018l063754l095439l017523k787880k409813
39709A79238382j933329j439030j012857p20901n90529o02361o97172p97750q37419
39700A70607034p81937o35797m33935k27265o9652q211p4774k77396n95071r80664
39690A66522332j373096j713433j957309k080334k078965j970316j790985j591800
39682A51966094j426634j338019j345646j443081j603355j789301j963794k097961
$$ y = [231070292, 232710414, 234191685, 235446482, 236422535, 237094713, 237469599, 237575787, 237445695, 237102253, 236557820, 235820112, 234894084, 233775535, 232443122, 230859144, 228982228, 226785142, 224267574, 221459285, 218416576, 215216768, 211950420, 208706896, 205552444, 202509054, 199547629, 196603809, 193612791, 190549037, 187453598, 184436075, 181648195, 179238382, 177305053, 175866023, 174853166, 174132265, 173541736, 172939375, 172242203, 171444453, 170607034, 169825097, 169189300, 168755365, 168528100, 168458448, 168450237, 168375463, 168098067, 167502996, 166522332, 165149236, 163435803, 161478494, 159398160, 157319195, 155348879, 153557894, 151966094, 150539460, 149201441, 147855795, 146412714, 144809359, 143020058, 141056264, 138958303]
39674A38958303k177125k202963k189202k151658k098846k029745j939509j827501
39666A22341754j701775j578314j476546j413222j396444j421993j473054j522217
39658A10358189j533918j467785j285362r60358m87995J12315Q01798J530014
39650A07066898K240423K873928L374279L697507L822065L753341L518762L155846
39642A33503049K700701K183886J634303J084459N69894J22007k38936n04066
39634A41055297o70390p36373p03767n83835m01690j94429l533J35043J99989
39625A38096312J90830J29178N3410P261K5997J25290K96476N09320P21206Q89949
39615A41045229R85664R97097R31214Q09030O61240N23781M30733M04241M45976
$$ y = [138958303, 136781178, 134578215, 132389013, 130237355, 128138509, 126108764, 124169255, 122341754, 120639979, 119061665, 117585119, 116171897, 114775453, 113353460, 111880406, 110358189, 108824271, 107356486, 106071124, 105110766, 104622771, 104735086, 105536884, 107066898, 109307321, 112181249, 115555528, 119253035, 123075100, 126828441, 130347203, 133503049, 136203750, 138387636, 140021939, 141106398, 141676292, 141798299, 141559363, 141055297, 140384907, 139648534, 138944767, 138360932, 137959242, 137764813, 137761280, 137896323, 138096312, 138287142, 138416320, 138469730, 138476991, 138502988, 138628278, 138924754, 139434074, 140155280, 141045229, 142030893, 143027990, 143959204, 144768234, 145429474, 145953255, 146383988, 146788229, 147234205]
39606A47234205N35664O37495P09736P12233O11042L83213K3575m49650r95599
39597A49401914j559518k085229k525134k845047l025820l064855k978097k800155
39589A28518059k579466k367839k207649k122292k113642k165673k250860k337325
39581A10373313k396581k411075k378605k311090k228339k150048k089414k050228
39573I2357933k027798k012160j991263j953034j887592j790879j668180j534054
39565G7492973j407281j303706j231300j189492j171581j167964j168951j166891
39557F7685807j157445j139793j115826j089017j063523j043384j031491j028457
39549E9016871j032218j038953j044709j046745j043604j033464j011128r65552
$$ y = [147234205, 147769869, 148407364, 149117100, 149829333, 150440375, 150823588, 150847163, 150397513, 149401914, 147842396, 145757167, 143232033, 140386986, 137361166, 134296311, 131318214, 128518059, 125938593, 123570754, 121363105, 119240813, 117127171, 114961498, 112710638, 110373313, 107976732, 105565657, 103187052, 100875962, 98647623, 96497575, 94408161, 92357933, 90330135, 88317975, 86326712, 84373678, 82486086, 80695207, 79027027, 77492973, 76085692, 74781986, 73550686, 72361194, 71189613, 70021649, 68852698, 67685807, 66528362, 65388569, 64272743, 63183726, 62120203, 61076819, 60045328, 59016871, 57984653, 56945700, 55900991, 54854246, 53810642, 52777178, 51766050, 50800498]
39541E0800498q80891p42427n44861k97725k4244K45588M83598O69671P94310
39532E0503517Q58653Q73245Q55520Q24899P95781P71534P43708O98167O25175
39523E7550199N27356M20259L24847K56732K19451K05936K05819K11985K21796
39514F0144380K34025K45716K51960K48120K32267K06123J74255J42264J14898
39505F1994008R4361P8848O1862L3186j8136r9873k13188l50886m97944o34440
39495F0447798p39976p97838p97915p38999o30911m94900l60018k55643k03667
39486E5427931k13748k82202l93013n20398o33771p05523p19291o74549n84712
39477E0700724m69820l48553k34522j38177p1367m9508q8366j96696l69277n84905
$$ y = [50800498, 49919607, 49177180, 48632319, 48334594, 48310350, 48555938, 49039536, 49709207, 50503517, 51362170, 52235415, 53090935, 53915834, 54711615, 55483149, 56226857, 56925024, 57550199, 58077555, 58497814, 58822661, 59079393, 59298844, 59504780, 59710599, 59922584, 60144380, 60378405, 60624121, 60876081, 61124201, 61356468, 61562591, 61736846, 61879110, 61994008, 62088369, 62167217, 62229079, 62262265, 62244129, 62144256, 61931068, 61580182, 61082238, 60447798, 59707822, 58909984, 58112069, 57373070, 56742159, 56247259, 55887241, 55631598, 55427931, 55214183, 54931981, 54538968, 54018570, 53384799, 52679276, 51959985, 51285436, 50700724, 50230904, 49882351, 49647829, 49509652, 49438285, 49388777, 49300411, 49103715, 48734438, 48149533]
39467D8149533q10220j006942j139666j183678j132470j002063q27921o53851
39459D0392722n18147m43848m35989m84235n68257o64565p53298q22701q69383
39450C4832299q95010r01961q90685q59886q08986p40747o61819n80430n03074
39441B7989701m32912l71117l19464k80984k57339k44968k33881k11149j67041
39432B5470846r9753j6038P2001J51629K13436K52969K69865K65690K42454K02746
39422B7025845J50818R2877L5641j6377o2968j07587j53701k00534k41841k68635
39412B6253538k73240k51297k01517j25521k8990P7333J79140K62479L18081L43747
39402B6553753L43541L24095K89758K39596J68559P2163m8451j84269l19868m37408
$$ y = [48149533, 47339313, 46332371, 45192705, 44009027, 42876557, 41874494, 41046573, 40392722, 39874575, 39430727, 38994738, 38510503, 37942246, 37277681, 36524383, 35701682, 34832299, 33937289, 33035328, 32144643, 31284757, 30475771, 29735024, 29073205, 28492775, 27989701, 27556789, 27185672, 26866208, 26585224, 26327885, 26082917, 25849036, 25637887, 25470846, 25371093, 25355055, 25427056, 25578685, 25792121, 26045090, 26314955, 26580645, 26823099, 27025845, 27176663, 27269540, 27305181, 27288804, 27225836, 27118249, 26964548, 26764014, 26522173, 26253538, 25980298, 25729001, 25527484, 25401963, 25372973, 25450306, 25629446, 25891925, 26210006, 26553753, 26897294, 27221389, 27511147, 27750743, 27919302, 27991465, 27943014, 27758745, 27438877, 27001469]
39392B7001469n21647n64136n64750n29463m66050l81250k81328j73961o7819
39383B3451065L0810J20980K05634K85772L54384L95257L88684L21421J95135
39374B5749142K8160j50419l10812m31479n03459n29236n17554m77263m13987
39365B2443093l31629k36933j42528o5164j9829j3317m0695q5910j26268j39516
39355B1241304j11322m0171O2857J79142K89183L77367M33696M53794M38368L92027
39345B3716245L21467K34145J38205M2505m4784j18265j75662k15722k36059k33593
39335B3428482k07552j62508j09406o3756m1225n1777r4762j58021k22566k71177
39325B2045732k96532l04133l08058l22211l52881l97124m46698m93406n31966
$$ y = [27001469, 26479822, 25915686, 25350936, 24821473, 24355423, 23974173, 23692845, 23518884, 23451065, 23481875, 23602855, 23808489, 24094261, 24448645, 24843902, 25232586, 25554007, 25749142, 25777302, 25626883, 25316071, 24884592, 24381133, 23851897, 23334343, 22857080, 22443093, 22111464, 21874531, 21732003, 21666839, 21647010, 21633693, 21592998, 21507088, 21380820, 21241304, 21129982, 21089811, 21152668, 21331810, 21620993, 21998360, 22432056, 22885850, 23324218, 23716245, 24037712, 24271857, 24410062, 24452567, 24407783, 24289518, 24113856, 23898134, 23662075, 23428482, 23220930, 23058422, 22949016, 22885260, 22844035, 22792258, 22697496, 22539475, 22316909, 22045732, 21749200, 21445067, 21137009, 20814798, 20461917, 20064793, 19618095, 19124689, 18592723]
39316A8592723n59980n76997n84110n83639n77756n66646n47982n18688m77352
39307A3599573m24776l62271k89838k06450j12008q969R7350J99056K85906L46191
39297A3123764L69443L50609K93626K11726J23630M7043p220l7651n0478n5630
39287A4368862o2467p6623r8565j24025j46182j58991j60370j53781j47020j48637
39277A3092201j63934j92624k28840k62790k83285k80913k51404j97695j29405
39268A1101311n9558Q5M3417P2641R7922J33671J92578K80078L91666N13830O27733
39257A3395374P14143P58433P54175P04033O17451N06980L85793K67124J63668
39248A8267174Q4918L3322K557k0121m8827r4112j59712k41292l27559m04219
$$ y = [18592723, 18032743, 17455746, 16871636, 16287997, 15710241, 15143595, 14595613, 14076925, 13599573, 13174797, 12812526, 12522688, 12316238, 12204230, 12195261, 12292611, 12491667, 12777573, 13123764, 13493207, 13843816, 14137442, 14349168, 14472798, 14519841, 14512621, 14474970, 14424492, 14368862, 14306395, 14229772, 14131207, 14007182, 13861000, 13702009, 13541639, 13387858, 13240838, 13092201, 12928267, 12735643, 12506803, 12244013, 11960728, 11679815, 11428411, 11230716, 11101311, 11041753, 11041838, 11085255, 11157896, 11255818, 11389489, 11582067, 11862145, 12253811, 12767641, 13395374, 14109517, 14867950, 15622125, 16326158, 16943609, 17450589, 17836382, 18103506, 18267174, 18352092, 18385414, 18387971, 18367850, 18319023, 18224911, 18065199, 17823907, 17496348, 17092129]
39238A7092129m59641m88967m93968m78903m45879l93554l20117k27982j26216
39229A3656902k8855M9645R8907J15197J01978O8774K8403p208l0966m2271m5607
39218A3964899m7419n3181o5747q4864j07767j30918j52289j72485j93331k14790
39208A2742108k33246k43200k41175k28077k07715j83066j54065j18912p7238
39199A1055414l1988J1334M6874P0221P9276P4598N9408L8865J8900N516N023
39188A1433441K4154O8612J39987K33059L35795M32618N09355N57341N74908N66037
39178A4875307N37297M94884M43052L83932L18208K46338J70401R5660K9919k0054
39168A7574944n2769p3035q8496j04315j19936j29721j26637j07126p4709l9718
$$ y = [17092129, 16632488, 16143521, 15649553, 15170650, 14724771, 14331217, 14011100, 13783118, 13656902, 13628047, 13677692, 13776599, 13891796, 13993774, 14062548, 14090951, 14083743, 14052777, 14010506, 13964899, 13917480, 13864299, 13798552, 13713688, 13605921, 13475003, 13322714, 13150229, 12956898, 12742108, 12508862, 12265662, 12024487, 11796410, 11588695, 11405629, 11251564, 11132652, 11055414, 11023426, 11034760, 11081634, 11151855, 11231131, 11305729, 11365137, 11404002, 11422902, 11428418, 11433441, 11457595, 11526207, 11666194, 11899253, 12235048, 12667666, 13177021, 13734362, 14309270, 14875307, 15412604, 15907488, 16350540, 16734472, 17052680, 17299018, 17469419, 17565079, 17594998, 17574944, 17522175, 17449140, 17360644, 17256329, 17136393, 17006672, 16880035, 16772909, 16698200, 16658482]
39158A6658482j4110m331p632j4668j5977p177J0012L0149M7216N6802N6982M8552
39146A6844300L5087K2415J6425J9393K7403L1488K1900q075o1291j37442k32417
39135A6579186l36310m33189n04638n35479n18168m54133l52602k28105r7250
39126A3119312K4596J25672J98771K41325K55309K46719K23752J93680J59715
39117A4788851J19859O8924K969p6752j63435k48266l24634l89185m39398m71243
39107A2867690m79997m63644m25242l71898l11200k48081j84195j19388n3395
39098A0210650J3683Q1379J47759K07190K49458K62583K38315J76419Q5101k1315
39088A1651222j24935k06657k50074k46946k00982j26481m2176L5731R7863J42707
$$ y = [16658482, 16644372, 16640041, 16632409, 16617741, 16601764, 16594587, 16604599, 16634748, 16681964, 16738766, 16795748, 16844300, 16879387, 16901802, 16918227, 16937620, 16965023, 16996511, 17018411, 17010336, 16949045, 16811603, 16579186, 16242876, 15809687, 15305049, 14769570, 14251402, 13797269, 13444667, 13216562, 13119312, 13143908, 13269580, 13468351, 13709676, 13964985, 14211704, 14435456, 14629136, 14788851, 14908710, 14977634, 14980603, 14903851, 14740416, 14492150, 14167516, 13778331, 13338933, 12867690, 12387693, 11924049, 11498807, 11126909, 10815709, 10567628, 10383433, 10264045, 10210650, 10224333, 10305712, 10453471, 10660661, 10910119, 11172702, 11411017, 11587436, 11672537, 11651222, 11526287, 11319630, 11069556, 10822610, 10621628, 10495147, 10452971, 10488702, 10586565, 10729272]
39078A0729272J75188K03172K32537K62948K87177K94385K75137K25624J49806
39069A2835246N9040l0967j05078j53159j72037j64826j38849j02953o4556k7179
39059A1934682J0156N1155R9064J53581K09393K57020K85612K86260K54343J90969
39049A3732235J03922P468q0750j45692j80531j87990j76508j54345j25725r1170
39039A2700914n0813p730L1296N7984O6007N3570K3690j7865o5917j18369j75778
39028A2496989k38116l01330l56793l94129m05343l88020l46607k91589k36343
39019I538719j92142j63275j44885j24919q9455k9225N5608J54465K49608L21722
39009I576221L55185L41256K79309J76702M7307r1546k23132l34431m16705m63701
$$ y = [10729272, 10904460, 11107632, 11340169, 11603117, 11890294, 12184679, 12459816, 12685440, 12835246, 12894286, 12863319, 12758241, 12605082, 12433045, 12268219, 12129370, 12026417, 11961861, 11934682, 11944838, 11995993, 12095057, 12248638, 12458031, 12715051, 13000663, 13286923, 13541266, 13732235, 13836157, 13843625, 13762875, 13617183, 13436652, 13248662, 13072154, 12917809, 12792084, 12700914, 12650101, 12642371, 12673667, 12731651, 12797658, 12851228, 12874918, 12857053, 12791136, 12672767, 12496989, 12258873, 11957543, 11600750, 11206621, 10801278, 10413258, 10066651, 9775062, 9538719, 9346577, 9183302, 9038417, 8913498, 8824043, 8794818, 8850426, 9004891, 9254499, 9576221, 9931406, 10272662, 10551971, 10728673, 10775980, 10684434, 10461302, 10126871, 9710166, 9246465]
38999I246465m69894m31163l48219k30241r5432L3031J34115J95765K18394K13154
38989H465975J95604J77766J63247J48319J27352R7776O1207K1666j6201m7813
38979I394898o9486q0011q1764p9982q0630q8090j03443j23706j42719j53783
38969H391284j52703j39300j16797r0326o5770m9184m6404o2684j02087j66094
38959G399935k51359l48050m40837n13123n52493n54181n20990m60954l84860
38950C373088l04261k29033j64335j08822n6098J001O6044J37065K07644K69581
38940C191874L15521L40436L42140L21701K84117K38486J96563J69639J65191
38931E565668J85086K25899K80580L40159L94993M36052M56966M56076M36655
$$ y = [9246465, 8776571, 8345408, 7997189, 7766948, 7671516, 7704547, 7838662, 8034427, 8252821, 8465975, 8661579, 8839345, 9002592, 9150911, 9278263, 9376039, 9437246, 9458912, 9442711, 9394898, 9325412, 9245401, 9163637, 9083655, 9003025, 8914935, 8811492, 8687786, 8545067, 8391284, 8238581, 8099281, 7982484, 7892158, 7826388, 7777204, 7730800, 7668116, 7566029, 7399935, 7148576, 6800526, 6359689, 5846566, 5294073, 4739892, 4218902, 3757948, 3373088, 3068827, 2839794, 2675459, 2566637, 2510539, 2511540, 2577584, 2714649, 2922293, 3191874, 3507395, 3847831, 4189971, 4511672, 4795789, 5034275, 5230838, 5400477, 5565668, 5750754, 5976653, 6257233, 6597392, 6992385, 7428437, 7885403, 8341479, 8778134]
38922H778134M04374L63779L16650K63143K04102J42536Q3724L4383J057j1946
38912A0579936l960K2499O3877J17529J81418K51202L17151L64401L78194L51530
38902A2623777K90242K12089J40753R8185R8545J45069K29790L35467M39175N17479
38892A5130571N52854N39116M82825L99470L07087K21245J53130J09331R1448
38883A7987077R5255J10616J23669J21587R7961N5375L007m9143r5303j35368
38873A8314733j72761k10644k48571k81491l02165l05814k93913k74525k59191
38864A5965658k58207k76514l11629l54320l91394m09313l97641l52120k76659
38855A2937861j82793q6024r19O2125R7390J02957Q0224L4256k6065q9009j42214
$$ y = [8778134, 9182508, 9546287, 9862937, 10126080, 10330182, 10472718, 10556442, 10590825, 10591882, 10579936, 10575976, 10598475, 10662352, 10779881, 10961299, 11212501, 11529652, 11894053, 12272247, 12623777, 12914019, 13126108, 13266861, 13365046, 13463591, 13608660, 13838450, 14173917, 14613092, 15130571, 15683425, 16222541, 16705366, 17104836, 17411923, 17633168, 17786298, 17895629, 17987077, 18082332, 18192948, 18316617, 18438204, 18536165, 18591540, 18594547, 18545404, 18450101, 18314733, 18141972, 17931328, 17682757, 17401266, 17099101, 16793287, 16499374, 16224849, 15965658, 15707451, 15430937, 15119308, 14764988, 14373594, 13964281, 13566640, 13214520, 12937861, 12755068, 12669044, 12668125, 12730250, 12827640, 12930597, 13010821, 13045077, 13019012, 12930003, 12787789]
38844A2787789j75091j80555j55916j03627l1737M7132J19000J72977K04764K17438
38834A2902174K18855K16354K11411J98086J67216J13729M1657l6593j05641j53601
38824A3773647j76507j78930j70570j60205j50288j35405j05788n4262J6987R3910
38814A2752589J54376J76451J46494O3263o2262k09534l52568m65767n30757n41532
38804A1130753n05184m37663l56757k75761k00636j31311o5341j158O0478J16442
38794I333862J61472J88733J91236J64497J09525L4719m4803j11083j49217j52438
38784I726503j23657p3154j4391L9774P9730J00887J04293R5493Q1711O8918O0222
38773A0146329N5874N3915N0690M1395K1147j3205o1399j19298j80127k36423
$$ y = [12787789, 12612698, 12432143, 12276227, 12172600, 12140863, 12187995, 12306995, 12479972, 12684736, 12902174, 13121029, 13337383, 13548794, 13746880, 13914096, 14027825, 14069482, 14032889, 13927248, 13773647, 13597140, 13418210, 13247640, 13087435, 12937147, 12801742, 12695954, 12641692, 12658679, 12752589, 12906965, 13083416, 13229910, 13293173, 13230911, 13021377, 12668809, 12203042, 11672285, 11130753, 10625569, 10187906, 9831149, 9555388, 9354752, 9223441, 9158100, 9156942, 9217420, 9333862, 9495334, 9684067, 9875303, 10039800, 10149325, 10184044, 10139241, 10028158, 9878941, 9726503, 9602846, 9529692, 9515301, 9555075, 9634805, 9735692, 9839985, 9935478, 10017189, 10086107, 10146329, 10202203, 10256118, 10306808, 10348203, 10369350, 10356145, 10294746, 10175448, 9995321, 9758898]
38763I758898k81440l09841l18683l09020k86863k61667k42493k33992k34617
38754G280282k37959k36242k23926j99243j62887j15415n6370J3668R0211J64644
38744F316763K27622K73282L00426L09943L01606K74014K28086J70308J11885
38735H513935O3718L1172J2672K631m051r149j1035o164R611M0315Q8594J53082
38723H885331K25883K93169L40152L57781L46679L15736K76830K39503K08633
38714A1489697J85175J67753J52938J34593J04438N5062j6234j05311k01825k91526
38704A1674760l59353l93186l87854l47583k84988k16529j56651j13554q8077
38695I326985p5268o6965n4570l1830K693M5020Q8237J27023J61296J96562K40707
$$ y = [9758898, 9477458, 9167617, 8848934, 8539914, 8253051, 7991384, 7748891, 7514899, 7280282, 7042323, 6806081, 6582155, 6382912, 6220025, 6104610, 6048240, 6061908, 6152119, 6316763, 6544385, 6817667, 7118093, 7428036, 7729642, 8003656, 8231742, 8402050, 8513935, 8577653, 8608825, 8621497, 8624128, 8620077, 8610928, 8599893, 8593729, 8603340, 8643655, 8732249, 8885331, 9111214, 9404383, 9744535, 10102316, 10448995, 10764731, 11041561, 11281064, 11489697, 11674872, 11842625, 11995563, 12130156, 12234594, 12289656, 12273422, 12168111, 11966286, 11674760, 11315407, 10922221, 10534367, 10186784, 9901796, 9685267, 9528616, 9415062, 9326985, 9251717, 9184752, 9130182, 9098352, 9101045, 9146065, 9234302, 9361325, 9522621, 9719183, 9959890]
38684I959890K98708L67771M35895M85648N01581M76742M14399L24967K21248
38675A3486849J15104J6238o7718j31222j71750j90997j94960j92016j89825j92787
38665A2286916k01073k11218k18094k17663k09025j94178j75452j52660j22357
38656A0585196p9791k2621M5691J14937J70988K01679K02703J80042J47371J19820
38646A1666015J07540J12291J28592J48236J65342J79394J95007K19032K56493
38637A3177942L07307L65216M18743M53387M54727M12975L28126K12297Q6073
38628A6216793l0228j24836j96925k52599k98665l38814l73492m01727m22667
38619A3776840m36117m42271m41262m32451m13706l81144l30179k57926j66125
$$ y = [9959890, 10258598, 10626369, 11062264, 11547912, 12049493, 12526235, 12940634, 13265601, 13486849, 13601953, 13618191, 13550473, 13419251, 13247501, 13056504, 12861544, 12669528, 12479703, 12286916, 12085843, 11874625, 11656531, 11438868, 11229843, 11035665, 10860213, 10707553, 10585196, 10505405, 10482784, 10528475, 10643412, 10814400, 11016079, 11218782, 11398824, 11546195, 11666015, 11773555, 11885846, 12014438, 12162674, 12328016, 12507410, 12702417, 12921449, 13177942, 13485249, 13850465, 14269208, 14722595, 15177322, 15590297, 15918423, 16130720, 16216793, 16186565, 16061729, 15864804, 15612205, 15313540, 14974726, 14601234, 14199507, 13776840, 13340723, 12898452, 12457190, 12024739, 11611033, 11229889, 10899710, 10641784, 10475659]
38610A0475659o2731L9126J24920J83537K10869K10594J92131J67035J45437J33351
38600A1819928J31161J33668J32520J20780R7447O8602M4035L1616L3125M3451
38590A2656333N2946N1877L5929J0198j1593j3427J4764P2709J51525K39132L24799
38579A3585192M00571M60511M99864N15104N04157M65965L99739L05324J84931
38570A7321358M4775j05148k53010l87161m97402n76224o20437o32028o16562
38561A3678161n79599n23552m47363l49101k29414r3358N0286J91198L19363M25755
38551A2442376N02493N43377N45219N09173M41079L49901K44785J32832J9546
38542A5730781q8603j82790k54018k97387l14443l11573k96233k74090k48115
$$ y = [10475659, 10412928, 10452054, 10576974, 10760511, 10971380, 11181974, 11374105, 11541140, 11686577, 11819928, 11951089, 12084757, 12217277, 12338057, 12435504, 12504106, 12548141, 12579757, 12612882, 12656333, 12709279, 12761156, 12797085, 12807283, 12795690, 12782263, 12797027, 12869736, 13021261, 13260393, 13585192, 13985763, 14446274, 14946138, 15461242, 15965399, 16431364, 16831103, 17136427, 17321358, 17366133, 17260985, 17007975, 16620814, 16123412, 15547188, 14926751, 14294723, 13678161, 13098562, 12575010, 12127647, 11778546, 11549132, 11455774, 11506060, 11697258, 12016621, 12442376, 12944869, 13488246, 14033465, 14542638, 14983717, 15333618, 15578403, 15711235, 15730781, 15642178, 15459388, 15205370, 14907983, 14593540, 14281967, 13985734, 13711644, 13463529]
38533A3463529k18809j85057j45939j02948o0722k4931J091J7548K5868K5492
38523A2795122J3523j1998m8390q7739j20125j38629j43181j40909j42046j53128
38513A1822500j71899j87799j87746j62786j11379l8435M7983J39573K28736L07587
38503A1686335L67156L99138M00197L75702L39383L08512K96998L09626L39640
38494A4822687L71312L87107L76295L39963K89301K38517J97057J65736J38403
38485A7326378J07017O6055J3617n0025j23577k04243k86975l65295m33200m86076
38475A5563676n19931n30408n13667m69117m02066l24037k50096j94549j67032
38466A2192773j70268j99567k43716k87387l15001l15092k83447k23575j44423
$$ y = [13463529, 13244720, 13059663, 12913724, 12810776, 12750054, 12725123, 12726214, 12743762, 12769630, 12795122, 12808645, 12796647, 12748257, 12660518, 12540393, 12401764, 12258583, 12117674, 11975628, 11822500, 11650601, 11462802, 11275056, 11112270, 11000891, 10962456, 11010439, 11150012, 11378748, 11686335, 12053491, 12452629, 12852826, 13228528, 13567911, 13876423, 14173421, 14483047, 14822687, 15193999, 15581106, 15957401, 16297364, 16586665, 16825182, 17022239, 17187975, 17326378, 17433395, 17499450, 17513067, 17463042, 17339465, 17135222, 16848247, 16482952, 16049752, 15563676, 15043745, 14513337, 13999670, 13530553, 13128487, 12804450, 12554354, 12359805, 12192773, 12022505, 11822938, 11579222, 11291835, 10976834, 10661742, 10378295, 10154720, 10010297]
38457A0010297n6547L1480J14708J91038K58886L14985L53571L67412L50221K99691
38447A2235742K19729J20564J6248p9289j55682k07621k34060k35835k12972j63884
38437A1302940q8075Q541J10066J93203K36131K28044J72634Q3621k3345j36307
38427A2087453k47350l49582m34658m93307n18332n07343m62858l89914k93599
38418H390510j78801n2152P6044J91961K80808L30531L34814K94181K15119J08463
38408I991478j1812j29467k27960k94191l22698l17498k89825k52488k13758j73972
38398G757809j26754o4165J7158J12701K11563L01306L72418M19597M40357M33771
38388I875761M01117L47198K79639K05648J28951N0212k8969j02195j58721j88999
$$ y = [10010297, 9953750, 9985230, 10099938, 10290976, 10549862, 10864847, 11218418, 11585830, 11936051, 12235742, 12455471, 12576035, 12592283, 12512994, 12357312, 12149691, 11915631, 11679796, 11466824, 11302940, 11214865, 11223406, 11333472, 11526675, 11762806, 11990850, 12163484, 12247105, 12223760, 12087453, 11840103, 11490521, 11055863, 10562556, 10044224, 9536881, 9074023, 8684109, 8390510, 8211709, 8159557, 8235601, 8427562, 8708370, 9038901, 9373715, 9667896, 9883015, 9991478, 9979666, 9850199, 9622239, 9328048, 9005350, 8687852, 8398027, 8145539, 7931781, 7757809, 7631055, 7566890, 7584048, 7696749, 7908312, 8209618, 8582036, 9001633, 9441990, 9875761, 10276878, 10624076, 10903715, 11109363, 11238314, 11288526, 11259557, 11157362, 10998641, 10809642]
38378A0809642j91733j77067j62640j64155j86260k19952k48093k54610k30823
38369H974309j76104r5562J504J01906J90308K53771K86741K92837K82185K66368
38359A0378263K54145K49628K52563K59287K63521K57415K33767J89027J25156
38350A2462772M8803l1494j07649j72338k18040k37029k23545j77309j05896k3926
38340A1214349N0928J03042J22846J08855O7809J2721m1232q1772j02910j04773
38330A1349863r0493o2707k2119L0919R2896J54358K00829K18245K00102J51668
38320A2223561Q8042K6909j9749n0073p0306q7907j04675j14788j09095q2600
38310A1699319l9943M782L3851L4153L138n0947j14484j76045k31258k82431l34102
$$ y = [10809642, 10617909, 10440842, 10278202, 10114047, 9927787, 9707835, 9459742, 9205132, 8974309, 8798205, 8702643, 8704147, 8806053, 8996361, 9250132, 9536873, 9829710, 10111895, 10378263, 10632408, 10882036, 11134599, 11393886, 11657407, 11914822, 12148589, 12337616, 12462772, 12511575, 12480081, 12372432, 12200094, 11982054, 11745025, 11521480, 11344171, 11238275, 11214349, 11265277, 11368319, 11491165, 11600020, 11667829, 11680550, 11639318, 11557546, 11454636, 11349863, 11259370, 11196663, 11174544, 11205463, 11298359, 11452717, 11653546, 11871791, 12071893, 12223561, 12311603, 12338512, 12318763, 12268690, 12198384, 12110477, 12005802, 11891014, 11781919, 11699319, 11659376, 11664158, 11698009, 11732162, 11735300, 11684353, 11569869, 11393824, 11162566, 10880135, 10546033]
38299A0546033l88252m42160m89353n21882n32316n15261m68907l96659l07650
38290F483593k15141j33010p1963l7215k8283m0272o5638r5976j23744j43604
38280E528747j52597j49044j31306r7902m9005J2114P9107J43907J98404K36203
38270E618628K54846K58072K56117K62337K87040L32112L89799M46237M87407
38261H592595N04442M96090M67690M27697L84131L43124L09475K86907K76274
38252A2088425K72931K66543K45050K01162J37314O5771L254l7086n1616m6267
38242A3145481l0939j2604P853L3071O3322R2045J06489R3773M8742k1415r8795
38231A3427023j61424j91063j78752j26623m6139M6167J33692K03665K49263K70348
$$ y = [10546033, 10157781, 9715621, 9226268, 8704386, 8172070, 7656809, 7187902, 6791243, 6483593, 6268452, 6135442, 6063479, 6026264, 5997981, 5957709, 5892071, 5796095, 5672351, 5528747, 5376150, 5227106, 5095800, 4997898, 4948893, 4961007, 5040114, 5184021, 5382425, 5618628, 5873474, 6131546, 6387663, 6650000, 6937040, 7269152, 7658951, 8105188, 8592595, 9097037, 9593127, 10060817, 10488514, 10872645, 11215769, 11525244, 11812151, 12088425, 12361356, 12627899, 12872949, 13074111, 13211425, 13277196, 13280450, 13243364, 13191748, 13145481, 13114542, 13101938, 13109791, 13142862, 13206184, 13298229, 13404718, 13498491, 13547233, 13525818, 13427023, 13265599, 13074536, 12895784, 12769161, 12723022, 12769189, 12902881, 13106546, 13355809, 13626157]
38221A3626157K73054K67529K63668K66535K74178K79021K71775K45703J99374
38212A5966994J36788O4554j2625r5052j86832k90595m01990n08444n93377o42777
38202A3436644o49822o15744n48106m58670l61492k70974j99719j56617j45321
38193A0030179j63030k00115k41687k71415k76254k49917j93757j15306k5674
38184H293024O2895J38568J91084K13755K06658J78929J47268J30042J39891J79108
38174I881222K39742L07261L65443M00956M06987L85020L43792K95295K49623
38165A2875341K11617J80971J55209J32927J15213J04673J03103J09213J17899
38156A4106166J21841J14775R4475O3373K6739r922m2380o8022q6234r9679j15443
$$ y = [13626157, 13899211, 14166740, 14430408, 14696943, 14971121, 15250142, 15521917, 15767620, 15966994, 16103782, 16168336, 16155711, 16060659, 15873827, 15583232, 15181242, 14672798, 14079421, 13436644, 12786822, 12171078, 11622972, 11164302, 10802810, 10531836, 10332117, 10175500, 10030179, 9867149, 9667034, 9425347, 9153932, 8877678, 8627761, 8434004, 8318698, 8293024, 8355919, 8494487, 8685571, 8899326, 9105984, 9284913, 9432181, 9562223, 9702114, 9881222, 10120964, 10428225, 10793668, 11194624, 11601611, 11986631, 12330423, 12625718, 12875341, 13086958, 13267929, 13423138, 13556065, 13671278, 13775951, 13879054, 13988267, 14106166, 14228007, 14342782, 14437257, 14500630, 14527369, 14517447, 14475067, 14407045, 14320811, 14221132, 14105689]
38145A4105689j44064j95565k74430l76573m89884n97225o79920p21099p08981
38136I917948o39521n17149l53233j63422L4876K24564L90606N21397O09664O53099
38126A0678829O54717O22271N66266M97380M24745L55832K97173K54241K29810
38117A4581264K21708K22040K19363K03113J67607J13018M2654m1304j40110k56172
38107A5333181l87253n21820o40110p21299p51916p30162o64294n67633m54000
38098I894694l35858k24689j31024o2128j8464P416K7306N1153Q2489J17903J49835
38087I558633J70633J75930J65537J41561J05776N9159L479n7665j19684j78090
38077A0025269k28060k63858k80261k75518k53021k19976j84097j50218j18198
$$ y = [14105689, 13961625, 13766060, 13491630, 13115057, 12625173, 12027948, 11348028, 10626929, 9917948, 9278427, 8761278, 8408045, 8244623, 8279499, 8504063, 8894669, 9416066, 10025730, 10678829, 11333546, 11955817, 12522083, 13019463, 13444208, 13800040, 14097213, 14351454, 14581264, 14802972, 15025012, 15244375, 15447488, 15615095, 15728113, 15770767, 15729463, 15589353, 15333181, 14945928, 14424108, 13783998, 13062699, 12310783, 11580621, 10916327, 10348694, 9894694, 9558836, 9334147, 9203123, 9140995, 9122531, 9129947, 9157253, 9208406, 9290895, 9408798, 9558633, 9729266, 9905196, 10070733, 10212294, 10318070, 10377229, 10380708, 10323043, 10203359, 10025269, 9797209, 9533351, 9253090, 8977572, 8724551, 8504575, 8320478, 8170260, 8052062]
38068H052062q3061l7711K2736R7204J77444K50081L01285L22228L12452K79314
38058I694034K34529J90546J58246J45059J52608J75159K00887K16106K10369
38049A1377543J79854J27613O0958j2321q6427j57533k22418k77974l22103l54600
38039A0312592l76890l91052l99121m02536m01285l93786l78769l58618l41042
38030F869493l36905l55280l98699m60612n25363n70813n74018n18794m01831
38021B727178k34044l6828J64242L45225M87518N79747O18599O08747N61157M89627
38011F311168M07161L24310K49565J89314J45823J15018Q7445N3054O701m9198
38001G840361j05952j52516j79865j84056j66843j33970r2223m6602J332N2841
$$ y = [8052062, 7969001, 7931290, 7954026, 8051230, 8228674, 8478755, 8780040, 9102268, 9414720, 9694034, 9928563, 10119109, 10277355, 10422414, 10575022, 10750181, 10951068, 11167174, 11377543, 11557397, 11685010, 11745968, 11733647, 11647220, 11489687, 11267269, 10989295, 10667192, 10312592, 9935702, 9544650, 9145529, 8742993, 8341708, 7947922, 7569153, 7210535, 6869493, 6532588, 6177308, 5778609, 5317997, 4792634, 4221821, 3647803, 3129009, 2727178, 2493134, 2456306, 2620548, 2965773, 3453291, 4033038, 4651637, 5260384, 5821541, 6311168, 6718329, 7042639, 7292204, 7481518, 7627341, 7742359, 7829804, 7882858, 7889559, 7840361, 7734409, 7581893, 7402028, 7217972, 7051129, 6917159, 6824936, 6778334, 6779666, 6832507]
37991F832507J08852J65840K13953K39659K32016J88951J19684M1700k5808o8221
37981H049133p8474n7041j0783M8514J06847J51681J74300J69408J33925O7788
37971H755298k3657j29038k33959l25501l94993m38116m53941m44311m13591l68002
37961E530189l14485k59680k09681j70483j48309j48842j75159k25266k91036
37952C587248l59947m19265m60264m79975m80280m66289m45169m24498m09289
37943c57728l99301l89304l72315l42916k98567k39762j70457r8199l2518J8117
37933b682950M8562N7308M5921J9182j4456m3950n9005n3880k8930J0852N8283
37922b643063J05544J45176J72036J85621J90057J90760J90686J90051J89583
$$ y = [6832507, 6941359, 7107199, 7321152, 7560811, 7792827, 7981778, 8101462, 8143162, 8117354, 8049133, 7970659, 7913618, 7902835, 7951349, 8058196, 8209877, 8384177, 8553585, 8687510, 8755298, 8731641, 8602603, 8368644, 8043143, 7648150, 7210034, 6756093, 6311782, 5898191, 5530189, 5215704, 4956024, 4746343, 4575860, 4427551, 4278709, 4103550, 3878284, 3587248, 3227301, 2808036, 2347772, 1867797, 1387517, 921228, 476059, 51561, -357728, -757029, -1146333, -1518648, -1861564, -2160131, -2399893, -2570350, -2668549, -2701067, -2682950, -2634388, -2577080, -2531159, -2511977, -2526433, -2570383, -2629388, -2683268, -2712198, -2701346, -2643063, -2537519, -2392343, -2220307, -2034686, -1844629, -1653869, -1463183, -1273132, -1083549]
37913a083549J93400K08154K38848K84457L36361L80664M03646L97825L65206
37904A725012L15832K62758K16682J82862J61095J48041J40551J38087J42538
37895C433458J55547J75491J96578K10580K09756J89309J48624R1062K2412n1200
37885D781617j24471j92256k48131k84298k93897k74660k31657j77205j27447
37876B827595r6775r2476j12200j45722j80196k06027k20216k25871k29415k38030
37866A080667k58305k95069l49562m18010m92251n62266o18791o54548o64330
37857c232465o44671n93519n10459l98130k64266j22218J1782J23509K04698K53735
37847e172004K73380K67555K39515J92144J29611N8643j1599p0866j09831j22514
$$ y = [-1083549, -890149, -681995, -443147, -158690, 177671, 558335, 961981, 1359806, 1725012, 2040844, 2303602, 2520284, 2703146, 2864241, 3012282, 3152833, 3290920, 3433458, 3589005, 3764496, 3961074, 4171654, 4381410, 4570719, 4719343, 4810405, 4832817, 4781617, 4657146, 4464890, 4216759, 3932461, 3638564, 3363904, 3132247, 2955042, 2827595, 2730820, 2638344, 2526144, 2380422, 2200226, 1994199, 1773983, 1548112, 1318697, 1080667, 822362, 527293, 177731, -240279, -732530, -1294796, -1913587, -2568135, -3232465, -3877136, -4470655, -4981114, -5379244, -5643510, -5765728, -5753946, -5630437, -5425739, -5172004, -4898624, -4631069, -4391554, -4199410, -4069799, -4011156, -4022755, -4093621, -4203452, -4325966]
37837d325966j08536p3837k8838J5147M9108O8005P1122O1568M4877K7070J3118
37826d187162O416Q636J9531L7092N8856Q3804J12962J47471J85112K18038K34366
37815c074878K23456J81766J15574L9362k8518p0674p5383m0676K3717R8487J60924
37804b446843J92700J85868J44866Q3816K0443l0609o2108p4731p4296o7551n8648
37793b187093m8278l5865k2835j3745j4073k6758n0466q0288j09251j29307j32368
37782b850327j12346o7894m175O7813J34598J85132K15044K28216K34692K45929
37772a723318K69509L05681L47139L82144L99493L92597L60423L05403K30900
37763A269971J40600L9815o3466j59429k38840k95210l25661l30483l12007k73403
$$ y = [-4325966, -4434502, -4508339, -4537177, -4522030, -4472922, -4404917, -4333795, -4272227, -4227350, -4200280, -4187162, -4180746, -4172110, -4152579, -4115487, -4056631, -3972827, -3859865, -3712394, -3527282, -3309244, -3074878, -2851422, -2669656, -2554082, -2514720, -2543238, -2613912, -2689295, -2729971, -2706254, -2607767, -2446843, -2254143, -2068275, -1923409, -1839593, -1819150, -1849759, -1911867, -1986598, -2060894, -2128445, -2187093, -2235371, -2271236, -2294071, -2307816, -2321889, -2348647, -2399113, -2479401, -2588652, -2717959, -2850327, -2962673, -3030567, -3034742, -2966929, -2832331, -2647199, -2432155, -2203939, -1969247, -1723318, -1453809, -1148128, -800989, -418845, -19352, 373245, 733668, 1039071, 1269971, 1410571, 1450386, 1386920, 1227491, 988651, 693441, 367780, 37297, -274710, -548113]
37753e48113k17805j48167o7758J9189J07299J90686K64117L23946L68144L95409
37743F86947M04039L91497L55074K93404K07962J03511j2969j34194k53691l65463
37733A676117m63150n40122n90318o08418n89245n28292m24734k84799j21733
37724b474694M8735K13926L66159N00123O09247O85420P23001P23553O96515O54064
37714B746049O03568N43459M65726L62973K34825Q9948n6664j88988k95257l70915
37704D134724m17951m41250m44769m30252l98913l54007l01690k49435k03395
37695H93062j66800j40524j25058j21970j33173j58210j91581k22634k38876k31114
37685h36878j97431j43828q1910k5170J5019L3352L3278K6089K5741M2323P8462
$$ y = [-548113, -765918, -914085, -981843, -962654, -855355, -664669, -400552, -76606, 291538, 686947, 1090986, 1482483, 1837557, 2130961, 2338923, 2442434, 2429465, 2295271, 2041580, 1676117, 1212967, 672845, 82527, -525891, -1115136, -1643428, -2068162, -2352961, -2474694, -2425959, -2212033, -1845874, -1345751, -736504, -51084, 671917, 1395470, 2091985, 2746049, 3349617, 3893076, 4358802, 4721775, 4956600, 5046548, 4989884, 4800896, 4505639, 4134724, 3716773, 3275523, 2830754, 2400502, 2001589, 1647582, 1345892, 1096457, 893062, 726262, 585738, 460680, 338710, 205537, 47327, -144254, -366888, -605764, -836878, -1034309, -1178137, -1260047, -1285217, -1270198, -1236846, -1203568, -1177479, -1151738, -1109415, -1030953]
37674a030953J30322J91146K54668L17109L77423M35489M89102N32620N58985
37665B255911N63416N45257N06737M50960L81588L03975K25731J55661J01721
37656E490957O9216O0070P3034J03965J45574J87551K18699K31046K23014J98721
37646G001847J64049J22924P6454K4205l4244r7904j62871k21925k66876k93038
37636F312621l02078l00216k93226k82536k65188k36486j92875j34035o4269P828
37626D249540P2335J22202J55106J71438J71209J53708J20132P5800K9159j1518
37616E309111m1173n9286o9793p9800r6778j24683j60797j95571k16241k12582
37606D052407j81741j29369o6533m570M9049R1874J24977J50454J69408J81181
$$ y = [-1030953, -900631, -709485, -454817, -137708, 239715, 675204, 1164306, 1696926, 2255911, 2819327, 3364584, 3871321, 4322281, 4703869, 5007844, 5233575, 5389236, 5490957, 5560173, 5620243, 5693277, 5797242, 5942816, 6130367, 6349066, 6580112, 6803126, 7001847, 7165896, 7288820, 7365274, 7389479, 7355235, 7257331, 7094460, 6872535, 6605659, 6312621, 6010543, 5710327, 5417101, 5134565, 4869377, 4632891, 4440016, 4305981, 4241712, 4249540, 4321875, 4444077, 4599183, 4770621, 4941830, 5095538, 5215670, 5291470, 5320629, 5309111, 5267938, 5208652, 5138859, 5059059, 4962281, 4837598, 4676801, 4481230, 4264989, 4052407, 3870666, 3741297, 3674764, 3670194, 3719243, 3811117, 3936094, 4086548, 4255956, 4437137]
37596D437137J83886J75992J57866J31875J00320O2772J5697m4116j14309j84148
37586D922972k36943k56804k35872j78343r9294j8886M5366Q4373R8315R2913
37576D217797P4320M6354J0973k9634p1891j11456j44759j69705j84887j88028
37566C449084j75280j42363q7144j2379P2855J54099K15501K45773K43567K18920
37556D182633J89493J73348J82121K17816K74236L41320M09629M72658N26644
37547F969898N69094N97384O08178N97825N63656N05688M27570L36088K39507
37538A1414888J45991O2734m520n2204q0005r1523r3479r2882r3124r1453p9934
37527A0944489m9463N767Q5749J84315K90179L88959M66680N14052N29529N19051
$$ y = [4437137, 4621023, 4797015, 4954881, 5086756, 5187076, 5249848, 5265545, 5221429, 5107120, 4922972, 4686029, 4429225, 4193353, 4015010, 3915716, 3896830, 3942196, 4026569, 4124884, 4217797, 4292117, 4338471, 4349444, 4319810, 4247919, 4136463, 3991704, 3821999, 3637112, 3449084, 3273804, 3131441, 3044297, 3031918, 3104773, 3258872, 3474373, 3720146, 3963713, 4182633, 4372126, 4545474, 4727595, 4945411, 5219647, 5560967, 5970596, 6443254, 6969898, 7538992, 8136376, 8744554, 9342379, 9906035, 10411723, 10839293, 11175381, 11414888, 11560879, 11623613, 11619093, 11566889, 11486884, 11395361, 11301882, 11209000, 11115876, 11024423, 10944489, 10895026, 10900793, 10986542, 11170857, 11461036, 11849995, 12316675, 12830727, 13360256, 13879307]
37517A3879307M92084M56128M12820L58011K85463J91613P8460m6599j73245k91499
37507A5642543l94304m78405n43282n89301o16792o26748o22263o08778n92272
37498A0570398n75990n57922n31258m88284m25488l46206k59200j74744j01248
37489G110058m3550j903K8735N7676R4417J43194K00111K55195K97748L21216
37479H462897L25307L15671L02129K95431L02636L22777L45959L57447L45097
37470A1375351L05706K46541J81611J25536Q8657P5216Q3942J09828J46016J85149
37460A2923553K19505K40373K38189K04730J36711L8697p6637j91648k89560l60588
37450A3083325m04842m30166m46667m62054m79869m99632n17111n24894n14366
$$ y = [13879307, 14371391, 14827519, 15240339, 15598350, 15883813, 16075426, 16153886, 16107287, 15934042, 15642543, 15248239, 14769834, 14226552, 13637251, 13020459, 12393711, 11771448, 11162670, 10570398, 9994408, 9436486, 8905228, 8416944, 7991456, 7645250, 7386050, 7211306, 7110058, 7066508, 7064605, 7093340, 7151016, 7245433, 7388627, 7588738, 7843933, 8141681, 8462897, 8788204, 9103875, 9406004, 9701435, 10004071, 10326848, 10672807, 11030254, 11375351, 11681057, 11927598, 12109209, 12234745, 12323402, 12398618, 12482560, 12592388, 12738404, 12923553, 13143058, 13383431, 13621620, 13826350, 13963061, 14001758, 13925121, 13733473, 13443913, 13083325, 12678483, 12248317, 11801650, 11339596, 10859727, 10360095, 9842984, 9318090, 8803724]
37441H803724m78964m17022l32978k36699j41223n9651k247K5291K2399o159n0341
37430G126130r5904j27318j32004j04387m7866K6563J04610J73710K26008K58111
37420G407653K69062K59198K31050J90840J48122J12798R1254Q3966Q5498Q6376
37410H965817P6356M8554K665n4850j13708j63218j93854j97529j68978j08816
37400H092439k5920O3839J43042J99789K32156K47082K54453K60643K66025K67457
$$ y = [8803724, 8324760, 7907738, 7574760, 7338061, 7196838, 7137187, 7134940, 7160231, 7182630, 7176471, 7126130, 7030226, 6902908, 6770904, 6666517, 6618651, 6645214, 6749824, 6923534, 7149542, 7407653, 7676715, 7935913, 8166963, 8357803, 8505925, 8618723, 8709977, 8793943, 8879441, 8965817, 9042173, 9090727, 9093392, 9038542, 8924834, 8761616, 8567762, 8370233, 8201255, 8092439, 8066519, 8130358, 8273400, 8473189, 8705345, 8952427, 9206880, 9467523, 9733548, 10001005]
$$ [...]
##END NTUPLES=NMR SPECTRUM
##END=
