##TITLE=31Pdec_DE-28_oil/TFA
 CDCl3
  64 sc
 29.11.2023
##JCAMPDX= 6.0         $$ Bruker NMR JCAMP-DX V2.0
##DATA TYPE= NMR SPECTRUM
##DATA CLASS= NTUPLES
##ORIGIN= UXNMR, Bruker Analytische Messtechnik GmbH
##OWNER= root
$$ XWIN-NMR		Version 3.5
$$ Thu Nov 30 16:36:16 2023 Russian Standard Time (UT+4h)  she@DPX200
##.OBSERVE FREQUENCY= 81.013821
##.OBSERVE NUCLEUS= ^31P
##.ACQUISITION MODE= SIMULTANEOUS
##.ACQUISITION SCHEME= undefined
##.AVERAGES= 64
##.DIGITISER RES= 16
##SPECTROMETER/DATA SYSTEM= spect
##.PULSE SEQUENCE= zgpg30
##.SOLVENT NAME= CDCl3
##.SHIFT REFERENCE= (INTERNAL, CDCl3, 0, 248.564)
##AUDIT TRAIL= $$ (NUMBER, WHEN, WHO, WHERE, WHAT)
$$ ##TITLE= Audit trail, XWIN-NMR		Version 3.5
$$ ##JCAMPDX= 5.01
$$ ##ORIGIN= Bruker BioSpin GmbH
$$ ##OWNER= she
$$ F:/spectra/data/she/nmr/P31/1/pdata/1/auditp.txt
$$ ##AUDIT TRAIL=  $$ (NUMBER, WHEN, WHO, WHERE, WHAT)
(   1,<2023-11-30 16:35:20.31 +0400>,<she>,<DPX200>,
      <continue with go, POWCHK disabled, PULCHK disabled
       configuration hash MD5:
       00 E9 B6 7A A2 85 ED C7 34 08 36 98 17 FE 4E 26
       data hash MD5: 32K
       DE 0D 28 45 6A 37 65 73 38 7F 57 53 97 74 92 07>)
(   2,<2023-11-30 16:35:21.59 +0400>,<she>,<DPX200>,
      <Start of raw data processing
       efp BC_mod = 2 LB = 10 FT_mod = 6 PKNL = 1 PHC0 = -11668.02 PHC1 = -67.90641 SI = 64K 
       data hash MD5: 64K
       51 69 E1 20 94 0E E3 A0 15 7E D7 57 FA 20 54 50>)
(   3,<2023-11-30 16:35:33.92 +0400>,<she>,<DPX200>,
      <pk PHC0 = 4.380967 PHC1 = 0 
       data hash MD5: 64K
       CA 2D 55 F6 60 7B 1F A5 42 39 98 E4 14 8A 04 93>)
(   4,<2023-11-30 16:35:43.93 +0400>,<she>,<DPX200>,
      <abs ABSG = 5 
       data hash MD5: 64K
       F3 C8 72 23 D8 26 09 27 D2 B0 7A 38 58 7A A3 90>)
$$ ##END=
$$ 
$$ hash MD5
$$ 69 1A 57 4F 83 0D 42 D0 B4 1D 0F 29 4E 11 AB B9
##$RELAX= 
##$RELAX= 
##$RELAX= 
##$RELAX= 
##$RELAX= 
##$RELAX= 
##$RELAX= 
##$RELAX= 
##$RELAX= 
$$ Bruker specific parameters
$$ --------------------------
##$DU= <F:/spectra>
##$EXPNO= 1
##$NAME= <P31>
##$PROCNO= 1
##$TYPE= <nmr>
##$USER= <she>
##$AMP= (0..31)
100 100 100 100 100 100 100 100 100 100 100 100 100 100 100 100 100 100 
100 100 100 100 100 100 100 100 100 100 100 100 100 100 
##$AQSEQ= 0
##$AQ_mod= 1
##$AUNM= <au_zg>
##$AUTOPOS= <>
##$BF1= 81.014009
##$BF2= 200.13
##$BF3= 200.13
##$BF4= 200.13
##$BF5= 200.13
##$BF6= 200.13
##$BF7= 200.13
##$BF8= 200.13
##$BYTORDA= 1
##$CFDGTYP= 0
##$CFRGTYP= 5
##$CHEMSTR= <none>
##$CNST= (0..31)
1 1 145 1 1 1 1 1 1 1 1 1 1 1 1 1 1 1 1 1 1 1 1 1 1 1 1 1 1 1 1 1 
##$CPDPRG= <waltz16>
##$CPDPRG1= <>
##$CPDPRG2= <waltz16>
##$CPDPRG3= <>
##$CPDPRG4= <mlev>
##$CPDPRG5= <mlev>
##$CPDPRG6= <mlev>
##$CPDPRG7= <mlev>
##$CPDPRG8= <mlev>
##$CPDPRGB= <>
##$CPDPRGT= <>
##$D= (0..31)
0 1 0 0 0 0 0 0 0 0 0 0.03 2e-05 3e-06 0 0 0 0 0 0 0 0 0 0 0 0 0 0 0 0 
0 0 
##$DATE= 1701347634
##$DBL= (0..7)
120 120 120 11 120 120 24 19 
##$DBP= (0..7)
150 150 150 150 150 150 150 150 
##$DBP07= 0
##$DBPNAM0= <>
##$DBPNAM1= <>
$$ [...]
##$SUBNAM3= <"">
##$SUBNAM4= <"">
##$SUBNAM5= <"">
##$SUBNAM6= <"">
##$SUBNAM7= <"">
##$SUBNAM8= <"">
##$SUBNAM9= <"">
##$SW= 501.771253377433
##$SWIBOX= (0..15)
0 1 3 0 0 0 0 0 0 0 0 0 0 0 0 0 
##$SW_h= 40650.406504065
##$TD= 32768
##$TD0= 1
##$TE= 0
##$TE2= 300
##$TE3= 300
##$TEG= 300
##$TL= (0..7)
0 120 53 12 22 120 120 120 
##$TP= (0..7)
150 150 150 150 150 150 150 150 
##$TP07= 0
##$TPNAME0= <>
##$TPNAME1= <>
##$TPNAME2= <>
##$TPNAME3= <>
##$TPNAME4= <>
##$TPNAME5= <>
##$TPNAME6= <>
##$TPNAME7= <>
##$TPOAL= (0..7)
0.5 0.5 0.5 0.5 0.5 0.5 0.5 0.5 
##$TPOFFS= (0..7)
0 0 0 0 0 0 0 0 
##$TUNHIN= 0
##$TUNHOUT= 0
##$TUNXOUT= 0
##$USERA1= <user>
##$USERA2= <user>
##$USERA3= <user>
##$USERA4= <user>
##$USERA5= <user>
##$V9= 5
##$VALIST= <valist>
##$VCLIST= <CCCCCCCCCCCCCCC>
##$VD= 0
##$VDLIST= <DDDDDDDDDDDDDDD>
##$VPLIST= <PPPPPPPPPPPPPPP>
##$VTLIST= <TTTTTTTTTTTTTTT>
##$WBST= 1024
##$WBSW= 4
##$XGAIN= (0..3)
0 0 0 0 
##$XL= 0
##$YL= 0
##$YMAX_a= 7916
##$YMIN_a= -2560
##$ZGOPTNS= <>
##$ZL1= 120
##$ZL2= 120
##$ZL3= 120
##$ZL4= 120
##$ABSF1= 248.5645
##$ABSF2= -253.2056
##$ABSG= 5
##$ABSL= 3
##$ALPHA= 0
##$AQORDER= 0
##$ASSFAC= 0
##$ASSFACI= 0
##$ASSFACX= 0
##$ASSWID= 0
##$AUNMP= <proc_1d>
##$AZFE= 0.1
##$AZFW= 0.5
##$BCFW= 0
##$BC_mod= 2
##$BYTORDP= 0
##$COROFFS= 0
##$CY= -3
##$DATMOD= 1
##$DC= 0
##$DFILT= <>
##$DTYPP= 0
##$F1P= 0
##$F2P= 0
##$FCOR= 1
##$FTSIZE= 65536
##$FT_mod= 6
##$GAMMA= 0
##$GB= 0
##$INTBC= 1
##$INTSCL= 6.047779e-11
##$ISEN= 30
##$LB= 10
##$LEV0= 0
##$LPBIN= 0
##$MAXI= 10000
##$MC2= 0
##$MEAN= 0
##$ME_mod= 0
##$MI= 50
##$NCOEF= 0
##$NC_proc= -10
##$NLEV= 6
##$NOISF1= 182.463
##$NOISF2= 159.3651
##$NSP= 0
##$NTH_PI= 0
##$NZP= 0
##$OFFSET= 248.5645
##$PC= 4
##$PHC0= -11663.64
##$PHC1= -67.90641
##$PH_mod= 1
##$PKNL= yes
##$PPARMOD= 0
##$PSCAL= 0
##$PSIGN= 0
##$REVERSE= no
##$SF= 81.0140089999694
##$SI= 65536
##$SIGF1= 159.3651
##$SIGF2= -187.1042
##$SINO= 113.3802
##$SIOLD= 16384
##$SREGLST= <1H.CDCl3>
##$SSB= 0
##$STSI= 65536
##$STSR= 0
##$SW_p= 40650.406504065
##$SYMM= 0
##$S_DEV= 0
##$TDeff= 32768
##$TDoff= 0
##$TI= <>
##$TILT= no
##$TM1= 0
##$TM2= 0
##$TOPLEV= 0
##$USERP1= <user>
##$USERP2= <user>
##$USERP3= <user>
##$USERP4= <user>
##$USERP5= <user>
##$WDW= 1
##$XDIM= 65536
##$YMAX_p= 315200532
##$YMIN_p= -252121719
$$ End of Bruker specific parameters
$$ ---------------------------------
##NTUPLES= NMR SPECTRUM
##VAR_NAME=  FREQUENCY,     SPECTRUM/REAL,   SPECTRUM/IMAG
##SYMBOL=    X,             R,               I
##VAR_TYPE=  INDEPENDENT,   DEPENDENT,       DEPENDENT
##VAR_FORM=  AFFN,          ASDF,            ASDF
##VAR_DIM=   65536,         65536,           65536
##UNITS=     HZ,            ARBITRARY UNITS, ARBITRARY UNITS
##FACTOR=    0.620285442955139, 1,           1
##FIRST=     20137.2065510682, 0,            0
##LAST=      -20513.1999529968, 0,           0
##MIN=       -20513.1999529968, -252121719,  0
##MAX=       20137.2065510682, 315200532,    0
$$ Real data points
##PAGE= N=1
##DATA TABLE= (X++(R..R)), XYDATA
$$ [...]
$$ plain form
42949 -12232845 -11579085 -10795366 -9963176 -9180255 -8543351 -8136798 -8028421 -8266037 -8866731
42940 -8866731 -9799666 -10974034 -12246260 -13450312 -14439047 -15116520 -15448407 -15452894 -15183756
42931 -15183756 -14714732 -14126709 -13495885 -12883408 -12329974 -11858377 -11483150 -11221424 -11096399
42922 -11096399 -11128589 -11319331 -11638352 -12024440 -12398249 -12679402 -12802246 -12729580 -12462854 -12042634
42912 -12042634 -11533511 -10997116 -10467195 -9941750 -9396356 -8808348 -8174280 -7508897 -6828564
42903 -6828564 -6134422 -5410283 -4637733 -3816795 -2976368 -2166720 -1439599 -829784 -349794
42894 -349794 1310 224795 316589 272654 98723 -184961 -546788 -949505 -1351844 -1706070
42884 -1706070 -1959157 -2065330 -2007478 -1812990 -1548197 -1289248 -1085007 -934065 -787750 -573670
$$ packed form
42949a2232845O53760P83719Q32190P82921O36904M06553J08377k37616o00694
42940h866731r32935j174368j272226j204052r88735o77473l31887m487K69138
42931a5183756M69024N88023O30824O12477N53434M71597L75227K61726J25025
42922a1096399l2190j90742l19021l86088l73809k81153j22844P2666K66726M20220
42912a2042634N09123N36395N29921N25445N45394N88008O34068O65383O80333
42903f828564O94142P24139P72550Q20938Q40427Q09648P27121O09815M79990
42894c49794L51104K23485R1794m3935j73931k83684l61827m02717m02339l54226
42884a706070k53087j06173N7852J94488K64793K58949K04241J50942J46315K14080
$$ plain form
42874 -573670 -223895 306224 1033020 1949071 3030062 4238174 5519945 6801159 7985847
42865 7985847 8967027 9649997 9978945 9953608 9629173 9101780 8485495 7885708 7375170 6981243
42855 6981243 6689032 6455874 6228010 5954802 5601032 5156202 4635618 4070604 3493217
42846 3493217 2925448 2379426 1867343 1413324 1057671 848539 825103 1001874 1360847 1851337
42836 1851337 2395644 2901761 3283635 3482161 3475830 3276406 2916396 2438922 1894094 1337963
42826 1337963 829000 421445 158330 66367 152363 399780 764712 1172134 1515496 1665393
42816 1665393 1492962 906151 -115490 -1508406 -3146162 -4883640 -6598435 -8208146
42808 -8208146 -9662173 -10924177 -11963578 -12763094 -13335283 -13733088 -14041481 -14348391 -14707279
$$ packed form
42874e73670L49775N30119P26796R16051J080991J208112J281771J281214J184688
42865G985847R81180O82970L28948k5337l24435n27393o16285n99787n10538l93927
42855F981243k92211k33158k27864k73208l53770m44830n20584n65014n77387
42846C493217n67769n46022n12083m54019l55653k09132k3436J76771L58973M90490
42836A851337N44307N06117L81874J98526o331j99424l60010m77474n44828n56131
42826A337963n08963m07555k63115r1963Q5996K47417L64932M07422L43362J49897
42816A665393j72431n86811j021641j392916j637756j737478j714795j609711
42808h208146j454027j262004j039401p99516n72189l97805l08393l06910l58888
$$ plain form
42799 -14707279 -15111227 -15492571 -15746847 -15767207 -15473912 -14830226 -13843639 -12556636 -11034280
42790 -11034280 -9355178 -7606565 -5878044 -4250042 -2781247 -1504171 -432821 423170
42782 423170 1047580 1416338 1507056 1315338 868621 226901 -532967 -1339378 -2137721 -2883227
42772 -2883227 -3523181 -3986435 -4192028 -4072984 -3600188 -2792725 -1711161 -438803 941262
42763 941262 2365599 3798720 5226031 6635506 7999628 9268274 10375004 11252121
42755 11252121 11848203 12142376 12149679 11914111 11492260 10936166 10283513 9556917 8768546 7925354
42745 7925354 7032596 6095420 5119602 4113701 3095257 2100660 1192137 451924 -40207
42736 -40207 -236876 -143349 182726 648876 1151051 1593891 1905559 2046271 2008296 1806854
$$ packed form
42799a4707279m03948l81344k54276k0360K93295O43686R86587J287003J522356
42790a1034280J679102J748613J728521J628002J468795J277076J071350Q55991
42782D23170O24410L68758R0718j91718m46717o41720p59868q06411p98343p45506
42772b883227o39954m63254k05593J19044M72796Q07463J081564J272358J380065
42763I41262J424337J433121J427311J409475J364122J268646J106730Q77117
42755A1252121N96082K94173P303k35568m21851n56094o52653p26596p88371q43192
42745G925354q92758r37176r75818j005901j018444r94597r08523p40213m92131
42736d0207j96669R3527L26075M66150N02175M42840L11668J40712l7975k01442
$$ plain form
42726 1806854 1466021 1006598 441177 -222423 -971984 -1781157 -2605242 -3387086 -4073554
42717 -4073554 -4637213 -5092488 -5494561 -5915891 -6407870 -6966177 -7518687 -7943392 -8107938
42708 -8107938 -7912904 -7322181 -6371942 -5157938 -3805942 -2434495 -1123197 99762 1245086
42699 1245086 2332927 3364901 4314386 5138766 5801926 6289760 6609681 6779454 6816836
42690 6816836 6735204 6541057 6229098 5778131 5154782 4326921 3281137 2036504 649351
42681 649351 -793153 -2189751 -3447236 -4499921 -5319369 -5911850 -6306346 -6539479 -6643984
42672 -6643984 -6643637 -6552967 -6379358 -6128034 -5810526 -5452055 -5089636 -4758344 -4473955 -4224963
42662 -4224963 -3980286 -3707639 -3390944 -3036801 -2667304 -2304430 -1955013 -1603659 -1215792
$$ packed form
42726A806854l40833m59423n65421o63600p49561q09173q24085p81844o86468
42717d073554n63659m55275m02073m21330m91979n58307n52510m24705j64546
42708h107938J95034N90723R50239J214004J351996J371447J311298J222959J145324
42699A245086J087841J031974R49485Q24380O63160M87834L19921J69773L7382
42690F816836q1632j94147l11959m50967o23349q27861j045784j244633j387153
42681F49351j442504j396598j257485j052685q19448n92481l94496k33133j04505
42672f643984L47R0670J73609K51324L17508L58471L62419L31292K84389K48992
42662d224963K44677K72647L16695L54143L69497L62874L49417L51354L87867
$$ plain form
42653 -1215792 -748511 -165079 551399 1389400 2309086 3252532 4160916 4990165 5715496
42644 5715496 6322142 6790579 7089084 7179484 7030560 6629162 5983839 5121951 4082938
42635 4082938 2909339 1637938 295327 -1098718 -2522183 -3943849 -5325628 -6633556
42627 -6633556 -7848238 -8964606 -9979181 -10873153 -11603836 -12112655 -12347982 -12291386 -11972776
42618 -11972776 -11466622 -10873032 -10294234 -9815250 -9492372 -9350429 -9387930 -9586418 -9919277
42609 -9919277 -10358136 -10877579 -11456912 -12076118 -12707222 -13307911 -13822766 -14190630 -14353739
42600 -14353739 -14267052 -13907091 -13276558 -12401629 -11325945 -10109135 -8831034 -7592785 -6505361
42591 -6505361 -5665308 -5126671 -4881070 -4855480 -4931470 -4980114 -4897595 -4625517 -4150312 -3490109
$$ packed form
42653a215792M67281N83432P16478Q38001R19686R43446R08384Q29249P25331
42644E715496O06646M68437K98505R0400j48924m01398o45323q61888j039013
42635D082938j173599j271401j342611j394045j423465j421666j381779j307928
42627f633556j214682j116368j014575q93972p30683n08819k35327N6596L18610
42618a1972776N06154N93590N78798M78984L22878J41943l7501j98488l32859
42609i919277m38859n19443n79333o19206o31104o00689n14855l67864j63109
42600a4353739Q6687L59961O30533Q74929J075684J216810J278101J238249J087424
42591f505361Q40053N38637K45601K5590p5990m8644Q2519K72078M75205O60203
$$ plain form
42581 -3490109 -2683041 -1783954 -864625 -7561 710790 1241721 1580288 1767534 1876894
42572 1876894 1989539 2169173 2447739 2826750 3288426 3806556 4351506 4890684 5387272
42563 5387272 5798327 6073194 6154922 5986604 5521372 4732631 3622327 2227352 624538
42554 624538 -1067660 -2696039 -4093298 -5111249 -5655404 -5704985 -5308866 -4561579 -3573919
42545 -3573919 -2452545 -1293601 -184410 796791 1588250 2155693 2499446 2652295 2666820
42536 2666820 2594032 2459571 2248546 1909067 1374874 596659 -430901 -1655021 -2967401
42527 -2967401 -4224239 -5279397 -6020509 -6396200 -6426778 -6195943 -5825083 -5436695 -5119235
42518 -5119235 -4907000 -4781983 -4694325 -4590375 -4435346 -4221228 -3959064 -3663931 -3343710 -2996468
$$ packed form
42581c490109Q07068Q99087R19329Q57064P18351N30931L38567J87246J09360
42572A876894J12645J79634K78566L79011M61676N18130N44950N39178M96588
42563E387272M11055K74867Q1728j68318m65232p88741j110304j394975j602814
42554F24538j692198j628379j397259j017951n44155m9581L96119P47287R87660
42545c573919J121374J158944J109191R81201P91459N67443L43753J52849J4525
42536B666820p2788j34461k11025l39479n34193p78215j027560j224120j312380
42527b967401j256838j055158p41112l75691l0578K30835L70860L88388L17460
42518e119235K12235J25017Q7658J03950J55029K14118K62164K95133L20221L47242
$$ plain form
42508 -2996468 -2612343 -2173047 -1646980 -984581 -120610 1013623 2471352 4272475 6393250
42499 6393250 8764475 11274233 13772350 16079222 18004948 19381271 20099744 20141678 19585164
42490 19585164 18583650 17324378 15984385 14700242 13557263 12593274 11809095 11181767
42482 11181767 10679782 10277116 9959203 9716917 9534051 9379977 9214270 8999148 8710003
42473 8710003 8338673 7891011 7382211 6831298 6255421 5666152 5069620 4468899 3864841
42464 3864841 3254301 2629899 1986347 1332493 700844 145224 -275237 -517897 -572452 -463841
42454 -463841 -243526 23728 270388 431207 445445 261668 -151931 -795406 -1632270 -2599318
42444 -2599318 -3628444 -4668269 -5693536 -6700389 -7695097 -8683610 -9663616 -10619327 -11522877
$$ packed form
42508b996468L84125M39296N26067O62399Q63971J134233J457729J801123K120775
42499F393250K371225K509758K498117K306872J925726J376323P18473M1934n56514
42490A9585164j001514j259272j339993j284143j142979r63989p84179o27328
42482A1181767n01985m02666l17913k42286j82866j54074j65707k15122k89145
42473H710003l71330m47662n08800n50913n75877n89269n96532o00721o04058
42464C864841o10540o24402o43552o53854o31649n55620m20461k42660n4555J08611
42454d63841K20315K67254K46660J60819J4238j83777m13599o43475q36864r67048
42444b599318j029126j039825j025267j006853r94708r88513r80006r55711r03550
$$ plain form
42435 -11522877 -12345053 -13069046 -13695032 -14230741 -14676296 -15015025 -15213958 -15230797 -15025998
42426 -15025998 -14581051 -13918120 -13108101 -12256486 -11471246 -10830796 -10369714 -10085448 -9953835
42417 -9953835 -9938134 -9986931 -10029421 -9979574 -9752600 -9287474 -8565934 -7619803 -6521378 -5357442
42407 -5357442 -4197666 -3075437 -1993575 -950120 35017 910320 1603040 2039129 2159677
42398 2159677 1927892 1328621 365353 -941426 -2552907 -4408738 -6426295 -8507451 -10553070
42389 -10553070 -12478118 -14218931 -15731172 -16984885 -17963152 -18664575 -19105566 -19319787 -19354808
42380 -19354808 -19266222 -19109217 -18929162 -18754420 -18593429 -18435525 -18254596 -18016278 -17688979
42371 -17688979 -17255576 -16720137 -16106375 -15450157 -14791350 -14168197 -13613744 -13153534 -12805941
$$ packed form
42435a1522877q22176p23993o25986n35709m45555l38729j98933j6839K04799
42426a5025998M44947O62931Q10019Q51615P85240O40450M61082K84266J31613
42417i953835J5701m8797m2490M9847K26974M65126P21540R46131J098425J163936
42407e357442J159776J122229J081862J043455R85137Q75303O92720M36089J20548
42398B159677k31785n99271r63268j306779j611481j855831k017557k081156k045619
42389a0553070j925048j740813j512241j253713r78267p01423m40991k14221l5021
42380a9354808Q8586J57005J80055J74742J60991J57904J80929K38318L27299
42371a7688979M33403N35439O13762O56218O58807O23153N54453M60210L47593
$$ plain form
42362 -12805941 -12586055 -12509706 -12591659 -12836707 -13230635 -13740073 -14322648 -14939768 -15564266 -16182792
42352 -16182792 -16797544 -17427476 -18102764 -18848730 -19665987 -20519948 -21347017 -22073222 -22635290
42343 -22635290 -22996717 -23154999 -23137284 -22984015 -22727009 -22374262 -21911202 -21317335 -20586725
42334 -20586725 -19738932 -18814804 -17862792 -16927071 -16043842 -15242048 -14539987 -13935408 -13396550
42325 -13396550 -12865206 -12276893 -11592239 -10824234 -10043660 -9354898 -8852950 -8586359 -8545533
42316 -8545533 -8675816 -8898797 -9127493 -9275100 -9266131 -9054825 -8644791 -8096937 -7516305 -7020232
42306 -7020232 -6701522 -6602366 -6707134 -6952156 -7245135 -7486304 -7585702 -7475059 -7116833 -6512066
42296 -6512066 -5702216 -4756565 -3743938 -2700966 -1615353 -434894 901474 2425149
$$ packed form
42362a2805941K19886P6349q1953k45048l93928n09438n82575o17120o24498o18526
42352a6182792o14752o29932o75288p45966q17257q53961q27069p26205n62068
42343b2635290l61427j58282J7715J53269K57006L52747M63060N93867P30610
42334b0586725Q47793R24128R52012R35721Q83229Q01794P02061O04579N38858
42325a3396550N31344N88313O84654P68005P80574O88762N01948K66591M0826
42316h545533j30283k22981k28696j47607Q969K11306M10034N47854N80632M96073
42306g020232L18710R9156j04768k45022k92979k41169r9398J10643L58226O04767
42296f512066Q09850R45651J012627J042972J085613J180459J336368J523675
$$ plain form
42288 2425149 4109737 5867459 7573862 9110261 10403873 11448335 12299490 13052627
42280 13052627 13810975 14654210 15614843 16669469 17747325 18751446 19583629 20166693 20461990
42271 20461990 20480444 20281675 19955835 19591236 19242123 18913738 18571765 18168344 17668531
42262 17668531 17064132 16371712 15620624 14840223 14052477 13270636 12500806 11744001 10999074
42253 10999074 10267934 9562138 8906677 8336614 7886254 7576321 7407230 7362946 7422087 7567671
42243 7567671 7789242 8078475 8424263 8811449 9222383 9638337 10039465 10404542 10712257
42234 10712257 10944846 11092882 11158172 11151800 11087976 10978520 10832749 10661734 10481136 10308381
42224 10308381 10156186 10028003 9918612 9818872 9722022 9629467 9553881 9516899 9540570 9636371
$$ packed form
42288B425149J684588J757722J706403J536399J293612J044462Q51155P53137
42280A3052627P58348Q43235R60633J054626J077856J004121Q32183N83064K95297
42271B0461990J8454j98769l25840l64599l49113l28385l41973m03421m99813
42262A7668531o04399o92420p51088p80401p87746p81841p69830p56805p44927
42253A0999074p31140p05796o55461n70063m50360l09933j69091m4284N9141J45584
42243G567671K21571K89233L45788L87186M10934M15954M01128L65077L07715
42234A0712257K32589J48036O5290o372o3824j09456j45771j71015j80598j72755
42224A0308381j52195j28183j09391r9740r6850r2555p5586l6982K3671R5801
$$ plain form
42214 9636371 9798553 10005720 10228032 10434163 10595508 10689995 10706900 10648124 10519542 10313514
42204 10313514 9993632 9493719 8733493 7642926 6185208 4372325 2270491 -7250
42196 -7250 -2322541 -4542750 -6569884 -8354617 -9890138 -11191969 -12276241 -13146481 -13791246
42187 -13791246 -14189639 -14320606 -14172381 -13748631 -13069613 -12170433 -11099935 -9920683 -8706268
42178 -8706268 -7532184 -6460783 -5525223 -4719605 -4001932 -3311710 -2595220 -1825368 -1006231
42169 -1006231 -163299 671103 1467723 2201303 2843721 3355066 3681592 3767033 3574166 3104012
42159 3104012 2399964 1533948 582278 -397176 -1377528 -2361231 -3365997 -4405444 -5474446
42150 -5474446 -6546528 -7582919 -8545617 -9406027 -10146931 -10761690 -11253940 -11635285 -11916883
$$ packed form
42214I636371J62182K07167K22312K06131J61345R4487J6905n8776j28582k06028
42204A0313514l19882m99913p60226j090567j457718j812883k101834k277741
42196g250k315291k220209k027134j784733j535521j301831j084272q70240o44765
42187a3791246l98393j30967J48225M23750O79018Q99180J070498J179252J214415
42178h706268J174084J071401R35560Q05618P17673O90222P16490P69852Q19137
42169a006231Q42932Q34402P96620P33580O42418N11345L26526Q5441j92867m70154
42159C104012p04048q66016r51670r79454r80352r83703j004766j039447j069002
42150e474446j072082j036391r62698q60410p40904o14759m92250l81345k81598
$$ plain form
42141 -11916883 -12097349 -12156479 -12062018 -11785994 -11319375 -10676201 -9887152 -8988573 -8012948 -6983585
42131 -6983585 -5913675 -4808461 -3668517 -2492039 -1275610 -15591 1286913 2618107
42123 2618107 3946757 5229843 6428730 7526401 8533812 9480473 10394414 11281712 12114180
42114 12114180 12829194 13341199 13561399 13420560 12889168 11989368 10794973 9419632 7997085
42105 7997085 6658621 5511977 4625736 4023797 3692179 3594275 3685627 3919929 4244335
42096 4244335 4589621 4865161 4966805 4797243 4288955 3417821 2203003 697451 -1024685
42087 -1024685 -2880436 -4788270 -6673361 -8466622 -10100203 -11504450 -12610095 -13357694
42079 -13357694 -13713707 -13687010 -13334926 -12752229 -12048661 -11327507 -10672016 -10137015 -9742647
$$ packed form
42141a1916883j80466n9130R4461K76024M66619O43174P89049Q98579R75625J029363
42131f983585J069910J105214J139944J176478J216429J260019J302504J331194
42123B618107J328650J283086J198887J097671J007411R46661R13941Q87298Q32468
42114A2114180P15014N12005K20200j40839n31392q99800j194395j375341j422547
42105G997085j338464j146644q86241o01939l31618r7904R1352K34302L24406
42096D244335L45286K75540J01644j69562n08288q71134j214818j505552j722136
42087a024685j855751j907834j885091j793261j633581j404247j105645p47599
42079a3357694l56013K6697L52084N82697P03568P21154O55491N35001L94368
$$ plain form
42070 -9742647 -9474180 -9293481 -9159864 -9049758 -8965454 -8931153 -8981325 -9147664 -9448349 -9880645
42060 -9880645 -10417665 -11011231 -11602172 -12135309 -12572788 -12900948 -13131275 -13298149 -13453014
42051 -13453014 -13652225 -13939841 -14332809 -14816412 -15350939 -15883662 -16359237 -16725664 -16937214
42042 -16937214 -16957298 -16763381 -16353097 -15747976 -14991567 -14143283 -13273411 -12462695 -11802720
42033 -11802720 -11388840 -11301290 -11579612 -12202573 -13085501 -14100265 -15112575 -16021248 -16781113
42024 -16781113 -17399641 -17912056 -18349540 -18714219 -18968239 -19038991 -18838417 -18288735 -17343399
42015 -17343399 -15995853 -14277386 -12250337 -10001076 -7633628 -5264077 -3015610 -1012067
42007 -1012067 632845 1829940 2527540 2718147 2437592 1758145 777742 -391645 -1632906
$$ packed form
42070i742647K68467J80699J33617J10106Q4304L4301n0172j66339l00685m32296
42060i880645n37020n93566n90941n33137m37479l28160k30327j66874j54865
42051a3453014j99211k87616l92968m83603n34527n32723m75575l66427k11550
42042a6937214k0084J93917M10284O05121P56409Q48284Q69872Q10716O59975
42033a1802720M13880Q7550k78322o22961q82928j014764j012310r08673p59865
42024a6781113o18528n12415m37484l64679k54020p0752K00574N49682R45336
42015a7343399J347546J718467K027049K249261K367448K369551K248467K003543
42007a012067J644912J197095O97600J90607k80555o79447r80403j169387j241261
$$ plain form
41998 -1632906 -2829197 -3869918 -4662102 -5146178 -5308552 -5183678 -4844634 -4386988 -3911230
41989 -3911230 -3506735 -3238931 -3142021 -3219034 -3448004 -3790413 -4198838 -4624497 -5026769 -5383079
41979 -5383079 -5692700 -5969380 -6226071 -6461847 -6658321 -6783447 -6796176 -6651245 -6310298 -5761967
41969 -5761967 -5041306 -4233104 -3453379 -2819374 -2423874 -2320396 -2514643 -2957156 -3540567
41960 -3540567 -4110120 -4491241 -4527512 -4115423 -3223649 -1892303 -216525 1676373 3648036
41951 3648036 5565346 7313577 8808784 10008721 10917869 11581994 12072315 12465349 12826940
41942 12826940 13205494 13632994 14127939 14694831 15319399 15964281 16571894 17077353 17426282
41933 17426282 17587734 17556069 17344472 16977222 16483794 15891961 15218089 14459837 13599249
$$ packed form
41998a632906j196291j040721p92184m84076j62374J24874L39044M57646M75758
41989c911230M04495K67804R6910p7013k28970l42409m08425m25659m02272l56310
41979e383079l09621k76680k56691k35776j96474j25126j2729J44931L40947N48331
41969e761967P20661Q08202P79725O34005L95500J03478j94247m42513n83411
41960c540567n69553l81121l6271M12089Q91774J331346J675778J892898J971663
41951C648036J917310J748231J495207J199937R09148O64125M90321L93034L61591
41942A2826940L78554M27500M94945N66892O24568O44882O07613N05459L48929
41933A7426282J61452l1665k11597l67250m93428n91833o73872p58252q60588
$$ plain form
41924 13599249 12617166 11509755 10296203 9014971 7714733 6446632 5258988 4192069
41916 4192069 3272352 2508623 1892017 1399455 998101 649248 312095 -50704 -465112
41907 -465112 -938357 -1457610 -1997321 -2530946 -3038729 -3506797 -3921044 -4263473 -4515503 -4666159
41897 -4666159 -4719693 -4698717 -4642007 -4597121 -4607091 -4691252 -4825138 -4930699 -4888588 -4574671 -3907313
41886 -3907313 -2882076 -1575378 -116266 1357131 2735294 3957054 5010982 5923030
41878 5923030 6734993 7480630 8170087 8790277 9317410 9729503 10010784 10151007 10146077 9999865
41868 9999865 9721736 9318758 8789654 8127914 7332454 6415791 5401419 4313035 3167841
41859 3167841 1983558 795411 -331909 -1309740 -2047654 -2481255 -2593728 -2423237 -2052197
$$ packed form
41924A3599249r82083j107411j213552j281232j300238j268101j187644j066919
41916D192069r19717p63729o16606m92562m01354l48853l37153l62799m14408
41907d65112m73245n19253n39711n33625n07783m68068m14247l42429k52030j50656
41897d666159n3534K0976N6710M4886r970q4161j33886j05561M2111L13917O67358
41886c907313J025237J306698J459112J473397J378163J221760J053928R12048
41878E923030Q11963P45637O89457O20190N27133M12093K81281J40223m930j46212
41868I999865k78129m02978n29104o61740p95460r16663j014372j088384j145194
41859C167841j184283j188147j127320r77831p37914m33601j12473J70491L71040
$$ plain form
41850 -2052197 -1580377 -1092489 -634582 -206707 231029 744373 1403855 2258589 3314422
41841 3314422 4529111 5827582 7126554 8353849 9455468 10392892 11136551 11660030 11937729
41832 11937729 11946930 11673009 11114774 10286729 9216504 7937630 6480369 4865858 3109130
41823 3109130 1232642 -715047 -2645836 -4433154 -5930077 -6999647 -7548274 -7552132 -7067001
41814 -7067001 -6215511 -5154230 -4033480 -2967073 -2022413 -1228313 -588769 -92004 287919
41805 287919 591748 870583 1173149 1529023 1937094 2367076 2774444 3120793 3388286 3580472
41795 3580472 3710092 3782845 3788987 3709367 3531841 3265839 2944385 2612867 2313943 2079897
41785 2079897 1936696 1914081 2050850 2387404 2946420 3711549 4617119 5557093 6411799 7081938
$$ packed form
41850b052197M71820M87888M57907M27875M37736N13344O59482Q54734J055833
41841C314422J214689J298471J298972J227295J101619R37424P43659N23479K77699
41832A1937729R201k73921n58235q28045j070225j278874j457261j614511j756728
41823C109130j876488j947689j930789j787318j496923j069570n48627l858M85131
41814g067001Q51490J061281J120750J066407R44660P94100O39544M96765L79923
41805B87919L03829K78835L02566L55874M08071M29982M07368L46349K67493J92186
41795C580472J29620P2753O142p9620j77526k66002l21454l31518k98924k34046
41785B079897j43201k2615J36769L36554N59016P65129R05570R39974Q54706O70139
$$ plain form
41775 7081938 7515906 7719609 7745763 7667976 7550507 7425312 7284221 7087100 6779530 6310263
41765 6310263 5642259 4758436 3666582 2403295 1030598 -379022 -1763152 -3082524
41757 -3082524 -4318896 -5462086 -6496608 -7394788 -8117656 -8623756 -8885541 -8907455 -8733801
41748 -8733801 -8437695 -8095189 -7759051 -7444692 -7130582 -6768631 -6300466 -5677059 -4877155
41739 -4877155 -3917743 -2852710 -1761844 -735687 139414 793972 1184633 1299305 1157725
41730 1157725 806749 309476 -270423 -883650 -1502507 -2117350 -2725498 -3319082 -3877467
41721 -3877467 -4367281 -4750687 -4999866 -5112493 -5121029 -5089944 -5100321 -5228071 -5525857 -6015845
41711 -6015845 -6693116 -7534255 -8506152 -9572618 -10697015 -11838786 -12945383 -13946672 -14759354
$$ packed form
41775G081938M33968K03703K6154p7787j17469j25195j41091j97121l07570m69267
41765F310263o68004q83823j091854j263287j372697j409620j384130j319372
41757c082524j236372j143190j034522q98180p22868n06100k61785k1914J73654
41748h733801K96106L42506L36138L14359L14110L61951M68165O23407P99904
41739d877155R59412J065033J090866J026157Q75101O54558L90661J14672j41580
41730A157725l50976m97273n79899o13227o18857o14843o08148n93584n58385
41721c877467m89814l83406k49179j12627q536L1085j0377j27750k97786m89988
41711f015845o77271q41139r71897j066466j124397j141771j106597j001289q12682
$$ plain form
41702 -14759354 -15301863 -15512053 -15359270 -14848761 -14022425 -12959058 -11771169 -10591353 -9545668
41693 -9545668 -8722316 -8150830 -7801795 -7604467 -7471999 -7326658 -7122146 -6857797 -6575188
41684 -6575188 -6332996 -6171621 -6089413 -6044970 -5980517 -5848154 -5624255 -5310246 -4926975 -4508859
41674 -4508859 -4098191 -3736974 -3455242 -3258278 -3117316 -2968759 -2724881 -2294517 -1606978
41665 -1606978 -630782 617563 2074243 3635886 5173693 6553556 7658659 8408251
41657 8408251 8768112 8752759 8421157 7866003 7196535 6518623 5918818 5455702 5155502 5007947
41647 5007947 4964394 4944886 4856951 4620263 4187266 3553129 2753378 1850033 909299 -21568
41637 -21568 -927749 -1823754 -2735872 -3679805 -4644299 -5587541 -6447453 -7161933 -7691409 -8034790
$$ packed form
41702a4759354n42509k10190J52783N10509Q26336J063367J187889J179816J045685
41693i545668Q23352N71486L49035J97328J32468J45341K04512K64349K82609
41684f575188K42192J61375Q2208M4443O4453J32363K23899L14009L83271M18116
41674d508859M10668L61217K81732J96964J40962J48557K43878M30364O87539
41665a606978R76196J248345J456680J561643J537807J379863J105103P49592
41657H408251L59861j5353l31602n55154o69468o77912n99805m63116l00200j47555
41647E007947m3553j9508q7935k36688m32997o34137p99751r03345r40734r30867
41637b1568r06181q96005r12118r43933r64494r43242q59912p14480n29476l43381
$$ plain form
41627 -8034790 -8231978 -8351282 -8466082 -8629477 -8856366 -9119149 -9357502 -9496853 -9467111 -9215270
41617 -9215270 -8711284 -7951177 -6959949 -5791481 -4520389 -3225851 -1974136 -807530 258078
41608 258078 1229738 2130713 2990403 3830476 4650067 5416413 6067623 6529839 6743685 6688905
41598 6688905 6396097 5940652 5422645 4941786 4576963 4376098 4356719 4513303 4825966 5266303
41588 5266303 5798650 6377469 6943623 7423021 7729671 7773082 7469337 6755413 5604514
41579 5604514 4036415 2116589 -56434 -2369366 -4711127 -6985547 -9119454 -11065238
41571 -11065238 -12797391 -14305652 -15588969 -16652010 -17502855 -18151519 -18611432 -18904938 -19069214
41562 -19069214 -19156523 -19225250 -19323266 -19469801 -19644669 -19792615 -19843962 -19742957 -19469304 -19041977
$$ packed form
41627h034790j97188j19304j14800j63395k26889k62783k38353j39351K9742K51841
41617i215270N03986P60107R91228J168468J271092J294538J251715J166606J065608
41608B58078R71660R00975Q59690Q40073Q19591P66346O51210M62216K13846n4780
41598F688905k92808m55445n18007m80859l64823k00865j9379J56584L12663M40337
41588E266303N32347N78819N66154M79398L06650M3411l03745p13924j150899
41579E604514j568099j919826k173023k312932k341761k274420k133907j945784
41571a1065238j732153j508261j283317j063041q50845o48664m59913k93506j64276
41562a9069214q7309o8727r8016j46535j74868j47946n1347J01005K73653M27327
$$ plain form
41552 -19041977 -18504858 -17903569 -17266159 -16596589 -15882322 -15110318 -14282878 -13426273 -12588781
41543 -12588781 -11828693 -11197331 -10725375 -10418944 -10264273 -10233687 -10287980 -10378386 -10454118 -10475178
41533 -10475178 -10423068 -10303661 -10143947 -9987933 -9893352 -9926694 -10154786 -10634217 -11400645 -12459164
41523 -12459164 -13777936 -15289685 -16904714 -18532903 -20105428 -21585444 -22962922 -24238170
41515 -24238170 -25405500 -26448202 -27347981 -28100982 -28726604 -29260105 -29732388 -30150393 -30490909
41506 -30490909 -30710699 -30765374 -30626339 -30289378 -29774628 -29120724 -28375403 -27583862 -26777845
41497 -26777845 -25971129 -25166261 -24370127 -23607479 -22920861 -22355177 -21937191 -21663700 -21504517
41488 -21504517 -21415455 -21350992 -21269857 -21135609 -20920116 -20614263 -20239603 -19848421 -19506641 -19268380
$$ packed form
41552a9041977N37119O01289O37410O69570P14267P72004Q27440Q56605Q37492
41543a2588781P60088O31362M71956L06431J54671L0586n4293r0406p5732k1060
41533a0475178N2110J19407J59714J56014R4581l3342k28092m79431p66428j058519
41523a2459164j318772j511749j615029j628189j572525j480016j377478j275248
41515b4238170j167330j042702q99779p53001o25622n33501m72283m18005l40516
41506c0490909k19790n4675J39035L36961N14750O53904P45321P91541Q06017
41497b6777845Q06716Q04868P96134P62648O86618N65684M17986K73491J59183
41488b1504517Q9062O4463Q1135J34248K15493L05853L74660L91182L41780K38261
$$ plain form
41478 -19268380 -19158108 -19169420 -19277089 -19452233 -19672006 -19920057 -20179469 -20424593 -20619187
41469 -20619187 -20723170 -20703250 -20540658 -20233023 -19791434 -19234197 -18578569 -17833634 -16998928
41460 -16998928 -16070511 -15050399 -13952757 -12804257 -11642393 -10517301 -9496357 -8662511
41452 -8662511 -8097354 -7852013 -7923066 -8251519 -8746987 -9320608 -9906048 -10460711 -10955000 -11361941
41442 -11361941 -11652625 -11795351 -11755995 -11501208 -11006604 -10267511 -9305499 -8165252 -6901868
41433 -6901868 -5563830 -4179728 -2756845 -1295046 190594 1653474 3018305 4202543
41425 4202543 5142788 5811205 6216732 6396587 6407337 6320794 6222521 6205859 6356932 6734740
41415 6734740 7357046 8200117 9211086 10324579 11475305 12602611 13647679 14548211 15237979
$$ packed form
41478a9268380J10272j1312j07669j75144k19773k48051k59412k45124j94594
41469b0619187j03983J9920J62592L07635M41589N57237O55628P44935Q34706
41460a6998928R28417J020112J097642J148500J161864J125092J020944Q33846
41452h662511N65157K45341p1053l28453m95468n73621n85440n54663m94289m06941
41442a1361941k90684j42726L9356K54787M94604P39093R62012J140247J263384
41433f901868J338038J384102J422883J461799J485640J462880J364831J184238
41425D202543R40245O68417M05527J79855J0750q6543r8273j6662J51073L77808
41415F734740O22306Q43071J010969J113493J150726J127306J045068R00532O89768
$$ plain form
41406 15237979 15656047 15762567 15551449 15052098 14320794 13428490 12450604 11459128 10514936
41397 10514936 9659717 8909049 8248411 7633433 6996181 6258932 5353818 4241933 2923981
41388 2923981 1438344 -151753 -1776554 -3377698 -4920442 -6396129 -7814010 -9186421
41380 -9186421 -10514699 -11782838 -12961870 -14022647 -14950398 -15753604 -16462974 -17121300 -17767535
41371 -17767535 -18418385 -19051748 -19599676 -19958989 -20020147 -19703825 -18989704 -17927573 -16630053
41362 -16630053 -15250777 -13951865 -12866436 -12067135 -11554003 -11268107 -11123764 -11041640 -10965682
41353 -10965682 -10859118 -10690000 -10423136 -10026637 -9485519 -8807291 -8013225 -7123880 -6152170
41344 -6152170 -5108172 -4009042 -2885529 -1781232 -744259 187165 999870 1712767 2369783
$$ packed form
41406A5237979M18068J06520k11118m99351p31304q92304r77886r91476r44192
41397A0514936q55219p50668o60638o14978o37252p37249r05114j111885j317952
41388B923981j485637j590097j624801j601144j542744j475687j417881j372411
41380i186421j328278j268139j179032j060777r27751q03206p09370o58326o46235
41371a7767535o50850o33363n47928l59313o1158L16322P14121J062131J297520
41362a6630053J379276J298912J085429P99301N13132K85896J44343Q2124P5958
41353a0965682J06564J69118K66864L96499N41118O78228P94066Q89345R71710
41344f152170J043998J099130J123513J104297J036973R31424Q12705P12897O57016
$$ plain form
41335 2369783 3021580 3705679 4434317 5194653 5960704 6710649 7438524 8151373 8853062
41326 8853062 9526521 10127186 10591471 10853916 10863336 10592687 10044267 9254769 8300605 7297350
41316 7297350 6386438 5709934 5382947 5473740 5994800 6902537 8103939 9471348 10865767
41307 10865767 12163572 13276804 14158933 14797078 15201045 15399151 15439448 15384752 15294243
41298 15294243 15199941 15095476 14945996 14710761 14361955 13890370 13301130 12608112 11832157
41289 11832157 11001885 10153621 9328660 8568302 7907073 7363924 6932886 6577536 6233595
41280 6233595 5819818 5253369 4466412 3422935 2133779 663924 -873763 -2337360 -3579197
41271 -3579197 -4466030 -4895137 -4809091 -4207912 -3151484 -1746378 -120765 1599937 3304159
$$ packed form
41335B369783O51797O84099P28638P60336P66051P49945P27875P12849P01689
41326H853062O73459O00665M64285K62445R420k70649n48420p89498r54164j003255
41316G297350r10912o76504l26987R0793N21060R07737J201402J367409J394419
41307A0865767J297805J113232Q82129O38145M03967J98106M0297n4696r0509
41298A5294243r4302j04465j49480k35235l48806m71585n89240o93018p75955
41289A1832157q30272q48264q24961p60358o61229n43149m31038l55350l43941
41280F233595m13777n66449p86957j043477j289156j469855j537687j463597j241837
41271c579197q86833m29107Q6046O01179J056428J405106J625613J720702J704222
$$ plain form
41262 3304159 4889415 6251712 7284366 7893888 8025135 7677792 6902106 5778601 4397305
41253 4397305 2846660 1209609 -440321 -2043682 -3555595 -4940113 -6163012 -7188516
41245 -7188516 -7981160 -8511074 -8761382 -8735819 -8461736 -7983247 -7345351 -6578275 -5693285 -4694110
41235 -4694110 -3597042 -2446663 -1316836 -295643 537277 1128340 1454177 1514082 1320269
41226 1320269 894114 268576 -508705 -1375549 -2258462 -3078490 -3760792 -4247216 -4507235
41217 -4507235 -4542605 -4385684 -4093686 -3738613 -3391358 -3102844 -2890064 -2733157 -2583351 -2378358
41207 -2378358 -2062520 -1607920 -1028260 -376157 278140 877199 1400433 1869853 2335964
41198 2335964 2852289 3451327 4131639 4858438 5574171 6213748 6719792 7053805 7199936
$$ packed form
41262C304159J585256J362297J032654O09522J31247l47343p75686j123505j381296
41253D397305j550645j637051j649930j603361j511913j384518j222899j025504
41245g188516p92644n29914k50308K5563K74083M78489O37896P67076Q84990R99175
41235d694110J097068J150379J129827J021193Q32920N91063L25837N9905j93813
41226A320269m26155o25538p77281q66844q82913q20028o82302m86424k60019
41217d507235l5370J56921K91998L55073L47255K88514K12780J56907J49806K04993
41207b378358L15838M54600N79660O52103O54297N99059N23234M69420M66111
41198B335964N16325N99038O80312P26799P15733O39577N06044L34013J46131
$$ plain form
41189 7199936 7161226 6952539 6595906 6120485 5564306 4973265 4395241 3870269 3419207 3034582
41179 3034582 2679059 2296196 1832191 1259675 591745 -120883 -808513 -1408368 -1885335
41170 -1885335 -2237187 -2483622 -2650018 -2759236 -2834248 -2902152 -2990421 -3118036 -3292270 -3516070
41160 -3516070 -3798409 -4155452 -4599073 -5122035 -5693485 -6270079 -6815187 -7312647 -7767169
41151 -7767169 -8194675 -8612229 -9034835 -9479037 -9967332 -10526781 -11179746 -11931040 -12758776
41142 -12758776 -13613456 -14424874 -15114358 -15610192 -15862861 -15853941 -15593752 -15109812 -14434006 -13594654
41132 -13594654 -12613743 -11506829 -10285164 -8960921 -7554502 -6100867 -4652731 -3280037
41124 -3280037 -2064689 -1088851 -417623 -82051 -71372 -339815 -824452 -1463052 -2201655
$$ packed form
41189G199936l8710k08687l56633m75421n56179n91041n78024n24972m51062l84625
41179C034582l55523l82863m64005n72516o67930p12628o87630n99855m76967
41170a885335l51852k46435j66396j09218p5012o7904q8269j27615j74234k23800
41160c516070k82339l57043m43621n22962n71450n76594n45108m97460m54522
41151g767169m27506m17554m22606m44202m88295n59449o52965p51294q27736
41142a2758776q54680q11418o89484m95834k52669Q920K60189M83940O75806Q39352
41132a3594654R80911J106914J221665J324243J406419J453635J448136J372694
41124c280037J215348R75838O71228L35572J0679k68443m84637o38600p38603
$$ plain form
41115 -2201655 -2991548 -3785406 -4542008 -5237600 -5872228 -6462982 -7029330 -7583120 -8128949
41106 -8128949 -8668916 -9203299 -9727121 -10229885 -10702632 -11147288 -11578628 -12014415 -12459288
41097 -12459288 -12894429 -13282282 -13584713 -13781843 -13877474 -13888098 -13826544 -13694834 -13491082 -13222518
41087 -13222518 -12912982 -12599017 -12316284 -12082336 -11883646 -11675428 -11398841 -11010074 -10506276
41078 -10506276 -9933819 -9375675 -8926224 -8664387 -8631768 -8819855 -9170755 -9593963 -9994353
41069 -9994353 -10299905 -10477889 -10534819 -10503378 -10424412 -10332789 -10251470 -10191603 -10153645 -10127948 -10097581
41058 -10097581 -10044962 -9958623 -9834464 -9669686 -9453122 -9158223 -8744099 -8166824 -7397499 -6438326
41048 -6438326 -5327710 -4131564 -2925741 -1778287 -738372 166088 924788 1539685 2020279
$$ packed form
41115b201655p89893p93858p56602o95592o34628n90754n66348n53790n45829
41106h128949n39967n34383n23822n02764m72747m44656m31340m35787m44873
41097a2459288m35141l87853l02431j97130r5631j0624O1554J31710K03752K68564
41087a3222518L09536L13965K82733K33948J98690K08218K76587L88767N03798
41078a0506276N72457N58144M49451K61837L2619j88087l50900m23208m00390
41069i994353l05552j77984n6930L1441P8966R1623Q1319N9867L7958K5697L0367
41058a0097581N2619Q6339J24159J64778K16564K94899M14124N77275P69325R59173
41048f438326J110616J196146J205823J147454J039915R04460P58700O14897M80594
$$ plain form
41039 2020279 2379223 2628297 2777132 2836423 2822754 2758937 2666924 2557513 2425105 2252652
41029 2252652 2024039 1734872 1393479 1012114 596529 142687 -357616 -907021 -1494155
41020 -1494155 -2088909 -2641979 -3089260 -3361526 -3398842 -3167292 -2672543 -1962914 -1118605 -232276
41010 -232276 609226 1336934 1907589 2308716 2556840 2685245 2726589 2702045 2623061 2500139
41000 2500139 2348070 2182941 2015209 1846008 1669400 1478140 1269736 1052127 848546
40991 848546 698070 647314 734233 971957 1340646 1788524 2238389 2598316 2778572 2713622
40981 2713622 2380829 1805723 1050813 194413 -690057 -1546505 -2337977 -3040674 -3636816
40972 -3636816 -4113715 -4471606 -4734636 -4954446 -5199517 -5533325 -5992113 -6573199 -7238584
$$ packed form
41039B020279L58944K49074J48835N9291j3669o3817r2013j09411j32408j72453
41029B252652k28613k89167l41393l81365m15585m53842n00303n49405n87134
41020a494155n94754n53070m47281k72266l7316K31550M94749P09629Q44309Q86329
41010b32276Q41502P27708N70655M01127K48124J28405M1344k4544p8984j22922
41000B500139j52069j65129j67732j69201j76608j91260k08404k17609k03581
40991H48546j50476n0756Q6919K37724L68689M47878M49865L59927J80256o4950
40981B713622l32793n75106p54910q56400q84470q56448p91472p02697n96142
40972c636816m76899l57891k63030k19810k45071l33808m58788n81086o65385
$$ plain form
40963 -7238584 -7931345 -8596936 -9200175 -9732022 -10206321 -10650429 -11092793 -11548959 -12009604
40954 -12009604 -12437447 -12777538 -12977429 -13006810 -12867556 -12592025 -12233966 -11857424 -11526049
40945 -11526049 -11291956 -11183663 -11196072 -11287539 -11386572 -11406370 -11263564 -10897833 -10287846 -9457959
40935 -9457959 -8473688 -7430858 -6444481 -5636343 -5114363 -4942906 -5116092 -5550998 -6107490
40926 -6107490 -6625586 -6963229 -7021622 -6754965 -6168109 -5305814 -4235174 -3023921 -1721954
40917 -1721954 -355106 1065743 2526884 3996806 5422122 6735182 7868895 8772698
40909 8772698 9425090 9840868 10073035 10208611 10356232 10625873 11106591 11850179 12863584
40900 12863584 14106913 15495052 16907255 18209711 19286986 20068882 20540583 20734916
$$ packed form
40963g238584o92761o65591o03239n31847m74299m44108m42364m56166m60645
40954a2009604m27843l40091j99891k9381J39254K75531L58059L76542L31375
40945a1526049K34093J08293j2409r1467r9033j9798J42806L65731O09987Q29887
40935i457959R84271J042830R86377Q08138N21980J71457j73186m34906n56492
40926f107490n18096l37643n8393K66657N86856Q62295J070640J211253J301967
40917a721954J366848J420849J461141J469922J425316J313060J133713R03803
40909H772698O52392M15778K32167J35576J47621K69641M80718P43588J013405
40900A2863584J243329J388139J412203J302456J077275P81896M71701J94333
$$ plain form
40892 20734916 20714629 20553492 20321368 20075500 19858671 19702396 19631542 19667188 19826500 20119492
40882 20119492 20543358 21076777 21677650 22286599 22836187 23264288 23528014 23612109 23526938 23298760
40872 23298760 22961671 22556972 22134532 21746589 21433543 21212214 21076246 21007642 20990646 21020183
40862 21020183 21102567 21250546 21476929 21790168 22191520 22670781 23200527 23734428 24215353
40853 24215353 24591732 24833607 24939798 24933089 24846222 24705360 24519051 24277884 23963466 23560319
40843 23560319 23064925 22490072 21865100 21232374 20640033 20131754 19735204 19452224 19255671
40834 19255671 19097566 18928141 18718334 18475858 18248813 18115983 18165473 18465515 19035878
40825 19035878 19831920 20749744 21650581 22393998 22868505 23012796 22824778 22357494 21703426
$$ packed form
40892B0734916k0287j61137k32124k45868k16829j56275p0854L5646J59312K92992
40882B0119492M23866N33419O00873O08949N49588M28101K63726Q4095q5171k28178
40872B3298760l37089m04699m22440l87943l13046k21329j35968o8604j6996K9537
40862B1020183Q2384J47979K26383L13239M01352M79261N29746N33901M80925
40853B4215353L76379K41875J06191o709q6867j40862j86309k41167l14418m03147
40843B3560319m95394n74853o24972o32726n92341n08279l96550k82980j96553
40834A9255671j58105j69425k09807k42476k27045j32830M9490L00042N70363
40825A9035878P96042R17824R00837P43417M74507J44291j88018m67284o54068
$$ plain form
40816 21703426 20972360 20270066 19683332 19273178 19074556 19098905 19335620 19751102 20288269
40807 20288269 20871152 21416032 21845231 22097660 22132789 21928652 21476837 20777757 19838738
40798 19838738 18675667 17316837 15805989 14201420 12569114 10970993 9453126 8039768
40790 8039768 6735387 5531731 4416058 3379451 2425205 1574195 861922 325335 -15623
40781 -15623 -172483 -190596 -136661 -76405 -53804 -83058 -156215 -259012 -383911 -533587 -714519
40770 -714519 -924422 -1139872 -1311914 -1374818 -1265578 -944901 -410393 301251 1120892 1958982
40760 1958982 2721121 3325715 3721311 3899311 3896841 3786203 3653311 3574291 3600946 3758776
40750 3758776 4051876 4466658 4972889 5527644 6086818 6621310 7129019 7635107 8179990
$$ packed form
40816B1703426p31066p02294n86734m10154j98622K4349K36715M15482N37167
40807B0288269N82883N44880M29199K52429L5129k04137m51815o99080r39019
40798A9838738j163071j358830j510848j604569j632306j598121j517867j413358
40790H039768j304381j203656j115673j036607r54246q51010p12273n36587l40958
40781a5623j56860j8113N3935O0256K2601k9254p3157j02797j24899j49676j80932
40770g14519k09903k15450j72042o2904J09240L20677N34508P11644Q19641Q38090
40760A958982P62139O04594L95596J78000k470j10638j32892p9020K6655J57830
40750C758776K93100M14782N06231N54755N59174N34492N07709N06088N44883
$$ plain form
40741 8179990 8801673 9521648 10339647 11235138 12169930 13090206 13932177 14633652 15145536
40732 15145536 15434596 15477997 15260421 14781874 14070615 13187586 12215207 11236085 10312650
40723 10312650 9474778 8716954 8004628 7289088 6527617 5701830 4825801 3939677 3091968
40714 3091968 2319981 1638526 1042114 518232 63098 -310601 -579926 -728557 -763113 -717339
40704 -717339 -640231 -574273 -536121 -511112 -465091 -366096 -202023 16080 265025 526488 800271
40693 800271 1106860 1476783 1931227 2465508 3046429 3623738 4144976 4563515 4839707 4942049
40683 4942049 4852795 4575835 4141173 3601387 3019538 2453742 1946892 1526189 1208127 1000392
40673 1000392 898419 883686 931719 1028475 1184472 1436379 1835484 2431662 3262291 4348124
$$ packed form
40741H179990O21683P19975Q17999Q95491R34792R20276Q41971P01475N11884
40732A5145536K89060M3401k17576m78547p11259q83029r72379r79122r23435
40723A0312650q37872p57824p12326p15540p61471q25787q76029q86124q47709
40714C091968p71987o81455n96412n23882m55134l73699k69325j48631l4556M5774
40704g17339P7108O5958L8152K5009M6021R8995J64073K18103K48945K61463K73783
40693H00271L06589L69923M54444N34281N80921N77309N21238M18539K76192J02342
40683D942049q9254k76960m34662n39786n81849n65796n06850m20703l18062k07735
40673A000392j01973j4733M8033R6756J55997K51907L99105N96178Q30629J085833
$$ plain form
40663 4348124 5691191 7270056 9033481 10897321 12748308 14455236 15885904 16926162
40655 16926162 17495846 17557842 17120985 16239766 15011280 13566870 12057224 10633207 9426218
40646 9426218 8531590 7999284 7836140 8019512 8515520 9292871 10327333 11598134 13081155
40637 13081155 14743454 16540388 18412830 20282979 22053372 23617297 24881704 25791150
40629 25791150 26337944 26554078 26493260 26214150 25770455 25208227 24567936 23886189 23191063
40620 23191063 22490336 21760586 20948706 19991052 18844240 17513291 16062681 14604059 13266591
40611 13266591 12163675 11368261 10902027 10738662 10819987 11080749 11472472 11974999 12590593
40602 12590593 13325597 14170604 15089062 16018718 16883607 17609578 18136130 18422141 18448504
$$ packed form
40663D348124J343067J578865J763425J863840J850987J706928J430668J040258
40655A6926162N69684O1996m36857q81219j228486j444410j509646j424017j206989
40646I426218q94628n32306j63144J83372M96008P77351J034462J270801J483021
40637A3081155J662299J796934J872442J870149J770393J563925J264407R09446
40629B5791150N46794K16134o0818k79110m43695n62228o40291o81747o95126
40620B3191063p00727p29750q11880r57654j146812j330949j450610j458622j337468
40611A3266591j102916p95414m66234j63365Q1325K60762L91723N02527O15594
40602A2590593P35004Q45007R18458R29656Q64889P25971N26552K86011K6363
$$ plain form
40593 18448504 18221818 17780033 17196963 16580422 16058928 15755950 15758890 16096934 16738966 17609301
40583 17609301 18607593 19622093 20538964 21257799 21715699 21909020 21898822 21795826 21731734
40574 21731734 21827503 22167778 22789769 23692327 24863037 26310698 28086034 30279309 32995550
40565 32995550 36319077 40283823 44862251 49975517 55517212 61379476 67473667 73741633
40557 73741633 80153271 86684792 93276674 99782699 105934921 111351930 115601956 118303057
40549 118303057 119218826 118308640 115717740 111724283 106674943 100931962 94836599 88683409
40541 88683409 82701313 77043952 71794006 66981624 62610192 58679281 55196955 52179225
40533 52179225 49640086 47579131 45973807 44779552 43935794 43373508 43021832 42813608 42689896
$$ packed form
40593A8448504k26686m41785n83070o16541n21494l02978K940L38044O42032Q70335
40583A7609301R98292J014500R16871P18835M57900J93321j0198j02996o4092
40574B1731734R5769L40275O21991R02558J170710J447661J775336K193275K716241
40565C2995550L323527L964746M578428N113266N541695N862264O094191O267966
40557G3741633O411638O531521O591882O506025O152222N417009M250026K701101
40549A18303057R15769r10186k590900l993457n049340n742981o095363o153190
40541H8683409n982096n657361n249946m812382m371432l930911l482326l017730
40533E2179225k539139k060955j605324j194255q43758n62286l51676k08224j23712
$$ plain form
40524 42689896 42602948 42518604 42419851 42310463 42213763 42163277 42189327 42310560 42535651 42872049
40514 42872049 43333654 43941344 44716198 45670632 46805013 48114903 49607800 51321644 53334727
40505 53334727 55759581 58719917 62317349 66599609 71541263 77041390 82934899 89009504
40497 89009504 95019606 100691323 105721466 109785115 112569578 113836128 113483967 111579286
40489 111579286 108331391 104031630 98988679 93484108 87750733 81964511 76242706 70647201
40481 70647201 65193851 59867236 54638576 49484296 44402569 39423916 34610829 30043882
40473 30043882 25799176 21928808 18454240 15372325 12665574 10310353 8284216 6575534
40465 6575534 5192860 4166640 3538932 3344242 3589026 4236819 5202783 6359001 7549883
$$ packed form
40524D2689896q6948q4344r8753j09388r6700n0486K6050J21233K25091L36398
40514D2872049M61605O07690P74854R54434J134381J309890J492897J713844K013083
40505E3334727K424854K960336L597432M282260M941654N500127N893509O074605
40497H9009504O010102N671717N030143M063649K784463J266550l52161j904681
40489A11579286l247895m299761n042951n504571n733375n786222n721805n595505
40481G0647201n453350n326615n228660n154280n081727m978653m813087m566947
40473C0043882m244706l870368l474568l081915k706751k355221k026137j708682
40465F575534j382674j026220o27708j94690K44784O47793R65964J156218J190882
$$ plain form
40456 7549883 8615705 9420682 9879770 9976360 9763774 9348175 8857368 8405554 8066137
40447 8066137 7862123 7776364 7774817 7830361 7936467 8107181 8367191 8739857 9240675 9879197
40437 9879197 10665726 11615042 12741975 14050641 15523924 17118439 18766256 20382752
40429 20382752 21880539 23188642 24272884 25150251 25890173 26599749 27395995 28373705 29580135
40420 29580135 31005560 32592512 34258843 35924525 37531481 39049435 40467665 41779331
40412 41779331 42967668 43999759 44827221 45390520 45626416 45480699 44924740 43967723 42656060
40403 42656060 41060322 39259736 37335039 35371825 33467320 31730965 30273894 29190008
40395 29190008 28537083 28326211 28522279 29051976 29814645 30694651 31576403 32361586 32985511
$$ packed form
40456G549883J065822Q04977M59088R6590k12586m15599m90807m51814l39417
40447H066137k04014q5759j547N5544J06106J70714K60010L72666N00818O38522
40437I879197P86529R49316J126933J308666J473283J594515J647817J616496
40429B0382752J497787J308103J084242Q77367P39922P09576P96246R77710J206430
40420B9580135J425425J586952J666331J665682J606956J517954J418230J311666
40412D1779331J188337J032091Q27462N63299K35896j45717n55959r57017j311663
40403D2656060j595738j800586j924697j963214j904505j736355j457071j083886
40395B9190008o52925k10872J96068N29697P62669Q80006Q81752P85183O23925
$$ plain form
40386 32985511 33428562 33718827 33922032 34117865 34369941 34704486 35110727 35562723 36048188
40377 36048188 36587012 37231320 38050814 39113019 40466847 42133663 44106251 46353906
40369 46353906 48831781 51493069 54302146 57245529 60337692 63621961 67169420 71077631
40361 71077631 75467547 80476083 86244626 92906249 100574117 109333130 119237676 130317461
40353 130317461 142588060 156057136 170717286 186522248 203350073 220961304 238962175
40346 238962175 256782340 273676300 288761588 301111839 309911192 314637712 315200532
40339 315200532 311954529 305575610 296857949 286529613 275153822 263124338 250720893
40332 250720893 238179404 225741571 213667154 202212733 191595313 181961191 173373094
$$ packed form
40386C2985511M43051K90265K03205J95833K52076L34545M06241M51996M85465
40377C6048188N38824O44308Q19494J062205J353828J666816J972588K247655
40369D6353906K477875K661288K809077K943383L092163L284269L547459L908211
40361G1077631M389916N008536N768543O661623P667868Q759013R904546J1079785
40353A30317461J2270599J3469076J4660150J5804962J6827825J7611231J8000871
40346B38962175J7820165J6893960J5085288J2350251Q799353M726520N62820
40339C15200532l246003o378919q717661j0328336j1375791j2029484j2403445
40332B50720893j2541489j2437833j2074417j1454421j0617420r634122q588097
$$ plain form
40325 173373094 165819372 159240652 153561185 148708925 144617042 141215295 138427357 136182269
40317 136182269 134434444 133181187 132470775 132399072 133094574 134694955 137323868 141078475
40309 141078475 146030978 152236805 159737885 168553762 178659472 189951886 202207325
40302 202207325 215038135 227865200 239930679 250370927 258348295 263209112 264613179
40295 264613179 262586296 257481496 249873940 240433812 229815089 218579750 207161299
40288 207161299 195861833 184870605 174290420 164163173 154493444 145271346 136491739
40281 136491739 128163793 120308840 112951861 106114423 99812153 94053932 88839592 84156855
40273 84156855 79980872 76277874 73010759 70142766 67636901 65451826 63537538 61834811
$$ packed form
40325A73373094p553722o578720n679467m852260m091883l401747k787938k245088
40317A36182269j747825j253257p10412p1703O95502J600381K628913L754607
40309A41078475M952503O205827P501080Q815877J0105710J1292414J2255439
40302B02207325J2830810J2827065J2065479J0440248P977368M860817J404067
40295B64613179k026883n104800p607556r440128j0618723j1235339j1418451
40288B07161299j1299466j0991228j0580185j0127247r669729r222098q779607
40281A36491739q327946p854953p356979o837438o302270n758221n214340m682737
40273H4156855m175983l702998l267115k867993k505865k185075j914288j702727
$$ plain form
40265 61834811 60280330 58816101 57399571 56010713 54652854 53345144 52108423 50951445
40257 50951445 49865661 48830643 47824694 46834137 45858908 44913497 44020029 43191887 42415172
40248 42415172 41641747 40802295 39834395 38711287 37457485 36143970 34864214 33701432
40240 33701432 32703307 31877112 31205493 30670426 30269349 30014255 29915619 29961929 30108109 30281055
40230 30281055 30400620 30406265 30277692 30041868 29764877 29532528 29427318 29510096 29811445 30331785
40220 30331785 31044786 31899999 32826805 33745898 34589917 35324261 35953880 36509917 37024829
40211 37024829 37512190 37962040 38352239 38669311 38929619 39190394 39542081 40082009 40880343
40202 40880343 41954282 43261647 44715814 46216346 47685063 49094287 50475374 51903675
$$ packed form
40265F1834811j554481j464229j416530j388858j357859j307710j236721j156978
40257E0951445j085784j035018j005949r90557r75229r45411q93468q28142p76715
40248D2415172p73425q39452r67900j123108j253802j313515j279756j162782
40240C3701432r98125q26195o71619n35067m01077k55094r8636M6310J46180J72946
40230C0281055J19565N645j28573k35824k76991k32349j05210Q2778L01349N20340
40220C0331785P13001Q55213R26806R19093Q44019P34344O29619N56037N14912
40211C7024829M87361M49850L90199L17072K60308K60775L51687N39928P98334
40202D0880343J073939J307365J454167J500532J468717J409224J381087J428301
$$ plain form
40194 51903675 53467802 55237941 57244769 59471871 61858413 64308113 66700939 68903294
40186 68903294 70773561 72165627 72938243 72975487 72214310 70667724 68432394 65675166 62600457
40177 62600457 59408770 56263420 53280371 50541545 48114794 46060001 44415346 43177391
40169 43177391 42295249 41687841 41275084 41004554 40860085 40851392 40993809 41289979 41722385 42259309
40159 42259309 42869908 43540527 44286723 45159749 46245702 47651116 49470975 51747604 54441122
40150 54441122 57429538 60539958 63595877 66460229 69059462 71384639 73476451 75406574
40142 75406574 77264266 79148606 81162587 83408056 85982582 88975887 92460693 96477863
40134 96477863 101023550 106045696 111447710 117089812 122781815 128271419 133240033 137319366
$$ packed form
40194E1903675J564127J770139K006828K227102K386542K449700K392826K202355
40186F8903294J870267J392066P72616L7244p61177j546586k235330k757228l074709
40177F2600457l191687l145350k983049k738826k426751k054793j644655j237955
40169D3177391q82142o07408m12757k70530j44469q693J42417K96170M32406N36924
40159D2259309O10599O70619P46196Q73026J085953J405414J819859K276629K693518
40150E4441122K988416L110420L055919K864352K599233K325177K091812J930123
40142G5406574J857692J884340K013981K245469K574526K993305L484806M017170
40134I6477863M545687N022146N402014N642102N692003N489604M968614M079333
$$ plain form
40126 137319366 140136535 141383415 140890515 138675966 134947112 130054769 124423163 118484438
40118 118484438 112632905 107195465 102408138 98396996 95172870 92649235 90680897 89108596
40110 89108596 87792805 86628463 85542548 84480746 83389718 82202210 80833711 79195933
40102 79195933 77222963 74897444 72264348 69427443 66530779 63730284 61161603 58912277
40094 58912277 57007068 55411419 54051255 52841420 51712583 50627488 49582091 48594009
40086 48594009 47686020 46872310 46150535 45498328 44872637 44212864 43450572 42526387 41409923
40077 41409923 40115042 38703335 37273209 35937490 34796761 33917264 33320025 32981944
40069 32981944 32843718 32818403 32798645 32665144 32299112 31598081 30491262 28949853 26989571
$$ packed form
40126A37319366K817169J246880m92900k214549l728854m892343n631606n938725
40118A18484438n851533n437440m787327m011142l224126k523635j968338j572301
40110H9108596j315791j164342j085915j061802j091028j187508j368499j637778
40102G9195933j972970k325519k633096k836905k896664k800495k568681k249326
40094E8912277j905209j595649j360164j209835j128837j085095j045397r88082
40086D8594009r07989q13710p21775o52207o25691o59773p62292r24185j116464
40077D1409923j294881j411707j430126j335719j140729q79497n97239l38081
40069C2981944j38226k5315j9758j33501l66032p01031j106819j541409j960282
$$ plain form
40060 26989571 24666237 22068192 19308158 16512754 13806900 11296078 9055615 7132794
40052 7132794 5556735 4345443 3505849 3032267 2908697 3112256 3610591 4351829 5254420
40043 5254420 6206696 7080708 7757114 8151898 8233966 8026566 7594073 7022655 6403104 5818496
40033 5818496 5335490 4999135 4832841 4843540 5029096 5384310 5903509 6579230 7398234 8338366
40023 8338366 9370130 10462304 11585253 12706404 13780555 14745089 15527775 16064844 16318572
40014 16318572 16284315 15985080 15460453 14758821 13936441 13059047 12198809 11423741 10783541
40005 10783541 10299260 9962106 9741595 9598735 9498590 9418754 9353536 9314197 9323426 9402314
39995 9402314 9554030 9755787 9969852 10171407 10375040 10637702 11030297 11592672 12298889
$$ packed form
40060B6989571k323334k598045k760034k795404k705854k510822k240463j922821
40052G132794j576059j211292q39594m73582j23570K03559M98335P41238R02591
40043E254420R52276Q74012O76406L94784Q2068k07400m32493n71418o19551n84608
40033E818496m83006l36355j66294J0699J85556L55214N19199O75721Q19004R40132
40023H338366J031764J092174J122949J121151J074151R64534P82686N37069K53728
40014A6318572l4257k99235n24627p01632q22380q77394q60238p75068o40200
40005A0783541m84281l37154k20511j42860j00145p9836o5218l9339R229P8888
39995I402314J51716K01757K14065K01555K03633K62662L92595N62375P06217
$$ plain form
39986 12298889 13052496 13713222 14142388 14249997 14027618 13555108 12979021 12474234 12207233
39977 12207233 12311985 12875986 13929320 15436354 17297140 19364122 21471617 23467726
39969 23467726 25236049 26699773 27811748 28542845 28878713 28824060 28406569 27676391 26704403
39960 26704403 25581818 24417491 23327571 22417934 21765282 21402097 21307826 21409150 21594151
39951 21594151 21741939 21759405 21608064 21305934 20903716 20451133 19974252 19473754 18938126
39942 18938126 18358403 17735651 17080263 16406011 15722452 15029933 14320970 13587803 12831360
39933 12831360 12066681 11323785 10645781 10084783 9694144 9516337 9568948 9833495 10251958
39924 10251958 10734342 11177561 11491084 11620563 11560206 11349081 11053341 10741621 10462682
$$ packed form
39986A2298889P53607O60726M29166J07609k22379m72510n76087n04787k67001
39977A2207233J04752N64001J053334J507034J860786K066982K107495J996109
39969B3467726J768323J463724J111975P31097L35868n4653m17491p30178r71988
39960B6704403j122585j164327j089920r09637o52652l63185r4271J01324J85001
39951B1594151J47788J7466j51341l02130m02218m52583m76881n00498n35628
39942A8938126n79723o22752o55388o74252o83559o92519p08963p33167p56443
39933A2831360p64679p42896o78004n60998l90639j77807N2611K64547M18463
39924A0251958M82384M43219L13523J29479o0357k11125k95740l11720k78939
$$ plain form
39915 10462682 10232700 10035610 9834819 9590253 9272783 8869869 8381408 7810719 7158263
39906 7158263 6422493 5605822 4719584 3784083 2824940 1869632 946401 85067 -681279
39897 -681279 -1314695 -1773424 -2019313 -2031860 -1822241 -1437526 -950971 -444079 9941 356620
39887 356620 566623 640663 610968 535473 484785 526282 709311 1052964 1538923 2114654
39877 2114654 2709338 3255239 3701049 4010601 4154728 4110173 3870466 3460133 2939873 2398469
39867 2398469 1936600 1650271 1618153 1892817 2494064 3403590 4563454 5882335 7250158
39858 7250158 8555564 9699450 10603542 11218255 11531346 11572040 11404511 11111964 10778860
39849 10778860 10477472 10258997 10147248 10135351 10187953 10249792 10257733 10151767 9882355 9415069
$$ packed form
39915A0462682k29982j97090k00791k44566l17470m02914m88461n70689o52456
39906G158263p35770q16671q86238r35501r59143r55308r23231q61334p66346
39897f81279o33416m58729k45889j2547K09619L84715M86555N06892M54020L46679
39887C56620K10003P4040k9695p5495n0688M1497J83029L43653M85959N75731
39877B114654N94684N45901M45810L09552J44127m4555k39707m10333n20260n41404
39867B398469m61869k86329l2118K74664O01247R09526J159864J318881J367823
39858G250158J305406J143886R04092O14713L13091M0694j67529k92547l33104
39849A0778860l01388k18475j11749j1897N2602O1839P941j05966k69412m67286
$$ plain form
39839 9415069 8735169 7852659 6805207 5655937 4485762 3382015 2425013 1674658 1161460
39830 1161460 886738 831483 967344 1263334 1688199 2212081 2807314 3443063 4071436 4613420
39820 4613420 4960255 4999671 4659141 3943535 2945156 1820057 743630 -133148 -710905
39811 -710905 -948961 -858194 -487984 87262 780406 1503025 2175606 2734681 3135245 3348975
39801 3348975 3361280 3170757 2792657 2264291 1647400 1023149 479999 99672 -52888 66088
39791 66088 477590 1177825 2136520 3299032 4594743 5950241 7303238 8613480 9868466
39782 9868466 11082614 12289316 13528105 14832472 16223881 17712463 19298832 20970693
39774 20970693 22693571 24402669 26005642 27401124 28507276 29286372 29752145 29957122
$$ packed form
39839I415069o79900q82510j047452j149270j170175j103747r57002p50355n13198
39830A161460k74722n5255J35861K95990M24865N23882N95233O35749O28373N41984
39820D613420L46835L9416l40530p15606r98379j125099j076427q76778n77757
39811g10905k38056R0767L70210N75246O93144P22619O72581N59075M00564K13730
39801C348975J2305j90523l78100n28366o16891o24251n43150l80327j52560J18976
39791F6088M11502P00235R58695J162512J295711J355498J352997J310242J254986
39782I868466J214148J206702J238789J304367J391409J488582J586369J671861
39774B0970693J722878J709098J602973J395482J106152P79096M65773K04977
$$ plain form
39766 29957122 29969003 29849083 29640220 29363755 29021358 28599519 28077107 27436151 26672906
39757 26672906 25803843 24862418 23887555 22909816 21942186 20979099 20003311 18997610 17956976
39748 17956976 16895803 15845380 14840784 13902793 13025321 12177576 11321442 10433164 9513486
39739 9513486 8577914 7634155 6664091 5623837 4460961 3136307 1637777 -17425 -1787304
39730 -1787304 -3610370 -5410507 -7104898 -8618969 -9907476 -10973228 -11871006 -12689730
39722 -12689730 -13519629 -14421460 -15411972 -16466632 -17530941 -18532799 -19394191 -20042425 -20419258
39713 -20419258 -20486211 -20226528 -19645150 -18767402 -17637717 -16320259 -14900101 -13478637 -12157870
39704 -12157870 -11017085 -10093936 -9381074 -8839524 -8419230 -8073359 -7758890 -7427647 -7020014
$$ packed form
39766B9957122J1881j19920k08863k76465l42397m21839n22412o40956p63245
39757B6672906q69063r41425r74863r77739r67630r63087r75788j005701j040634
39748A7956976j061173j050423j004596r37991q77472q47745q56134q88278r19678
39739I513486r35572r43759r70064j040254j162876j324654j498530j655202j769879
39730a787304j823066j800137j694391j514071j288507j065752q97778q18724
39722a2689730q29899r01831r90512j054660j064309j001858q61392o48234l76833
39713b0419258o6953K59683N81378Q77748J129685J317458J420158J421464J320767
39704a2157870J140785R23149P12862N41550M20294L45871L14469L31243M07633
$$ plain form
39695 -7020014 -6470906 -5726561 -4762152 -3590920 -2262248 -851659 552462 1862085 3002475
39686 3002475 3926623 4629476 5153392 5575410 5977609 6415491 6901347 7407792 7882914
39677 7882914 8265431 8495033 8520473 8309136 7857697 7199599 6404636 5568161 4790031 4146550
39667 4146550 3663925 3306775 2992703 2631164 2169045 1619411 1058918 596447 329236
39658 329236 306201 511847 873670 1286772 1644833 1866578 1910430 1775573 1491986 1103581
39648 1103581 649115 147778 -402457 -1011737 -1679907 -2386955 -3097047 -3767312 -4350451
39639 -4350451 -4790616 -5021387 -4973251 -4590447 -3851267 -2783593 -1467841 -24523 1407537
39630 1407537 2691376 3704327 4345541 4543622 4263706 3508251 2308378 709358 -1242364
$$ packed form
39695g020014N49108P44345R64409J171232J328672J410589J404121J309623J140390
39686C002475R24148P02853N23916M22018M02199M37882M85856N06445M75122
39677G882914L82517K29602K5440k11337m51439o58098p94963q36475p78130o43481
39667D146550m82625l57150l14072l61539m62119n49634n60493m62471k67211
39658C29236k3035K05646L61823M13102L58061K21745M3852j34857k83587l88405
39648A103581m54466n01337n50235o09280o68170p07048p10092o70265n83139
39639d350451m40165k30771M8136L82804P39180J067674J315752J443318J432060
39630A407537J283839J012951O41214J98081k79916p55455j199873j599020j951722
$$ plain form
39621 -1242364 -3504973 -6038151 -8792269 -11693373 -14630510 -17454701 -19996530 -22099432
39613 -22099432 -23653867 -24614505 -24993212 -24836677 -24205143 -23163094 -21781345 -20142746 -18344191
39604 -18344191 -16491774 -14690063 -13028558 -11568467 -10332154 -9297371 -8398991 -7540533
39596 -7540533 -6614841 -5529468 -4231197 -2724972 -1082638 564137 2050288 3218511
39588 3218511 3961292 4247787 4126673 3706675 3123954 2507828 1954908 1518021 1211595
39579 1211595 1030549 975340 1071870 1375044 1952656 2858410 4108647 5671188 7464686
39570 7464686 9364694 11218060 12869031 14193008 15124767 15667867 15881453 15851303 15657271
39561 15657271 15348944 14937050 14401438 13709206 12832947 11761601 10502767 9080131 7530238
$$ packed form
39621a242364k262609k533178k754118k901104k937137k824191k541829k102902
39613b2099432j554435r60638l78707J56535O31534J042049J381749J638599J798555
39604a8344191J852417J801711J661505J460091J236313J034783Q98380Q58458
39596g540533R25692J085373J298271J506225J642334J646775J486151J168223
39588C218511P42781K86495j21114m19998n82721o16126n52920m36887l06426
39579A211595j81046n5209R6530L03174N77612R05754J250237J562541J793498
39570G464686J900008J853366J650971J323977R31759N43100K13586l0150j94032
39561A5657271l08327m11894n35612o92232q76259j071346j258834j422636j549893
$$ plain form
39552 7530238 5900483 4247763 2635467 1125709 -233649 -1421845 -2448690 -3343430
39544 -3343430 -4133236 -4821764 -5377399 -5737563 -5832166 -5621533 -5131601 -4464100 -3772602 -3218321
39534 -3218321 -2930439 -2986042 -3407755 -4169983 -5208869 -6436266 -7757458 -9087928 -10361958
39525 -10361958 -11529172 -12543357 -13354377 -13911606 -14177500 -14142602 -13834624 -13319595 -12694649
39516 -12694649 -12070771 -11546462 -11180644 -10977255 -10888610 -10833708 -10720835 -10466221 -10007633 -9315544
39506 -9315544 -8402030 -7323097 -6169707 -5047038 -4046973 -3223081 -2578435 -2072848 -1647139
39497 -1647139 -1253116 -875434 -536412 -282923 -162020 -197635 -380464 -674108 -1029151 -1394508
39487 -1394508 -1723670 -1980148 -2143288 -2209850 -2189018 -2095899 -1949879 -1777433 -1613042 -1493479
$$ packed form
39552G530238j629755j652720j612296j509758j359358j188196j026845q94740
39544c343430p89806o88528n55635l60164r4603K10633M89932O67501O91498N54281
39534c218321K87882n5603m21713p62228j038886j227397j321192j330470j274030
39525a0361958j167214j014185q11020n57229k65894L4898L07978N15029O24946
39516a2694649O23878N24309L65818K03389Q8645N4902J12873K54614M58588O92089
39506i315544R13514J078933J153390J122669J000065Q23892O44646N05587M25709
39497a647139L94023L77682L39022K53489J20903l5615j82829k93644l55043l65357
39487a394508l29162k56478j63140o6562K0832R3119J46020J72446J64391J19563
$$ plain form
39477 -1493479 -1445942 -1473880 -1545436 -1590099 -1508871 -1199190 -587942 341590 1542871 2922154
39467 2922154 4365448 5759424 6999245 7989868 8650680 8925649 8793689 8273536 7421296
39458 7421296 6321908 5077199 3792896 2565539 1469575 546641 -199315 -799483 -1311805
39449 -1311805 -1808192 -2357024 -3003464 -3756262 -4589959 -5462042 -6334105 -7183999 -8002736
39440 -8002736 -8778984 -9481084 -10048635 -10400809 -10458359 -10168210 -9519409 -8545441 -7314491
39431 -7314491 -5913166 -4430630 -2948879 -1540637 -271036 803494 1643364 2238798
39423 2238798 2619100 2848879 3008589 3165670 3347705 3529055 3639544 3595993 3344057 2887403
39413 2887403 2287039 1634283 1017629 501939 123564 -106127 -196570 -175168 -82176 41530
$$ packed form
39477a493479M7537k7938p1556m4663Q1228L09681O11248R29532J201281J379283
39467B922154J443294J393976J239821R90623O60812K74969j31960n20153q52240
39458G421296j099388j244709j284303j227357j095964r22934p45956o00168n12322
39449a311805m96387n48832o46440p52798q33697q72083q72063q49894q18737
39440h002736p76248p02100n67551l52174n7550K90149O48801R73968J230950
39431g314491J401325J482536J481751J408242J269601J074530Q39870N95434
39423B238798L80302K29779J59710J57081J82035J81350J10489m3551k51936m56654
39413B887403o00364o52756o16654n15690l78375k29691r0443K1402R2992J23706
$$ plain form
39403 41530 173078 322320 529110 839560 1273677 1803924 2357786 2844251 3192395 3383434
39393 3383434 3459145 3501809 3597560 3803838 4136235 4576319 5090162 5643578 6206050 6746690
39383 6746690 7232623 7635580 7941576 8154631 8292224 8377388 8431797 8470375 8498311 8513852
39373 8513852 8517771 8523659 8560134 8661065 8848645 9119856 9445238 9780597 10083055 10320041
39363 10320041 10466528 10495583 10372172 10057550 9524790 8778854 7870442 6894640 5973113
39354 5973113 5226260 4744224 4564199 4660768 4954565 5337925 5705892 5977218 6097848 6032802
39344 6032802 5758669 5263947 4554202 3654051 2602218 1444605 233331 -966759 -2072472
39335 -2072472 -2988358 -3627386 -3937483 -3919352 -3624629 -3133876 -2525143 -1849138 -1122541 -340365
$$ packed form
39403D1530J31548J49242K06790L10450M34117N30247N53862M86465L48144J91039
39393C383434P5711M2664R5751K06278L32397M40084N13843N53416N62472N40640
39383F746690M85933M02957L05996K13055J37593Q5164N4409L8578K7936J5541
39373H513852L919N888L6475J00931J87580K71211L25382L35359L02458K36986
39363A0320041J46487K9055j23411l14622n32760p45936r08412r75802r21527
39354E973113p46853m82036j80025R6569K93797L83360L67967K71326J20630o5046
39344F032802k74133m94722p09745r00151j051833j157613j211274j200090j105713
39335b072472r15886o39028l10097J8131K94723M90753O08733O76005P26597P82176
$$ plain form
39325 -340365 500788 1379938 2239741 2992848 3547612 3843801 3881070 3725254 3489241 3297330
39315 3297330 3247305 3383458 3689645 4104874 4554357 4980522 5358506 5691551 5996093 6291930
39305 6291930 6604430 6971900 7445528 8076696 8898391 9912069 11086153 12364323 13677443
39296 13677443 14953699 16124543 17127372 17907673 18422481 18644810 18567987 18209952 17617537
39287 17617537 16868040 16063622 15316704 14729760 14375328 14280678 14419964 14716978 15060283
39278 15060283 15326973 15405856 15212305 14694653 13837153 12661530 11223414 9600999 7880848
39269 7880848 6149270 4490680 2984536 1693258 645771 -169436 -793347 -1274549 -1652343
39260 -1652343 -1954389 -2204669 -2430005 -2657955 -2909178 -3192442 -3506540 -3845478 -4200558
$$ packed form
39325c40365Q41153Q79150Q59803P53107N54764K96189L7269j55816k36013j91911
39315C297330n0025J36153L06187M15229M49483M26165L77984L33045L04542K95837
39305F291930L12500L67470M73628O31168Q21695J013678J174084J278170J313120
39296A3677443J276256J170844J002829P80301N14808K22329p6823l58035n92415
39287A7617537p49497q04418p46918n86944l54432r4650J39286K97014L43305
39278A5060283K66690P8883j93551n17652q57500j175623j438116j622415j720151
39269G880848j731578j658590j506144j291278j047487q15207o23911m81202l77794
39260a652343l02046k50280k25336k27950k51223k83264l14098l38938l55080
$$ plain form
39251 -4200558 -4558030 -4897276 -5194279 -5428792 -5589102 -5670710 -5670790 -5582839 -5394380 -5088987
39241 -5088987 -4653074 -4085436 -3403835 -2642872 -1843852 -1044492 -275872 433820 1055819
39232 1055819 1563381 1939761 2186559 2327370 2403453 2460596 2531321 2622119 2714982 2783196
39222 2783196 2810575 2801828 2780430 2779724 2834743 2977933 3238391 3643447 4220964 4998891 5998569
39211 5998569 7222256 8641067 10191400 11782950 13313548 14682721 15800833 16598243
39203 16598243 17039384 17137495 16957329 16597304 16158141 15716703 15319021 14989871 14744025
39194 14744025 14587035 14506301 14463458 14398458 14246515 13959099 13517116 12929995 12224237 11431160
39184 11431160 10582040 9711697 8864843 8097056 7465107 7008329 6730695 6595870 6540467
$$ packed form
39251d200558l57472l39246k97003k34513j60310q1608q0Q7951J88459L05393
39241e088987M35913N67638O81601P60963P99020P99360P68620P09692O21999
39232A055819N07562L76380K46798J40811P6083N7143P0725R0798R2863O8214
39222B783196K7379q747k1398p06N5019J43190K60458M05056N77517P77927R99678
39211E998569J223687J418811J550333J591550J530598J369173J118112P97410
39203A6598243M41141R8111j80166l60025m39163m41438l97682l29150k45846
39194A4744025j56990q0734m2843o5000j51943k87416m41983n87121p05758p93077
39184A1431160q49120q70343q46854p67787o31949m56778k77634j34825n5403
$$ plain form
39175 6540467 6498655 6424916 6306374 6165239 6055758 6057342 6262203 6756605 7598607 8799077
39165 8799077 10314824 12059592 13929122 15826550 17673947 19406707 20960039 22259903
39157 22259903 23224704 23776721 23858328 23446769 22561557 21261606 19634382 17782704 15813672
39148 15813672 13830608 11926841 10180973 8654966 7395985 6440059 5813558 5529960
39140 5529960 5583379 5942138 6544540 7298223 8086477 8785400 9290695 9545690 9559457 9407305
39130 9407305 9211372 9104807 9190270 9509003 10033545 10684567 11359718 11959625 12403199 12633687
39120 12633687 12622424 12376195 11946846 11433521 10967184 10677527 10655457 10928235 11456890 12154405
39110 12154405 12915887 13648646 14290395 14809248 15189866 15418975 15482157 15372487 15100374
$$ packed form
39175F540467m1812p3739j18542j41135j09481J584K04861M94402Q42002J200470
39165H799077J515747J744768J869530J897428J847397J732760J553332J299864
39157B2259903R64801N52017Q1607m11559q85212j299951j627224j851678j969032
39148A5813672j983064j903767j745868j526007j258981r55926o26501k83598
39140E529960N3419L58759O02402P53683P88254O98923N05295K54995J3767j52152
39130I407305j95933j06565Q5463L18733N24542O51022O75151N99907M43574K30488
39120A2633687j1263k46229m29349n13325m66337k89657k2070K72778N28655O97515
39110A2154405P61482P32759O41749N18853L80618K29109O3182j09670k72113
$$ plain form
39101 15100374 14693442 14185515 13604296 12968138 12293791 11608532 10958299 10407179 10027850
39092 10027850 9885887 10023168 10445878 11119278 11967866 12879853 13718361 14342502 14636498
39083 14636498 14538178 14055793 13266619 12299484 11309679 10454311 9870080 9651507 9830933
39074 9830933 10368314 11159533 12063895 12941441 13685912 14241504 14598658 14774343 14790461 14663745
39064 14663745 14409930 14053157 13628782 13175118 12718955 12263937 11788982 11257480 10630554
39055 10630554 9875184 8964502 7877484 6606381 5169494 3616849 2020711 457710
39047 457710 -1003548 -2304479 -3396195 -4245125 -4841914 -5204591 -5373285 -5402419 -5355702
39038 -5355702 -5302517 -5311972 -5445047 -5747646 -6244595 -6932858 -7775975 -8705889 -9636343 -10485059
$$ packed form
39101A5100374m06932n07927n81219o36158o74347o85259o50233n51120l79329
39092A0027850j41963J37281M22710O73400Q48588R11987Q38508O24141K93996
39083A4636498r8320m82385p89174r67135r89805q55368n84231k18573J79426
39074I830933N37381P91219R04362Q77546P44471N55592L57154J75685J6118j26716
39064A4663745k53815l56773m24375m53664m56163m55018m74955n31502o26926
39055A0630554p55370r10682j087018j271103j436887j552645j596138j563001
39047D57710j461258j300931j091716q48930n96789l62677j68694k9134M6717
39038e355702N3185r455j33075l02599m96949o88263q43117r29914r30454q48716
$$ plain form
39028 -10485059 -11195780 -11749799 -12160394 -12452608 -12641025 -12720562 -12675472 -12497652 -12200607 -11822142
39018 -11822142 -11417935 -11050833 -10779038 -10644955 -10666675 -10833638 -11107665 -11430541 -11737990
39009 -11737990 -11975953 -12111844 -12135674 -12052843 -11875648 -11619006 -11299766 -10935000 -10536870 -10107176
38999 -10107176 -9636236 -9106348 -8495660 -7780207 -6937597 -5956479 -4849044 -3657731 -2450324
38990 -2450324 -1306029 -299331 514012 1107274 1486696 1685871 1751952 1731373 1662925 1578931
38980 1578931 1507787 1470807 1473068 1495531 1497766 1434744 1280767 1046480 777552 534676 365559
38969 365559 282602 255539 221911 112750 -114611 -449571 -819947 -1107826 -1184867 -954851
38959 -954851 -388453 463268 1483090 2523522 3447820 4159049 4610020 4797482 4747801
$$ packed form
39028a0485059p10721n54019m10595k92214j88417p9537M5090J77820K97045L78465
39018a1822142M04207L67102K71795J34083k1720j66963k74027l22876l07449
39009a1737990k37963j35891k3830Q2831J77195K56642L19240L64766L98130M29694
38999a0107176M70940N29888O10688P15453Q42610R81118J107435J191313J207407
38990b450324J144295J006698Q13343N93262L79422J99175O6081k0579o8448q3994
38980A578931p1144l6980K261K2463K235o3022j53977k34287k68928k42876j69117
38969C65559q2957k7063l3628j09161k27361l34960l70376k87879p7041K30016
38959i54851N66398Q51721J019822J040432R24298P11229M50971J87462m9681
$$ plain form
38950 4747801 4500303 4093501 3558793 2923233 2218066 1487579 794622 221978 -130902
38941 -130902 -157349 239625 1124614 2506719 4323403 6437599 8651606 10738018 12483135
38932 12483135 13731680 14416971 14564566 14270055 13664361 12882531 12044743 11249092 10571075
38923 10571075 10064191 9758132 9655072 9729121 9933963 10217373 10534358 10850725 11136836
38914 11136836 11359471 11480655 11465224 11290639 10950922 10453400 9814660 9061485 8233410
38905 8233410 7377638 6533468 5716075 4913345 4099438 3256347 2391553 1545364 786901
38896 786901 200453 -133247 -154219 164933 811354 1727971 2819418 3975315 5106935
38887 5106935 6178956 7216958 8286304 9455446 10762998 12202238 13725792 15263638
$$ packed form
38950D747801k47498m06802n34708o35560p05167p30487o92957n72644l52880
38941a30902k6447L96974Q84989J382105J816684K114196K214007K086412J745117
38932A2483135J248545O85291J47595k94511o05694p81830q37788p95651o78017
38923A0571075n06884l06059j03060P4049K04842K83410L16985L16367K86111
38914A1136836K22635J21184j5431j74585l39717m97522o38740p53175q28075
38905H233410q55772q44170q17393q02730q13907q43091q64794q46189p58463
38896G86901n86448l33700k0972L19152O46421R16617J091447J155897J131620
38887E106935J072021J038002J069346J169142J307552J439240J523554J537846
$$ plain form
38879 15263638 16743092 18102297 19296683 20303413 21127041 21802929 22391653 22962066 23569213
38870 23569213 24238450 24964308 25723897 26496192 27275143 28067348 28872876 29658348 30339665
38861 30339665 30789837 30873041 30488681 29603560 28259938 26561506 24646667 22658324 20717878
38852 20717878 18909882 17280296 15845722 14607567 13565462 12726347 12107171 11731104
38844 11731104 11619299 11781305 12206689 12860003 13681388 14594392 15519595 16388937 17154325
38835 17154325 17786866 18269193 18588220 18734753 18709690 18530824 18234837 17873619 17506106
38826 17506106 17185711 16944438 16779685 16652504 16501120 16263870 15899717 15396850 14767851
38817 14767851 14037760 13233637 12380067 11498140 10603018 9699594 8781577 7838782 6870181
$$ packed form
38879A5263638J479454J359205J194386J006730Q23628O75888N88724N70413O07147
38870B3569213O69237P25858P59589P72295P78951P92205Q05528P85472O81317
38861C0339665M50172Q3204l84360q85121j343622j698432j914839j988343j940446
38852B0717878j807996j629586j434574j238155j042105q39115o19176l76067
38844A1731104j11805J62006M25384O53314Q21385R13004R25203Q69342P65388
38835A7154325O32541M82327L19027J46533k5063j78866k95987l61218l67513
38826A7506106l20395k41273j64753j27181j51384k37250l64153n02867o28999
38817A4767851p30091q04123q53570q81927q95122r03424r18017r42795r68601
$$ plain form
38808 6870181 5894200 4949164 4083961 3344431 2760567 2336707 2046686 1838295 1650288
38799 1650288 1437214 1188351 927785 695306 521967 416371 367031 353761 358337 370551
38789 370551 391169 433015 519587 682154 958970 1397691 2055363 2988412 4232710 5783204
38779 5783204 7583375 9527054 11469198 13243878 14690704 15687351 16177362 16178854 15767721
38770 15767721 15043888 14099386 13003416 11804954 10541185 9241094 7924230 6601227
38762 6601227 5278623 3963168 2660879 1372738 93601 -1181444 -2445380 -3669045
38754 -3669045 -4799438 -5768621 -6508473 -6963819 -7100422 -6909592 -6410699 -5648341 -4680683
38745 -4680683 -3562305 -2331087 -1006782 399384 1871630 3381462 4888283 6346164
$$ packed form
38808F870181r75981r45036q65203p39530n83864m23860k90021k08391j88007
38799A650288k13074k48863k60566k32479j73339j05596m9340j3270M576J2214
38789C70551K0618M1846Q6572J62567K76816M38721O57672R33049J244298J550494
38779E783204J800171J943679J942144J774680J446826R96647M90011J492m11133
38770A5767721p23833r44502j095970j198462j263769j300091j316864j323003
38762F601227j322604j315455j302289j288141j279137j275045j263936j223665
38754c669045j130393r69183p39852m55346j36603J90830M98893P62358R67658
38745d680683J118378J231218J324305J406166J472246J509832J506821J457881
$$ plain form
38737 6346164 7710704 8942787 10011935 10903438 11627492 12222841 12749772 13275775 13861930
38728 13861930 14555296 15386818 16371124 17504437 18758606 20072955 21349899 22460721
38720 22460721 23263514 23629944 23474900 22781583 21612515 20098225 18404012 16687198 15062323
38711 15062323 13586115 12263302 11065992 9956104 8901496 7882158 6890044 5929218
38703 5929218 5018731 4194171 3502295 2988044 2679119 2575375 2648033 2848924 3125420 3434597
38693 3434597 3751632 4070249 4395169 4729082 5060798 5363314 5605332 5769538 5865177 5927124
38683 5927124 6003518 6139696 6364583 6681872 7067111 7472730 7842303 8130595 8319759 8420938
38673 8420938 8459179 8452637 8402866 8304398 8166230 8029507 7969766 8081981 8453514 9133424
$$ packed form
38737F346164J364540J232083J069148Q91503P24054N95349N26931N26003N86155
38728A3861930O93366Q31522R84306J133313J254169J314349J276944J110822
38720B2460721Q02793L66430j55044o93317j169068j514290j694213j716814j624875
38711A5062323j476208j322813j197310j109888j054608j019338r92114r60826
38703E929218r10487q24560o91876n14251l08925j03744P2658K00891K76496L09177
38693C434597L17035L18617L24920L33913L31716L02516K42018J64206R5639O1947
38683E927124P6394J36178K24887L17289L85239M05619L69573K88292J89164J01179
38673H420938L8241o542m9771r8468j38168j36723n9741J12215L71533O79910
$$ plain form
38663 9133424 10109259 11302800 12589074 13830720 14912281 15763278 16368435 16766943 17039066
38654 17039066 17278449 17557870 17905090 18301109 18697770 19040467 19283719 19396336 19358920
38645 19358920 19158536 18785939 18239025 17530601 16693845 15780618 14853715 13976722 13203368
38636 13203368 12567355 12075890 11710673 11435874 11208055 10983587 10723917 10402092 10011866
38627 10011866 9575462 9142731 8777156 8532231 8429170 8447127 8530098 8606545 8613765 8518319
38617 8518319 8325005 8070187 7802470 7560865 7362406 7205092 7081604 6991616 6941665 6931667
38607 6931667 6938851 6912822 6787028 6499880 6013853 5324671 4459541 3467217 2403807 1319041
38597 1319041 248180 -787360 -1772465 -2689821 -3516315 -4225561 -4793623 -5204746 -5456393
$$ packed form
38663I133424R75835J193541J286274J241646J081561Q50997O05157L98508K72123
38654A7039066K39383K79421L47220L96019L96661L42697K43252J12617l7416
38645A9358920k00384l72597n46914p08424q36756r13227r26903q76993p73354
38636A3203368o36013m91465l65217k74799k27819k24468k59670l21825l90226
38627A0011866m36404m32731l65575k44925j03061J7957Q2971P6447P220r5446
38617H518319j93314k54818k67717k41605j98459j57314j23488q9988m9951r998
38607F931667P184k6029j25794k87148m86027o89182q65130r92324j063410j084766
38597A319041j070861j035540r85105r17356q26494p09246n68062m11123k51647
$$ plain form
38588 -5456393 -5563368 -5558308 -5484833 -5383521 -5276996 -5162444 -5015481 -4802003 -4490392 -4058353
38578 -4058353 -3495049 -2803702 -2007053 -1150161 -292170 512717 1232266 1856845 2383338
38569 2383338 2797550 3070882 3172483 3084558 2808753 2361988 1767876 1049775 228506 -673863
38559 -673863 -1624968 -2573722 -3451352 -4185506 -4720598 -5032532 -5131183 -5053261 -4852201 -4589557
38549 -4589557 -4329066 -4132937 -4058439 -4151370 -4434426 -4894162 -5475510 -6091474 -6646831 -7065128
38539 -7065128 -7305885 -7365915 -7268622 -7050026 -6747699 -6393803 -6011431 -5614284 -5209375 -4800332
38529 -4800332 -4388037 -3968469 -3531642 -3065803 -2566645 -2046416 -1537299 -1087049 -748915
38520 -748915 -569203 -575528 -768884 -1122623 -1589263 -2112383 -2639105 -3130306 -3567499 -3955140
$$ packed form
38588e456393j06975N060P3475J01312J06525J14552J46963K13478L11611M32039
38578d058353N63304O91347P96649Q56892Q57991Q04887P19549O24579N26493
38569B383338M14212K73332J01601q7925k75805m46765n94112p18101q21269r02369
38559f73863r51105r48754q77630p34154n35092l11934r8651P7922K01060K62644
38549d589557K60491J96129P4498r2931k83056m59736n81348o15964n55357m18297
38539g065128k40757o0030R7293K18596L02327L53896L82372L97147M04909M09043
38529d800332M12295M19568M36827M65839M99158N20229N09117M50250L38134
38520g48915J79712o325j93356l53739m66640n23120n26722m91201m37193l87641
$$ plain form
38510 -3955140 -4317355 -4690804 -5117892 -5642037 -6301613 -7119136 -8089168 -9173830 -10310816
38501 -10310816 -11429006 -12461980 -13354668 -14066398 -14575705 -14887096 -15033733 -15069276 -15048336
38492 -15048336 -15003685 -14932780 -14801949 -14566001 -14191517 -13670878 -13021593 -12275749 -11470041 -10644330
38482 -10644330 -9848613 -9150648 -8634888 -8388790 -8480541 -8937095 -9730804 -10778763 -11954446
38473 -11954446 -13108308 -14092802 -14787286 -15118606 -15073009 -14695769 -14077855 -13333579 -12575913
38464 -12575913 -11895099 -11343245 -10926021 -10602905 -10296918 -9912362 -9355885 -8554614 -7466356
38455 -7466356 -6080806 -4415851 -2515301 -451525 1670304 3714769 5533140 6994597
38447 6994597 8021146 8609402 8827579 8791083 8632491 8479430 8440643 8592745 8966594 9542178
$$ packed form
38510c955140l62215l73449m27088n24145o59576q17523r70032j084662j136986
38501a0310816j118190j032974q92688p11730n09307l11391j46637l5543K0940
38492a5048336M4651P0905J30831K35948L74484N20639O49285P45844Q05708Q25711
38482a0644330P95717O97965N15760K46098r1751m56554p93709j047959j175683
38473a1954446j153862r84494o94484l31320M5597L77240O17914P44276P57666
38464a2575913O80814N51854M17224L23116L05987L84556N56477Q01271J088258
38455g466356J385550J664955J900550K063776K121829K044465J818371J461457
38447F994597J026549N88256K18177l6496j58592j53061l8787J52102L73849N75584
$$ plain form
38437 9542178 10259474 11041081 11815147 12530818 13165500 13724576 14232692 14718523 15200426
38428 15200426 15680528 16147371 16580022 16947911 17208046 17305737 17181839 16783112 16070623
38419 16070623 15024647 13647827 11967178 10033059 7914518 5694124 3465385 1330734
38411 1330734 -605682 -2252777 -3549188 -4472100 -5032860 -5262240 -5193128 -4847349 -4229783
38402 -4229783 -3331553 -2143385 -676416 1019429 2852523 4707632 6476339 8082194
38394 8082194 9487395 10680701 11656948 12400634 12881264 13061364 12912684 12433474 11659806
38385 11659806 10666240 9555255 8439746 7425801 6601093 6028775 5743247 5745614 6000120
38376 6000120 6434050 6942914 7402799 7690943 7710711 7410913 6789540 5880840 4734194
$$ packed form
38437I542178P17296P81607P74066P15671O34682N59076N08116M85831M81903
38428A5200426M80102M66843M32651L67889K60135R7691j23898l98727p12489
38419A6070623j045976j376820j680649j934119k118541k220394k228739k134651
38411A330734j936416j647095j296411r22912n60760k29380O9112L45779O17566
38402d229783Q98230J188168J466969J695845J833094J855109J768707J605855
38394H082194J405201J193306R76247P43686M80630J80100j48680m79210p73668
38385A1659806r93566j110985j115509j013945q24708n72318k85528K367K54506
38376F000120M33930N08864M59885K88144J9768k99798o21373r08700j146646
$$ plain form
38367 4734194 3395639 1898895 268296 -1467948 -3261568 -5037167 -6702253 -8169565
38359 -8169565 -9376768 -10292014 -10906724 -11225269 -11258413 -11020394 -10528114 -9803955 -8882954
38350 -8882954 -7818664 -6678296 -5524245 -4391483 -3275843 -2141866 -946250 335152
38342 335152 1688778 3059965 4364986 5512676 6425878 7053870 7373287 7383055 7102210
38333 7102210 6574981 5878417 5121392 4426811 3900299 3599559 3519539 3599382 3746170 3865797
38323 3865797 3891608 3802387 3623425 3411283 3232212 3146539 3202376 3431035 3836325 4380936
38313 4380936 4982435 5527846 5902840 6021757 5845343 5381373 4672026 3776576 2758063
38304 2758063 1678440 600039 -413678 -1303972 -2028179 -2568464 -2930172 -3130205 -3184936
$$ packed form
38367D734194j338555j496744j630599j736244j793620j775599j665086j467312
38359h169565j207203r15246o14710l18545l3144K38019M92280P24159R21001
38350h882954J064290J140368J154051J132762J115640J133977J195616J281402
38342C35152J353626J371187J305021J147690R13202O27992L19417R768k80845
38333G102210n27229o96564p57025o94581n26512l00740q0020P9843J46788J19627
38323C865797K5811q9221j78962k12142j79071q5673N5837K28659M05290N44611
38313D380936O01499N45411L74994J18917j76414m63970p09347q95450j018513
38304B758063j079623j078401j013717q90294p24207n40285l61708k00033n4731
$$ plain form
38295 -3184936 -3107950 -2918532 -2651001 -2353700 -2076510 -1856803 -1714835 -1660627 -1705667 -1871520
38285 -1871520 -2191290 -2702848 -3434287 -4385572 -5514056 -6731028 -7911256 -8912785 -9603162
38276 -9603162 -9886973 -9725778 -9140453 -8193281 -6959693 -5506176 -3885584 -2148053 -355146
38267 -355146 1416225 3084658 4582060 5864687 6909817 7702749 8225486 8454450 8365911
38258 8365911 7943200 7181377 6088802 4688136 3019465 1144840 -851719 -2875158
38250 -2875158 -4839855 -6688483 -8397354 -9966990 -11407977 -12732775 -13954648 -15086149
38242 -15086149 -16130707 -17069705 -17854772 -18413759 -18670287 -18568742 -18094695 -17284311 -16220707
38233 -16220707 -15018797 -13803441 -12688088 -11759525 -11069108 -10628092 -10407793 -10349377 -10385017
$$ packed form
38295c184936P6986J89418K67531K97301K77190K19707J41968N4208m5040j65853
38285a871520l19770n11558p31439r51285j128484j216972j180228j001529o90377
38276i603162k83811J61195N85325R47172J233588J453517J620592J737531J792907
38267c55146J771371J668433J497402J282627J045130P92932N22737K28964q8539
38258H365911m22711p61823j092575j400666j668671j874625j996559k023439
38250b875158j964697j848628j708871j569636j440987j324798j221873j131501
38242a5086149j044558r38998p85067n58987k56528J01545M74047Q10384J063604
38233a6220707J201910J215356J115353R28563O90417M41016K20299N8416l5640
$$ plain form
38224 -10385017 -10462790 -10562574 -10695938 -10894550 -11197527 -11643932 -12267745 -13087595 -14087424 -15194742
38214 -15194742 -16272226 -17136031 -17599052 -17520840 -16841812 -15590277 -13865449 -11807550 -9566925
38205 -9566925 -7281675 -5068442 -3023920 -1229669 245072 1342888 2018860 2243924
38197 2243924 2011951 1346575 301318 -1048225 -2613913 -4299378 -5998977 -7597932
38189 -7597932 -8980675 -10048835 -10742858 -11056993 -11039803 -10780410 -10387768 -9970370 -9618781
38180 -9618781 -9390737 -9301464 -9324777 -9407259 -9490028 -9528219 -9501690 -9417014 -9304024 -9208270 -9179129
38169 -9179129 -9255419 -9454043 -9767232 -10169060 -10626421 -11107934 -11586816 -12038057 -12433544 -12739725
38159 -12739725 -12920845 -12947330 -12805108 -12499444 -12048752 -11470314 -10767072 -9925707 -8929221
$$ packed form
38224a0385017p7773r9784j33364j98612l02977m46405o23813q19850r99829j107318
38214a5194742j077484q63805m63021P8212O79028J251535J724828K057899K240625
38205i566925K285250K213233K044522J794251J474741J097816O75972K25064
38197B243924k31973o65376j045257j349543j565688j685465j699599j598955
38189g597932j382743j068160o94023l14135J7190K59393L92642M17398L51589
38180i618781K28044Q9273k3313q2482q2769l8191K6529Q4676J12990R5754K9141
38169i179129p6290j98624l13189m01828m57361m81513m78882m51241l95487l06181
38159a2739725j81120k6485J42222L05664M50692N78438P03242Q41365R96486
$$ plain form
38150 -8929221 -7778020 -6509448 -5206942 -3992366 -2999448 -2335668 -2049693 -2120659 -2472873
38141 -2472873 -3006496 -3630904 -4288782 -4960123 -5641494 -6312016 -6911039 -7345746 -7523169
38132 -7523169 -7384321 -6922887 -6185898 -5261317 -4256680 -3273599 -2386644 -1634507 -1024039
38123 -1024039 -541114 -162057 136851 371903 547422 656192 685495 625105 470597 218538
38113 218538 -141569 -628406 -1257363 -2021590 -2877731 -3746047 -4526221 -5122278 -5466671 -5534440
38103 -5534440 -5342468 -4934830 -4361103 -3658255 -2845022 -1930581 -930861 117461 1151979
38094 1151979 2089438 2837564 3309502 3437379 3184864 2561214 1635660 541839 -540734
38085 -540734 -1429249 -1986872 -2155093 -1957500 -1481480 -852623 -211665 305596 589320 577690
$$ packed form
38150h929221J151201J268572J302506J214576R92918O63780K85975p0966l52214
38141b472873n33623o24408o57878o71341o81371o70522n99023m34707j77423
38132g523169J38848M61434P36989R24581J004637R83081Q86955P52137O10468
38123a024039M82925L79057K98908K35052J75519J08770K9303o0390j54508k52059
38113B18538l60107m86837o28957p64227q56141q68316p80174n96057l44393o7769
38103e534440J91972M07638N73727P02848Q13233R14441R99720J048322J034518
38094A151979R37459P48126M71938J27877k52515o23650r25554j093821j082573
38085e40734q88515n57623j68221J97593M76020O28857O40958N17261K83724j1630
$$ plain form
38075 577690 273031 -257480 -899822 -1523609 -2013956 -2295367 -2342642 -2177549 -1854414 -1441791
38065 -1441791 -1007297 -607903 -283602 -52416 92838 184191 272705 416604 666359 1054289
38055 1054289 1595566 2298654 3173646 4227240 5444735 6772299 8115230 9357579 10393367
38046 10393367 11151330 11600530 11738993 11579550 11146328 10483112 9662039 8779123 7934138
38037 7934138 7206789 6645231 6272176 6098960 6133567 6377171 6813412 7397463 8051158 8670654
38027 8670654 9149628 9409701 9419991 9193200 8764357 8170467 7442418 6604543 5671849 4644394
38017 4644394 3508167 2248413 868514 -599228 -2097302 -3555612 -4903812 -6080172
38009 -6080172 -7038873 -7754917 -8222265 -8444007 -8421116 -8148482 -7621092 -6845925 -5853005 -4700921
$$ packed form
38075E77690l04659n30511o42342o23787m90347k81411m7275J65093L23135M12623
38065a441791M34494L99394L24301K31186J45254R1353Q8514J43899K49755L87930
38055A054289N41277P03088Q74992J053594J217495J327564J342931J242349J035788
38046A0393367P57963M49200J38463j59443m33222o63216q21073q82916q44985
38037G934138p27349n61558l73055j73216L4607K43604M36241N84051O53695O19496
38027H670654M78974K60073J0290k26791m28843n93890p28049q37875r32694j027455
38017D644394j136227j259754j379899j467742j498074j458310j348200j176360
38009f080172r58701p16044m67348k21742K2891K72634N27390P75167R92920J152084
$$ plain form
37999 -4700921 -3474824 -2277355 -1215585 -388474 122362 259491 -3025 -651682 -1629813
37990 -1629813 -2844213 -4181972 -5528977 -6780935 -7846423 -8649090 -9133746 -9273272 -9070507
37981 -9070507 -8553895 -7769819 -6774535 -5627600 -4388826 -3119195 -1882270 -741021 251438
37972 251438 1063778 1695574 2178756 2568548 2925572 3296609 3703509 4144699 4605879 5071787
37962 5071787 5531390 5973246 6374660 6693509 6869757 6835403 6525994 5890423 4901939 3572310
37952 3572310 1963478 187364 -1610067 -3275686 -4678082 -5730734 -6404621 -6727921
37944 -6727921 -6773381 -6637135 -6415254 -6184574 -5991752 -5850879 -5747504 -5646643 -5503041 -5272075
37934 -5272075 -4919822 -4430773 -3811202 -3086178 -2291144 -1463390 -638818 146633 857017
$$ packed form
37999d700921J226097J197469J061770Q27111N10836J37129k62516o48657r78131
37990a629813j214400j337759j347005j251958j065488q02667m84656j39526K02765
37981i070507N16612P84076R95284J146935J238774J269631J236925J141249R92459
37972B51438Q12340O31796M83182L89792L57024L71037M06900M41190M61180M65908
37962E071787M59603M41856M01414L18849J76248l4354l09409o35571r88484j329629
37952C572310j608832j776114j797431j665619j402396j052652o73887l23300
37944f727921m5460J36246K21881K30680J92822J40873J03375J00861J43602K30966
37934e272075L52253M89049O19571P25024P95034Q27754Q24572P85451P10384
$$ plain form
37925 857017 1462104 1946515 2316312 2598572 2831689 3046483 3243388 3377257 3360722 3087224
37915 3087224 2463795 1440784 30313 -1689885 -3588541 -5507956 -7300080 -8859955
37907 -8859955 -10143711 -11164608 -11970942 -12617456 -13142371 -13556902 -13848808 -13997722 -13995616
37898 -13995616 -13861082 -13637301 -13374187 -13108067 -12854511 -12617995 -12407164 -12241381 -12145042
37889 -12145042 -12138145 -12232515 -12434224 -12746559 -13170278 -13702574 -14335059 -15046952 -15792050 -16487462
37879 -16487462 -17017820 -17261722 -17131912 -16609656 -15755952 -14695699 -13586139 -12586590 -11838734
37870 -11838734 -11454063 -11500794 -11990429 -12873115 -14048748 -15389438 -16761123 -18035450 -19092327
37861 -19092327 -19819709 -20117068 -19904933 -19137817 -17814343 -15979015 -13715603 -11137998 -8384472
$$ packed form
37925H57017O05087M84411L69797K82260K33117K14794J96905J33869j6535k73498
37915C087224o23429j023011j410471j720198j898656j919415j792124j559875
37907h859955j283756j020897q06334o46514n24915m14531k91906j48914K106
37898a3995616J34534K23781K63114K66120K53556K36516K10831J65783R6339
37889a2145042O897r4370k01709l12335m23719n32296o32485p11893p45098o95412
37879a6487462n30358k43902J29810N22256Q53704J060253J109560R99549P47856
37870a1838734L84671m6731m89635q82686j175633j340690j371685j274327j056877
37861a9092327p27382k97359K12135P67116J323474J835328K263412K577605K753526
$$ plain form
37852 -8384472 -5614720 -3002527 -717438 1103360 2383117 3120822 3386204 3296715 2987556
37843 2987556 2587370 2205675 1928874 1817654 1901225 2168600 2560368 2967257 3243962 3242622
37833 3242622 2857229 2057986 897190 -513929 -2041401 -3560423 -4975860 -6231969
37825 -6231969 -7312111 -8228510 -9005878 -9666661 -10222943 -10673563 -11002615 -11179953 -11167762
37816 -11167762 -10933694 -10464168 -9770631 -8888090 -7869872 -6779688 -5678313 -4606523 -3574918
37807 -3574918 -2571339 -1583474 -620431 282635 1079258 1734881 2244860 2638933 2970940
37798 2970940 3297756 3655479 4042552 4416889 4707480 4834914 4733782 4372079 3764465
37789 3764465 2976005 2113674 1306701 680949 333511 312632 608406 1159931 1879323 2682866
$$ packed form
37852h384472K769752K612193K285089J820798J279757P37705K65382q9489l09159
37843B987556m00186l81695k76801j11220Q3571K67375L91768M06889K76705j340
37833C242622l85393p99243j160796j411119j527472j519022j415437j256109
37825f231969j080142r16399p77368o60783n56282m50620l29052j77338J2191
37816a1167762K34068M69526O93537Q82541J018218J090184J101375J071790J031605
37807c574918J003579R87865R63043R03066P96623O55623N09979L94073L32007
37798B970940L26816L57723L87073L74337K90591J27434j01132l61703o07614
37789C764465p88460q62331q06973o25752l47438k0879K95774N51525P19392Q03543
$$ plain form
37779 2682866 3513546 4344640 5166513 5967834 6722512 7387805 7912243 8247242 8355521
37770 8355521 8213645 7812207 7159078 6285695 5249391 4124786 2986714 1896520 902005
37761 902005 48693 -610725 -1019959 -1134964 -942229 -469544 215930 1022859 1860087 2661163
37751 2661163 3399126 4087522 4770488 5506739 6350623 7333841 8452906 9665446 10894083
37742 10894083 12035946 12979180 13627787 13929312 13892733 13584901 13103530 12537247 11931539
37733 11931539 11278387 10534628 9656322 8627168 7466094 6215255 4920672 3617591
$$ packed form
37779B682866Q30680Q31094Q21873Q01321P54678O65293N24438L34999J08279
37770H355521j41876m01438o53129q73383j036304j124605j138072j090194r94515
37761I02005q53312o59418m09234j15005J92735M72685O85474Q06929Q37228Q01076
37751B661163P37963O88396O82966P36251Q43884R83218J119065J212540J228637
37742A0894083J141863R43234O48607L01525l6579l07832m81371n66283o05708
37733A1931539o53152p43759q78306j029154j161074j250839j294583j303081
$$ [...]
##END NTUPLES=NMR SPECTRUM
##END=
