##TITLE=31Pdec_DE-27sr3
 D2O
 24 sc
 13.2.2024
##JCAMPDX= 6.0         $$ Bruker NMR JCAMP-DX V2.0
##DATA TYPE= NMR SPECTRUM
##DATA CLASS= NTUPLES
##ORIGIN= UXNMR, Bruker Analytische Messtechnik GmbH
##OWNER= root
$$ XWIN-NMR		Version 3.5
$$ Tue Feb 13 16:15:28 2024 Russian Standard Time (UT+4h)  she@DPX200
##.OBSERVE FREQUENCY= 81.013821
##.OBSERVE NUCLEUS= ^31P
##.ACQUISITION MODE= SIMULTANEOUS
##.ACQUISITION SCHEME= undefined
##.AVERAGES= 24
##.DIGITISER RES= 16
##SPECTROMETER/DATA SYSTEM= spect
##.PULSE SEQUENCE= zgpg30
##.SOLVENT NAME= D2O
##.SHIFT REFERENCE= (INTERNAL, D2O, 0, 248.564)
##AUDIT TRAIL= $$ (NUMBER, WHEN, WHO, WHERE, WHAT)
$$ ##TITLE= Audit trail, XWIN-NMR		Version 3.5
$$ ##JCAMPDX= 5.01
$$ ##ORIGIN= Bruker BioSpin GmbH
$$ ##OWNER= she
$$ F:/spectra/data/she/nmr/P31/1/pdata/1/auditp.txt
$$ ##AUDIT TRAIL=  $$ (NUMBER, WHEN, WHO, WHERE, WHAT)
(   1,<2024-02-13 16:14:05.87 +0400>,<she>,<DPX200>,
      <created by zg, POWCHK disabled, PULCHK disabled
       configuration hash MD5:
       00 E9 B6 7A A2 85 ED C7 34 08 36 98 17 FE 4E 26
       data hash MD5: 32K
       A5 A6 A5 11 22 15 CA 4C 20 EF 68 A9 51 40 73 46>)
(   2,<2024-02-13 16:14:08.43 +0400>,<she>,<DPX200>,
      <Start of raw data processing
       efp BC_mod = 2 LB = 10 FT_mod = 6 PKNL = 1 PHC0 = -13021.91 PHC1 = 388.4835 SI = 64K 
       data hash MD5: 64K
       70 C9 39 CE 5E E5 74 B4 95 9F 7A 6B 41 26 57 07>)
(   3,<2024-02-13 16:14:27.87 +0400>,<she>,<DPX200>,
      <pk PHC0 = 197.9374 PHC1 = -452.6 
       data hash MD5: 64K
       09 B7 C6 E8 B7 37 79 AA 62 26 FF 8F AF BB 3A 98>)
(   4,<2024-02-13 16:15:00.76 +0400>,<she>,<DPX200>,
      <pk PHC0 = 65.75253 PHC1 = -154.6 
       data hash MD5: 64K
       F7 DD F1 01 81 E3 0A 55 E5 8A BD 24 17 55 41 33>)
$$ ##END=
$$ 
$$ hash MD5
$$ D7 51 1B 63 09 FE EE 58 5F 3D 4A 25 A3 06 DA 8D
##$RELAX= 
##$RELAX= 
##$RELAX= 
##$RELAX= 
##$RELAX= 
##$RELAX= 
##$RELAX= 
##$RELAX= 
##$RELAX= 
$$ Bruker specific parameters
$$ --------------------------
##$DU= <F:/spectra>
##$EXPNO= 1
##$NAME= <P31>
##$PROCNO= 1
##$TYPE= <nmr>
##$USER= <she>
##$AMP= (0..31)
100 100 100 100 100 100 100 100 100 100 100 100 100 100 100 100 100 100 
100 100 100 100 100 100 100 100 100 100 100 100 100 100 
##$AQSEQ= 0
##$AQ_mod= 1
##$AUNM= <au_zg>
##$AUTOPOS= <>
##$BF1= 81.014009
##$BF2= 200.13
##$BF3= 200.13
##$BF4= 200.13
##$BF5= 200.13
##$BF6= 200.13
##$BF7= 200.13
##$BF8= 200.13
##$BYTORDA= 1
##$CFDGTYP= 0
##$CFRGTYP= 5
##$CHEMSTR= <none>
##$CNST= (0..31)
1 1 145 1 1 1 1 1 1 1 1 1 1 1 1 1 1 1 1 1 1 1 1 1 1 1 1 1 1 1 1 1 
##$CPDPRG= <waltz16>
##$CPDPRG1= <>
##$CPDPRG2= <waltz16>
##$CPDPRG3= <>
##$CPDPRG4= <mlev>
##$CPDPRG5= <mlev>
##$CPDPRG6= <mlev>
##$CPDPRG7= <mlev>
##$CPDPRG8= <mlev>
##$CPDPRGB= <>
##$CPDPRGT= <>
##$D= (0..31)
0 1 0 0 0 0 0 0 0 0 0 0.03 2e-05 3e-06 0 0 0 0 0 0 0 0 0 0 0 0 0 0 0 0 
0 0 
##$DATE= 1707826445
##$DBL= (0..7)
120 120 120 11 120 120 24 19 
##$DBP= (0..7)
150 150 150 150 150 150 150 150 
##$DBP07= 0
##$DBPNAM0= <>
$$ [...]
##$SUBNAM2= <"">
##$SUBNAM3= <"">
##$SUBNAM4= <"">
##$SUBNAM5= <"">
##$SUBNAM6= <"">
##$SUBNAM7= <"">
##$SUBNAM8= <"">
##$SUBNAM9= <"">
##$SW= 501.771253377433
##$SWIBOX= (0..15)
0 1 3 0 0 0 0 0 0 0 0 0 0 0 0 0 
##$SW_h= 40650.406504065
##$TD= 32768
##$TD0= 1
##$TE= 0
##$TE2= 300
##$TE3= 300
##$TEG= 300
##$TL= (0..7)
0 120 53 12 22 120 120 120 
##$TP= (0..7)
150 150 150 150 150 150 150 150 
##$TP07= 0
##$TPNAME0= <>
##$TPNAME1= <>
##$TPNAME2= <>
##$TPNAME3= <>
##$TPNAME4= <>
##$TPNAME5= <>
##$TPNAME6= <>
##$TPNAME7= <>
##$TPOAL= (0..7)
0.5 0.5 0.5 0.5 0.5 0.5 0.5 0.5 
##$TPOFFS= (0..7)
0 0 0 0 0 0 0 0 
##$TUNHIN= 0
##$TUNHOUT= 0
##$TUNXOUT= 0
##$USERA1= <user>
##$USERA2= <user>
##$USERA3= <user>
##$USERA4= <user>
##$USERA5= <user>
##$V9= 5
##$VALIST= <valist>
##$VCLIST= <CCCCCCCCCCCCCCC>
##$VD= 0
##$VDLIST= <DDDDDDDDDDDDDDD>
##$VPLIST= <PPPPPPPPPPPPPPP>
##$VTLIST= <TTTTTTTTTTTTTTT>
##$WBST= 1024
##$WBSW= 4
##$XGAIN= (0..3)
0 0 0 0 
##$XL= 0
##$YL= 0
##$YMAX_a= 1718
##$YMIN_a= -3980
##$ZGOPTNS= <>
##$ZL1= 120
##$ZL2= 120
##$ZL3= 120
##$ZL4= 120
##$ABSF1= 0
##$ABSF2= 0
##$ABSG= 0
##$ABSL= 0
##$ALPHA= 0
##$AQORDER= 0
##$ASSFAC= 0
##$ASSFACI= 0
##$ASSFACX= 0
##$ASSWID= 0
##$AUNMP= <proc_1d>
##$AZFE= 0.1
##$AZFW= 0.5
##$BCFW= 0
##$BC_mod= 2
##$BYTORDP= 0
##$COROFFS= 0
##$CY= -3
##$DATMOD= 1
##$DC= 0
##$DFILT= <>
##$DTYPP= 0
##$F1P= 0
##$F2P= 0
##$FCOR= 1
##$FTSIZE= 65536
##$FT_mod= 6
##$GAMMA= 0
##$GB= 0
##$INTBC= 1
##$INTSCL= 6.047779e-11
##$ISEN= 30
##$LB= 10
##$LEV0= 0
##$LPBIN= 0
##$MAXI= 10000
##$MC2= 0
##$MEAN= 0
##$ME_mod= 0
##$MI= 50
##$NCOEF= 0
##$NC_proc= -10
##$NLEV= 6
##$NOISF1= 182.463
##$NOISF2= 159.3651
##$NSP= 0
##$NTH_PI= 0
##$NZP= 0
##$OFFSET= 248.5645
##$PC= 4
##$PHC0= -12758.22
##$PHC1= -218.7165
##$PH_mod= 1
##$PKNL= yes
##$PPARMOD= 0
##$PSCAL= 0
##$PSIGN= 0
##$REVERSE= no
##$SF= 81.0140089999694
##$SI= 65536
##$SIGF1= 159.3651
##$SIGF2= -187.1042
##$SINO= 113.3802
##$SIOLD= 16384
##$SREGLST= <1H.CDCl3>
##$SSB= 0
##$STSI= 65536
##$STSR= 0
##$SW_p= 40650.406504065
##$SYMM= 0
##$S_DEV= 0
##$TDeff= 32768
##$TDoff= 0
##$TI= <>
##$TILT= no
##$TM1= 0
##$TM2= 0
##$TOPLEV= 0
##$USERP1= <user>
##$USERP2= <user>
##$USERP3= <user>
##$USERP4= <user>
##$USERP5= <user>
##$WDW= 1
##$XDIM= 65536
##$YMAX_p= 478375582
##$YMIN_p= -24484690
$$ End of Bruker specific parameters
$$ ---------------------------------
##NTUPLES= NMR SPECTRUM
##VAR_NAME=  FREQUENCY,     SPECTRUM/REAL,   SPECTRUM/IMAG
##SYMBOL=    X,             R,               I
##VAR_TYPE=  INDEPENDENT,   DEPENDENT,       DEPENDENT
##VAR_FORM=  AFFN,          ASDF,            ASDF
##VAR_DIM=   65536,         65536,           65536
##UNITS=     HZ,            ARBITRARY UNITS, ARBITRARY UNITS
##FACTOR=    0.620285442955139, 1,           1
##FIRST=     20137.2065510682, 0,            0
##LAST=      -20513.1999529968, 0,           0
##MIN=       -20513.1999529968, -24484690,   0
##MAX=       20137.2065510682, 478375582,    0
$$ Real data points
##PAGE= N=1
##DATA TABLE= (X++(R..R)), XYDATA
$$ [...]
38697 2584198 3048485 3452318 3814688 4145020 4451332 4746293 5046586 5366458 5709961
38688 5709961 6066554 6412204 6714703 6940072 7057894 7046158 6897076 6622687 6255873 5843445
38678 5843445 5433273 5061362 4743756 4474303 4227338 3964615 3645668 3239480 2734537
38669 2734537 2144447 1506753 873405 294667 -197179 -596211 -919295 -1194352 -1448968
38660 -1448968 -1705822 -1984110 -2300818 -2667423 -3084096 -3537321 -4003814 -4457926 -4877637
38651 -4877637 -5246474 -5551166 -5776031 -5896749 -5878026 -5678429 -5260719 -4602011 -3698634 -2564735
38641 -2564735 -1227419 276756 1900429 3580981 5241023 6800775 8198707 9406586
38633 9406586 10427710 11281145 11985097 12549524 12978024 13273561 13443851 13504350 13477466 13388455
38623 13388455 13261281 13117096 12973530 12840745 12714407 12571306 12373284 12079321 11660329
38614 11660329 11109772 10444679 9695481 8890016 8042865 7158728 6247299 5337257 4478384
38605 4478384 3730839 3148905 2767251 2594265 2613526 2791487 3087156 3460151 3876635 4314538
38595 4314538 4767522 5244680 5763862 6339933 6972167 7636104 8284807 8860550 9311070
38586 9311070 9600373 9708709 9626414 9351248 8893605 8284492 7577280 6838167 6128071 5484555
38576 5484555 4912967 4390777 3881609 3351663 2783262 2183837 1588981 1056662 651560
38567 651560 424428 395843 551696 850912 1239599 1664300 2079760 2451119 2753413 2971559
38557 2971559 3101799 3152944 3144554 3100948 3043830 2988596 2946575 2929421 2949280 3013148 3116547
38546 3116547 3242712 3368020 3469479 3530026 3539881 3493932 3386734 3209013 2949799 2603985
38536 2603985 2179918 1701228 1201917 718028 279620 -95329 -404926 -665271 -909959
38527 -909959 -1186331 -1547705 -2042215 -2701334 -3531714 -4512052 -5594467 -6709988 -7779094
38518 -7779094 -8727409 -9502819 -10086521 -10491044 -10744797 -10871616 -10878431 -10759350 -10512457 -10155914
38508 -10155914 -9731183 -9291924 -8887185 -8548650 -8285401 -8084468 -7915978 -7743818 -7540837
38499 -7540837 -7302166 -7048548 -6817049 -6644565 -6552771 -6540451 -6584965 -6651715 -6707418 -6730068
38489 -6730068 -6709615 -6640361 -6512916 -6313194 -6028831 -5657572 -5212310 -4720398 -4216295 -3727914
38479 -3727914 -3261284 -2793060 -2279333 -1679703 -984401 -228998 511176 1142939 1582099
38470 1582099 1774503 1705313 1395532 888741 234889 -520337 -1335759 -2167786 -2964904 -3669922
38460 -3669922 -4228975 -4601275 -4764567 -4715875 -4470291 -4060504 -3537015 -2966073 -2421819 -1971959
38450 -1971959 -1660982 -1497822 -1453912 -1473392 -1492142 -1458247 -1345851 -1157623 -916682 -653270
38440 -653270 -392449 -147276 81298 300028 518473 746274 991647 1258410 1541364 1823548
38430 1823548 2079201 2282595 2418797 2490562 2516785 2522415 2525810 2532511 2539818 2547389 2564339 2607787
38418 2607787 2695638 2839247 3038387 3278213 3528857 3750091 3901920 3958217 3917961 3808871
38408 3808871 3680922 3591380 3587371 3693311 3906930 4202235 4535682 4854159 5105130 5247210
38398 5247210 5256769 5128020 4869219 4499427 4046598 3544479 3027375 2525340 2061310 1648054
38388 1648054 1283497 948884 616739 268567 -87938 -414757 -656914 -767035 -729082 -570108
38378 -570108 -353934 -158846 -49868 -59106 -182251 -389534 -642797 -910449 -1175519 -1435251
38368 -1435251 -1693397 -1949641 -2192759 -2402151 -2556450 -2642763 -2660272 -2616804 -2521794 -2379983
38358 -2379983 -2188122 -1935035 -1604701 -1182175 -661218 -51051 621775 1319538 2006792
38349 2006792 2664938 3299296 3933535 4594117 5293445 6020484 6742047 7411253 7976891
38340 7976891 8389834 8607270 8597174 8342468 7841568 7104101 6145544 4985783 3652165
38331 3652165 2183202 629529 -948104 -2483110 -3909834 -5172438 -6232972 -7074946
38323 -7074946 -7700766 -8123644 -8355690 -8395945 -8224704 -7809390 -7120552 -6149840 -4921805
38314 -4921805 -3496797 -1966374 -442248 960817 2144929 3045114 3635682 3926088 3950261
38305 3950261 3754387 3386770 2891652 2307404 1667717 1003287 342012 -292521 -882933
38296 -882933 -1418940 -1897058 -2320136 -2697589 -3045302 -3382752 -3726205 -4080562 -4434605 -4762151
38286 -4762151 -5027833 -5195168 -5236269 -5142276 -4930224 -4641045 -4328410 -4045000 -3833258 -3721430
38276 -3721430 -3720624 -3820559 -3987222 -4167579 -4302899 -4346587 -4279256 -4114927 -3897090 -3688648
38266 -3688648 -3560894 -3583172 -3811854 -4279198 -4986875 -5908329 -6998128 -8201652 -9460326
38257 -9460326 -10713051 -11897041 -12949602 -13810288 -14422839 -14737971 -14719195 -14352744 -13658694
38248 -13658694 -12696334 -11557576 -10349355 -9173372 -8111987 -7222852 -6539458 -6074179 -5822352
38239 -5822352 -5766508 -5880152 -6131234 -6485415 -6907742 -7361483 -7806104 -8198365 -8497305 -8669163
38229 -8669163 -8688911 -8540174 -8217068 -7727395 -7093115 -6346427 -5524232 -4663595 -3797141 -2946644
38219 -2946644 -2116883 -1294932 -457671 415241 1329508 2271088 3209473 4106657 4927441
38210 4927441 5647838 6260170 6773975 7212107 7603164 7973686 8343087 8720954 9104643
38201 9104643 9477404 9810439 10071322 10236157 10299182 10274471 10188822 10069746 9935187 9790229
38191 9790229 9630383 9445376 9218292 8922383 8523433 7991420 7315185 6509382 5609325
38182 5609325 4658932 3700170 2767828 1887683 1074556 329526 -360623 -1017798 -1660948
38173 -1660948 -2294911 -2907678 -3477466 -3982519 -4405515 -4731711 -4946348 -5035724 -4991064 -4812099
38163 -4812099 -4509464 -4106878 -3643151 -3172206 -2759019 -2470724 -2364371 -2475020 -2808780
38154 -2808780 -3343479 -4035983 -4832582 -5679140 -6529222 -7349150 -8118535 -8825220 -9456272
38145 -9456272 -9990373 -10397574 -10647904 -10723484 -10626349 -10378179 -10014032 -9574288 -9097829 -8618343
38135 -8618343 -8164571 -7762344 -7433647 -7190879 -7031591 -6941107 -6902828 -6906654 -6946666 -7010119
38125 -7010119 -7069207 -7085184 -7023824 -6871951 -6643991 -6374922 -6105505 -5869966 -5692138 -5587682
38115 -5587682 -5565687 -5626264 -5756820 -5931129 -6111656 -6252767 -6304418 -6218912 -5962109 -5525559
38105 -5525559 -4933220 -4239329 -3518825 -2853710 -2317520 -1959903 -1795480 -1802526 -1933850 -2135921
38095 -2135921 -2367831 -2612427 -2876928 -3185584 -3569495 -4057750 -4671789 -5423162 -6313972
38086 -6313972 -7338394 -8483234 -9726700 -11037121 -12374010 -13691757 -14943584 -16084095
38078 -16084095 -17071539 -17871730 -18462795 -18837165 -18998512 -18955680 -18718535 -18299000 -17716052
38069 -17716052 -17000418 -16195551 -15354817 -14537008 -13801732 -13204490 -12790523 -12586998 -12593945 -12776133
38059 -12776133 -13060836 -13347225 -13528601 -13520303 -13281031 -12818532 -12179219 -11428506 -10630786 -9835942
38049 -9835942 -9075072 -8363261 -7704515 -7095360 -6527412 -5990795 -5478136 -4986585 -4516215
38040 -4516215 -4066419 -3633585 -3212245 -2799458 -2400213 -2030469 -1714860 -1478858 -1339734
38031 -1339734 -1303456 -1372019 -1557872 -1894499 -2432750 -3222396 -4290045 -5626878 -7190562
38022 -7190562 -8914572 -10715814 -12498558 -14159866 -15601515 -16747012 -17556202 -18029602
38014 -18029602 -18199966 -18116057 -17827647 -17378086 -16804321 -16140046 -15418891 -14677234 -13955890
38005 -13955890 -13297574 -12737842 -12293007 -11953483 -11689037 -11463882 -11251756 -11041238 -10829445
37996 -10829445 -10611189 -10373168 -10097339 -9769685 -9386701 -8954572 -8482043 -7972308 -7418882
37987 -7418882 -6806919 -6118419 -5339562 -4469393 -3528159 -2561145 -1633446 -815233 -162749
37978 -162749 297127 573098 705347 754394 787995 869883 1050845 1360990 1803689 2353858
37968 2353858 2961913 3561535 4079012 4444473 4605580 4539706 4257634 3795635 3200529 2515519
37958 2515519 1771483 984675 160948 -694255 -1564830 -2419908 -3221460 -3939122 -4561315
37949 -4561315 -5094613 -5552409 -5940770 -6249202 -6450279 -6508665 -6397112 -6112692 -5684024 -5164786
37939 -5164786 -4618609 -4106166 -3680596 -3387596 -3262375 -3320066 -3543917 -3879507 -4241587 -4533959
37929 -4533959 -4675064 -4618001 -4357419 -3924065 -3373182 -2771843 -2187008 -1675108 -1274431 -1000769
37919 -1000769 -845793 -778732 -753381 -720670 -642598 -501273 -299328 -52925 217723 494582
37909 494582 761269 996977 1170213 1237896 1151939 871389 376186 -322227 -1178486 -2122210
37899 -2122210 -3076463 -3978600 -4794655 -5521647 -6178166 -6789080 -7372273 -7932789 -8463811
37890 -8463811 -8949509 -9366142 -9683300 -9869962 -9905729 -9790512 -9545069 -9202171 -8796075 -8357744
37880 -8357744 -7915910 -7498775 -7132724 -6839019 -6630882 -6511548 -6472530 -6491699 -6531406 -6537870
37870 -6537870 -6444913 -6185298 -5708062 -4993602 -4057184 -2939016 -1687729 -346808 1050253
37861 1050253 2475823 3899301 5280599 6571694 7726003 8709145 9504336 10110824 10538071
37852 10538071 10798474 10900316 10843664 10622679 10234380 9688453 9010989 8240044 7417848
37843 7417848 6586199 5786201 5057208 4430387 3920142 3522665 3226348 3026734 2932159 2953619
37833 2953619 3087098 3304270 3560771 3817068 4057289 4293045 4549638 4843364 5163925
37824 5163925 5472541 5716744 5852898 5862952 5755992 5555877 5285919 4962419 4599660 4218636
37814 4218636 3850249 3530751 3294011 3165007 3155148 3258848 3452231 3694866 3933294 4105034
37804 4105034 4144133 3990214 3599590 2953902 2063383 965864 -276395 -1582708 -2864518
37795 -2864518 -4039249 -5042682 -5835282 -6401240 -6742233 -6869715 -6799752 -6552549 -6155539
37786 -6155539 -5646808 -5076402 -4504739 -3997222 -3613822 -3395178 -3351567 -3462324 -3687577 -3985778
37776 -3985778 -4326442 -4691136 -5063999 -5420083 -5720927 -5921185 -5981986 -5882387 -5622724 -5220041
37766 -5220041 -4700260 -4091470 -3419442 -2704061 -1956112 -1176575 -361765 485191 1341808
37757 1341808 2161103 2879189 3432922 3778715 3904111 3829576 3603413 3293467 2976363 2723552
37747 2723552 2585579 2579457 2684224 2846224 2991473 3040938 2925264 2596360 2033860 1245477
37737 1245477 261894 -871678 -2104236 -3384987 -4665021 -5896133 -7030780 -8025815
37729 -8025815 -8847811 -9474355 -9888782 -10073394 -10009744 -9688798 -9123753 -8354795 -7442179 -6453819
37719 -6453819 -5455742 -4507927 -3661942 -2956976 -2415059 -2039208 -1817411 -1732128 -1770969 -1932110
37709 -1932110 -2220104 -2634151 -3156505 -3748482 -4355651 -4917809 -5378046 -5688020 -5809896
37700 -5809896 -5716979 -5395205 -4847050 -4097661 -3199605 -2229644 -1273085 -399684 356614 1002290
37690 1002290 1571713 2106893 2641099 3191905 3762286 4345666 4931397 5509033 6071315
37681 6071315 6616299 7147964 7673726 8198984 8721455 9228180 9695534 10091340 10379533
37672 10379533 10528609 10522359 10367887 10096050 9753385 9388554 9037640 8712316 8394121 8037445
37662 8037445 7581759 6970058 6167328 5172448 4020267 2774643 1515165 320570 -746870
37653 -746870 -1650463 -2378359 -2935452 -3334453 -3591088 -3723684 -3754710 -3711606 -3624454 -3518884
37643 -3518884 -3405879 -3274332 -3092125 -2816305 -2407160 -1840011 -1111649 -241551 730963
37634 730963 1752814 2765608 3714965 4558479 5270451 5842668 6281836 6604727 6831917
37625 6831917 6981704 7066841 7095922 7077483 7021032 6930898 6796025 6585173 6254886 5767631
37615 5767631 5108999 4293554 3357521 2344827 1295431 241401 -789820 -1770211 -2669568
37606 -2669568 -3458390 -4111454 -4609014 -4936963 -5088901 -5069008 -4891442 -4574860 -4136261 -3589322
37596 -3589322 -2947775 -2229958 -1459656 -660594 153969 990416 1875109 2843833 3926264
37587 3926264 5134093 6456323 7859478 9289890 10677802 11943911 13007956 13798930
37579 13798930 14266869 14394337 14202670 13747587 13103408 12341700 11514088 10647075 9749464
37570 9749464 8825052 7880557 6923626 5954337 4959024 3913735 2797570 1608464 371340
37561 371340 -866648 -2050415 -3132603 -4084384 -4900076 -5596184 -6204786 -6762088 -7295983
37552 -7295983 -7817607 -8319158 -8776649 -9155361 -9416803 -9525990 -9456843 -9193832 -8730971 -8072009
37542 -8072009 -7233883 -6249877 -5165750 -4027026 -2865105 -1693676 -519617 639075
37534 639075 1740905 2722106 3511483 4052345 4321593 4336015 4141547 3790864 3321724 2747274
37524 2747274 2061925 1257883 342032 -657024 -1695636 -2729413 -3723945 -4655266 -5503718
37515 -5503718 -6249918 -6877223 -7377417 -7753564 -8017663 -8185581 -8273264 -8295997 -8269179 -8207557
37505 -8207557 -8121154 -8009069 -7854817 -7627145 -7287804 -6803786 -6158795 -5359882 -4438892 -3450643
37495 -3450643 -2468299 -1574472 -848617 -355453 -139412 -224189 -611148 -1272799 -2146116 -3135812
37485 -3135812 -4133357 -5046512 -5825374 -6471306 -7024473 -7537694 -8050613 -8575542 -9097633
37476 -9097633 -9584378 -9996940 -10298358 -10457800 -10452932 -10272376 -9918175 -9406769 -8768044 -8043622
37466 -8043622 -7284700 -6547078 -5881088 -5318546 -4863533 -4493072 -4168575 -3853885 -3533686
37457 -3533686 -3225561 -2979858 -2865486 -2946732 -3261286 -3808817 -4553771 -5439662 -6407794 -7411696
37447 -7411696 -8421253 -9416703 -10378633 -11280697 -12087966 -12760220 -13258570 -13553362 -13630311
37438 -13630311 -13492132 -13155612 -12646605 -11995698 -11236180 -10404612 -9542038 -8691712 -7891247
37429 -7891247 -7163470 -6513801 -5936518 -5423512 -4968341 -4566336 -4216757 -3928009 -3719347
37420 -3719347 -3613178 -3620667 -3729358 -3899685 -4071517 -4178197 -4164110 -4000496 -3693523 -3280772
37410 -3280772 -2817256 -2357244 -1940266 -1587132 -1305966 -1102698 -988761 -981523 -1097972 -1346316
37400 -1346316 -1721139 -2204840 -2773367 -3401616 -4065549 -4741958 -5408471 -6045239 -6638040
37391 -6638040 -7181338 -7678774 -8138181 -8561235 -8933333 -9221926 -9387063 -9399518 -9256429 -8985818
37381 -8985818 -8637739 -8267055 -7916869 -7609958 -7349323 -7123497 -6912040 -6690594 -6437061
37372 -6437061 -6138345 -5794199 -5415305 -5016721 -4611191 -4206888 -3811663 -3442121 -3132191
37363 -3132191 -2934017 -2906748 -3096179 -3515494 -4137893 -4904164 -5738653 -6563995 -7309887 -7918088
37353 -7918088 -8347666 -8580999 -8626931 -8517296 -8296583 -8008639 -7685708 -7343228 -6980836 -6588406
37343 -6588406 -6155746 -5683274 -5188685 -4704849 -4269396 -3913079 -3654536 -3502607 -3460554 -3526554
37333 -3526554 -3690412 -3931001 -4218172 -4519236 -4807296 -5067957 -5301604 -5520259 -5740729
37324 -5740729 -5977102 -6234607 -6505153 -6765353 -6979564 -7109691 -7128925 -7032723 -6841625 -6595616
37314 -6595616 -6343639 -6132174 -5995621 -5950500 -5994704 -6111310 -6274996 -6458888 -6639985 -6802106
37304 -6802106 -6936530 -7041768 -7122874 -7188566 -7245022 -7289859 -7312479 -7302353 -7258915 -7194883 -7131413
37293 -7131413 -7090543 -7090360 -7143518 -7256943 -7431833 -7664830 -7950487 -8283533 -8659121 -9070521
37283 -9070521 -9505285 -9941944 -10349420 -10690433 -10928102 -11032762 -10985389 -10776089 -10399850 -9853990
37273 -9853990 -9140273 -8270705 -7273193 -6193685 -5093301 -4040377 -3098134 -2310266 -1688942
37264 -1688942 -1210762 -824394 -469109 -97901 304476 716580 1090454 1371996 1522968
37255 1522968 1536228 1438244 1277068 1100027 931564 763267 562337 294126 -53933 -460249
37245 -460249 -874278 -1234259 -1486281 -1595123 -1544793 -1334237 -975350 -495615 58799 625502
37235 625502 1136095 1530785 1771754 1850510 1786266 1614791 1371730 1078992 742382 360851
37225 360851 -61096 -507880 -956983 -1387233 -1783546 -2135475 -2432720 -2662256 -2808645 -2855512
37215 -2855512 -2785820 -2580999 -2221133 -1688203 -972629 -81966 950577 2061601 3161283
37206 3161283 4146970 4922357 5413915 5577847 5397142 4874323 4026368 2884593 1497238
37197 1497238 -69976 -1738267 -3423914 -5045611 -6527510 -7798578 -8792365 -9451142
37189 -9451142 -9735303 -9635532 -9182569 -8447846 -7530316 -6532448 -5536685 -4593921 -3725454 -2929845
37179 -2929845 -2186801 -1459587 -702754 122771 1033522 2014735 3023011 3997822 4875063
37170 4875063 5595563 6105723 6354368 6293358 5885808 5118729 4013319 2627808 1051345
37161 1051345 -609291 -2245366 -3758411 -5066663 -6108820 -6849886 -7289238 -7465114 -7448911
37152 -7448911 -7328111 -7184149 -7075701 -7035051 -7076482 -7207588 -7433645 -7751774 -8139716 -8547559
37142 -8547559 -8899623 -9108905 -9099660 -8828163 -8292246 -7527196 -6592639 -5556507 -4479567
37133 -4479567 -3402966 -2342265 -1290858 -231689 848174 1946375 3040755 4090891
37125 4090891 5043100 5837615 6418545 6746439 6809734 6629702 6256551 5759152 5212215 4683002
37115 4683002 4218983 3839378 3533598 3266285 2985860 2634635 2161336 1536233 764845
37106 764845 -107246 -1003809 -1840057 -2548592 -3097381 -3491621 -3759894 -3933804 -4033592 -4067774
37096 -4067774 -4044900 -3986990 -3933266 -3930485 -4016094 -4205150 -4488654 -4843513 -5247461 -5689621
37086 -5689621 -6170027 -6689083 -7235928 -7786053 -8310804 -8791124 -9224133 -9617135 -9973615
37077 -9973615 -10281713 -10513782 -10638069 -10635548 -10512188 -10300685 -10052270 -9823051 -9659397 -9586171
37067 -9586171 -9601894 -9684149 -9804032 -9942670 -10100784 -10296203 -10551434 -10878767 -11271200 -11703407
37057 -11703407 -12140611 -12548993 -12902012 -13182017 -13380427 -13499036 -13551117 -13558912 -13546565 -13532017
37047 -13532017 -13522755 -13517052 -13507669 -13484124 -13433144 -13340384 -13195431 -12997661 -12758402 -12497836 -12239457
37036 -12239457 -12005118 -11810489 -11660050 -11544485 -11445791 -11350166 -11259810 -11192922 -11170831 -11202800
37026 -11202800 -11280470 -11384082 -11492991 -11592086 -11671862 -11725073 -11744395 -11724247 -11667270 -11592026 -11535943
37015 -11535943 -11549877 -11686076 -11984267 -12459018 -13089953 -13818215 -14554147 -15197447 -15663738
37006 -15663738 -15907095 -15929980 -15777485 -15518363 -15220235 -14928999 -14660064 -14401676 -14124039
36997 -14124039 -13788162 -13353888 -12790104 -12087070 -11264595 -10368591 -9455720 -8575659 -7763295
36988 -7763295 -7044951 -6451019 -6023151 -5810335 -5857208 -6191037 -6811143 -7682496 -8736149
36979 -8736149 -9878806 -11009195 -12033937 -12877238 -13486037 -13836591 -13943438 -13862503 -13678883
36970 -13678883 -13480418 -13330903 -13257879 -13258146 -13311616 -13392474 -13474808 -13536639 -13564993 -13558997 -13526405
36959 -13526405 -13474297 -13401396 -13299677 -13165267 -13009523 -12859643 -12746123 -12684813 -12665342 -12652681
36949 -12652681 -12599902 -12464306 -12218767 -11854268 -11374865 -10789519 -10104912 -9321292 -8432255
36940 -8432255 -7429219 -6309601 -5084944 -3784596 -2454014 -1149876 66432 1138088
36932 1138088 2024773 2712506 3214840 3563761 3795598 3939325 4010918 4012991 3937467 3769666
36922 3769666 3492984 3093515 2564167 1907642 1137117 273649 -659461 -1643295 -2667384
36913 -2667384 -3727998 -4819953 -5926042 -7011269 -8027017 -8923560 -9663629 -10229771 -10622990
36904 -10622990 -10855359 -10941983 -10897184 -10736379 -10480461 -10157124 -9796388 -9423111 -9051875 -8686906
36894 -8686906 -8325264 -7960068 -7582588 -7184080 -6758012 -6301262 -5812383 -5287764 -4720255
36885 -4720255 -4105019 -3451448 -2792769 -2184263 -1688843 -1357904 -1217428 -1264046 -1469597 -1791119
36875 -1791119 -2184240 -2617279 -3080512 -3584347 -4145087 -4765097 -5418525 -6050514 -6589882
36866 -6589882 -6969447 -7147018 -7120750 -6933139 -6660180 -6388237 -6187788 -6095039 -6107505 -6192185
36856 -6192185 -6299756 -6377745 -6379086 -6266827 -6017881 -5627004 -5109180 -4497917 -3839518 -3186176
36846 -3186176 -2591231 -2107699 -1788038 -1681687 -1828464 -2249668 -2941052 -3870668 -4981696
36837 -4981696 -6199426 -7441809 -8631552 -9705211 -10615697 -11330107 -11829000 -12110927 -12199499
36828 -12199499 -12146058 -12022485 -11903903 -11847201 -11875094 -11973822 -12105119 -12225476 -12304013 -12333744
36818 -12333744 -12334004 -12342473 -12398003 -12521321 -12703844 -12910094 -13090524 -13196772 -13192800 -13058923 -12788769
36807 -12788769 -12382191 -11839666 -11162907 -10361500 -9460519 -8503349 -7547062 -6651642 -5866889
36798 -5866889 -5221402 -4716852 -4329020 -4016002 -3733252 -3452744 -3179413 -2956163 -2852844
36789 -2852844 -2942490 -3274432 -3854871 -4641894 -5556073 -6501231 -7385740 -8135803 -8698731 -9041397
36779 -9041397 -9150596 -9037261 -8740355 -8324530 -7869373 -7453258 -7137259 -6954053 -6905258 -6968708
36769 -6968708 -7113110 -7312292 -7550217 -7814522 -8085796 -8332992 -8519466 -8615515 -8609703 -8513216
36759 -8513216 -8355459 -8172850 -7996149 -7843207 -7720992 -7634417 -7594404 -7618503 -7723620 -7916707
36749 -7916707 -8190401 -8525500 -8896269 -9273679 -9626196 -9921514 -10131426 -10238117 -10239000 -10148817
36739 -10148817 -9999198 -9835329 -9709330 -9671001 -9757853 -9987001 -10351788 -10824726 -11364812 -11924432
36729 -11924432 -12453491 -12903868 -13238048 -13439526 -13516898 -13496539 -13407532 -13267718 -13077388 -12821966
36719 -12821966 -12481618 -12043812 -11513097 -10912156 -10272082 -9616441 -8948817 -8252813 -7506416
36710 -7506416 -6702976 -5865621 -5045245 -4302338 -3682712 -3200088 -2833941 -2542739 -2285841
36701 -2285841 -2044250 -1830909 -1684508 -1647618 -1739188 -1937650 -2186528 -2420320 -2595140 -2706739
36691 -2706739 -2787435 -2884697 -3032058 -3226924 -3427899 -3573835 -3613015 -3525528 -3330104 -3078607
36681 -3078607 -2845029 -2710934 -2746634 -2991725 -3444006 -4063881 -4792173 -5570563 -6352851 -7102912
36671 -7102912 -7785583 -8361147 -8789632 -9042674 -9116037 -9036763 -8861598 -8665397 -8521281 -8479094
36661 -8479094 -8551691 -8715655 -8925121 -9129674 -9285530 -9355345 -9302403 -9090758 -8697488 -8130045
36651 -8130045 -7433856 -6681145 -5945983 -5279384 -4695936 -4175225 -3674747 -3148158 -2562354
36642 -2562354 -1908509 -1205397 -495805 162974 713424 1113399 1346962 1425877 1382675 1260625
36632 1260625 1104979 955953 841971 774111 745697 740296 746016 767675 827602 953056 1158886
36621 1158886 1438410 1768689 2124260 2487835 2852053 3215956 3582645 3958856 4351234
36612 4351234 4756073 5147446 5473437 5665761 5658407 5405429 4890554 4127797 3156349 2033625
36602 2033625 829329 -378038 -1503843 -2463315 -3183932 -3621620 -3773369 -3679128 -3411125
36593 -3411125 -3055006 -2690976 -2382478 -2174514 -2097299 -2169045 -2396116 -2773702 -3289542 -3928808
36583 -3928808 -4676489 -5516604 -6430281 -7394293 -8380075 -9353392 -10275170 -11103265 -11794446
36574 -11794446 -12306925 -12604098 -12658412 -12453320 -11984023 -11260424 -10313396 -9199707 -7999239
36565 -7999239 -6803141 -5697556 -4748150 -3987863 -3409536 -2967162 -2589165 -2200735 -1744816
36556 -1744816 -1191105 -531523 229327 1079228 1997695 2955821 3921405 4866743 5772880
36547 5772880 6627733 7421505 8144786 8791820 9366753 9887297 10380653 10871324 11366930
36538 11366930 11850564 12284046 12618899 12807463 12808522 12587951 12120265 11396104 10432966 9278784
36528 9278784 7999510 6654123 5272756 3853397 2379621 847679 -713200 -2237520
36520 -2237520 -3637314 -4824915 -5733345 -6326234 -6596583 -6559867 -6247831 -5705950 -4994183
36511 -4994183 -4188382 -3377804 -2653894 -2090627 -1725399 -1553145 -1538389 -1636407 -1808896 -2027236
36501 -2027236 -2268412 -2513100 -2749786 -2980804 -3223157 -3500499 -3829408 -4208806 -4620914
36492 -4620914 -5044003 -5467431 -5897359 -6349300 -6833219 -7339934 -7834499 -8259170 -8546852
36483 -8546852 -8642474 -8524152 -8213663 -7770669 -7273829 -6797602 -6393135 -6077852 -5835076 -5623469
36473 -5623469 -5394588 -5113689 -4775199 -4404403 -4043492 -3729834 -3479266 -3283132 -3118283
36464 -3118283 -2962191 -2804535 -2650636 -2517367 -2425933 -2396346 -2445317 -2585497 -2823724 -3158919
36454 -3158919 -3582425 -4081725 -4645312 -5266147 -5943264 -6681509 -7487847 -8363174 -9292867
36445 -9292867 -10242840 -11165199 -12010373 -12738444 -13324931 -13761623 -14054966 -14222209 -14283862 -14253561
36435 -14253561 -14130743 -13901747 -13549082 -13061887 -12440466 -11694484 -10840214 -9900815 -8907617
36426 -8907617 -7898037 -6909562 -5973679 -5113447 -4345033 -3681395 -3136312 -2727032 -2473716
36417 -2473716 -2395086 -2502039 -2792150 -3246553 -3828788 -4485077 -5147009 -5738805 -6189715 -6448369
36407 -6448369 -6492983 -6332748 -6001175 -5546714 -5025674 -4498153 -4024383 -3659259 -3444936 -3402926
36397 -3402926 -3527690 -3784136 -4110973 -4430032 -4659448 -4727628 -4585352 -4213936 -3627455 -2867832
36387 -2867832 -1993725 -1066678 -139257 750921 1579625 2328466 2976296 3495876 3859432
36378 3859432 4050891 4077634 3974898 3800255 3620197 3493415 3456643 3518418 3662612 3858220
36368 3858220 4069055 4259154 4393804 4438457 4358153 4119697 3697139 3078426 2270261 1300648
36358 1300648 220697 -895182 -1954912 -2862420 -3535167 -3918474 -3992887 -3774456 -3307892
36349 -3307892 -2653048 -1869815 -1009511 -115905 769929 1609050 2370201 3036902 3611686
36340 3611686 4116629 4590181 5079296 5627298 6261338 6984570 7775185 8590842 9376089
36331 9376089 10071139 10620386 10978809 11116107 11021165 10708787 10225041 9642981 9044395 8494494
36321 8494494 8023919 7627921 7280292 6951327 6620787 6283343 5948120 5634604 5366974
36312 5366974 5168947 5060325 5054259 5153146 5342725 5587155 5830198 6005805 6055639 5945267
36302 5945267 5670521 5251913 4722458 4116477 3463925 2790968 2125113 1500641 958437
36293 958437 537156 260388 129448 127595 231969 424364 694739 1037707 1446067 1905608
36283 1905608 2393941 2883727 3348867 3772270 4154614 4521947 4926813 5438128 6121982
36274 6121982 7022609 8152462 9493308 11004666 12635765 14339129 16083375 17861292
36266 17861292 19690346 21606372 23653834 25875820 28305750 30962972 33855202 36988812
36258 36988812 40382631 44077042 48133227 52625591 57635108 63247393 69552364 76640475
36250 76640475 84594270 93477241 103322030 114119178 125806604 138256838 151255664
36243 151255664 164468921 177406128 189403067 199650548 207287730 211554632 211965394
36236 211965394 208438700 201327476 191332317 179336800 166231649 152784169 139575676
36229 139575676 126998478 115287975 104564405 94867957 86183621 78460021 71625498
36222 71625498 65599629 60297296 55627024 51489799 47783632 44413376 41300530 38388223
36214 38388223 35641010 33042620 30593607 28307569 26203952 24298823 22598389 21099342
36206 21099342 19795812 18688494 17790070 17123188 16711589 16568986 16691598 17058072 17636386
36197 17636386 18393385 19301180 20337629 21483751 22724105 24052240 25476422 27019043
36189 27019043 28708903 30571125 32619015 34848754 37238150 39752732 42359955 45044955
36181 45044955 47817443 50703330 53721537 56850697 59993850 62955124 65446554 67135961
36173 67135961 67727198 67043352 65077451 61989374 58054089 53588607 48889742 44200865
36165 44200865 39705250 35531667 31760501 28428204 25533609 23047396 20921523 19094680
36157 19094680 17494067 16037992 14643706 13239996 11779173 10242385 8636521 6986208
36149 6986208 5326206 3697318 2145002 717360 -540644 -1597397 -2445952 -3110140
36141 -3110140 -3640009 -4096634 -4533401 -4983149 -5455450 -5940207 -6411036 -6827341 -7140173
36132 -7140173 -7305445 -7299826 -7129870 -6829497 -6449569 -6047240 -5680032 -5404448 -5275378 -5341718
36122 -5341718 -5636516 -6165454 -6900716 -7784102 -8737227 -9674683 -10518293 -11210734 -11723709
36113 -11723709 -12055922 -12222759 -12245516 -12145981 -11945481 -11664665 -11322985 -10939757 -10537846 -10148084
36103 -10148084 -9810170 -9565935 -9445316 -9452449 -9561807 -9727561 -9899213 -10034034 -10103112 -10093423
36093 -10093423 -10007452 -9859441 -9669175 -9456891 -9241453 -9040147 -8868497 -8741497 -8677763 -8703747
36083 -8703747 -8852134 -9151415 -9610193 -10204569 -10876616 -11546943 -12137291 -12593899 -12902420
36074 -12902420 -13089541 -13211755 -13335135 -13512424 -13765529 -14080635 -14417476 -14726488 -14964150
36065 -14964150 -15100807 -15122490 -15031689 -14848726 -14610169 -14360000 -14134489 -13947774 -13786376 -13615899
36055 -13615899 -13396084 -13096434 -12706090 -12236384 -11718260 -11196858 -10723264 -10342755 -10081311
36046 -10081311 -9935307 -9869209 -9822495 -9723228 -9504745 -9122695 -8568789 -7875315 -7105418 -6331521
36036 -6331521 -5613437 -4989205 -4482293 -4116212 -3922828 -3937078 -4181764 -4652669 -5312995 -6099254
36026 -6099254 -6933949 -7738283 -8441209 -8985438 -9332291 -9465328 -9390580 -9131487 -8719113 -8181653
36016 -8181653 -7539275 -6808291 -6012195 -5190896 -4399455 -3694741 -3116493 -2672698 -2336590
36007 -2336590 -2056125 -1770123 -1422293 -968219 -377792 360523 1231356 2185359 3142074
35998 3142074 4006420 4693529 5150479 5364821 5357919 5169600 4843042 4415255 3914216 3361864
35988 3361864 2780140 2194098 1626579 1086587 562202 27794 -536556 -1127093 -1712854
35979 -1712854 -2247595 -2686196 -2992889 -3137849 -3089703 -2814626 -2285959 -1498594 -478574
35970 -478574 717870 2015053 3333204 4602671 5772524 6811988 7706014 8448166 9034078
35961 9034078 9457783 9711727 9789103 9685718 9399191 8926191 8261010 7398849 6344487
35952 6344487 5123467 3790491 2429733 1144784 40477 -797423 -1318368 -1515179 -1423803
35943 -1423803 -1115834 -684861 -227886 174368 471624 647073 709773 683191 597101 484683
35933 484683 381000 318196 316603 375843 472038 564250 607015 561705 401583 111963 -309384
35922 -309384 -849203 -1475790 -2140103 -2781334 -3333931 -3733662 -3923621 -3862514 -3534721 -2957041
35912 -2957041 -2176117 -1255902 -262105 747192 1721317 2611737 3368528 3941058 4281026
35903 4281026 4346238 4106213 3550496 2697017 1595513 322700 -1030176 -2374172 -3639347
35894 -3639347 -4786110 -5806585 -6715272 -7534020 -8279204 -8956052 -9559226 -10075224 -10483355
35885 -10483355 -10756096 -10862819 -10779958 -10505666 -10071510 -9543297 -9009014 -8559085 -8266606
35876 -8266606 -8172446 -8277221 -8541752 -8897571 -9265920 -9578778 -9793324 -9894626 -9888429 -9791113
35866 -9791113 -9623598 -9410411 -9179799 -8960364 -8774025 -8629156 -8517987 -8419878 -8309681 -8168741
35856 -8168741 -7994287 -7802122 -7620365 -7477902 -7395126 -7381847 -7440500 -7568800 -7758863 -7995138
35846 -7995138 -8254601 -8509268 -8728605 -8881157 -8937566 -8876304 -8690053 -8389170 -8000398 -7561463
35836 -7561463 -7113305 -6692287 -6324694 -6024474 -5793137 -5620420 -5486093 -5364215 -5229474
35827 -5229474 -5063725 -4861565 -4634466 -4411110 -4229961 -4123597 -4101992 -4145726 -4214757 -4267646
35817 -4267646 -4279187 -4246279 -4180493 -4094340 -3991250 -3865332 -3709625 -3526272 -3331717 -3153569
35807 -3153569 -3020034 -2946367 -2925195 -2927106 -2913275 -2854804 -2748898 -2623495 -2528219 -2515973 -2622824
35796 -2622824 -2853927 -3181013 -3552999 -3915887 -4233401 -4498573 -4730929 -4962248 -5220590
35787 -5220590 -5521825 -5869811 -6258119 -6665503 -7045586 -7320216 -7386959 -7142832 -6515603 -5489114
35777 -5489114 -4112299 -2489414 -755961 951398 2521644 3884986 5013523 5909500
35769 5909500 6588739 7067066 7353427 7448689 7347340 7040493 6520660 5789271 4865928 3795063
35759 3795063 2644821 1497019 433370 -474751 -1169813 -1607724 -1758285 -1609319 -1174482
35750 -1174482 -501976 322021 1182555 1959559 2557545 2926801 3066595 3012490 2818120 2540770
35740 2540770 2233660 1942270 1700705 1526087 1412200 1326548 1215622 1020052 695517 231140
35730 231140 -342401 -958074 -1529041 -1971310 -2225113 -2266841 -2106563 -1773895 -1302111 -720290
35720 -720290 -55863 658364 1380770 2064601 2666145 3151565 3498593 3693857 3729843 3604773
35710 3604773 3325554 2911317 2394476 1817783 1228533 673576 198090 -153310 -338310
35701 -338310 -324675 -100771 318476 894140 1571828 2290850 2991348 3620426 4138425 4523594
35691 4523594 4771423 4887036 4873807 4724925 4423820 3954680 3318104 2542338 1680835 794506
35681 794506 -71169 -898333 -1690471 -2456038 -3198615 -3921894 -4641380 -5387469 -6192909 -7072669
35671 -7072669 -8011274 -8966257 -9883206 -10710458 -11405627 -11936105 -12280401 -12432588 -12405221 -12225570
35661 -12225570 -11925604 -11531173 -11055635 -10500038 -9859390 -9132689 -8332506 -7489077 -6646297
35652 -6646297 -5851551 -5144379 -4548028 -4065071 -3676900 -3347761 -3033825 -2694861 -2303269
35643 -2303269 -1846878 -1327369 -759141 -170400 397583 898645 1297996 1589500 1803183
35634 1803183 1995691 2226098 2528807 2897613 3288435 3637804 3887001 4001403 3979054 3847820
35624 3847820 3654124 3447488 3265187 3121114 3002101 2872535 2685162 2394246 1967599
35615 1967599 1394812 689782 -112756 -964388 -1810302 -2594585 -3263979 -3771598 -4081836
35606 -4081836 -4177057 -4065077 -3783327 -3393941 -2967424 -2560532 -2199888 -1881006 -1583009 -1288959
35596 -1288959 -998397 -725138 -484589 -281343 -104997 65690 254884 482053 756360
35587 756360 1073750 1417256 1760302 2072384 2326518 2506628 2610590 2644834 2612264 2502671
35577 2502671 2294970 1970704 1526894 976094 333865 -393361 -1207255 -2103277 -3054815
35568 -3054815 -4008161 -4892092 -5637294 -6197033 -6560720 -6754813 -6831049 -6848348 -6857292 -6892327
35558 -6892327 -6970206 -7089867 -7231729 -7359803 -7431831 -7417449 -7316183 -7163740 -7020972 -6950716
35548 -6950716 -6995086 -7164143 -7438681 -7781599 -8150054 -8504386 -8814402 -9063899 -9251661 -9387265
35538 -9387265 -9484299 -9556388 -9618285 -9689117 -9793960 -9962808 -10227611 -10617153 -11149645 -11825233
35528 -11825233 -12621670 -13494770 -14383316 -15217604 -15930393 -16467655 -16796235 -16906887 -16812450
35519 -16812450 -16541599 -16129963 -15612222 -15017631 -14367597 -13672616 -12929703 -12125090 -11244719
35510 -11244719 -10288441 -9280494 -8270985 -7327694 -6520686 -5904273 -5502169 -5300958 -5253952
35501 -5253952 -5293537 -5347607 -5355218 -5277731 -5103441 -4845314 -4532398 -4196931 -3861068 -3528428
35491 -3528428 -3184412 -2805913 -2376872 -1903185 -1419832 -985918 -668806 -523715 -576906 -818653
35481 -818653 -1208107 -1687692 -2201122 -2708089 -3190578 -3649485 -4093692 -4526475 -4935482 -5291306
35471 -5291306 -5555229 -5691663 -5678351 -5509406 -5190899 -4733495 -4148231 -3448448 -2655404 -1802192
35461 -1802192 -933123 -100043 641969 1239471 1647365 1837180 1804754 1574954 1201102 756107
35451 756107 314266 -71099 -383146 -640970 -883865 -1150471 -1463488 -1823563 -2209743 -2583599
35441 -2583599 -2896723 -3101291 -3160547 -3054713 -2780947 -2350424 -1786721 -1126665 -420834 270050
35431 270050 884195 1370582 1698495 1860372 1867022 1738143 1493256 1147686 715229 214909
35421 214909 -323613 -860307 -1350976 -1756384 -2051220 -2231143 -2316094 -2347030 -2374844 -2444869
35411 -2444869 -2584101 -2796725 -3067635 -3368884 -3664657 -3914404 -4076061 -4109697 -3979917 -3656995
35401 -3656995 -3119475 -2359708 -1388802 -235379 1062602 2467171 3944689 5464600 6996508
35392 6996508 8508827 9969123 11344988 12604631 13716818 14649868 15370379 15843532 16037186
35383 16037186 15930033 15520751 14832307 13907151 12795651 11546713 10208534 8838177 7509888
35374 7509888 6312314 5333234 4638413 4253291 4153834 4269770 4500052 4736156 4885628
35365 4885628 4889143 4728599 4427115 4041983 3650751 3332321 3148201 3129933 3275604 3554397
35355 3554397 3916732 4307530 4678608 4994802 5231074 5365038 5374026 5241878 4970571 4585881
35345 4585881 4130691 3649682 3174803 2717828 2269763 1804263 1284396 673703 -50180
35336 -50180 -884959 -1801698 -2751940 -3679167 -4528688 -5253120 -5814400 -6184594 -6346728 -6295266
35326 -6295266 -6035616 -5583061 -4962422 -4209436 -3373166 -2516574 -1711289 -1024573 -502236
35317 -502236 -156777 30611 94528 66987 -31207 -185876 -379543 -586880 -778689 -928332
35307 -928332 -1013214 -1010796 -895379 -641693 -235186 316481 977237 1685963 2370201 2966111
35297 2966111 3436005 3774883 4004050 4157864 4271663 4374396 4484805 4609691 4744618
35288 4744618 4877498 4993578 5078999 5121019 5105448 5014564 4829350 4537022 4139988 3659930
35278 3659930 3133081 2598017 2081632 1590306 1111209 623128 109924 -432484 -999488
35269 -999488 -1586919 -2197004 -2835776 -3504011 -4188671 -4861138 -5483699 -6021014 -6451505 -6775045
35259 -6775045 -7015230 -7215171 -7426393 -7692957 -8036262 -8446532 -8883680 -9286399 -9586620
35250 -9586620 -9726418 -9673568 -9430473 -9031435 -8527514 -7964963 -7368082 -6735805 -6053205 -5309892
35240 -5309892 -4513920 -3694309 -2892667 -2149114 -1488774 -914293 -407302 62554 526202
35231 526202 1006183 1511226 2033182 2546986 3016270 3404477 3685830 3848862 3890934 3809906
35221 3809906 3601508 3265526 2815891 2286397 1727352 1195088 740258 399833 194411
35212 194411 130139 203711 408315 737543 1184718 1737254 2369034 3036002 3679700 4239599
35202 4239599 4669288 4948165 5082308 5094848 5012152 4853353 4627697 4339485 3996800 3618559
35192 3618559 3235301 2882430 2588872 2366858 2207955 2086718 1968993 1820522 1613461
35183 1613461 1331051 970475 541951 62620 -452235 -994424 -1559790 -2137972 -2701918
35174 -2701918 -3205754 -3595439 -3828503 -3891781 -3805927 -3613864 -3361178 -3081102 -2792207 -2507758
35164 -2507758 -2248292 -2047492 -1946413 -1979240 -2159049 -2470990 -2874927 -3315389 -3735374 -4090181
35154 -4090181 -4357004 -4537363 -4652687 -4735671 -4819679 -4927935 -5065410 -5217276 -5355504 -5450753
35144 -5450753 -5483735 -5451151 -5364490 -5243452 -5107776 -4971275 -4840278 -4716477 -4602294 -4505335
35134 -4505335 -4438376 -4413871 -4436216 -4496857 -4574837 -4641152 -4663782 -4611668 -4457464 -4179240 -3762068
35123 -3762068 -3201617 -2511027 -1728259 -917340 -158509 470655 914014 1145924 1167689 996932
35113 996932 658614 182654 -393306 -1021057 -1642695 -2195792 -2621371 -2873227 -2927291 -2788581
35103 -2788581 -2492037 -2094644 -1660465 -1244575 -882511 -588406 -360284 -188312 -61757
35094 -61757 27893 87658 125564 152215 179897 219804 279600 363041 470525 596984 725472
35083 725472 820900 831817 702771 390205 -128168 -853597 -1771077 -2852976 -4060777 -5346971
35073 -5346971 -6657854 -7936603 -9126717 -10176246 -11041683 -11689344 -12093597 -12234447 -12098789
35064 -12098789 -11687869 -11027941 -10176060 -9214399 -8235201 -7325970 -6562524 -6008382 -5713721
35055 -5713721 -5710742 -6008310 -6589713 -7413618 -8416214 -9514160 -10610790 -11608166 -12424115
35046 -12424115 -13008573 -13351694 -13479477 -13439099 -13280527 -13041259 -12738695 -12371410 -11926914
35037 -11926914 -11390923 -10754212 -10016684 -9189781 -8296541 -7367598 -6433778 -5519041 -4637466
35028 -4637466 -3795930 -3001712 -2270824 -1629659 -1104877 -706383 -416725 -196588 -2720
35019 -2720 194406 402573 609703 791076 918142 967082 925428 795657 595938 358919
35009 358919 128409 -47234 -125654 -83038 75597 313034 565994 760369 832387 749648
34999 749648 523626 206698 -126167 -402370 -571756 -614768 -538591 -366135 -125333 154022
34989 154022 434212 661705 768668 687800 372409 -190294 -977747 -1938857 -3003678 -4093868
34979 -4093868 -5133823 -6061618 -6838192 -7453575 -7928914 -8312395 -8667993 -9058891 -9530509
34970 -9530509 -10099091 -10750439 -11449620 -12157134 -12843138 -13492323 -14098552 -14655077 -15147731
34961 -15147731 -15554415 -15848981 -16005922 -16004290 -15831976 -15491418 -15004844 -14414374 -13773726 -13133763
34951 -13133763 -12528944 -11971122 -11451534 -10947128 -10427459 -9861504 -9224866 -8505744 -7706179
34942 -7706179 -6837529 -5914096 -4950917 -3967738 -2994836 -2074371 -1254986 -582365 -89584
34933 -89584 210814 331607 310070 199884 57848 -69767 -157632 -207576 -250011 -338165 -533372
34922 -533372 -884353 -1409012 -2087935 -2872614 -3702365 -4519382 -5275274 -5930484 -6451906 -6811437
34912 -6811437 -6984856 -6951300 -6696079 -6217996 -5537478 -4699706 -3770110 -2823547 -1929765 -1137577
34902 -1137577 -461729 121332 663804 1223999 1839347 2506794 3179044 3776980 4211701
34893 4211701 4407636 4320048 3942821 3305122 2459988 1471914 410224 -650855 -1630436
34884 -1630436 -2443568 -3010675 -3271566 -3199067 -2807364 -2152630 -1326671 -445254 368460 1005000
34874 1005000 1390327 1499944 1357413 1016151 533069 -52000 -720613 -1463947 -2265326
34865 -2265326 -3089418 -3884052 -4591955 -5164493 -5569015 -5785200 -5793400 -5565100 -5065450 -4268005
34855 -4268005 -3170814 -1801536 -208503 1554347 3437050 5391529 7361120 9271515
34847 9271515 11031861 12547561 13739126 14559040 15000024 15090805 14880177 14416928 13736913
34838 13736913 12863538 11817569 10626670 9328563 7968380 6593603 5249015 3972697
34830 3972697 2793263 1727994 781894 -51350 -785726 -1438096 -2024925 -2561255 -3060138
34821 -3060138 -3530480 -3973172 -4377025 -4717199 -4959321 -5070181 -5030806 -4844653 -4537160 -4149394
34811 -4149394 -3730809 -3332210 -2996671 -2748647 -2586692 -2486112 -2412523 -2339970 -2264043 -2202866
34801 -2202866 -2185137 -2230958 -2335174 -2462495 -2558044 -2568615 -2463654 -2245466 -1944810 -1606176
34791 -1606176 -1271428 -969804 -717621 -524948 -402477 -363384 -420641 -584460 -862957 -1264387
34781 -1264387 -1797391 -2467869 -3274129 -4202767 -5227171 -6309429 -7405169 -8469762 -9464399
34772 -9464399 -10361406 -11147463 -11821944 -12388838 -12845753 -13178102 -13364531 -13391383 -13266225 -13020392
34762 -13020392 -12698259 -12340283 -11970479 -11595290 -11213787 -10833677 -10484979 -10222930 -10115053
34753 -10115053 -10215788 -10541602 -11061536 -11708483 -12402377 -13070092 -13653030 -14104783 -14387717
34744 -14387717 -14475030 -14357999 -14053127 -13603416 -13071359 -12525610 -12025818 -11609982 -11287349
34735 -11287349 -11038862 -10825968 -10605262 -10342292 -10017583 -9623825 -9160780 -8635946 -8072390
34726 -8072390 -7516770 -7038113 -6713291 -6603542 -6731951 -7071399 -7547163 -8052013 -8468213
34717 -8468213 -8690548 -8644794 -8296467 -7647634 -6725867 -5573947 -4246409 -2811694 -1353513
34708 -1353513 33829 1257157 2240751 2942550 3363928 3547717 3563829 3487498 3377904
34699 3377904 3263816 3140236 2976964 2736364 2393872 1953220 1450243 944103 500374
34690 500374 173675 -3874 -27106 82407 279681 504454 695317 805707 813488 719064
34680 719064 535807 282389 -16513 -324007 -588874 -754736 -778227 -645731 -378623 -24945
34670 -24945 356799 714365 1015170 1255117 1460697 1681216 1970817 2366075 2869222 3445526
34660 3445526 4036688 4584429 5054222 5449824 5813121 6208256 6693465 7289390 7957409
34651 7957409 8600447 9088522 9297704 9144060 8599394 7687216 6466722 5014759 3412796
34642 3412796 1740797 75768 -1508508 -2942172 -4160178 -5103910 -5725640 -5996177 -5912211
34633 -5912211 -5499400 -4811647 -3930045 -2961027 -2027478 -1248318 -712589 -462045 -492380 -770414
34623 -770414 -1254604 -1906491 -2688984 -3556920 -4450139 -5296891 -6027467 -6590470 -6963289 -7153243
34613 -7153243 -7190756 -7117188 -6970558 -6774437 -6535724 -6251828 -5920954 -5547931 -5143438 -4720243
34603 -4720243 -4290680 -3866813 -3462040 -3091940 -2772821 -2518840 -2340589 -2246568 -2244979 -2341938
34593 -2341938 -2535936 -2812252 -3140870 -3478737 -3776126 -3986480 -4076933 -4035020 -3869660 -3608868
34583 -3608868 -3296884 -2989165 -2742441 -2601795 -2591545 -2714411 -2956439 -3291910 -3686417 -4101801
34573 -4101801 -4506023 -4884439 -5244126 -5606756 -5994806 -6420482 -6881911 -7363700 -7837849
34564 -7837849 -8265756 -8604536 -8817719 -8886554 -8817829 -8646113 -8429329 -8238003 -8141156 -8193749
34554 -8193749 -8429096 -8856439 -9461975 -10211691 -11055007 -11929379 -12767100 -13505321 -14097883
34545 -14097883 -14525177 -14798292 -14956027 -15055669 -15160097 -15324438 -15584909 -15950973 -16401264
34536 -16401264 -16884303 -17325448 -17640201 -17751889 -17609676 -17200992 -16552602 -15719025 -14764250
34527 -14764250 -13745723 -12705189 -11664758 -10625718 -9571171 -8474518 -7312186 -6075429
34519 -6075429 -4776547 -3447757 -2133763 -880824 273623 1307225 2213119 2994725
34511 2994725 3656655 4195242 4593418 4823443 4857099 4678836 4295605 3738507 3055636 2300365
34501 2300365 1521140 755680 27582 -657236 -1313124 -1972376 -2676558 -3464575 -4362215
34492 -4362215 -5375703 -6489079 -7664397 -8844595 -9959770 -10937109 -11712771 -12242242 -12506073
34483 -12506073 -12510236 -12282400 -11865500 -11309311 -10660971 -9956841 -9219157 -8459862 -7690187 -6929850
34473 -6929850 -6208843 -5559913 -5007291 -4559341 -4207703 -3929391 -3688193 -3436764 -3123723
34464 -3123723 -2706991 -2168697 -1524448 -822754 -135559 456144 877745 1074690 1021885 726590
34454 726590 224061 -432919 -1188404 -1998286 -2840693 -3715828 -4633352 -5593365 -6572234 -7522328
34444 -7522328 -8386599 -9120499 -9709363 -10171070 -10541904 -10854174 -11119776 -11328997 -11462333
34435 -11462333 -11504401 -11449688 -11297758 -11043844 -10674028 -10171044 -9529145 -8769001 -7941523 -7115167
34425 -7115167 -6351805 -5684443 -5109267 -4595071 -4102317 -3600572 -3078148 -2544657 -2029496
34416 -2029496 -1576830 -1235901 -1046944 -1026244 -1155762 -1382250 -1628403 -1814444 -1883516 -1820900
34406 -1820900 -1658255 -1460470 -1301114 -1237528 -1295384 -1466848 -1720450 -2016860 -2323217 -2619243
34396 -2619243 -2892907 -3130303 -3309183 -3403232 -3396232 -3297703 -3149837 -3019772 -2979049 -3079382
34386 -3079382 -3336852 -3732147 -4224366 -4767499 -5318904 -5837626 -6279678 -6599128 -6757367
34377 -6757367 -6734654 -6535652 -6185625 -5720888 -5180004 -4599411 -4012660 -3450378 -2938836 -2496752
34367 -2496752 -2131266 -1835172 -1587997 -1361946 -1130515 -875584 -590184 -277413 52215
34358 52215 383279 697643 977442 1210591 1399389 1568830 1767635 2057131 2491007 3095640
34348 3095640 3859745 4736060 5653143 6533809 7314887 7960933 8466289 8846677 9127588
34339 9127588 9336499 9500486 9645943 9796714 9970307 10175925 10418280 10706396 11060412
34330 11060412 11508768 12074954 12760980 13536951 14341986 15096019 15718129 16145008 16342787
34321 16342787 16308131 16059303 15622944 15023854 14282367 13418125 12454511 11419189 10341655
34312 10341655 9252181 8183489 7171094 6248309 5438102 4748710 4177671 3722311 3390565
34303 3390565 3206239 3205703 3426232 3889892 4589774 5485300 6509085 7581894 8628635
34294 8628635 9589214 10422278 11104121 11626426 11994864 12227825 12353445 12404337 12411119 12396412
34284 12396412 12370482 12329645 12259029 12140327 11962178 11728035 11456825 11175313 10905549 10653974
34274 10653974 10409168 10151229 9868070 9568140 9281133 9046680 8897968 8848264 8885894 8980504
34264 8980504 9098937 9222611 9355697 9519605 9739605 10033522 10407776 10859638 11382648
34255 11382648 11973162 12635992 13385840 14241851 15215864 16299060 17454476 18621922 19735925
34246 19735925 20748888 21646709 22447739 23186232 23891105 24573067 25226934 25845756 26435649
34237 26435649 27020116 27630338 28288516 28996933 29741363 30506401 31291316 32115563 33012018
34228 33012018 34014883 35151489 36442658 37909418 39579552 41488093 43671642 46162017
34220 46162017 48985112 52165437 55731914 59720270 64170124 69117471 74586038 80583481
34212 80583481 87106375 94150833 101721062 109832751 118516276 127824604 137842296 148686748
34204 148686748 160498162 173424227 187609323 203193088 220313942 239106011 259679182
34197 259679182 282081349 306250692 331964215 358780684 385974775 412471722 436811994
34190 436811994 457194488 471651361 478375582 476141420 464666627 444744336 418068270
34183 418068270 386830506 353270116 319330403 286485673 255712888 227552349 202208193
34176 202208193 179654311 159724445 142178323 126746385 113159611 101168845 90554612
34169 90554612 81127295 72719945 65179981 58367011 52159154 46462933 41218568 36395670
34161 36395670 31979987 27956400 24295417 20949766 17863494 14989131 12303003 9808858
34153 9808858 7526022 5467593 3621096 1943680 375281 -1138132 -2624927 -4081909
34145 -4081909 -5482920 -6794994 -7993171 -9068384 -10027469 -10887650 -11668764 -12386194 -13046503
34136 -13046503 -13646517 -14175034 -14615168 -14945256 -15137664 -15157341 -14964536 -14525854 -13832946
34127 -13832946 -12920009 -11866830 -10779634 -9755864 -8851107 -8065958 -7357738 -6667136 -5944590
34118 -5944590 -5166687 -4341343 -3504614 -2712234 -2028355 -1513708 -1214038 -1148987 -1303685 -1628177
34108 -1628177 -2048143 -2483772 -2868297 -3158823 -3337449 -3405213 -3373077 -3254375 -3061562 -2806349
34098 -2806349 -2499876 -2151321 -1767419 -1355470 -927937 -503589 -103143 257341 570770
34089 570770 840113 1078438 1309068 1564497 1882378 2298658 2839333 3512332 4301684 5167260
34079 5167260 6052473 6897866 7654173 8288965 8785644 9137643 9341147 9389173 9270078 8972619
34069 8972619 8495663 7856502 7092447 6254921 5398904 4571187 3800794 3095835 2449503
34060 2449503 1852384 1302535 805582 364860 -30060 -406538 -800200 -1239774 -1735069
34051 -1735069 -2274598 -2832289 -3377817 -3885439 -4339562 -4737892 -5092733 -5429286 -5778852
34042 -5778852 -6166894 -6600156 -7059633 -7503870 -7880828 -8142388 -8256591 -8216033 -8041557 -7778841
34032 -7778841 -7486207 -7216977 -7004497 -6857308 -6765784 -6715296 -6698493 -6721047 -6798637 -6946785
34022 -6946785 -7168529 -7446444 -7743262 -8010032 -8196652 -8260230 -8170907 -7917264 -7511399 -6990303
34012 -6990303 -6410171 -5834388 -5319804 -4906149 -4610840 -4429164 -4338840 -4307691 -4302604 -4297737
34002 -4297737 -4280233 -4251992 -4226630 -4222412 -4254570 -4331050 -4453385 -4620744 -4834107 -5098628 -5422881
33991 -5422881 -5813029 -6261670 -6736589 -7178890 -7516336 -7687059 -7660665 -7445381 -7079696 -6616265
33981 -6616265 -6108016 -5601498 -5135892 -4743004 -4445367 -4253190 -4162395 -4154953 -4201654 -4267326
33971 -4267326 -4318255 -4330452 -4296284 -4227160 -4150701 -4102038 -4111544 -4194397 -4347432 -4554103 -4792851
33960 -4792851 -5043189 -5287431 -5510017 -5697367 -5839372 -5931455 -5974991 -5975206 -5938979 -5876142 -5804470
33949 -5804470 -5753209 -5759594 -5858772 -6073347 -6408430 -6852804 -7382715 -7964857 -8557427 -9110347
33939 -9110347 -9567395 -9873043 -9984318 -9883683 -9586379 -9137502 -8599421 -8035069 -7494085
33930 -7494085 -7006194 -6581834 -6216952 -5898384 -5608199 -5327609 -5041921 -4746333 -4449311
33921 -4449311 -4169010 -3921653 -3707428 -3503379 -3269173 -2962633 -2555297 -2039550 -1426224
33912 -1426224 -738082 -4993 737847 1451750 2099575 2653787 3104245 3462247 3759386
33903 3759386 4041544 4359348 4757079 5262882 5883266 6603438 7392511 8210770 9016408
33894 9016408 9771001 10444545 11020087 11495928 11882859 12196330 12446609 12630928 12730092 12710202
33884 12710202 12529236 12147420 11538878 10701006 9658525 8460791 7172607 5860107 4574909
33875 4574909 3341606 2154283 985455 -194715 -1396898 -2599183 -3748834 -4778953
33867 -4778953 -5632878 -6285453 -6751023 -7072994 -7298821 -7453340 -7525995 -7479844 -7276761 -6903701
33857 -6903701 -6385646 -5779784 -5156029 -4575209 -4075904 -3674409 -3373786 -3173477 -3073489 -3073173
33847 -3073173 -3167829 -3346096 -3590299 -3882413 -4215943 -4607536 -5097619 -5734528 -6549210 -7536186
33837 -7536186 -8652413 -9832784 -11010654 -12131660 -13156868 -14059278 -14819649 -15424224 -15863119
33828 -15863119 -16128154 -16211480 -16107361 -15817372 -15356794 -14759551 -14079694 -13387575 -12759188
33819 -12759188 -12259766 -11926565 -11757980 -11714453 -11731648 -11740524 -11685365 -11532538 -11269250 -10897728
33809 -10897728 -10430758 -9889855 -9303289 -8701638 -8111470 -7549329 -7018382 -6510420 -6015126
33800 -6015126 -5533782 -5088251 -4715582 -4448307 -4293184 -4224042 -4193844 -4156803 -4086490 -3982237
33790 -3982237 -3864757 -3765427 -3713318 -3724165 -3795655 -3910270 -4041611 -4158149 -4222753 -4192595
33780 -4192595 -4025544 -3693832 -3198398 -2574057 -1879429 -1174425 -496222 152992 799340
33771 799340 1475401 2196362 2948084 3692631 4385175 4990223 5488573 5874866 6151827 6327074
33761 6327074 6413892 6432900 6410538 6372852 6336760 6302835 6252864 6153324 5964060 5649686 5189885
33750 5189885 4585075 3856386 3041401 2187657 1345133 559018 -135694 -717060 -1177139
33741 -1177139 -1521353 -1765176 -1927904 -2026308 -2072133 -2074212 -2041979 -1986811 -1920460 -1852003 -1784492
33730 -1784492 -1711799 -1616485 -1469935 -1235585 -875147 -356992 334982 1194385 2189562 3265997
33720 3265997 4353583 5378057 6275599 7007122 7565457 7968858 8241671 8393190 8409222
33711 8409222 8262482 7934171 7432280 6797244 6095818 5409145 4819005 4392864 4169049
33702 4169049 4146665 4285176 4513910 4746820 4897878 4896437 4702973 4321199 3799125 3215767
33692 3215767 2659100 2205078 1903953 1774986 1808853 1976136 2237403 2548811 2861386 3118536
33682 3118536 3257445 3215643 2940048 2395922 1574241 495826 -789708 -2210508 -3683007
33673 -3683007 -5124133 -6462135 -7642722 -8628824 -9395872 -9926223 -10205074 -10219001 -9958923
33664 -9958923 -9428343 -8652764 -7682222 -6582881 -5422863 -4262262 -3151946 -2137161 -1258982
33655 -1258982 -551164 -35675 278983 396270 330111 106036 -236951 -648931 -1078787 -1487219
33645 -1487219 -1855533 -2186280 -2498387 -2821377 -3189105 -3629588 -4150104 -4723429 -5284332
33636 -5284332 -5740784 -5995737 -5970159 -5619910 -4944445 -3988421 -2836018 -1596208 -379982
33627 -379982 723016 1658055 2403853 2961083 3341291 3562939 3653241 3650415 3603026 3566384
33617 3566384 3596531 3741891 4034303 4483233 5076121 5784020 6569093 7391109 8211929 8998175
33607 8998175 9723445 10372461 10947961 11476424 12006374 12597598 13307440 14182071 15254308
33598 15254308 16543266 18052353 19767585 21659483 23687623 25803449 27948386 30048322
33590 30048322 32007732 33706849 35004918 35751771 35808065 35071559 33503375 31145500 28120979
33581 28120979 24614097 20837062 16995373 13261500 9759717 6561209 3689211 1133421
33573 1133421 -1131309 -3130390 -4884324 -6411157 -7730710 -8867127 -9850588 -10719777
33565 -10719777 -11523283 -12315647 -13146038 -14043140 -15003704 -15990441 -16939119 -17770403 -18402701
33556 -18402701 -18765664 -18814524 -18541745 -17979335 -17187921 -16236447 -15182569 -14063230 -12898520
33547 -12898520 -11704173 -10503245 -9328060 -8209875 -7162844 -6174364 -5210389 -4233505
33539 -4233505 -3221689 -2175453 -1110817 -47043 999318 2010988 2964549 3831610
33531 3831610 4586134 5209740 5689337 6010983 6158781 6122906 5912386 5563453 5135820 4695845
33521 4695845 4294509 3954000 3672566 3443438 3271523 3173320 3160787 3224332 3330633 3437764
33511 3437764 3516155 3561005 3590580 3635460 3727054 3889708 4136192 4465463 4862017 5295963
33501 5295963 5723299 6088189 6329907 6393989 6242753 5860452 5252581 4442329 3466296 2369455
33491 2369455 1198982 -1954 -1198288 -2363298 -3474942 -4510625 -5443993 -6246110
33483 -6246110 -6890072 -7356077 -7634885 -7729869 -7658536 -7452887 -7156372 -6816155 -6472907 -6153795
33473 -6153795 -5873104 -5639041 -5459655 -5341900 -5285373 -5278368 -5302256 -5342704 -5400261 -5493083 -5649869
33462 -5649869 -5896820 -6245385 -6686627 -7194265 -7733945 -8273655 -8790784 -9273624 -9717423
33453 -9717423 -10116672 -10457350 -10714344 -10857332 -10862112 -10718921 -10431626 -10010331 -9465829 -8810715
33443 -8810715 -8063623 -7249933 -6397139 -5529261 -4665550 -3824267 -3027289 -2300343 -1667672
33434 -1667672 -1145724 -741999 -460001 -304493 -280986 -390236 -624042 -966529 -1398819 -1902558
33424 -1902558 -2460609 -3055917 -3668903 -4272891 -4829915 -5292997 -5618994 -5787434 -5813311 -5744895
33414 -5744895 -5648914 -5593479 -5636097 -5815781 -6145519 -6606007 -7145516 -7688790 -8152905 -8465177
33404 -8465177 -8577361 -8470299 -8146461 -7615448 -6884290 -5962192 -4877935 -3696712 -2521774
33395 -2521774 -1476426 -675185 -198737 -81656 -311401 -832661 -1554840 -2364885 -3145510
33386 -3145510 -3793464 -4231607 -4413425 -4322900 -3971995 -3395277 -2641259 -1762734 -810251 169115
33376 169115 1129807 2027537 2823347 3489259 4010184 4380429 4598874 4667794 4595771 4400890
33366 4400890 4111182 3762298 3393636 3043058 2740038 2498644 2313318 2159607 1999469
33357 1999469 1788954 1486618 1062797 509134 -155397 -887130 -1629785 -2329944 -2947793
33348 -2947793 -3459762 -3855795 -4135419 -4304418 -4371668 -4345780 -4232281 -4032756 -3747347 -3380235
33338 -3380235 -2945190 -2467534 -1981308 -1523746 -1129963 -829155 -642610 -583502 -657424 -861041
33328 -861041 -1177182 -1568982 -1979117 -2338420 -2582203 -2667404 -2583028 -2350080 -2012295 -1622375
33318 -1622375 -1228927 -867575 -557853 -306040 -112183 22715 93546 92807 13979 -146927
33308 -146927 -391317 -716278 -1109805 -1546121 -1986113 -2385068 -2705026 -2926049 -3051410 -3105162
33298 -3105162 -3124511 -3151087 -3223800 -3373142 -3615491 -3947342 -4341924 -4752033 -5121083 -5400035
33288 -5400035 -5563379 -5616951 -5594530 -5545855 -5521499 -5559779 -5679938 -5884658 -6171397 -6546288
33278 -6546288 -7030915 -7655350 -8439393 -9372111 -10402073 -11445360 -12408370 -13214209 -13820856
33269 -13820856 -14225851 -14459364 -14570167 -14608635 -14611381 -14592890 -14547108 -14456447 -14302071 -14070800
33259 -14070800 -13758143 -13369098 -12917267 -12421231 -11897905 -11355605 -10791456 -10195719 -9560754
33250 -9560754 -8889127 -8197067 -7513302 -6875064 -6322434 -5891781 -5609811 -5489301 -5526035 -5696922
33240 -5696922 -5961927 -6272484 -6583739 -6862991 -7089684 -7251035 -7341985 -7372489 -7375921 -7409784
33230 -7409784 -7545972 -7855072 -8391536 -9184153 -10233548 -11516373 -12993522 -14617332 -16333056
33221 -16333056 -18074275 -19757368 -21282371 -22544175 -23451353 -23944757 -24008252 -23669322 -22992578
33212 -22992578 -22069884 -21007102 -19905602 -18840588 -17844384 -16904009 -15975887 -15011137 -13979682
33203 -13979682 -12883129 -11753434 -10641707 -9604951 -8696592 -7961713 -7434597 -7136096 -7070159
33194 -7070159 -7220458 -7549198 -8001065 -8514199 -9036131 -9537939 -10019037 -10499242 -11001273
33185 -11001273 -11531170 -12064629 -12545339 -12897549 -13049334 -12956469 -12614204 -12049832 -11301125
33176 -11301125 -10395637 -9344844 -8155108 -6844161 -5448946 -4019990 -2609631 -1264910
33168 -1264910 -28510 1057781 1953639 2625218 3050504 3222418 3150714 2863655 2407849
33159 2407849 1844292 1241349 667103 182104 -168360 -362834 -411004 -355855 -267151 -225588
33149 -225588 -301525 -536512 -936170 -1477757 -2127486 -2857022 -3650047 -4497586 -5388837 -6305993
33139 -6305993 -7225825 -8124108 -8978178 -9767682 -10477098 -11101422 -11651596 -12154547 -12646137
33130 -12646137 -13160430 -13720913 -14336906 -15003858 -15703554 -16402185 -17048548 -17576881 -17916855
33121 -17916855 -18008648 -17817377 -17340725 -16607120 -15667445 -14586164 -13435093 -12288126 -11214095
33112 -11214095 -10268643 -9488255 -8887433 -8457698 -8168962 -7976162 -7830993 -7692483 -7529870
33103 -7529870 -7318732 -7038227 -6675355 -6233791 -5739468 -5237378 -4781025 -4420506 -4194391
33094 -4194391 -4126380 -4224698 -4482245 -4877235 -5374790 -5929653 -6490419 -7006020 -7434375 -7751068
33084 -7751068 -7954530 -8065078 -8117725 -8151435 -8199299 -8283163 -8412836 -8587098 -8794483 -9014952
33074 -9014952 -9224065 -9398285 -9517991 -9567015 -9530762 -9395268 -9147667 -8778512 -8287404 -7691386
33064 -7691386 -7030825 -6365723 -5760534 -5263754 -4892828 -4632057 -4443891 -4287158 -4133671
33055 -4133671 -3978024 -3840327 -3763200 -3802531 -4011428 -4421653 -5031427 -5805989 -6688832 -7615512
33045 -7615512 -8523777 -9359492 -10081121 -10664367 -11106161 -11425453 -11658169 -11845562 -12019409
33036 -12019409 -12190571 -12346582 -12459195 -12498055 -12444493 -12299617 -12083270 -11825110 -11553676 -11289724
33026 -11289724 -11045380 -10825504 -10627270 -10437980 -10234500 -9987537 -9670609 -9269636 -8787407
33017 -8787407 -8239670 -7645878 -7022415 -6383977 -5750912 -5154507 -4634361 -4229306 -3968140
33008 -3968140 -3865311 -3922480 -4133305 -4487273 -4968877 -5551803 -6192503 -6829600 -7392358 -7815514
32998 -7815514 -8054465 -8095210 -7955680 -7677525 -7311433 -6903222 -6487843 -6091817 -5737678 -5444122
32988 -5444122 -5222606 -5076450 -5005819 -5014680 -5112891 -5311019 -5612352 -6008447 -6480496 -7003998
32978 -7003998 -7553374 -8105582 -8643229 -9156453 -9641554 -10095398 -10507457 -10853227 -11093047
32969 -11093047 -11178619 -11066307 -10732451 -10185038 -9468503 -8661315 -7866082 -7192011 -6733048
32960 -6733048 -6549565 -6660484 -7046062 -7656437 -8421850 -9263710 -10106121 -10886400 -11563364
32951 -11563364 -12122683 -12577400 -12960973 -13313661 -13668347 -14042646 -14438996 -14848746 -15254660
32942 -15254660 -15628775 -15927109 -16087266 -16036413 -15712116 -15089094 -14198880 -13132351 -12024267
32933 -12024267 -11026151 -10274992 -9863478 -9817729 -10090113 -10572684 -11127866 -11623130 -11954876
32924 -11954876 -12056088 -11893725 -11465032 -10796048 -9939233 -8966655 -7959514 -6998368 -6157791
32915 -6157791 -5504899 -5096773 -4972099 -5137966 -5559143 -6157588 -6824327 -7439790 -7896658
32906 -7896658 -8119991 -8080041 -7794138 -7316881 -6722192 -6084277 -5465167 -4912637 -4465213 -4155604
32896 -4155604 -4006229 -4019476 -4172071 -4420252 -4713419 -5008118 -5275707 -5502854 -5688216 -5839166
32886 -5839166 -5970085 -6100993 -6254264 -6448770 -6693255 -6981902 -7294321 -7600176 -7866312
32877 -7866312 -8062921 -8166885 -8164231 -8055012 -7860302 -7625603 -7414578 -7292978 -7309580 -7482911
32867 -7482911 -7798969 -8219158 -8693183 -9170480 -9606151 -9961138 -10199129 -10283535 -10177995 -9852952
32857 -9852952 -9297640 -8531980 -7610213 -6611373 -5619467 -4702867 -3902876 -3235475 -2702292
32848 -2702292 -2302560 -2039321 -1918495 -1943712 -2110966 -2405448 -2801233 -3263703 -3754368 -4236880
32838 -4236880 -4682034 -5069824 -5388519 -5632308 -5798601 -5884858 -5885400 -5790530 -5590034 -5279716
32828 -5279716 -4867157 -4374356 -3837855 -3306917 -2838181 -2485330 -2285916 -2250579 -2359617 -2568878
32818 -2568878 -2823366 -3073225 -3284637 -3440727 -3534275 -3559709 -3511449 -3390030 -3211167 -3010009
32808 -3010009 -2835088 -2733603 -2737396 -2859970 -3106013 -3483121 -4002793 -4667808 -5456419 -6317875
32798 -6317875 -7184931 -7996420 -8716894 -9344028 -9902366 -10427779 -10949207 -11474404 -11984674
32789 -11984674 -12439432 -12786882 -12975874 -12966361 -12737736 -12293781 -11662872 -10894868 -10058129 -9237421
32779 -9237421 -8528109 -8021443 -7782021 -7825874 -8109760 -8538018 -8986238 -9334056 -9495160 -9433668
32769 -9433668 -9162215 -8725262 -8176455 -7559216 -6896408 -6190501 -5432255 -4614020 -3742732
32760 -3742732 -2847290 -1976543 -1188419 -534980 -49224 263149 425941 487844 510988 555817
32750 555817 668452 875063 1182535 1581287 2047369 2545039 3032922 3474504 3848782 4153489
32740 4153489 4395628 4572186 4652314 4574035 4261102 3653749 2738391 1561313 219957
32731 219957 -1162576 -2466344 -3594579 -4480782 -5086791 -5398064 -5419964 -5175370 -4702449
32722 -4702449 -4051511 -3280527 -2449505 -1614470 -822327 -108066 504628 999341 1360676
32713 1360676 1568157 1593936 1408052 991984 354767 -458566 -1373107 -2301274 -3159829 -3878383
32703 -3878383 -4401284 -4690876 -4735873 -4559800 -4221304 -3803683 -3398255 -3088361 -2937055 -2977739
32693 -2977739 -3207194 -3583263 -4030648 -4455928 -4768837 -4903536 -4832526 -4567482 -4146481 -3613987
32683 -3613987 -3004244 -2336201 -1620405 -871316 -116772 601236 1236183 1753944 2148805
32674 2148805 2447999 2699037 2944855 3200054 3440172 3606972 3624825 3421541 2948271 2193291
32664 2193291 1184721 -18399 -1341205 -2707075 -4047992 -5312709 -6472964 -7524613
32656 -7524613 -8481281 -9363103 -10186257 -10957388 -11673443 -12325057 -12900486 -13387066 -13769862
32647 -13769862 -14031148 -14154984 -14135931 -13985024 -13726504 -13385844 -12976572 -12494280 -11921195
32638 -11921195 -11237968 -10435563 -9520912 -8514478 -7442400 -6327982 -5186534 -4025522
32630 -4025522 -2849421 -1666276 -491836 651211 1737926 2745994 3657125 4454351
32622 4454351 5118488 5628336 5965910 6122835 6102765 5918601 5587442 5125720 4544643 3846744
32612 3846744 3026482 2076311 995247 -204363 -1492851 -2821418 -4124686 -5330642
32604 -5330642 -6375813 -7217927 -7840290 -8249105 -8467886 -8530428 -8471904 -8320003 -8090205 -7787294
32594 -7787294 -7411468 -6965504 -6459671 -5912258 -5345924 -4783162 -4244733 -3751900 -3329199
32585 -3329199 -3003267 -2795623 -2711635 -2732162 -2815265 -2909853 -2974547 -2990982 -2965707 -2922862 -2892876
32574 -2892876 -2900344 -2953196 -3037230 -3120269 -3165107 -3143932 -3045948 -2875703 -2646366 -2373767 -2073242
32563 -2073242 -1757606 -1435587 -1113236 -800645 -521184 -316775 -245214 -371068 -753820 -1435179
32553 -1435179 -2427155 -3705266 -5211778 -6868877 -8594882 -10315199 -11964665 -13484132
32545 -13484132 -14816735 -15907728 -16708665 -17184479 -17321540 -17134825 -16671498 -16007045 -15231099
32536 -15231099 -14424752 -13637448 -12874615 -12103605 -11276434 -10358542 -9349315 -8284657 -7221414
32527 -7221414 -6212334 -5284288 -4430246 -3617959 -2808850 -1975278 -1107371 -209486 707116
32518 707116 1629670 2547013 3452741 4348227 5241452 6137884 7025161 7859908 8566230 9049605
32508 9049605 9220690 9018709 8426182 7472775 6230110 4799616 3294833 1820796 456145
32499 456145 -755289 -1800179 -2682477 -3409924 -3987016 -4414574 -4691872 -4818836 -4798991
32490 -4798991 -4643337 -4372091 -4011191 -3584656 -3108259 -2589251 -2032313 -1447379 -853551
32481 -853551 -275431 266858 767273 1235103 1685394 2124683 2541782 2908246 3184911 3328211
32471 3328211 3294446 3044800 2552914 1812552 841730 -317713 -1603825 -2940563 -4245530
32462 -4245530 -5437731 -6443508 -7200928 -7664217 -7807990 -7628787 -7142673 -6381323 -5389822
32453 -5389822 -4226154 -2958827 -1659688 -393171 792814 1869352 2822065 3644421
32445 3644421 4333572 4888695 5308842 5589836 5723930 5704770 5534643 5228633 4813696 4324770
32435 4324770 3800075 3275952 2781871 2337528 1953744 1637138 1396940 1250623 1223374 1337794
32425 1337794 1596723 1969495 2392565 2786981 3083681 3241952 3251064 3117344 2849672 2456655
32415 2456655 1957930 1399521 859934 440801 245779 356550 814250 1611147 2693173
32406 2693173 3970686 5334059 6671111 7883050 8894722 9656764 10141999 10341465 10263530
32397 10263530 9935167 9402632 8729697 7992311 7268555 6624529 6100343 5702107 5403623
32388 5403623 5157258 4909701 4615832 4243926 3770592 3172292 2424297 1511524 444327
32379 444327 -732786 -1945722 -3105656 -4127257 -4945259 -5526665 -5876132 -6032951 -6060811
32370 -6060811 -6034691 -6029387 -6111641 -6334666 -6732813 -7315503 -8061724 -8917248 -9796353 -10589754
32360 -10589754 -11180084 -11463579 -11372042 -10887175 -10043013 -8918083 -7621461 -6275596 -4997948
32351 -4997948 -3884477 -2998432 -2366425 -1982239 -1817473 -1835237 -2000154 -2279488 -2637204
32342 -2637204 -3028119 -3397767 -3688520 -3849922 -3850908 -3689538 -3394128 -3013725 -2603946 -2217334
32332 -2217334 -1901570 -1701246 -1657587 -1804615 -2163549 -2737486 -3508186 -4436550 -5467084
32323 -5467084 -6534769 -7573023 -8523095 -9344710 -10024244 -10574154 -11020770 -11385248 -11668307
32314 -11668307 -11848163 -11892943 -11779732 -11509156 -11108615 -10624960 -10111860 -9617237 -9174785
32305 -9174785 -8802599 -8509607 -8305711 -8207927 -8237661 -8412062 -8737750 -9212184 -9829786 -10585266
32295 -10585266 -11469825 -12462486 -13522175 -14584668 -15566094 -16373478 -16921366 -17150259 -17040542
32286 -17040542 -16617597 -15948175 -15130292 -14278018 -13502097 -12889213 -12484808 -12284132 -12234622
32277 -12234622 -12250681 -12238388 -12122633 -11866735 -11478266 -11001672 -10501938 -10043404 -9667839 -9378285
32267 -9378285 -9135795 -8871641 -8510522 -7996163 -7311000 -6484517 -5588225 -4718822 -3974208
32258 -3974208 -3428918 -3116474 -3025061 -3108099 -3303647 -3551808 -3802313 -4013103 -4147146 -4174036
32248 -4174036 -4077434 -3864217 -3569363 -3252199 -2983897 -2830753 -2840041 -3033326 -3407373 -3938833
32238 -3938833 -4588385 -5302920 -6017982 -6663586 -7174131 -7499976 -7616990 -7531101 -7276304 -6906943
32228 -6906943 -6487712 -6085301 -5762240 -5569535 -5535807 -5656456 -5890113 -6167038 -6407757 -6545380
32218 -6545380 -6543483 -6402561 -6152501 -5835914 -5492662 -5153982 -4846315 -4597198 -4434762 -4378348
32208 -4378348 -4425743 -4546401 -4686817 -4785983 -4792692 -4677493 -4438008 -4099876 -3714119 -3349037
32198 -3349037 -3075912 -2952068 -3007579 -3240798 -3624114 -4117346 -4683342 -5299327 -5959370 -6668139
32188 -6668139 -7431160 -8248374 -9113967 -10019578 -10955579 -11908474 -12857587 -13775424 -14632448
32179 -14632448 -15403060 -16069126 -16620027 -17050329 -17356629 -17535159 -17582207 -17498324 -17294067 -16992268
32169 -16992268 -16623940 -16220797 -15810883 -15420422 -15078208 -14816461 -14665949 -14648032 -14767303
32160 -14767303 -15007204 -15330759 -15688514 -16032626 -16330978 -16573794 -16769751 -16934988 -17081294
32151 -17081294 -17208126 -17300109 -17329636 -17263294 -17070063 -16728813 -16232667 -15588956 -14814977 -13931312
32141 -13931312 -12955960 -11903021 -10787998 -9637178 -8494594 -7421030 -6485328 -5752885
32133 -5752885 -5274894 -5078106 -5154789 -5456470 -5896838 -6365422 -6748340 -6950656 -6915949 -6639278
32123 -6639278 -6169163 -5595340 -5023645 -4545728 -4215462 -4042033 -4000633 -4051178 -4152499 -4267252
32113 -4267252 -4363206 -4417830 -4424756 -4394032 -4342371 -4280157 -4206274 -4114548 -4004866 -3889018 -3787800
32102 -3787800 -3723876 -3716302 -3778032 -3914320 -4121507 -4388542 -4702362 -5053700 -5438315 -5852415
32092 -5852415 -6285408 -6713076 -7091988 -7356874 -7425876 -7217386 -6674784 -5788996 -4610055
32083 -4610055 -3244694 -1840476 -557924 464641 1143517 1468304 1501453 1359475 1179592
32074 1179592 1078286 1113843 1267627 1452002 1539833 1402292 942267 115276 -1066046 -2542796
32064 -2542796 -4228622 -6026959 -7842149 -9587120 -11191545 -12609592 -13822407 -14832608
32056 -14832608 -15653527 -16299300 -16780480 -17105644 -17285895 -17337913 -17282187 -17135620 -16901901 -16566873
32046 -16566873 -16105396 -15498433 -14749451 -13887854 -12956846 -11995241 -11026007 -10057232 -9092306
32037 -9092306 -8142002 -7231657 -6399317 -5685150 -5118044 -4707796 -4446961 -4318764 -4303966 -4383421
32027 -4383421 -4538869 -4755421 -5024670 -5343775 -5708056 -6101043 -6490160 -6833698 -7096413
32018 -7096413 -7263408 -7341754 -7348323 -7293553 -7174155 -6979322 -6703197 -6352333 -5943104 -5492733
32008 -5492733 -5010792 -4495823 -3938307 -3328582 -2666079 -1965490 -1257737 -587151 -7236
31999 -7236 424993 657997 658103 421286 -21845 -612232 -1278824 -1958374 -2608043 -3203380
31989 -3203380 -3724408 -4143055 -4426295 -4557382 -4561363 -4514600 -4527785 -4709855 -5131972 -5808443
31979 -5808443 -6699398 -7728745 -8807136 -9852565 -10804893 -11631938 -12325450 -12889013 -13325301
31970 -13325301 -13631569 -13805776 -13856259 -13804222 -13674417 -13479603 -13209684 -12833250 -12310892 -11613174
31960 -11613174 -10735048 -9702153 -8568421 -7406206 -6291289 -5287408 -4436672 -3759511
31952 -3759511 -3261722 -2942546 -2799381 -2828307 -3020953 -3358728 -3807910 -4320625 -4842974 -5325104
31942 -5325104 -5726432 -6014830 -6164084 -6153618 -5970946 -5615940 -5105904 -4478199 -3785659 -3084013
31932 -3084013 -2418247 -1816583 -1293476 -854924 -499927 -218886 5701 193089 354066
31923 354066 481017 542994 488895 258205 -204547 -935109 -1935846 -3165430 -4538476
31914 -4538476 -5941521 -7262498 -8419901 -9376620 -10133683 -10711614 -11132602 -11413661 -11572371
31905 -11572371 -11637812 -11655520 -11680286 -11760484 -11923552 -12170191 -12478777 -12816889 -13154743 -13474502
31895 -13474502 -13770934 -14043742 -14287759 -14488991 -14630542 -14704774 -14722489 -14711247 -14702931 -14718871
31885 -14718871 -14761415 -14814410 -14849159 -14832046 -14732621 -14531606 -14227476 -13839670 -13406383 -12974698
31875 -12974698 -12583807 -12248226 -11951133 -11652115 -11303347 -10864024 -10308163 -9627705 -8833843
31866 -8833843 -7956149 -7037350 -6123871 -5255722 -4460656 -3755379 -3151921 -2663722 -2306442
31857 -2306442 -2092509 -2022017 -2073920 -2201947 -2339562 -2415727 -2376836 -2204315 -1917941 -1562784
31847 -1562784 -1187387 -825098 -486683 -164594 156269 486732 823788 1145795 1414788
31838 1414788 1586030 1621077 1499085 1222871 818563 328553 -200960 -732695 -1244097 -1723132
31828 -1723132 -2158548 -2532973 -2823629 -3009125 -3077880 -3034934 -2905262 -2731136 -2561567 -2436306
31818 -2436306 -2372091 -2358344 -2362495 -2339114 -2238721 -2017868 -1652679 -1151544 -557606 64122
31808 64122 649843 1158160 1578806 1926291 2224172 2490132 2729777 2939458 3111790 3237531
31798 3237531 3303255 3289266 3171930 2931290 2561911 2082672 1538924 990994 489981 53114
31788 53114 -344186 -751073 -1208036 -1718617 -2243177 -2716183 -3074189 -3278087 -3320030 -3215900
31778 -3215900 -2991470 -2671189 -2274159 -1816872 -1319694 -813199 -339694 53742 329293
31769 329293 471303 488649 403994 236623 -10757 -354569 -822493 -1441130 -2226306 -3179337
31759 -3179337 -4286650 -5518031 -6823021 -8130420 -9355725 -10415846 -11246125 -11814707
31751 -11814707 -12131199 -12246997 -12245097 -12220583 -12257412 -12409332 -12690374 -13076120 -13513245 -13933782
31741 -13933782 -14270786 -14472332 -14510154 -14379705 -14092269 -13665215 -13118399 -12479784 -11795117
31732 -11795117 -11132268 -10574346 -10203158 -10079894 -10230065 -10636967 -11245480 -11975857 -12744054
31723 -12744054 -13481519 -14146734 -14724515 -15215094 -15619290 -15927214 -16116061 -16157252 -16026790
31714 -16026790 -15710004 -15197266 -14476561 -13532498 -12355503 -10956062 -9375506 -7687999 -5993061
31705 -5993061 -4400729 -3012919 -1905482 -1115041 -633406 -411117 -370061 -422098 -488012
31696 -488012 -511661 -467214 -359022 -213657 -65768 55787 133685 158346 121940 18389
31686 18389 -150422 -369534 -613034 -852666 -1067179 -1247550 -1397108 -1528737 -1661988 -1821230
31676 -1821230 -2033209 -2321486 -2697817 -3154267 -3660584 -4167655 -4613949 -4932114 -5056653
31667 -5056653 -4935548 -4545329 -3903482 -3070732 -2140801 -1221710 -414828 204096 598579
31658 598579 775273 774786 652541 459385 231385 -8655 -242523 -447342 -590869 -633955
31648 -633955 -539752 -285794 126321 667087 1281832 1900146 2451683 2884878 3180816 3354667
31638 3354667 3443855 3489898 3522766 3552559 3568831 3546460 3456365 3276725 2998301 2620840 2145189
31627 2145189 1569968 896802 139281 -672597 -1495622 -2280545 -2978330 -3543838 -3938053
31618 -3938053 -4130137 -4100529 -3846403 -3388889 -2777785 -2088085 -1406629 -813033 -361703 -70066
31608 -70066 84346 156813 219364 340312 566376 913087 1365124 1884579 2422947 2932096
31598 2932096 3370757 3706373 3914659 3978372 3884561 3620460 3171879 2528794 1697187 709467
31588 709467 -374756 -1479725 -2531910 -3478403 -4298705 -5005723 -5635699 -6231153 -6823455
31579 -6823455 -7421767 -8012868 -8572307 -9081446 -9540315 -9967567 -10386639 -10806122 -11206371
31570 -11206371 -11541178 -11754882 -11805966 -11684176 -11413342 -11042210 -10631264 -10240674 -9919604
31561 -9919604 -9697329 -9579781 -9553696 -9594996 -9675405 -9765351 -9836076 -9863389 -9831129 -9730681 -9555766
31550 -9555766 -9295987 -8934060 -8449512 -7827959 -7072229 -6210684 -5298694 -4410501 -3621549
31541 -3621549 -2986131 -2519983 -2197737 -1968711 -1784700 -1626357 -1514799 -1501986 -1644256 -1972592
31531 -1972592 -2475309 -3101591 -3781676 -4450182 -5059495 -5579328 -5988826 -6271674 -6420457
31522 -6420457 -6448044 -6397123 -6338586 -6355685 -6519635 -6867453 -7390920 -8039292 -8733226 -9385710
31512 -9385710 -9924954 -10312648 -10550852 -10675168 -10738398 -10792554 -10875041 -11000796 -11159905 -11320840
31502 -11320840 -11439795 -11474449 -11396666 -11197266 -10880204 -10451190 -9909982 -9251851 -8475560 -7590952
31492 -7590952 -6621684 -5604065 -4585194 -3622053 -2780063 -2127787 -1725654 -1610668 -1783501
31483 -1783501 -2204902 -2803909 -3494915 -4197812 -4855437 -5443022 -5965891 -6446115 -6904993
31474 -6904993 -7350876 -7777788 -8172743 -8524888 -8831150 -9097720 -9339394 -9577664 -9836791
31465 -9836791 -10137835 -10492714 -10899962 -11341403 -11778469 -12150366 -12379274 -12385124 -12105544 -11512112
31455 -11512112 -10616086 -9463068 -8121280 -6669259 -5186298 -3745212 -2405348 -1205760
31447 -1205760 -161751 731998 1493040 2143063 2704354 3199264 3647575 4059637 4429333
31438 4429333 4733136 4937472 5010832 4934934 4711056 4359796 3913815 3405486 2855209 2267508
31428 2267508 1637586 963498 255512 -462594 -1159470 -1805097 -2378552 -2871971 -3288859
31419 -3288859 -3636355 -3913798 -4103530 -4170769 -4075371 -3790803 -3320222 -2701101 -1996798 -1279794
31409 -1279794 -613159 -36208 440478 828130 1144832 1402395 1603249 1746874 1837975 1889825
31399 1889825 1922580 1960213 2027979 2149482 2342020 2610725 2944106 3314429 3685416 4025467
31389 4025467 4319195 4568592 4781643 4956614 5074985 5109323 5039654 4865004 4602006 4273561
31379 4273561 3896846 3477429 3010597 2487735 1904252 1264435 579510 -139319 -885851
31370 -885851 -1656515 -2443144 -3228249 -3986999 -4693996 -5330873 -5892451 -6389946 -6849237 -7303733
31360 -7303733 -7784757 -8313611 -8896971 -9524901 -10170988 -10795559 -11352709 -11800171 -12109555
31351 -12109555 -12273690 -12308516 -12249158 -12142507 -12039319 -11986781 -12020885 -12158994 -12395558 -12704682
31341 -12704682 -13050751 -13404240 -13756238 -14124229 -14544755 -15054894 -15670659 -16372549 -17105472
31332 -17105472 -17793809 -18365422 -18774184 -19011591 -19103759 -19097094 -19039926 -18967593 -18896014 -18824756
31322 -18824756 -18745799 -18651048 -18532997 -18378731 -18163286 -17849646 -17398133 -16781139 -15995046 -15063232
31312 -15063232 -14030276 -12952537 -11890035 -10900426 -10032913 -9320845 -8775055 -8381753 -8107159
31303 -8107159 -7907073 -7736839 -7558359 -7344535 -7083076 -6779239 -6454709 -6142011 -5877812
31294 -5877812 -5698314 -5635325 -5709772 -5923646 -6256097 -6667622 -7109885 -7535035 -7900438 -8169299
31284 -8169299 -8310719 -8303028 -8141704 -7848712 -7476913 -7104755 -6821749 -6709801 -6826904 -7198419
31274 -7198419 -7818064 -8655970 -9667777 -10800451 -11995615 -13193916 -14341261 -15394174
31266 -15394174 -16321549 -17102561 -17722276 -18167222 -18423912 -18482275 -18342074 -18016659 -17529301
31257 -17529301 -16902736 -16147718 -15258104 -14217552 -13016860 -11673822 -10244599 -8820396
31249 -8820396 -7511695 -6427486 -5656437 -5254151 -5237749 -5586043 -6242105 -7117968 -8105376
31240 -8105376 -9095001 -9998645 -10763759 -11374313 -11841754 -12194391 -12469819 -12709171 -12950204
31231 -12950204 -13219131 -13524879 -13860117 -14209066 -14556400 -14890723 -15201977 -15478761 -15711218
31222 -15711218 -15898824 -16057172 -16218304 -16423138 -16708577 -17094233 -17573803 -18113593 -18656863
31213 -18656863 -19130958 -19455584 -19552870 -19360217 -18844839 -18016229 -16931052 -15686227 -14400291
31204 -14400291 -13188110 -12136578 -11288364 -10638260 -10142656 -9737878 -9359988 -8959997 -8512875
31195 -8512875 -8021462 -7515408 -7043850 -6661839 -6414083 -6321712 -6376813 -6545579 -6776912 -7012057
31185 -7012057 -7193401 -7273081 -7220476 -7024506 -6688211 -6220339 -5632631 -4945484 -4194087 -3424494
31175 -3424494 -2678076 -1974236 -1304200 -641192 38554 735783 1419295 2030777 2498411
31166 2498411 2751931 2735083 2415779 1794985 912670 -152984 -1295482 -2397869 -3354695
31157 -3354695 -4093361 -4590058 -4875784 -5029784 -5161330 -5383807 -5786467 -6410101 -7234019
31148 -7234019 -8180288 -9134589 -9974757 -10595544 -10923186 -10920001 -10582090 -9933330 -9019202 -7903472
31138 -7903472 -6666483 -5399533 -4191424 -3110723 -2192568 -1436867 -817930 -300508 144222
31129 144222 528577 847853 1088954 1242905 1314104 1321962 1296163 1270264 1277049 1344527 1489155
31118 1489155 1706478 1965795 2216916 2409620 2516071 2542829 2525861 2512420 2539723 2619652
31108 2619652 2734548 2844739 2904358 2878976 2758391 2560907 2329226 2119891 1988198 1970761
31098 1970761 2069631 2244054 2416099 2492291 2395208 2091334 1601408 989075 336020 -282875
31088 -282875 -814985 -1234066 -1535565 -1727312 -1820596 -1825678 -1751926 -1608876 -1405275 -1147621
31078 -1147621 -841882 -499315 -142745 191671 459251 615729 624985 461124 105211 -458084
31068 -458084 -1238487 -2232357 -3414035 -4731356 -6106988 -7445335 -8645152 -9617015 -10300126
31059 -10300126 -10669914 -10732365 -10511169 -10039020 -9358322 -8525162 -7606477 -6668595 -5765744
31050 -5765744 -4937587 -4214763 -3623029 -3179462 -2884805 -2722081 -2666723 -2702544 -2831633 -3069682
31040 -3069682 -3428270 -3894132 -4417292 -4915046 -5290997 -5462013 -5382875 -5059155 -4543476 -3917509
31030 -3917509 -3268387 -2669421 -2170339 -1795802 -1547894 -1409983 -1352498 -1341870 -1351796 -1373110
31020 -1373110 -1417423 -1511386 -1683219 -1948790 -2306335 -2743737 -3252575 -3837147 -4510080 -5276886
31010 -5276886 -6120432 -6996030 -7839373 -8580886 -9157859 -9520463 -9633726 -9479260 -9057583
31001 -9057583 -8388548 -7507688 -6459408 -5290324 -4045362 -2766799 -1495229 -272019
30993 -272019 856761 1836788 2606953 3110054 3311232 3215398 2872613 2366065 1787162 1209377
30983 1209377 672633 183728 -270533 -707084 -1136888 -1565141 -1997048 -2441111 -2904985
30974 -2904985 -3385950 -3863660 -4302466 -4664094 -4923523 -5078199 -5145943 -5155438 -5137703 -5124166
30964 -5124166 -5150331 -5259300 -5499541 -5915267 -6532813 -7349469 -8330359 -9414714 -10528307
30955 -10528307 -11597371 -12561103 -13382100 -14054062 -14604283 -15087936 -15573565 -16123104 -16772534
30946 -16772534 -17519749 -18324511 -19121330 -19840473 -20427781 -20855010 -21119137 -21235877 -21233686 -21150148
30936 -21150148 -21028322 -20910613 -20830420 -20803748 -20823290 -20857362 -20855684 -20761614 -20526497 -20119695
30926 -20119695 -19530717 -18765486 -17841819 -16787055 -15636950 -14433706 -13222559 -12047135
30918 -12047135 -10943699 -9935007 -9026372 -8206486 -7452470 -6736348 -6031445 -5319332 -4596739
30909 -4596739 -3878564 -3193356 -2572534 -2039248 -1602655 -1259457 -1000547 -818483 -711404
30900 -711404 -681636 -731092 -857859 -1056892 -1324183 -1661384 -2077278 -2583368 -3183610 -3863016
30890 -3863016 -4582985 -5288462 -5924007 -6449483 -6847241 -7119838 -7283838 -7365728 -7401450 -7435724
30880 -7435724 -7516016 -7679860 -7940750 -8281469 -8660562 -9028675 -9343769 -9575343 -9698061 -9685821
30870 -9685821 -9517424 -9193488 -8751648 -8265908 -7827434 -7517394 -7386273 -7447320 -7682175 -8051897
30860 -8051897 -8507761 -9000219 -9486812 -9938838 -10343916 -10701451 -11012402 -11270189 -11460009
30851 -11460009 -11567364 -11589301 -11540162 -11448697 -11349780 -11276637 -11257131 -11313316 -11460786 -11705549
30841 -11705549 -12039519 -12437954 -12861675 -13265061 -13608895 -13874366 -14071708 -14237253 -14418534
30832 -14418534 -14654567 -14961219 -15327823 -15725030 -16118983 -16484449 -16809928 -17092473 -17326439
30823 -17326439 -17493772 -17561423 -17487536 -17235443 -16791746 -16180532 -15464053 -14725888 -14043712 -13465968
30813 -13465968 -13003924 -12640052 -12344079 -12086151 -11842519 -11596592 -11340249 -11076442 -10819957
30804 -10819957 -10593322 -10417973 -10303464 -10239284 -10194961 -10131549 -10020426 -9858443 -9669787 -9493924
30794 -9493924 -9367357 -9308196 -9308958 -9339394 -9358323 -9330402 -9241463 -9106812 -8970248 -8895080 -8950051
30783 -8950051 -9193368 -9657951 -10341593 -11205895 -12185172 -13201113 -14175464 -15036297 -15720993
30774 -15720993 -16181999 -16396048 -16370483 -16140335 -15756519 -15271422 -14728149 -14155805 -13569762
30765 -13569762 -12974591 -12367704 -11742636 -11091538 -10406935 -9683965 -8925241 -8148923 -7396129
30756 -7396129 -6730552 -6225768 -5943155 -5909772 -6106318 -6470895 -6917226 -7359194 -7730248 -7989378
30746 -7989378 -8113777 -8085949 -7884754 -7485916 -6871863 -6045829 -5042181 -3925868 -2779819
30737 -2779819 -1686684 -714072 92002 707398 1128162 1368758 1459202 1440081 1356144 1249980
30727 1249980 1156888 1101376 1095277 1137385 1214706 1305858 1387101 1440502 1462137 1466943 1486931 1561872
30715 1561872 1725718 1994822 2362575 2800431 3262556 3692787 4035169 4248221 4318772 4268287
30705 4268287 4146873 4016501 3931482 3926466 4017643 4213705 4526223 4969954 5551362 6251896
30695 6251896 7016121 7752585 8348826 8694859 8706223 8340391 7605464 6561806 5314955
30686 5314955 3996996 2737819 1634594 731503 18960 -546998 -1014303 -1408542 -1723333
30677 -1723333 -1930207 -2000053 -1923203 -1718450 -1429658 -1116113 -844037 -681226 -690729 -919572
30667 -919572 -1384800 -2064422 -2899803 -3809963 -4711907 -5538479 -6247269 -6820139 -7258239 -7577304
30657 -7577304 -7803501 -7967590 -8097471 -8211896 -8317040 -8405020 -8453882 -8431067 -8302259 -8044129
30647 -8044129 -7656448 -7168625 -6637632 -6137610 -5745336 -5527021 -5529009 -5770843 -6239018 -6883700
30637 -6883700 -7623298 -8359391 -8998524 -9472534 -9748984 -9828986 -9737152 -9511343 -9195729 -8835232
30627 -8835232 -8469422 -8128117 -7831906 -7596352 -7434772 -7356377 -7361742 -7440436 -7573920 -7742777
30617 -7742777 -7933620 -8140653 -8360983 -8588390 -8811914 -9021051 -9213311 -9397683 -9590380
30608 -9590380 -9804592 -10040842 -10285569 -10520477 -10736393 -10940742 -11152427 -11387822 -11647389
30599 -11647389 -11910199 -12137332 -12280608 -12292726 -12137090 -11796950 -11282046 -10627971 -9884224
30590 -9884224 -9093818 -8275276 -7418142 -6494063 -5475124 -4348419 -3121359 -1819406 -481253
30581 -481253 844718 2102514 3232241 4178961 4906189 5408031 5712451 5872713 5950754
30572 5950754 5999371 6048904 6101479 6133813 6107037 5979359 5717072 5301925 4735184 4037920
30562 4037920 3245980 2399984 1534716 673136 -173774 -1004702 -1826565 -2653271 -3501033
30553 -3501033 -4379185 -5281066 -6182232 -7048534 -7848692 -8562973 -9184480 -9716221 -10167953
30544 -10167953 -10552823 -10881950 -11158385 -11374881 -11517741 -11573390 -11531637 -11382418 -11108913 -10684652
30534 -10684652 -10081313 -9286941 -8325170 -7262915 -6200609 -5249870 -4509130 -4044840 -3880390
30525 -3880390 -3992865 -4318963 -4770826 -5258852 -5715195 -6111335 -6464792 -6831679 -7285066
30516 -7285066 -7885415 -8655236 -9569121 -10561499 -11545156 -12431271 -13145618 -13639469 -13894332
30507 -13894332 -13919459 -13742729 -13398506 -12917884 -12325823 -11646084 -10909900 -10161650 -9456616
30498 -9456616 -8850765 -8386554 -8079869 -7913190 -7838842 -7792788 -7714065 -7562070 -7326094 -7026080
30488 -7026080 -6706225 -6423172 -6230956 -6166976 -6244863 -6458114 -6792478 -7239041 -7798996 -8477153
30478 -8477153 -9269778 -10155458 -11093486 -12027996 -12894328 -13626587 -14167166 -14477706 -14547994 -14397779
30468 -14397779 -14068329 -13605730 -13043919 -12396942 -11664031 -10841998 -9935452 -8959417 -7936086
30459 -7936086 -6890245 -5845699 -4822268 -3833272 -2885019 -1979404 -1118099 -305135 453904
30450 453904 1154938 1798094 2388229 2932662 3436693 3899177 4312290 4668567 4973328 5254527
30440 5254527 5560997 5946418 6446277 7060769 7752731 8459305 9108121 9629878 9966405
30431 9966405 10077813 9950623 9604320 9091917 8491517 7888928 7355917 6932522 6621111
30422 6621111 6393040 6202186 5999289 5745106 5421531 5036761 4619328 4200820 3794729
30413 3794729 3382470 2915228 2333024 1593596 697287 -304604 -1321415 -2247694 -2989597
30404 -2989597 -3484735 -3711752 -3689110 -3464648 -3099755 -2653456 -2171210 -1681340 -1199299 -737207
30394 -737207 -313839 39912 283055 373490 280913 -1141 -449016 -1011648 -1621962 -2212572
30384 -2212572 -2729778 -3141541 -3438466 -3629199 -3732279 -3767009 -3746708 -3677165 -3559764 -3395167
30374 -3395167 -3183740 -2923552 -2610444 -2242685 -1826778 -1377896 -912192 -436148 57692
30365 57692 583184 1145608 1730614 2306285 2837093 3299550 3689297 4017231 4299743 4549378
30355 4549378 4768900 4949254 5071547 5113037 5055394 4891609 4628526 4284854 3887518 3468779
30345 3468779 3063464 2703776 2411828 2194229 2042586 1938335 1856552 1766557 1632600 1418444
30335 1418444 1095398 650834 95300 -533398 -1172883 -1748646 -2192960 -2461255 -2538763 -2436937
30325 -2436937 -2183869 -1813443 -1357171 -841086 -286394 290214 878497 1475666 2082654
30316 2082654 2697060 3307786 3894148 4428303 4879752 5222427 5443680 5551098 5572374 5547068
30306 5547068 5513284 5494827 5494719 5498753 5487440 5448982 5384546 5302551 5207031 5089768 4932664
30295 4932664 4718115 4438627 4098683 3710162 3288468 2854410 2440023 2092127 1868478
30286 1868478 1825511 2001008 2398375 2979747 3671912 4383369 5026511 5537511 5887946 6085646
30276 6085646 6166329 6180140 6176871 6192455 6239502 6305130 6356874 6353042 6251918 6016867 5618685
30265 5618685 5038075 4269550 3325432 2237341 1053453 -167967 -1366529 -2487354 -3488219
30256 -3488219 -4346725 -5066479 -5678860 -6235720 -6791249 -7378785 -7995700 -8608310 -9175761
30247 -9175761 -9676659 -10119551 -10531680 -10937242 -11342181 -11734732 -12098941 -12431598 -12753269
30238 -12753269 -13108229 -13552473 -14132895 -14864794 -15717661 -16617317 -17464580 -18161519 -18633519
30229 -18633519 -18840421 -18776605 -18462592 -17931177 -17212927 -16327817 -15287097 -14102862 -12797946
30220 -12797946 -11410354 -9991354 -8599297 -7290721 -6109608 -5076979 -4185289 -3401384
30212 -3401384 -2677504 -1965241 -1226812 -441565 390848 1249537 2094973 2877227 3548798
30203 3548798 4077415 4453686 4691784 4825081 4899418 4964869 5066070 5232878 5474517 5778253
30193 5778253 6109952 6414090 6615783 6631238 6388990 5854716 5045973 4026983 2885346
30184 2885346 1703115 536361 -590347 -1677777 -2741321 -3800196 -4867029 -5937813
30176 -5937813 -6984336 -7952251 -8766840 -9346399 -9621056 -9552574 -9149070 -8469101 -7612563
30167 -7612563 -6700428 -5849792 -5152882 -4666389 -4411536 -4380126 -4541961 -4852812 -5264143 -5733156
30157 -5733156 -6228406 -6727290 -7207290 -7638025 -7980978 -8198273 -8265493 -8181159 -7968081 -7666209
30147 -7666209 -7319803 -6963414 -6612264 -6261730 -5896221 -5501704 -5073887 -4618083 -4143273
30138 -4143273 -3656284 -3160225 -2657332 -2153351 -1660096 -1194600 -775789 -421239 -145921
30129 -145921 36852 113560 69584 -109083 -431384 -896018 -1488387 -2180823 -2934949 -3705203
30119 -3705203 -4444591 -5113296 -5686944 -6158728 -6533161 -6816107 -7008434 -7106524 -7107069 -7012336
30109 -7012336 -6834316 -6597327 -6336886 -6092145 -5892983 -5748386 -5643957 -5550971 -5441450 -5300311
30099 -5300311 -5129350 -4944390 -4770446 -4637836 -4578619 -4621463 -4785133 -5073512 -5475943 -5973773
30089 -5973773 -6549167 -7189333 -7882245 -8606793 -9324574 -9978523 -10498643 -10813057 -10863140 -10619990
30079 -10619990 -10095391 -9339368 -8422745 -7413255 -6358835 -5286717 -4215039 -3164998
30071 -3164998 -2164011 -1241605 -428098 238470 704247 902688 772463 279976 -567803
30062 -567803 -1726490 -3129004 -4702753 -6382140 -8113828 -9856083 -11575033 -13239624
30054 -13239624 -14815940 -16262316 -17528693 -18563435 -19327412 -19810768 -20045435 -20106263 -20096591
30045 -20096591 -20120346 -20250529 -20507549 -20856587 -21223570 -21520647 -21669586 -21615439 -21329909 -20809185
30035 -20809185 -20071187 -19153353 -18108678 -16998433 -15883089 -14814728 -13832981 -12964536 -12225376
30026 -12225376 -11624580 -11167815 -10858206 -10693889 -10664195 -10747786 -10914947 -11133642 -11376509 -11623955
30016 -11623955 -11858982 -12054715 -12163728 -12121206 -11865204 -11362939 -10626033 -9706189 -8676929
30007 -8676929 -7613702 -6581140 -5628930 -4792586 -4093380 -3534023 -3092961 -2725249 -2374961
29998 -2374961 -1994486 -1560059 -1076462 -571673 -86081 339735 675709 908578 1042432
29989 1042432 1094619 1088731 1046164 979129 889273 773197 630103 464946 285995 101553
29979 101553 -80407 -251474 -404563 -538234 -660270 -788605 -950316 -1179197 -1510417 -1971655
29969 -1971655 -2573095 -3300364 -4113329 -4952210 -5751433 -6459034 -7054559 -7556295 -8013064
29960 -8013064 -8484239 -9017098 -9630270 -10308023 -11005542 -11661499 -12212430 -12605112 -12805930
29951 -12805930 -12806725 -12624449 -12292316 -11845042 -11305679 -10680919 -9965957 -9155027 -8252382 -7280071
29941 -7280071 -6281331 -5319875 -4474764 -3828875 -3450586 -3374558 -3592311 -4059212 -4713472 -5495465
29931 -5495465 -6358070 -7266600 -8192480 -9106381 -9975714 -10768356 -11460108 -12040574 -12514209
29922 -12514209 -12897035 -13210991 -13476979 -13707982 -13905077 -14058454 -14152383 -14170903 -14101837 -13938596
29912 -13938596 -13680030 -13329173 -12892330 -12379572 -11805887 -11191590 -10561775 -9945444 -9374036
29903 -9374036 -8878495 -8485455 -8214452 -8076599 -8072700 -8189551 -8396845 -8649275 -8896078 -9095555
29893 -9095555 -9228606 -9304979 -9358890 -9436103 -9579447 -9820042 -10176117 -10655024 -11252990 -11952110
29883 -11952110 -12719455 -13512885 -14292441 -15030859 -15716970 -16351002 -16935727 -17468409 -17936545
29874 -17936545 -18318324 -18587489 -18720705 -18703704 -18532674 -18210537 -17741511 -17128219 -16372843
29865 -16372843 -15480563 -14462643 -13338222 -12135271 -10890762 -9648933 -8456736 -7357491
29857 -7357491 -6385195 -5561126 -4892065 -4368316 -3961200 -3623019 -3293959 -2917323 -2458130
29848 -2458130 -1916311 -1328934 -762832 -302664 -37000 -42434 -368037 -1025888 -1991789 -3213758
29838 -3213758 -4622087 -6136975 -7673827 -9147800 -10478752 -11598191 -12459388 -13048340
29830 -13048340 -13389288 -13538779 -13568052 -13540181 -13491627 -13426011 -13322188 -13151763 -12897070 -12561988
29820 -12561988 -12173133 -11773878 -11415385 -11148078 -11015366 -11049510 -11268276 -11671336 -12237264
29811 -12237264 -12923349 -13670029 -14409555 -15076636 -15618320 -16001586 -16218330 -16286787 -16246617 -16145508
29801 -16145508 -16020356 -15882069 -15712777 -15476266 -15133657 -14654684 -14020884 -13224032 -12265320
29792 -12265320 -11157707 -9929296 -8623781 -7295835 -6003147 -4798703 -3725269 -2811296
29784 -2811296 -2066844 -1480722 -1022047 -648018 -315391 9949 349324 712239 1097105
29775 1097105 1488805 1856380 2157143 2348883 2403525 2312739 2082457 1722407 1239759 640663
29765 640663 -63561 -851285 -1689840 -2539015 -3356833 -4105321 -4754694 -5285443 -5689433 -5971873
29755 -5971873 -6155020 -6281346 -6411392 -6613081 -6945161 -7442690 -8111208 -8929349 -9854361
29746 -9854361 -10826565 -11774014 -12620627 -13298519 -13761924 -13998866 -14036810 -13938997 -13790723 -13679263
29736 -13679263 -13674195 -13814017 -14101675 -14508854 -14987299 -15483845 -15954685 -16374207 -16735283 -17040764
29726 -17040764 -17290615 -17472589 -17562729 -17534786 -17371185 -17068637 -16637371 -16097061 -15472153 -14787516
29716 -14787516 -14065280 -13323776 -12578109 -11840673 -11121040 -10426370 -9762794 -9135980 -8548497
29707 -8548497 -7994153 -7452773 -6889637 -6261629 -5528606 -4666261 -3676640 -2593621 -1481462
29698 -1481462 -425467 483973 1169376 1580259 1699755 1544396 1159958 615231 -6500
29689 -6500 -619012 -1147216 -1541180 -1785908 -1902513 -1939017 -1953881 -1999441 -2111840 -2308646
29679 -2308646 -2590531 -2943932 -3345817 -3772745 -4211414 -4662979 -5136084 -5632999 -6139631
29670 -6139631 -6626733 -7060225 -7412278 -7666329 -7815015 -7854706 -7781176 -7589028 -7274471 -6838988
$$ [...]
##END NTUPLES=NMR SPECTRUM
##END=
