##TITLE=31Pdec_DE-27sr2
 D2O
 24 sc
 13.2.2024
##JCAMPDX= 6.0         $$ Bruker NMR JCAMP-DX V2.0
##DATA TYPE= NMR SPECTRUM
##DATA CLASS= NTUPLES
##ORIGIN= UXNMR, Bruker Analytische Messtechnik GmbH
##OWNER= root
$$ XWIN-NMR		Version 3.5
$$ Tue Feb 13 14:04:51 2024 Russian Standard Time (UT+4h)  she@DPX200
##.OBSERVE FREQUENCY= 81.013821
##.OBSERVE NUCLEUS= ^31P
##.ACQUISITION MODE= SIMULTANEOUS
##.ACQUISITION SCHEME= undefined
##.AVERAGES= 24
##.DIGITISER RES= 16
##SPECTROMETER/DATA SYSTEM= spect
##.PULSE SEQUENCE= zgpg30
##.SOLVENT NAME= CDCl3
##.SHIFT REFERENCE= (INTERNAL, CDCl3, 0, 248.564)
##AUDIT TRAIL= $$ (NUMBER, WHEN, WHO, WHERE, WHAT)
$$ ##TITLE= Audit trail, XWIN-NMR		Version 3.5
$$ ##JCAMPDX= 5.01
$$ ##ORIGIN= Bruker BioSpin GmbH
$$ ##OWNER= she
$$ F:/spectra/data/she/nmr/P31/1/pdata/1/auditp.txt
$$ ##AUDIT TRAIL=  $$ (NUMBER, WHEN, WHO, WHERE, WHAT)
(   1,<2024-02-13 14:04:01.85 +0400>,<she>,<DPX200>,
      <created by zg, POWCHK disabled, PULCHK disabled
       configuration hash MD5:
       00 E9 B6 7A A2 85 ED C7 34 08 36 98 17 FE 4E 26
       data hash MD5: 32K
       B6 6A 10 4B 28 2C DF F9 87 7E BA 71 B4 38 1F 4C>)
(   2,<2024-02-13 14:04:04.01 +0400>,<she>,<DPX200>,
      <Start of raw data processing
       efp BC_mod = 2 LB = 10 FT_mod = 6 PKNL = 1 PHC0 = -12876.41 PHC1 = 36.88348 SI = 64K 
       data hash MD5: 64K
       93 E8 3F 3C E7 9C 4C A7 3A 40 95 0E D4 DF BC 45>)
(   3,<2024-02-13 14:04:22.85 +0400>,<she>,<DPX200>,
      <pk PHC0 = -31.54659 PHC1 = 74.80001 
       data hash MD5: 64K
       5A 3D BE C2 4E 65 24 44 7A E7 09 AE 7F 9D E3 CD>)
(   4,<2024-02-13 14:04:28.29 +0400>,<she>,<DPX200>,
      <abs ABSG = 5 
       data hash MD5: 64K
       74 56 96 7F 94 FA E5 A1 0A EE 61 41 92 03 1F AF>)
$$ ##END=
$$ 
$$ hash MD5
$$ 5C 92 9E 67 A7 A4 D7 37 E8 E2 B3 D7 A6 62 0D 0B
##$RELAX= 
##$RELAX= 
##$RELAX= 
##$RELAX= 
##$RELAX= 
##$RELAX= 
##$RELAX= 
##$RELAX= 
##$RELAX= 
$$ Bruker specific parameters
$$ --------------------------
##$DU= <F:/spectra>
##$EXPNO= 1
##$NAME= <P31>
##$PROCNO= 1
##$TYPE= <nmr>
##$USER= <she>
##$AMP= (0..31)
100 100 100 100 100 100 100 100 100 100 100 100 100 100 100 100 100 100 
100 100 100 100 100 100 100 100 100 100 100 100 100 100 
##$AQSEQ= 0
##$AQ_mod= 1
##$AUNM= <au_zg>
##$AUTOPOS= <>
##$BF1= 81.014009
##$BF2= 200.13
##$BF3= 200.13
##$BF4= 200.13
##$BF5= 200.13
##$BF6= 200.13
##$BF7= 200.13
##$BF8= 200.13
##$BYTORDA= 1
##$CFDGTYP= 0
##$CFRGTYP= 5
##$CHEMSTR= <none>
##$CNST= (0..31)
1 1 145 1 1 1 1 1 1 1 1 1 1 1 1 1 1 1 1 1 1 1 1 1 1 1 1 1 1 1 1 1 
##$CPDPRG= <waltz16>
##$CPDPRG1= <>
##$CPDPRG2= <waltz16>
##$CPDPRG3= <>
##$CPDPRG4= <mlev>
##$CPDPRG5= <mlev>
##$CPDPRG6= <mlev>
##$CPDPRG7= <mlev>
##$CPDPRG8= <mlev>
##$CPDPRGB= <>
##$CPDPRGT= <>
##$D= (0..31)
0 1 0 0 0 0 0 0 0 0 0 0.03 2e-05 3e-06 0 0 0 0 0 0 0 0 0 0 0 0 0 0 0 0 
0 0 
##$DATE= 1707818641
##$DBL= (0..7)
120 120 120 11 120 120 24 19 
##$DBP= (0..7)
150 150 150 150 150 150 150 150 
##$DBP07= 0
##$DBPNAM0= <>
##$DBPNAM1= <>
$$ [...]
##$SUBNAM3= <"">
##$SUBNAM4= <"">
##$SUBNAM5= <"">
##$SUBNAM6= <"">
##$SUBNAM7= <"">
##$SUBNAM8= <"">
##$SUBNAM9= <"">
##$SW= 501.771253377433
##$SWIBOX= (0..15)
0 1 3 0 0 0 0 0 0 0 0 0 0 0 0 0 
##$SW_h= 40650.406504065
##$TD= 32768
##$TD0= 1
##$TE= 0
##$TE2= 300
##$TE3= 300
##$TEG= 300
##$TL= (0..7)
0 120 53 12 22 120 120 120 
##$TP= (0..7)
150 150 150 150 150 150 150 150 
##$TP07= 0
##$TPNAME0= <>
##$TPNAME1= <>
##$TPNAME2= <>
##$TPNAME3= <>
##$TPNAME4= <>
##$TPNAME5= <>
##$TPNAME6= <>
##$TPNAME7= <>
##$TPOAL= (0..7)
0.5 0.5 0.5 0.5 0.5 0.5 0.5 0.5 
##$TPOFFS= (0..7)
0 0 0 0 0 0 0 0 
##$TUNHIN= 0
##$TUNHOUT= 0
##$TUNXOUT= 0
##$USERA1= <user>
##$USERA2= <user>
##$USERA3= <user>
##$USERA4= <user>
##$USERA5= <user>
##$V9= 5
##$VALIST= <valist>
##$VCLIST= <CCCCCCCCCCCCCCC>
##$VD= 0
##$VDLIST= <DDDDDDDDDDDDDDD>
##$VPLIST= <PPPPPPPPPPPPPPP>
##$VTLIST= <TTTTTTTTTTTTTTT>
##$WBST= 1024
##$WBSW= 4
##$XGAIN= (0..3)
0 0 0 0 
##$XL= 0
##$YL= 0
##$YMAX_a= 1926
##$YMIN_a= -1914
##$ZGOPTNS= <>
##$ZL1= 120
##$ZL2= 120
##$ZL3= 120
##$ZL4= 120
##$ABSF1= 248.5645
##$ABSF2= -253.2056
##$ABSG= 5
##$ABSL= 3
##$ALPHA= 0
##$AQORDER= 0
##$ASSFAC= 0
##$ASSFACI= 0
##$ASSFACX= 0
##$ASSWID= 0
##$AUNMP= <proc_1d>
##$AZFE= 0.1
##$AZFW= 0.5
##$BCFW= 0
##$BC_mod= 2
##$BYTORDP= 0
##$COROFFS= 0
##$CY= -3
##$DATMOD= 1
##$DC= 0
##$DFILT= <>
##$DTYPP= 0
##$F1P= 0
##$F2P= 0
##$FCOR= 1
##$FTSIZE= 65536
##$FT_mod= 6
##$GAMMA= 0
##$GB= 0
##$INTBC= 1
##$INTSCL= 6.047779e-11
##$ISEN= 30
##$LB= 10
##$LEV0= 0
##$LPBIN= 0
##$MAXI= 10000
##$MC2= 0
##$MEAN= 0
##$ME_mod= 0
##$MI= 50
##$NCOEF= 0
##$NC_proc= -9
##$NLEV= 6
##$NOISF1= 182.463
##$NOISF2= 159.3651
##$NSP= 0
##$NTH_PI= 0
##$NZP= 0
##$OFFSET= 248.5645
##$PC= 4
##$PHC0= -12907.96
##$PHC1= 111.6835
##$PH_mod= 1
##$PKNL= yes
##$PPARMOD= 0
##$PSCAL= 0
##$PSIGN= 0
##$REVERSE= no
##$SF= 81.0140089999694
##$SI= 65536
##$SIGF1= 159.3651
##$SIGF2= -187.1042
##$SINO= 113.3802
##$SIOLD= 16384
##$SREGLST= <1H.CDCl3>
##$SSB= 0
##$STSI= 65536
##$STSR= 0
##$SW_p= 40650.406504065
##$SYMM= 0
##$S_DEV= 0
##$TDeff= 32768
##$TDoff= 0
##$TI= <>
##$TILT= no
##$TM1= 0
##$TM2= 0
##$TOPLEV= 0
##$USERP1= <user>
##$USERP2= <user>
##$USERP3= <user>
##$USERP4= <user>
##$USERP5= <user>
##$WDW= 1
##$XDIM= 65536
##$YMAX_p= 372273296
##$YMIN_p= -134079109
$$ End of Bruker specific parameters
$$ ---------------------------------
##NTUPLES= NMR SPECTRUM
##VAR_NAME=  FREQUENCY,     SPECTRUM/REAL,   SPECTRUM/IMAG
##SYMBOL=    X,             R,               I
##VAR_TYPE=  INDEPENDENT,   DEPENDENT,       DEPENDENT
##VAR_FORM=  AFFN,          ASDF,            ASDF
##VAR_DIM=   65536,         65536,           65536
##UNITS=     HZ,            ARBITRARY UNITS, ARBITRARY UNITS
##FACTOR=    0.620285442955139, 1,           1
##FIRST=     20137.2065510682, 0,            0
##LAST=      -20513.1999529968, 0,           0
##MIN=       -20513.1999529968, -134079109,  0
##MAX=       20137.2065510682, 372273296,    0
$$ Real data points
##PAGE= N=1
##DATA TABLE= (X++(R..R)), XYDATA
$$ [...]
37016a261886N7445O8567O6861N9638M6881K3062j4853o0406r7793j09547q6431
37005a308462l3077L3974R4131J31481J39638J21429Q5640M3584O235j8670k9135
36994g33232k9208k6206k6259l0793l5732l3486j6899J6507O2251J10205J49173
36983e93679J72138J78996J75429J69093J66129J70248J83886K08873K45066K88404
36973A364583L31133L64452L81227L76790L48818K98399K32147J62761J05940
36964C966250P4781P4926J02959J47954J94625K26995K32531K06211J52585Q3467
36954E463284J1535n6621j23350j96981k85025l87632m94680n88192o49494o67782
36944B025062o45073n94010n30075m64019l99825l38173k80995k32975j99468
$$ y = [-1261886, -1204441, -1135874, -1069013, -1009375, -962494, -939432, -954285, -1014691, -1112484, -1222031, -1308462, -1341539, -1307565, -1213434, -1081953, -942315, -820886, -735246, -691662, -685427, -704097, -733232, -762440, -788646, -814905, -845698, -881430, -914916, -931815, -915308, -853057, -742852, -593679, -421541, -242545, -67116, 101977, 268106, 438354, 622240, 831113, 1076179, 1364583, 1695716, 2060168, 2441395, 2818185, 3167003, 3465402, 3697549, 3860310, 3966250, 4041031, 4115957, 4218916, 4366870, 4561495, 4788490, 5021021, 5227232, 5379817, 5463284, 5474819, 5418198, 5294848, 5097867, 4812842, 4425210, 3930530, 3342338, 2692844, 2025062, 1379989, 785979, 255904, -208115, -607940, -946113, -1227108, -1460083, -1659551]
36935a659551j83117j81247j85190j82148j59824j12509m5419K5763Q0368J00611
36925b502263P7707J4045p8518j82511k79431l54304l99159m13796m03114l72581
36915d893925l24801k59312j75097p3672L9337J54944K63277L56101M27994M76069
36905d009085M99424M99204M78750M43157L98360L50716L06919K73053K52429
36896e07073K43917K42887K44567K46941K50675K56699K64210K70510K71647K62661
36886B047641K38242J95212J35812O8780O627l9191o2333o3484n0039l3393k4140
36875B419734k7323m0690n6800o6471o0793l1781K5895J11105K12860L11021L82077
36864C178834M06904L76440K93513J71658L2047j01243k07196k73330k98570k92442
$$ y = [-1659551, -1842668, -2023915, -2209105, -2391253, -2551077, -2663586, -2709005, -2683242, -2602874, -2502263, -2424556, -2410511, -2489029, -2671540, -2950971, -3305275, -3704434, -4118230, -4521344, -4893925, -5218726, -5478038, -5653135, -5726807, -5687470, -5532526, -5269249, -4913148, -4485154, -4009085, -3509661, -3010457, -2531707, -2088550, -1690190, -1339474, -1032555, -759502, -507073, -263156, -20269, 224298, 471239, 721914, 978613, 1242823, 1513333, 1784980, 2047641, 2285883, 2481095, 2616907, 2685687, 2692314, 2653123, 2590790, 2527306, 2477267, 2443874, 2419734, 2392411, 2351721, 2294921, 2228450, 2167657, 2135876, 2161771, 2272876, 2485736, 2796757, 3178834, 3585738, 3962178, 4255691, 4427349, 4459396, 4358153, 4150957, 3877627, 3579057, 3286615]
36854C286615k70878k50137k41535k49696k74426l13240l61604m11735m53067
36845D60297m75275m71396m38931l79932l01774k17385j42360q9065o1576n5160
36835b172557o0201o7263p0002o5102n0980k7668J545K8963M4831M3032K6082
36824b369320M902o882j43K5535O2136R6888J17721J18605J02373P8979N9896
36813a709310N2400N7327P0727Q6904J00674J08505J09284J04735R8790R5748
36803h24216R8131J05290J13235J15564J05231P6856K8868l5563j09067j81433
36793e07104k41077k76965k81685k54700k03561j41940q5880n0088m4573p1307
36783b158880j22389j82016k32016k57361k48541k01217j15885J549J39710K83863
$$ y = [3286615, 3015737, 2765600, 2524065, 2274369, 1999943, 1686703, 1325099, 913364, 460297, -14978, -486374, -925305, -1305237, -1607011, -1824396, -1966756, -2055821, -2117397, -2172557, -2232758, -2300021, -2370023, -2435125, -2486105, -2513773, -2512228, -2483265, -2438434, -2395402, -2369320, -2364418, -2371300, -2371443, -2345908, -2283772, -2186884, -2069163, -1950558, -1848185, -1769206, -1709310, -1656910, -1599583, -1528856, -1441952, -1341278, -1232773, -1123489, -1018754, -919964, -824216, -726085, -620795, -507560, -391996, -286765, -209909, -181041, -216604, -325671, -507104, -748181, -1025146, -1306831, -1561531, -1765092, -1907032, -1992912, -2043000, -2087573, -2158880, -2281269, -2463285, -2695301, -2952662, -3201203, -3402420, -3518305, -3516756, -3377046, -3093183]
36773c093183M19569N35553O24171O80226P00460O84798O37441N65244M73916
36764B228195L66001K43307J11339j8885j33399k19640k69537k80656k55694k00561
36754A570470j21929k6348P7816J78049K58595L05555L12659K83457K28827J62008
36744C229159R4159L1982k2481p0647j15644j60587k06768k51822k89033l09440
36734A928878l06270k78798k32514j76081j18124o5704k3320Q714L4920O1721
36724H33422R1673J19606J34692J27334R5500M5762j1064o5743j13765j54790
36714A102627j90321k21788k49592k72834k89968l00619l07360l15525l30449
36705a375829l53619l80116l98905l96533l63297k98791k13138j22989m5341O827
$$ y = [-3093183, -2673614, -2138061, -1513890, -833664, -133204, 551594, 1189035, 1754279, 2228195, 2594196, 2837503, 2948842, 2929957, 2796558, 2576918, 2307381, 2026725, 1771031, 1570470, 1448541, 1422193, 1500009, 1678058, 1936653, 2242208, 2554867, 2838324, 3067151, 3229159, 3323318, 3355300, 3332819, 3262172, 3146528, 2985941, 2779173, 2527351, 2238318, 1928878, 1622608, 1343810, 1111296, 935215, 817091, 751387, 728067, 736781, 771701, 833422, 925095, 1044701, 1179393, 1306727, 1402227, 1447989, 1436925, 1371182, 1257417, 1102627, 912306, 690518, 440926, 168092, -121876, -422495, -729855, -1045380, -1375829, -1729448, -2109564, -2508469, -2905002, -3268299, -3567090, -3780228, -3903217, -3948558, -3941731]
36695c941731K6103J1184l2540r3514j56841k08507k38970k44904k29230j99635
36685e308585j65688j35346j12444r6607q5367p6843p1229p0224p4959q4008r3032
36674f374332r6135q7461o1584j3313O1117J61111K79718M05451N27191O37833
36664d560404P33485Q09601Q58527Q71344Q42659P74425O75738N58769M33789
36655A997933L06461J78947N3569o3729j62966k33769k71309k80562k75283k71518
36645I77774k79500k98893l19908l28894l14734k72831k05711j21365l0639N5701
36635a139000J29818J88295K31127K59403K74242K77754K73557K64796K51417
36626A011409K30227J98308J56521J10269O7930L8753L0817M8800R2309J55677
$$ y = [-3941731, -3915628, -3904444, -3936984, -4030498, -4187339, -4395846, -4634816, -4879720, -5108950, -5308585, -5474273, -5609619, -5722063, -5818670, -5904037, -5980880, -6052109, -6122333, -6197292, -6281300, -6374332, -6470467, -6557928, -6619512, -6632825, -6571708, -6410597, -6130879, -5725428, -5198237, -4560404, -3826919, -3017318, -2158791, -1287447, -444788, 329637, 1005375, 1564144, 1997933, 2304394, 2483341, 2536910, 2473181, 2310215, 2076446, 1805137, 1524575, 1249292, 977774, 698274, 399381, 79473, -249421, -564155, -836986, -1042697, -1164062, -1194701, -1139000, -1009182, -820887, -589760, -330357, -56115, 221639, 495196, 759992, 1011409, 1241636, 1439944, 1596465, 1706734, 1774664, 1813417, 1844234, 1893034, 1985343, 2141020]
36616B141020K28909K98964L51510L74027L59634L09441K32116J41293N2216k1723
36606D467407p2191r7838j04176j01815j03944j23157j67373k35813l17545l94066
36596B749489m44853m53053m09468l14710j79905k5387J23413K42276L14410L34022
36586A936234L06264K44231J64425Q1921O477n9016j17199j72978k30495k91566
36576A868298l55220m17435m71341n08830n23372n12413m78049m26346l66155
36567b190863l07090k56287k15429j80952j48161j15727q6312o3037m5811l1270
36557c640939j5697K830K5271N3912R2969J46231K13213K86384L51198L89358
36547b095270L84778L29939K29578R9541l8096j60382k47234k84180k65238j94992
$$ y = [2141020, 2369929, 2668893, 3020403, 3394430, 3754064, 4063505, 4295621, 4436914, 4489130, 4467407, 4395216, 4297378, 4193202, 4091387, 3987443, 3864286, 3696913, 3461100, 3143555, 2749489, 2304636, 1851583, 1442115, 1127405, 947500, 922113, 1045526, 1287802, 1602212, 1936234, 2242498, 2486729, 2651154, 2733075, 2739552, 2680536, 2563337, 2390359, 2159864, 1868298, 1513078, 1095643, 624302, 115472, -407900, -920313, -1398362, -1824708, -2190863, -2497953, -2754240, -2969669, -3150621, -3298782, -3414509, -3500821, -3563858, -3609669, -3640939, -3656636, -3653806, -3628535, -3574623, -3481654, -3335423, -3122210, -2835826, -2484628, -2095270, -1710492, -1380553, -1150975, -1051434, -1089530, -1249912, -1497146, -1781326, -2046564, -2241556]
36537b241556q7612L7329J59783K62284L31240L58195L41586K87628K08663J19046
36527b23414L0339n1787j27550j99920k70051l33688l80694l98311l76822l14714
36517b646612k20612j11173o394P5566J22802J32777J13027P8095M3051J6701
36507b402772j542j9607m7197r0166j47196k09892k65978l04475l20351l15677
36497d124853k96425k67280k28455j76211j05577j2822J02633K36335L77667N11582
36487c983406O23466P04141P51372P67237P53949P11415O38142N34653M07116
36478A908085K68501J36195K7170m6958q2897q5873o6971l8741j0972J1468K8295
36467B047302M1838N4673O7613P9031Q5911Q6154Q0392P2115O6035O5544P0577
$$ y = [-2241556, -2329168, -2291839, -2132056, -1869772, -1538532, -1180337, -838751, -551123, -342460, -223414, -193075, -244862, -372412, -572332, -842383, -1176071, -1556765, -1955076, -2331898, -2646612, -2867224, -2978397, -2984791, -2909225, -2786423, -2653646, -2540619, -2462524, -2419473, -2402772, -2404314, -2423921, -2471118, -2561284, -2708480, -2918372, -3184350, -3488825, -3809176, -4124853, -4421278, -4688558, -4917013, -5093224, -5198801, -5211623, -5108990, -4872655, -4494988, -3983406, -3359940, -2655799, -1904427, -1137190, -383241, 328174, 966316, 1500969, 1908085, 2176586, 2312781, 2339951, 2292993, 2210096, 2124223, 2057252, 2018511, 2007539, 2019007, 2047302, 2089140, 2143813, 2211426, 2290457, 2376368, 2462522, 2542914, 2615029, 2681064, 2746608, 2817185]
36456B817185P7278Q0181P5565O3333M6000K5996L661k3115n8003j04578j64122
36445B839381k33807l06626l73239m24306m52119m51765m22674l70068l04559
36436d99782k38848j82864j40498j10084q7691o9968n4120l6055j0002K8753Q0096
36425a321063J37998J93414K38725K70331K88223K94322K91768K85786K84684
36416I64188K99161L39022M08121N00038N97406O76268P13882O96427O23385N07198
36406F325096L68289K27214R7366j7497j19308k08390k78463l17577l14046k63500
36396E499184j73260o1655M7851J35197J90339K14382K15444K03007J84449J64756
36386F619694J48018J38839J42468J63128K01316K52084L06420L55560L95213
$$ y = [2817185, 2894463, 2974644, 3050209, 3113542, 3159542, 3185538, 3189199, 3166084, 3108081, 3003503, 2839381, 2605574, 2298948, 1925709, 1501403, 1049284, 597519, 174845, -195223, -499782, -738630, -921494, -1061992, -1172076, -1259767, -1329735, -1383855, -1419910, -1429912, -1401159, -1321063, -1183065, -989651, -750926, -480595, -192372, 101950, 393718, 679504, 964188, 1263349, 1602371, 2010492, 2510530, 3107936, 3784204, 4498086, 5194513, 5817898, 6325096, 6693385, 6920599, 7017965, 7000468, 6881160, 6672770, 6394307, 6076730, 5762684, 5499184, 5325924, 5264269, 5312120, 5447317, 5637656, 5852038, 6067482, 6270489, 6454938, 6619694, 6767712, 6906551, 7049019, 7212147, 7413463, 7665547, 7971967, 8327527, 8722740]
36377H722740M26379M52331M74421M89932M93126M78680M45689M00091L53561
36368A2736950L18539L01916L01927L10932L22454L37489L66009M23500N25386
36359A5945102O81880Q94431J154281J444182J743339K033391K302654K547769
36351B8747029K773958K994285L226796L489394L794995M150058M556723N016394
36343E8749632N532582O112102O764259P497991Q317696R219074J0185281J1182846
36335A23561463J2157589J3031452J3701040J4038458J3896883J3125840J1600808
36328B15113533R266180O180368K541378j329590n052893q282057j0782106j2461927
36320A95192886j3356723j3582354j3288617j2626977j1734130j0725611r692989
$$ y = [8722740, 9149119, 9601450, 10075871, 10565803, 11058929, 11537609, 11983298, 12383389, 12736950, 13055489, 13357405, 13659332, 13970264, 14292718, 14630207, 14996216, 15419716, 15945102, 16626982, 17521413, 18675694, 20119876, 21863215, 23896606, 26199260, 28747029, 31520987, 34515272, 37742068, 41231462, 45026457, 49176515, 53733238, 58749632, 64282214, 70394316, 77158575, 84656566, 92974262, 102193336, 112378617, 123561463, 135719052, 148750504, 162451544, 176490002, 190386885, 203512725, 215113533, 224379713, 230560081, 233101459, 231771869, 226718976, 218436919, 207654813, 195192886, 181836163, 168253809, 154965192, 142338215, 130604085, 119878474, 110185485]
36313A10185485q701552p789507o971320o245345n602604n033074m528380m081434
36305F1232269l684479l327461k998896k689043k392729k109190j839936j587187
36297D0603348j353900j143885r60553q04669o72245n53363m32655k92159j16409
36288C4273510J02101L59685O42626R32730J214679J481050J732358J973338K209288
36279D4921365K444631K682914K926085L172576L414776L636209L808627L890466
36271G0897649L828936L567367L058286K280993J259222O9890j166364k313820
36263H1482159l257989l932194m323804m462461m401116m199573l914267l593106
36255D9397649l273062k978973k723419k508289k328302k175476k042672j924889
$$ y = [110185485, 101483933, 93694426, 86723106, 80477761, 74875157, 69842083, 65313703, 61232269, 57547790, 54220329, 51221433, 48532390, 46139661, 44030471, 42190535, 40603348, 39249448, 38105563, 37145010, 36340341, 35668096, 35114733, 34682078, 34389919, 34273510, 34375611, 34735296, 35377922, 36310652, 37525331, 39006381, 40738739, 42712077, 44921365, 47365996, 50048910, 52974995, 56147571, 59562347, 63198556, 67007183, 70897649, 74726585, 78293952, 81352238, 83633231, 84892453, 84962343, 83795979, 81482159, 78224170, 74291976, 69968172, 65505711, 61104595, 56905022, 52990755, 49397649, 46124587, 43145614, 40422195, 37913906, 35585604, 33410128, 31367456, 29442567]
36247B9442567j818430j718981j619653j510380j379919j220765j034498q33619
36239A8306322o37961m67953l38997k58956k27413k35291k66076l00682l24658
36230A5248335l33024l28997l18059l02226k78330k40209j82682j05333j5122
36221A3144353P3318J40812J69940J51946R0437l94j02032j98584k80629l44751
36211A2844416l90423m17230m24468m13048l87672l57053l31667l20524l28669
36202I473662l55962l96631m39743m71370m78574m53771l97517l18391k29829
36193E931874j45062p2689j5541K6772N4311O5755O0504M1511J6051o365j7654
36182E939467j4412R86K1957M0978N2296N2562L9777J2125l1971r2455j65886
$$ y = [29442567, 27624137, 25905156, 24285503, 22775123, 21395204, 20174439, 19139941, 18306322, 17668361, 17200408, 16861411, 16602455, 16375042, 16139751, 15873675, 15572993, 15248335, 14915311, 14586314, 14268255, 13966029, 13687699, 13447490, 13264808, 13159475, 13144353, 13217671, 13358483, 13528423, 13680369, 13770806, 13770412, 13668380, 13469796, 13189167, 12844416, 12453993, 12036763, 11612295, 11199247, 10811575, 10454522, 10122855, 9802331, 9473662, 9117700, 8721069, 8281326, 7809956, 7331382, 6877611, 6480094, 6161703, 5931874, 5786812, 5714123, 5698582, 5725354, 5779665, 5845420, 5905924, 5947435, 5963486, 5957121, 5939467, 5925055, 5926041, 5947998, 5988976, 6041272, 6093834, 6133611, 6145736, 6113765, 6021310, 5855424]
36171E855424k44890l19801l81705m24603m45061m40377m07668l45053k54146
36162B592120j42260k3214Q4326J61700J96971J89894J51729J00055N2092J9816
36152C383229P602J1622K0806K0185l480n5812j31672k16552k92126l43755l66738
36141B033309l68275l63357l66294l82604m06427m24954m26259m05276l65127
36132a475264l14698k65067k26574k06873k09632k33714k73084l17830l56285
36123c879021l77435l72897l38463k75591j92431j03034k4028L0312N2639M5183
36113e434766J9805m752p905K6656J05861K25177L70625N23887O67904P89683
36103b717825Q79553R29309R32873Q90329Q11587P14924O19182N34593M59293
$$ y = [5855424, 5610534, 5290733, 4909028, 4484425, 4039364, 3598987, 3191319, 2846266, 2592120, 2449860, 2426646, 2510972, 2672672, 2869643, 3059537, 3211266, 3311321, 3363413, 3383229, 3390831, 3402453, 3423259, 3443444, 3439964, 3384152, 3252480, 3035928, 2743802, 2400047, 2033309, 1665034, 1301677, 935383, 552779, 146352, -278602, -704861, -1110137, -1475264, -1789962, -2055029, -2281603, -2488476, -2698108, -2931822, -3204906, -3522736, -3879021, -4256456, -4629353, -4967816, -5243407, -5435838, -5538872, -5562900, -5532588, -5479949, -5434766, -5414961, -5419713, -5427618, -5400962, -5295101, -5069924, -4699299, -4175412, -3507508, -2717825, -1838272, -908963, 23910, 914239, 1725826, 2440750, 3059932, 3594525, 4053818]
36094D053818L84368L03291K18137J38439P4841L3306J3605J1658K2481M1333
36084E295277O3099Q1702R0995Q6503O6383L0938j8430p9913j51850k32985l21139
36073D910580m09740m84991n28077n23092m65785l67111k49748j40482o2363k9030
36063A650161m2429r4473j71544k58967l43412m13442m59821m76248m60077m12810
36053a483062l40588k54486j69442j01140o1462n4275p3285j03404j26180j27537
36043b894861j03610o0961j1379L4549P0825R5593J09032J12068J06656R6880
36033b445208Q9639R3687J16742J61679K23832K91355L49120L84672L93258L79209
36023C7985L53160L26944L08884L00711K96626K84905K52391J90676J01027m959
$$ y = [4053818, 4438186, 4741477, 4959614, 5098053, 5172894, 5206200, 5219805, 5231463, 5253944, 5295277, 5358376, 5440078, 5531073, 5617576, 5683959, 5714897, 5696467, 5616554, 5464704, 5231719, 4910580, 4500840, 4015849, 3487772, 2964680, 2498895, 2131784, 1882036, 1741554, 1679191, 1650161, 1607732, 1513259, 1341715, 1082748, 739336, 325894, -133927, -610175, -1070252, -1483062, -1823650, -2078136, -2247578, -2348718, -2410180, -2464455, -2537740, -2641144, -2767324, -2894861, -2998471, -3059432, -3070811, -3036262, -2965437, -2869844, -2760812, -2648744, -2542088, -2445208, -2355569, -2261882, -2145140, -1983461, -1759629, -1468274, -1119154, -734482, -341224, 37985, 391145, 718089, 1026973, 1327684, 1624310, 1909215, 2161606, 2352282, 2453309, 2448350]
36013B448350j09701j96671k56233k86964k92342k76038k39829j85401j17711
36004D87460m6658J4398N2317N8304L0977k2699q9194j52557j99396k22760k23644
35993c13452k09823j92483j81267j79246j80489j72532j43102q6906q148Q2085
35983a585363J70741K46913L03741L38140L49019L35688K98170K39295J66180
35974H62524Q9239J9360l4916o9754q7788r7838j10795j32827j60265j79922j74548
35963g7530j30056m1157Q6218K35947L85435N10965N93245O21745N96324N25601
35953C306737M23324L05230J87384Q4798Q710l6561n4400n2562l7478j0118L3462
35942D158526R7090J78519K67101L47208M05339M36079M43261M36286M24388M12245
$$ y = [2448350, 2338649, 2141978, 1885745, 1598781, 1306439, 1030401, 790572, 605171, 487460, 440802, 455200, 507517, 565821, 596798, 574099, 484905, 332348, 132952, -89808, -313452, -523275, -715758, -897025, -1076271, -1256760, -1429292, -1572394, -1659300, -1667448, -1585363, -1414622, -1167709, -863968, -525828, -176809, 158879, 457049, 696344, 862524, 951763, 971123, 936207, 866453, 778665, 680827, 570032, 437205, 276940, 97018, -77530, -207586, -248743, -162525, 73422, 458857, 969822, 1563067, 2184812, 2781136, 3306737, 3730061, 4035291, 4222675, 4307473, 4316183, 4279622, 4225222, 4172660, 4135182, 4125064, 4158526, 4255616, 4434135, 4701236, 5048444, 5453783, 5889862, 6333123, 6769409, 7193797, 7606042]
35932G606042L98838L79784L51487L14331K72967K34010K03318J84602J78795
35923A0124174J82760J87798J80420J47007Q0437j5650j28132k40344l38673m15711
35913I764086m68671m95349m91532m52632l78425k77219j65875o5374N507L5238
35903G009754K1954k6556r5025j65037k20874k54418k66650k65023k58684k53881
35893E225560k51264k45741k29249j95275j42436p4732Q90P7096J46872K03239
35883D514960K39401K49774K31301J84473J13915K7782o4043j52268k29687k91555
35873D824053l35619l62190l73908l74803l69033l60011l50039l40206l30437
35864A627807l19752l06826k90748k71985k53546k41553k43976k67023l10840
$$ y = [7606042, 8004880, 8384664, 8736151, 9050482, 9323449, 9557459, 9760777, 9945379, 10124174, 10306934, 10494732, 10675152, 10822159, 10902596, 10886946, 10758814, 10518470, 10179797, 9764086, 9295415, 8800066, 8308534, 7855902, 7477477, 7200258, 7034383, 6969009, 6974516, 7009754, 7031708, 7005152, 6910127, 6745090, 6524216, 6269798, 6003148, 5738125, 5479441, 5225560, 4974296, 4728555, 4499306, 4304031, 4161595, 4086863, 4087753, 4164849, 4311721, 4514960, 4754361, 5004135, 5235436, 5419909, 5533824, 5561606, 5497563, 5345295, 5115608, 4824053, 4488434, 4126244, 3752336, 3377533, 3008500, 2648489, 2298450, 1958244, 1627807, 1308055, 1001229, 710481, 438496, 184950, -56603, -300579, -567602, -878442]
35855h78442l67633m24282m68051m91403m92998m75409m42459l98109l46459k91607
35845e076852k37213j86501j42673j08692q5934p2731o4474n5529m1596k0611
35835f092806Q098M5048R0557J43342J99171K51088K91095L12010L08930K80875
35825d162592K32481J73986J17774P3081M2873K5251J7224J7011K3409L4072M5052
35814c360378N2079N2666M7339L8468K6367N351l5989j08488k13496l37714m55875
35803d289670n40108n70778n43030m66096l56796k31704j02133K6959J55380K84840
35793f633136M15337N41869O53322P34879P73102P61118P01277O04293M85779
35784i62160L62510K50362J63744J14360J07833J39943J96205K56579L02742L23235
$$ y = [-878442, -1246075, -1670357, -2138408, -2629811, -3122809, -3598218, -4040677, -4438786, -4785245, -5076852, -5314065, -5500566, -5643239, -5751931, -5837865, -5910596, -5975070, -6030599, -6072195, -6092806, -6084708, -6039660, -5949103, -5805761, -5606590, -5355502, -5064407, -4752397, -4443467, -4162592, -3930111, -3756125, -3638351, -3565270, -3522397, -3497146, -3479922, -3462911, -3439502, -3405430, -3360378, -3308299, -3255633, -3208294, -3169826, -3143459, -3138108, -3174097, -3282585, -3496081, -3833795, -4289670, -4829778, -5400556, -5943586, -6409682, -6766478, -6998182, -7100315, -7073356, -6917976, -6633136, -6217799, -5675930, -5022608, -4287729, -3514627, -2753509, -2052232, -1447939, -962160, -599650, -349288, -185544, -71184, 36649, 176592, 372797, 629376, 932118, 1255353]
35774A255353L14212K77523K19052J48095P6516J6755k0897l0885j4332K0436
35764B261828O0077R1039J04540R8754P7633M8317J8872l631j5196j6330j1371
35753B714532n438j041K766P514J1046O079j6118n9484j19590j85650k46052k93211
35741A815353l25152l44119l53531l54878l46420l25069k90646k49110k11662
35732i85234j89613j88322k04351k27695k47239k55743k51410k36280k13710j86888
35722c186485j58541j31091j06379q4940o4982m1796q556M0958J08583J89147
35712c444082K71332L42263L93298M23163M36392M38818M34014M22849M05185
35703A23232L81377L52955L23316K98304K84764K86242K98280L08000K99857K63962
$$ y = [1255353, 1569565, 1847088, 2066140, 2214235, 2290751, 2307506, 2286609, 2255724, 2241392, 2261828, 2321905, 2412944, 2517484, 2616238, 2693871, 2742188, 2761060, 2757429, 2742233, 2725903, 2714532, 2709094, 2708053, 2710819, 2718333, 2729379, 2735458, 2719340, 2659856, 2540266, 2354616, 2108564, 1815353, 1490201, 1146082, 792551, 437673, 91253, -233816, -524462, -773572, -985234, -1174847, -1363169, -1567520, -1795215, -2042454, -2298197, -2549607, -2785887, -2999597, -3186485, -3345026, -3476117, -3582496, -3667436, -3732418, -3774214, -3782770, -3741812, -3633229, -3444082, -3172750, -2830487, -2437189, -2014026, -1577634, -1138816, -704802, -281953, 123232, 504609, 857564, 1180880, 1479184, 1763948, 2050190, 2348470, 2656470, 2956327, 3220289]
35693C220289K00890J19579L0792n8649j47351k37004l28702m20181n04768n72358
35683A302537o12237o16800n84423n19820m31579l28216k15018r3441L6656J73097
35673a889244L08005M27104N13008N51690N38932M82843M00788L12842K35620
35664A881588J78817J44257J26632J15926J01763P8057M5435R896k1178m3082
35654B618111n5721o2718o8582p5892q4328r1749r6006r6029r2087q5977q1438
35643A727584q3958r9179j30212j75382k28369k81349l29172l70942m07035m34132
35633h12146m43570m25545l75787k98873k05760j08491j6498O3730J27299J70290
35623b325351J90768J90460J75321J53885J34193J21256J16936J21865J37484
$$ y = [3220289, 3421179, 3540758, 3571550, 3512901, 3365550, 3128546, 2799844, 2379663, 1874895, 1302537, 690300, 73500, -510923, -1030743, -1462322, -1790538, -2005556, -2098997, -2062341, -1889244, -1581239, -1154135, -641127, -89437, 449495, 932338, 1333126, 1645968, 1881588, 2060405, 2204662, 2331294, 2447220, 2548983, 2627040, 2672475, 2682371, 2661193, 2618111, 2562390, 2499672, 2431090, 2355198, 2270870, 2179121, 2083115, 1987086, 1894999, 1809022, 1727584, 1643626, 1544447, 1414235, 1238853, 1010484, 729135, 399963, 29021, -378014, -812146, -1255716, -1681261, -2057048, -2355921, -2561681, -2670172, -2686670, -2622940, -2495641, -2325351, -2134583, -1944123, -1768802, -1614917, -1480724, -1359468, -1242532, -1120667, -983183]
35614i83183J66029K08106K59709L11549L52111L72908L72149L54088L25058K89782
35604B028306K50830K10542J72506J40781J18119J05617J04216J15527J39655
35595C386099J71297J98282K05464J82224J28643N6447j5333o7300q6114o8470
35585D091239k1785L8539R4655J32711J47280J41488J23385J01436Q1812O7619
35575D998379N8522N0218L4552J110n9828j53613k77650m19766n60622o79855
35565B991447p62534q02024p98752p57287o84201n87086m74035l52922k30069
35556b457463j08854J0339J27602K39995L40473M20974M77054N09922N24353N24735
35546F09130N12204M84303M37019L68031K79390J77672P1657l0503j22392j98614
$$ y = [-983183, -817154, -609048, -349339, -37790, 314321, 687229, 1059378, 1413466, 1738524, 2028306, 2279136, 2489678, 2662184, 2802965, 2921084, 3026701, 3130917, 3246444, 3386099, 3557396, 3755678, 3961142, 4143366, 4272009, 4328456, 4313123, 4245823, 4159709, 4091239, 4069454, 4107993, 4202648, 4335359, 4482639, 4624127, 4747512, 4848948, 4930760, 4998379, 5056901, 5107119, 5141671, 5142781, 5082953, 4929340, 4651690, 4231924, 3671302, 2991447, 2228913, 1426889, 628137, -129150, -813351, -1400437, -1874472, -2227394, -2457463, -2566317, -2555978, -2428376, -2188381, -1847908, -1426934, -949880, -439958, 84395, 609130, 1121334, 1605637, 2042656, 2410687, 2690077, 2867749, 2939406, 2908903, 2786511, 2587897]
35536B587897k53675k81870k78486k41819j74794q4778J8600J25859K28035L15245
35526A960214L76154M00617L84291L31833K56319J75014J03471N0308J5049r831
35516D043439l3522o1396r2509j20912j39117j41383j25744r4967n6490k0497
35506C156902M459J6388K1304K9038M6207P2263J01349J26948J44214J48735J34867
35495D002674R7096L4456m5428j26675j91319k28422k40175k40267k45562k67014
35485B549364l05550l53960m01666m38660m57033m50879m16283l52592k64086
35476h91345j60451n5084L7810J06079J42032J44318J18087P2365J5638m7182
35466e17733j13875j80918k40244k80102k89746k64177k05249j19134j3254J04808
$$ y = [2587897, 2334222, 2052352, 1773866, 1532047, 1357253, 1272475, 1291075, 1416934, 1644969, 1960214, 2336368, 2736985, 3121276, 3453109, 3709428, 3884442, 3987913, 4038221, 4053270, 4043439, 4009917, 3948521, 3856012, 3735100, 3595983, 3454600, 3328856, 3233889, 3177399, 3156902, 3161361, 3177749, 3199053, 3228091, 3274298, 3346561, 3447910, 3574858, 3719072, 3867807, 4002674, 4099770, 4134226, 4088798, 3962123, 3770804, 3542382, 3302207, 3061940, 2816378, 2549364, 2243814, 1889854, 1488188, 1049528, 592495, 141616, -274667, -627259, -891345, -1051796, -1106880, -1069070, -962991, -820959, -676641, -558554, -486189, -470551, -517733, -631608, -812526, -1052770, -1332872, -1622618, -1886795, -2092044, -2211178, -2224432, -2119624]
35456b119624K26790L43316M44338N20318N64411N75513N59893N28870M92885
35447B136710M56260M16463L67749L05722K29964J44389N6248k5658r3494j43003
35437C851350j74771j93052k03091k09100k14097k20268k27958k33827k30989
35428A944197k12650j76908j28913p8889l7760j3017o205j2570k3374l0771l3045
35417A190095l6366n0771q2154j25818j66441j84802j67131j11794l0167N8612
35407B93263J36214J92323K26226K42690K46543K40685K27831K12434J99801J93312
35397B411322J92554J93723J91066J77717J46320R0946J0532q8515j93215k88121
35387B844329l59710l98776m01335l69307l10447k36022j56728p9587p756N7619
$$ y = [-2119624, -1892834, -1549518, -1105180, -584862, -20451, 555062, 1114955, 1643825, 2136710, 2592970, 3009433, 3377182, 3682904, 3912868, 4057257, 4113505, 4087847, 3994353, 3851350, 3676579, 3483527, 3280436, 3071336, 2857239, 2636971, 2409013, 2175186, 1944197, 1731547, 1554639, 1425726, 1346837, 1309077, 1296060, 1289855, 1277285, 1253911, 1223140, 1190095, 1153729, 1102958, 1020804, 894986, 728545, 543743, 376612, 264818, 234651, 293263, 429477, 621800, 848026, 1090716, 1337259, 1577944, 1805775, 2018209, 2218010, 2411322, 2603876, 2797599, 2988665, 3166382, 3312702, 3403648, 3414180, 3325665, 3132450, 2844329, 2484619, 2085843, 1684508, 1315201, 1004754, 768732, 612004, 532417, 524661, 582280]
35377E82280J15723J65591K06131K35776K51964K51417K31685J93241J40542Q1277
35367B455627K4262k3236n8308q4558j11485j49769k04426k70309l32863l73244
35357H71691l75171l31161k46098j35560j8426R2040J92106K83502L65070M27458
35347A125451M55260M35047L63481K50120J13724k4527j46403k38475k91691l01233
35337A740754k67595j98080j06992j3503O2553J05922J10709Q2977L9302K22j9342
35326A536927j7365m550L407m571l0265o8206j10437j48743j73512j72819j35441
35315F74425n7085N4702J80760K95631L74903M01628L70557K89604J78244O2888
35305B826257k9810p9913p9266l2484M6703J41431K36083L17170L72919L94897
$$ y = [582280, 698003, 863594, 1069725, 1305501, 1557465, 1808882, 2040567, 2233808, 2374350, 2455627, 2479889, 2456653, 2398345, 2313787, 2202302, 2052533, 1848107, 1577798, 1244935, 871691, 496520, 165359, -80739, -216299, -234725, -142685, 49421, 332923, 697993, 1125451, 1580711, 2015758, 2379239, 2629359, 2743083, 2718556, 2572153, 2333678, 2041987, 1740754, 1473159, 1275079, 1168087, 1154584, 1217137, 1323059, 1433768, 1516745, 1556047, 1556269, 1536927, 1519562, 1515012, 1518419, 1513848, 1483583, 1415377, 1304940, 1156197, 982685, 809866, 674425, 617340, 672042, 852802, 1148433, 1523336, 1924964, 2295521, 2585125, 2763369, 2826257, 2796447, 2716534, 2637268, 2604784, 2651487, 2792918, 3029001, 3346171, 3719090, 4113987]
35295D113987L81958L42698K92969K49022K20829K09503K09207K10694K03785
35286F434652J78293J25117L8748p9371k19150l63865m95408n99878o70331p05949
35276C642858p09520o85556o39543n77233n03307m20185l28121k26439j14695
35267e61741O954J37606K74679M12212N39799O43825P11391P35358P17624O68325
35257D286032O00758N24891M43655L54654K55939J51379N1513l0378q3802j04565
35247F450076r5164o3248j9778K2594N1622N8736M3032J3455j3624k1737k715
35236F423249L9325R0741J35281J60167J58623J29418P5568L345p8704j61219
35226F975794k36106k98729l49297l92521m35233m82828n36240n90880o37662
$$ y = [4113987, 4495945, 4838643, 5131612, 5380634, 5601463, 5810966, 6020173, 6230867, 6434652, 6612945, 6738062, 6776810, 6697439, 6478289, 6114424, 5619016, 5019138, 4348807, 3642858, 2933338, 2247782, 1608239, 1031006, 527699, 107514, -220607, -447046, -561741, -554787, -417181, -142502, 269710, 809509, 1453334, 2164725, 2900083, 3617707, 4286032, 4886790, 5411681, 5855336, 6209990, 6465929, 6617308, 6668821, 6638443, 6554641, 6450076, 6354912, 6291664, 6271886, 6294480, 6346102, 6404838, 6447870, 6461325, 6447701, 6425964, 6423249, 6462574, 6553315, 6688596, 6848763, 7007386, 7136804, 7212372, 7215717, 7137013, 6975794, 6739688, 6440959, 6091662, 5699141, 5263908, 4781080, 4244840, 3653960, 3016298]
35217C016298o65325o63222o24494n49269m46382l31501k21481j27812n3487N394
35207f61281N5708J04281J56292K13727K73788L29213L71296L93662L94069L74044
35197B004799L38049K92766K45576K01995J63895J30237R9589P2080M9348L3061
35187C631395K3451J8659J5040Q232n284k6663n3813q1743j04080j15085j11353
35176C198756r2986o4415l4366j3806j1763l1035o6596j07632j41781j59580j57853
35165B316943j41098j19872j06085j07208j22486j43066j55511j46672j08128
35156A166817l9547M9433J39811K07634K31678K01095J18816q37j38053k73102
35146A663745l89371m74099n18264n17011m70982l87776k81812j71534p4649l432
$$ y = [3016298, 2350973, 1687751, 1063257, 513988, 67606, -263895, -485376, -613188, -666675, -661281, -605573, -501292, -345000, -131273, 142515, 471728, 843024, 1236686, 1630755, 2004799, 2342848, 2635614, 2881190, 3083185, 3247080, 3377317, 3476906, 3548986, 3598334, 3631395, 3654846, 3673505, 3688545, 3696777, 3691493, 3664830, 3611017, 3529274, 3425194, 3310109, 3198756, 3105770, 3041355, 3006989, 2993183, 2981420, 2950385, 2883789, 2776157, 2634376, 2474796, 2316943, 2175845, 2055973, 1949888, 1842680, 1720194, 1577128, 1421617, 1274945, 1166817, 1127270, 1176703, 1316514, 1524148, 1755826, 1956921, 2075737, 2074900, 1936847, 1663745, 1274374, 800275, 282011, -235000, -705982, -1093758, -1375570, -1547104, -1621753, -1625185]
35136a625185L8040N4067N5176N4459O3731R0592J36839J98123K65047L25983
35126c43128L70775L93406L92280L68917L26740K70988K08944J49089R8810O1876
35116B298697L7454K1610J0087K91q676j6974k4374k9745l0926k5740j3573M084
35104B222215K4805M7433P3703J08023J55064K16380K88028L61025M24534M69508
35094D390718M89966M81384M38915L58791K42868J02228m4335j76714k80374l49193
35084E654254l83836l88480l68871l32152k86898k41859k03542j74186j51429
35075C123001j29960j04254p1421l3097M848L5268N4360O4786P4526R1459J17104
35064C226620J44072J59405J52060J19765P0882K0065j9229m0337m4000l5073
$$ y = [-1625185, -1587145, -1533078, -1477902, -1423443, -1359712, -1269120, -1132281, -934158, -669111, -343128, 27647, 421053, 813333, 1182250, 1508990, 1779978, 1988922, 2138011, 2236821, 2298697, 2336151, 2357761, 2367848, 2368139, 2359463, 2342489, 2318115, 2288370, 2257444, 2231704, 2218131, 2222215, 2247020, 2294453, 2368156, 2476179, 2631243, 2847623, 3135651, 3496676, 3921210, 4390718, 4880684, 5362068, 5800983, 6159774, 6402642, 6504870, 6460535, 6283821, 6003447, 5654254, 5270418, 4881938, 4513067, 4180915, 3894017, 3652158, 3448616, 3274430, 3123001, 2993041, 2888787, 2817366, 2784269, 2789117, 2824385, 2878745, 2943531, 3018057, 3109516, 3226620, 3370692, 3530097, 3682157, 3801922, 3872804, 3892869, 3873640, 3833303, 3789303, 3754230]
35054C754230j8879M55K0198L8938N5917O8961P2763O0705L0322j2669n7201r5484
35042C918256j29841j70910k28119l00191l73041m26000m41313m10895l37993
35033A099953k35060j20044j1937P4067J30402J58278J65734J63868J62727J67547
35023A755535J76465J81191J71264J39719Q6889K0291m8535j08095j50099j71002
35013B053623j71800j56287j28656r1924m8126N03N1278J02406J54074K07212
35003A972303K60769L10715L52105L81831L98978M02961L92502L67223L30422
34994E169809K89887K55207K32651K20819K10202J87492J42185P1726j7103j10329
34984F652546j91155k45141k64505k50092k10620j60164j14859q9093r1419j21618
$$ y = [3754230, 3735351, 3735806, 3756004, 3794942, 3850859, 3919820, 3992583, 4053288, 4083610, 4070941, 4013740, 3918256, 3788415, 3617505, 3389386, 3089195, 2716154, 2290154, 1848841, 1437946, 1099953, 864893, 744849, 732912, 806979, 937381, 1095659, 1261393, 1425261, 1587988, 1755535, 1932000, 2113191, 2284455, 2424174, 2511063, 2531354, 2482819, 2374724, 2224625, 2053623, 1881823, 1725536, 1596880, 1504956, 1456830, 1457333, 1508611, 1611017, 1765091, 1972303, 2233072, 2543787, 2895892, 3277723, 3676701, 4079662, 4472164, 4839387, 5169809, 5459696, 5714903, 5947554, 6168373, 6378575, 6566067, 6708252, 6779978, 6762875, 6652546, 6461391, 6216250, 5951745, 5701653, 5491033, 5330869, 5216010, 5126917, 5035498, 4913880]
34974D913880j70433k22304k60069k69968k45571j89259j10917k4586N5173J16032
34964C591978J49681J53157J29541Q7084L6139j4898o2048j05105j45070j82401
34954C638058k17229k50265k82578l14363l44026l68335l83110l83684l65318
34945G29150l24148k58888j72429p2174L1457J27779K08433K68679L07036L23962
34935A168857L20609K98812K62149K16540J69059J25723R0521O6430N6690O4325
34925B839715R0043J30246J76410K16061K35483K23753J76916J00465Q725p9292
34915D118525j46932j86945k04015k10736k20077k40103k72769l14257l54521
34906A968170l78085l68871l17836k28496j16697m912Q6136J44962J72645J79884
$$ y = [4913880, 4743447, 4521143, 4261074, 3991106, 3745535, 3556276, 3445359, 3420773, 3475946, 3591978, 3741659, 3894816, 4024357, 4111441, 4147580, 4132682, 4070634, 3965529, 3820459, 3638058, 3420829, 3170564, 2887986, 2573623, 2229597, 1861262, 1478152, 1094468, 729150, 405002, 146114, -26315, -98489, -67032, 60747, 269180, 537859, 844895, 1168857, 1489466, 1788278, 2050427, 2266967, 2436026, 2561749, 2652270, 2718700, 2775390, 2839715, 2929758, 3060004, 3236414, 3452475, 3687958, 3911711, 4088627, 4189092, 4197817, 4118525, 3971593, 3784648, 3580633, 3369897, 3149820, 2909717, 2636948, 2322691, 1968170, 1590085, 1221214, 903378, 674882, 558185, 553273, 639409, 784371, 957016, 1136900]
34896A136900J79320J77594J72001J53391J13299N0957k4157r5827j48614j74861
34886A540003j77789j69709j66525j80707k15931k66373l20798l68442m02921
34877g29192m22861m30426m28759m19023l98452l61184l02062k21002j24830k5749
34867c863540O2412J28232J65713J75376J63436J39731J15387J00512J01638J19354
34857b591749J47601J75943J94310J97709J88153J72639J58617J49825J45095
34848a061857J40648J34031J26761J23709J29626J45291J65966J83217J89321
34839B76713J81994J66806J55144J57994J79175K12567K45047K62526K55187K20307
34829B313460J62994R4859L0241j8967m7001n4754m8181l6304k8832l2699m8689
$$ y = [1136900, 1316220, 1493814, 1665815, 1819206, 1932505, 1983462, 1959305, 1863478, 1714864, 1540003, 1362214, 1192505, 1025980, 845273, 629342, 362969, 42171, -326271, -729192, -1152053, -1582479, -2011238, -2430261, -2828713, -3189897, -3491959, -3712961, -3837791, -3863540, -3801128, -3672896, -3507183, -3331807, -3168371, -3028640, -2913253, -2812741, -2711103, -2591749, -2444148, -2268205, -2073895, -1876186, -1688033, -1515394, -1356777, -1206952, -1061857, -921209, -787178, -660417, -536708, -407082, -261791, -95825, 87392, 276713, 458707, 625513, 780657, 938651, 1117826, 1330393, 1575440, 1837966, 2093153, 2313460, 2476454, 2571313, 2601554, 2582587, 2535586, 2480832, 2432651, 2396347, 2367515, 2334816, 2286127]
34818B286127p1065r1520j05091j13595j24034j43314j73465k10524k46929k74831
34808G31759k88482k85915k70345k50042k35321k33447k44328k59373k64016k43204
34798a842714j88053j00571O628J15731K11001K83967L34603L68623L92215M06883
34788a1687M07541L85199L32386K48129J40582K6633p1914j35022j51135j20220
34778A050492n1876L9567J39883K37803L25401L96841M47185M72402M70036M39653
34768C967387L83659L09194K29006J57581J02897O0196J4183n1102j41946k50616
34758D780439l58319m42809m87032m85334m44289l78022l01010k22492j44966
34749A516166o6662J3762R3263J63869K15892K42448K41915K17113J72646J12489
$$ y = [2286127, 2215062, 2123542, 2018451, 1904856, 1780822, 1637508, 1464043, 1253519, 1006590, 731759, 443277, 157362, -112983, -363025, -598346, -831793, -1076121, -1335494, -1599510, -1842714, -2030767, -2131338, -2124710, -2008979, -1797978, -1514011, -1179408, -810785, -418570, -11687, 395854, 781053, 1113439, 1361568, 1502150, 1528783, 1456869, 1321847, 1170712, 1050492, 998616, 1038183, 1178066, 1415869, 1741270, 2138111, 2585296, 3057698, 3527734, 3967387, 4351046, 4660240, 4889246, 5046827, 5149724, 5209920, 5224103, 5173001, 5031055, 4780439, 4422120, 3979311, 3492279, 3006945, 2562656, 2184634, 1883624, 1661132, 1516166, 1449504, 1463266, 1556529, 1720398, 1936290, 2178738, 2420653, 2637766, 2810412, 2922901]
34739B922901L9231m5039j37188k31976l22117l99273m55612m85837m88985m68592
34729g2487m30460l79413l17616k45697j65709q4043j2763L2152L6260n839q5469
34718a731084j81424k68077l25510l46099l34955l05181k70859k40315k11994
34709d215498j74780j13736j8940J07692K52314L95527N20259O15828O77117P01510
34699a252707O87019O33242N44645M33452L18516K18839J45274R6497O1812K7941
34689A914530j5057p0757j35671k00586k54240k88358l01225k97804k86845k76756
34679b12769k72144k72657k74908k76184k76784k78969k84033k90376k93369k85789
34669c017982k58537k03015j15602j596J24551K43084L34434L83899L84582L38444
$$ y = [2922901, 2962132, 2917093, 2779905, 2547929, 2225812, 1826539, 1370927, 885090, 396105, -72487, -502947, -882360, -1199976, -1445673, -1611382, -1695425, -1708188, -1676036, -1639776, -1645615, -1731084, -1912508, -2180585, -2506095, -2852194, -3187149, -3492330, -3763189, -4003504, -4215498, -4390278, -4504014, -4522954, -4415262, -4162948, -3767421, -3247162, -2631334, -1954217, -1252707, -565688, 67554, 612199, 1045651, 1364167, 1583006, 1728280, 1824777, 1886589, 1914530, 1899473, 1828716, 1693045, 1492459, 1238219, 949861, 648636, 350832, 63987, -212769, -484913, -757570, -1032478, -1308662, -1585446, -1864415, -2148448, -2438824, -2732193, -3017982, -3276519, -3479534, -3595136, -3596732, -3472181, -3229097, -2894663, -2510764, -2126182, -1787738]
34659a787738K55472J51461M5328m3803r9964j13764q4242j8238P2041J72033
34649a451414K67984L50343M16039M67766N10299N46112N73153N85494N76084
34640B841860N40243M78556L97839L09813K28330J66264J32301J27840J45574
34631E368620J71823J92300J97727J85824J59424J23699Q4706M8704K0786L146
34621F556759n225o772l455L210J0535J3943Q413r345l9913q1385j29444j77499
34609F139822k18498k48400k68398k83366k97985l14665l34775l60684l95349
34600C417702m39690m90417n40043n78459n94871n79678n26278m32594l02199
34591a066527j45052K2871J82017L13542M03538M45151M38550L89973L10844K16790
$$ y = [-1787738, -1532266, -1380805, -1335477, -1379280, -1479244, -1593008, -1677250, -1695488, -1623447, -1451414, -1183430, -833087, -417048, 50718, 561017, 1107129, 1680282, 2265776, 2841860, 3382103, 3860659, 4258498, 4568311, 4796641, 4962905, 5095206, 5223046, 5368620, 5540443, 5732743, 5930470, 6116294, 6275718, 6399417, 6484123, 6532827, 6553613, 6556759, 6551534, 6544762, 6541307, 6544517, 6555052, 6568995, 6577408, 6568063, 6528150, 6446765, 6317321, 6139822, 5921324, 5672924, 5404526, 5121160, 4823175, 4508510, 4173735, 3813051, 3417702, 2978012, 2487595, 1947552, 1369093, 774222, 194544, -331734, -764328, -1066527, -1211579, -1188708, -1006691, -693149, -289611, 155540, 594090, 984063, 1294907, 1511697]
34581A511697J26183N7829K7424M3005J01217J86954K77667L50812L91123L94369
34571C468280L65776L14232K46245J64126O9436l1795j26755j98198k29806k12015
34561C829526j46263m5881O7582J71636K50213K97333L16036L14626L02906K89698
34551E647412K81169K79242K80661K78015K63268K32043J85892J31104P5057K2306
34541G676169k7409p8032j33294j92481k49217k94414l20996l26749l14034k88271
34531E451272k57181k30448k18034k26511k55472k96819l38052l67581l78694
34522B882480l70417l46247l12780k78662k52882k42281k49996k76109l19430
34513B33676l78008m47938n22307n92199o49191o87259p02843o93882o59162n98682
$$ y = [1511697, 1637880, 1695709, 1723133, 1766138, 1867355, 2054309, 2331976, 2682788, 3073911, 3468280, 3834056, 4148288, 4394533, 4558659, 4628095, 4596300, 4469545, 4271347, 4041541, 3829526, 3683263, 3637382, 3704964, 3876600, 4126813, 4424146, 4740182, 5054808, 5357714, 5647412, 5928581, 6207823, 6488484, 6766499, 7029767, 7261810, 7447702, 7578806, 7653863, 7676169, 7648760, 7570728, 7437434, 7244953, 6995736, 6701322, 6380326, 6053577, 5739543, 5451272, 5194091, 4963643, 4745609, 4519098, 4263626, 3966807, 3628755, 3261174, 2882480, 2512063, 2165816, 1853036, 1574374, 1321492, 1079211, 829215, 553106, 233676, -144332, -592270, -1114577, -1706776, -2355967, -3043226, -3746069, -4439951, -5099113, -5697795]
34503e697795n14600m11797k97519j79959o6742L5481J20011J79083K05044J94057
34493f434736J49827Q4030J2568m9717r2623j11424j06364q2227m7707j3396J1423
34482f680346K1384J5407m761l5905p3360j10723j40895j58479j61827j53436
34472g482941j39053j26355j23011j33569j56156j81379j94990j83151j37507
34463h858112n7602M9785J73356L00317M18687N18836N94717O44539O70168O75248
34453d870061O63129O35923N94617N39522M70782L89466K99382K08673J29419
34444i39148P4254N0821N7142Q1320J07023J21885J23602J19888J22796J41629
34434F1212J78859K30631K90110L50578M06461M52673M83769M93921M77957M33215
$$ y = [-5697795, -6212395, -6624192, -6921711, -7101670, -7168412, -7132931, -7012920, -6833837, -6628793, -6434736, -6284909, -6200879, -6188311, -6238028, -6330651, -6442075, -6548439, -6630666, -6678373, -6691769, -6680346, -6658962, -6643555, -6648316, -6684221, -6757581, -6868304, -7009199, -7167678, -7329505, -7482941, -7621994, -7748349, -7871360, -8004929, -8161085, -8342464, -8537454, -8720605, -8858112, -8915714, -8865929, -8692573, -8392256, -7973569, -7454733, -6860016, -6215477, -5545309, -4870061, -4206932, -3571009, -2976392, -2436870, -1966088, -1576622, -1277240, -1068567, -939148, -864894, -814073, -756931, -675611, -568588, -446703, -323101, -203213, -80417, 61212, 240071, 470702, 760812, 1111390, 1517851, 1970524, 2454293, 2948214, 3426171, 3859386]
34424C859386L61813K72110J77989R5347L6893P507K741J1966K5198L9396N9702
34413D950048R4593J48744K18553K92278L53512L86269L80417L35498K60695J70557
34403G591164P9360k477o8950j17223j46206j55436j44560j13672o4371r98O8427
34392F925058J32011J75168J83603J47414O4695n6775k00420l44577m68170n55916
34382F002091o00163n98827n52464m63815l40075j95011m8144P9228J69306K11940
34372C664066K05783J56391P3359l0963j40964k37998l03533l24336k96813k28207
34362B536785j34272l4235N5286J24823J72574K01126K13761K13481K04536J93611
34352C747476J88654J96226K19174K55125K95768L27781L36737L13155K57058
$$ y = [3859386, 4221199, 4493309, 4671298, 4766645, 4803538, 4811045, 4813786, 4825752, 4850950, 4890346, 4950048, 5044641, 5193385, 5411938, 5704216, 6057728, 6443997, 6824414, 7159912, 7420607, 7591164, 7670524, 7668047, 7599097, 7481874, 7335668, 7180232, 7035672, 6922000, 6857629, 6856631, 6925058, 7057069, 7232237, 7415840, 7563254, 7627949, 7571174, 7370754, 7026177, 6558007, 6002091, 5401928, 4803101, 4250637, 3786822, 3446747, 3251736, 3203592, 3282820, 3452126, 3664066, 3869849, 4026240, 4099599, 4068636, 3927672, 3689674, 3386141, 3061805, 2764992, 2536785, 2402513, 2368278, 2423564, 2548387, 2720961, 2922087, 3135848, 3349329, 3553865, 3747476, 3936130, 4132356, 4351530, 4606655, 4902423, 5230204, 5566941, 5880096, 6137154]
34343F137154J77940R0618J0097n2032q9369j01011r0390o3335k6825J0808L9722
34332F043377N0454L7585K652m6090r7357j41765j75065j97595k10912k14783
34322E050501k07032j85224j47712r3542k3229N8815J42403K13127K57273K67424
34312E332804K45874K04373J60046J28848J19612J31638J56784J84480K06849
34303F871308K21494K30797K38850K48651K61314K76306K90922K99695K96306
34294I235643K78608K52963K33466K35952K71162L41248M39965N54306O66437
34285A2509750P57080Q11126Q23394Q00690P58468P14278O82044O69344O77415
34276A9203589P02747P39616P82858Q29662Q79702R34169R95120J065899J152036
$$ y = [6137154, 6315094, 6405712, 6415809, 6363777, 6274408, 6173397, 6083007, 6019672, 5992847, 6003655, 6043377, 6093831, 6131416, 6134068, 6087978, 5990621, 5848856, 5673791, 5476196, 5265284, 5050501, 4843469, 4658245, 4510533, 4416991, 4393762, 4452577, 4594980, 4808107, 5065380, 5332804, 5578678, 5783051, 5943097, 6071945, 6191557, 6323195, 6479979, 6664459, 6871308, 7092802, 7323599, 7562449, 7811100, 8072414, 8348720, 8639642, 8939337, 9235643, 9514251, 9767214, 10000680, 10236632, 10507794, 10849042, 11289007, 11843313, 12509750, 13266830, 14077956, 14901350, 15702040, 16460508, 17174786, 17856830, 18526174, 19203589, 19906336, 20645952, 21428810, 22258472, 23138174, 24072343, 25067463, 26133362, 27285398]
34267B7285398J260890J398787J566406J755718J952048K141243K317781K488840
34259D2167111K672340K890721L163754L503563L914015M394822M948013N583141
34251G3237480O318455P177669Q183836R352572J0687086J2176390J3796004J5508955
34243A56438447J7265073J8997641K0616990K2001695K2990450K3380350K2938243
34236C04628889K1431241J8680538J4634264R437520L460844k746620q577459
34229C60949217j3513287j7234512j9652421k0869165k1102416k0612218j9648708
34222B28316490j8421956j7088340j5748780j4455798j3226675j2059213j0946427
34215A26369301r886977q889290p969092p142470o418469n795137n260518m797397
$$ y = [27285398, 28546288, 29945075, 31511481, 33267199, 35219247, 37360490, 39678271, 42167111, 44839451, 47730172, 50893926, 54397489, 58311504, 62706326, 67654339, 73237480, 79555935, 86733604, 94917440, 104270012, 114957098, 127133488, 140929492, 156438447, 173703520, 192701161, 213318151, 235319846, 258310296, 281690646, 304628889, 326060130, 344740668, 359374932, 368812452, 372273296, 369526676, 360949217, 347435930, 330201418, 310548997, 289679832, 268577416, 247965198, 228316490, 209894534, 192806194, 177057414, 162601616, 149374941, 137315728, 126369301, 116482324, 107593034, 99623942, 92481472, 86063003, 80267866, 75007348, 70209951]
34207G0209951m389370m025851l703855l425422l192052k999911k838816k694554
34199D2940120k552075k398068k223351k025091j807484j579741j352235j133070
34191B7869005r26633p34569n58499m02814k75180j83792j33098j21446j42362
34182B4390612j88022k52045l30158m19407n17286o20972p26052q24909r06220
34173A9605541r57309r68959r40090q78997p99801p15974o34717n55557m73568
34164A2680569l84808k90502j97888j17968o2012l8997n4995j13524k14935l54026
34154A0850914n17450o83523q25569r18250r44826r02705q04098o70675n25282
34145D058536l85892k64465j68517j01920o4071m9139m6816m4738l2175m149L6153
$$ y = [70209951, 65820581, 61794730, 58090875, 54665453, 51473401, 48473490, 45634674, 42940120, 40388045, 37989977, 35766626, 33741535, 31934051, 30354310, 29002075, 27869005, 26942372, 26207803, 25649304, 25246490, 24971310, 24787518, 24654420, 24532974, 24390612, 24202590, 23950545, 23620387, 23200980, 22683694, 22062722, 21336670, 20511761, 19605541, 18648232, 17679273, 16739183, 15860186, 15060385, 14344411, 13709694, 13154137, 12680569, 12295761, 12005259, 11807371, 11689403, 11627391, 11588394, 11533399, 11419875, 11204940, 10850914, 10333464, 9649941, 8824372, 7906122, 6961296, 6058591, 5254493, 4583818, 4058536, 3672644, 3408179, 3239662, 3137742, 3073671, 3024532, 2977716, 2932978, 2900803, 2896654, 2932807]
34134B932807P8549J10630J23471J15587R3379O7828M8631L9239L6252L3449K6869
34123C706691J7228R267R786K5361N9200J07818J60145K01136K18617K09104J78844
34112D903197J39852J03853P7837O3163N7810N9747O9071Q7540J16295J53976
34102E832341J96695K38977K74117K94150K91397K61943K08110J36832N4795l4859
34092G754498j30626k27192l12180l69244l86081l61394l05860k37186j73472
34083E251263j28456j08955j13423j32127j50686j56417j43877j16024q1031m7777
34073D072490k2387o406L475J3694L0098N4155Q1386J02992J09732R6344O4725
34062D600298K3911j3741l8192m5486l7902k1861n411M697O486M700Q531K6223
$$ y = [2932807, 3011356, 3121986, 3245457, 3361044, 3454423, 3522251, 3570882, 3610121, 3646373, 3679822, 3706691, 3723919, 3733186, 3742972, 3768333, 3827533, 3935351, 4095496, 4296632, 4515249, 4724353, 4903197, 5043049, 5146902, 5224739, 5287902, 5345712, 5405459, 5474530, 5562070, 5678365, 5832341, 6029036, 6268013, 6542130, 6836280, 7127677, 7389620, 7597730, 7734562, 7789357, 7754498, 7623872, 7396680, 7084500, 6715256, 6329175, 5967781, 5661921, 5424735, 5251263, 5122807, 5013852, 4900429, 4768302, 4617616, 4461199, 4317322, 4201298, 4120267, 4072490, 4050103, 4043697, 4047172, 4060866, 4090964, 4145119, 4226505, 4329497, 4439229, 4535573, 4600298, 4624209, 4610468, 4572276, 4526790, 4488888, 4467027, 4461616, 4466313, 4472799, 4477499, 4486030, 4512253]
34050D512253O0981J11062J72117K38498L03410L59714M01430M23795M21950L91460
34040G396670L32565K54781J75892J14054P8531O6339O6848O9883P1162P1959
34030H698684P4547P7488P4454N7467K2078k9604r0310j51915k08970k59254l02106
34019G962559l36770l62021l76898l81606l77822l67899l53235l32963l04252
34010D769093k64623k14779j59558j05678n7866j6810J9215N1126P8089R9798
34000D198007J18780J39123J62224J83769J95353J89835J66069J29202Q6484M2350
33990E611196l110n1673j03904j58837k16061k76635l40621m03263m53766m78522
33980C124804m66763m14784l26737k12949q7732L2519J31563J96325K20048K04671
$$ y = [4512253, 4573234, 4684296, 4856413, 5094911, 5398321, 5758035, 6159465, 6583260, 7005210, 7396670, 7729235, 7984016, 8159908, 8273962, 8352493, 8418832, 8485680, 8555563, 8626725, 8698684, 8773231, 8850719, 8925173, 8982640, 9004718, 8975114, 8884804, 8732889, 8523919, 8264665, 7962559, 7625789, 7263768, 6886870, 6505264, 6127442, 5759543, 5406308, 5073345, 4769093, 4504470, 4289691, 4130133, 4024455, 3966589, 3949779, 3968994, 4020120, 4098209, 4198007, 4316787, 4455910, 4618134, 4801903, 4997256, 5187091, 5353160, 5482362, 5568846, 5611196, 5608086, 5556413, 5452509, 5293672, 5077611, 4800976, 4460355, 4057092, 3603326, 3124804, 2658041, 2243257, 1916520, 1703571, 1615839, 1648358, 1779921, 1976246, 2196294, 2400965]
33970B400965J61645J09915P0087N6409P1239J05953J47262J83990K10283K25023
33960C742771K29206K22993K03973J67970J12144L7950m8265j36834k16895k78111
33950D036902l12222l14378k83726k23191j38801l8973O6409J67067K53609L19055
33940C531751L60310L78739L79349L68991L54186L38766L22036K99232K65055
33931F598415K17561J58713R1219J5750o8013j57911k47626l28628l93783m39629
33921E446068m66444m77119m76185m69249m62170m59148m60294m60920m54186
33912A260353m35734m06434l71072l34716l00355k68851k39108k06522j61597
33903a464036r2247R613J41519K89080M30714N44668O13809O27283N81086M79369
$$ y = [2400965, 2562610, 2672525, 2742612, 2799021, 2870260, 2976213, 3123475, 3307465, 3517748, 3742771, 3971977, 4194970, 4398943, 4566913, 4679057, 4717007, 4668742, 4531908, 4315013, 4036902, 3724680, 3410302, 3126576, 2903385, 2764584, 2725611, 2792020, 2959087, 3212696, 3531751, 3892061, 4270800, 4650149, 5019140, 5373326, 5712092, 6034128, 6333360, 6598415, 6815976, 6974689, 7065908, 7081658, 7013645, 6855734, 6608108, 6279480, 5885697, 5446068, 4979624, 4502505, 4026320, 3557071, 3094901, 2635753, 2175459, 1714539, 1260353, 824619, 418185, 47113, -287603, -587958, -856809, -1095917, -1302439, -1464036, -1556283, -1546670, -1405151, -1116071, -685357, -140689, 473120, 1100403, 1681489, 2160858]
33893B160858L35687J71656J1376j26802k36679l24254m00843m73781n41048n92802
33883a6632o17599o08312n64666m92595m02136l04876k11006j26650n2815J3000
33873c384287P3248J26920J68399J89644J84838J54856J08226N7313J2135k3781
33863b332489n2888p9646j06327j31156j49306j55597j47016j23658q8149m4497
33853c410729L359N3707J09263J76969K64101L72713M96235O19952P24241P89082
33843A98893P99323P49519O46309N06442L51136J99141O1787n7352j57912k36963
33833C060323k87515l02930k83040k36124j75561j14842o4730l3066k5402m4709
33823A492404q9891j54222k25877k91440l40441l67370l69871l45766k92172k07569
$$ y = [2160858, 2496545, 2668201, 2679577, 2552775, 2316096, 1991842, 1590999, 1117218, 576170, -16632, -634231, -1242543, -1807209, -2299804, -2701940, -3006816, -3217822, -3344472, -3397287, -3384287, -3311039, -3184119, -3015720, -2826076, -2641238, -2486382, -2378156, -2320843, -2308708, -2332489, -2385377, -2465023, -2571350, -2702506, -2851812, -3007409, -3154425, -3278083, -3366232, -3410729, -3407370, -3353663, -3244400, -3067431, -2803330, -2430617, -1934382, -1314430, -590189, 198893, 998216, 1747735, 2394044, 2900486, 3251622, 3450763, 3512550, 3455198, 3297286, 3060323, 2772808, 2469878, 2186838, 1950714, 1775153, 1660311, 1595581, 1562515, 1537113, 1492404, 1402513, 1248291, 1022414, 730974, 390533, 23163, -346708, -692474, -984646, -1192215]
33813a192215r4722L7681J75412L00983L97459M52805M63205M33708L75828L03300
33803A653444K28231J59360J02503O1859M0526L9494N5609Q0309J01073J05815
33793B628223Q7687M6956j0833p7969j46245k07041k51645k72750k66497k33548
33783A296338j78655j09097l3060M0950J03894J46351J60307J42172R5396L1147
33773A695743l3705q1055r7198p7116k5309M6796J24582J93169K39368K53710
33763B238985K32822J81098J09895L3698l5494r2290j38014j76736k10294k35792
33753A907878k47134k39334k12626j73769j33831j04116r2686j02873j33501j79881
33743B88127k35014k90725l38312l69141l75996l55788l12198k55835k00475j56938
$$ y = [-1192215, -1286937, -1249256, -1073844, -772861, -375402, 77403, 540608, 974316, 1350144, 1653444, 1881675, 2041035, 2143538, 2205397, 2245923, 2285417, 2341026, 2421335, 2522408, 2628223, 2715910, 2762866, 2752033, 2674064, 2527819, 2320778, 2069133, 1796383, 1529886, 1296338, 1117683, 1008586, 975526, 1016476, 1120370, 1266721, 1427028, 1569200, 1664596, 1695743, 1662038, 1580983, 1483785, 1406669, 1381360, 1428156, 1552738, 1745907, 1985275, 2238985, 2471807, 2652905, 2762800, 2796498, 2761004, 2668714, 2530700, 2353964, 2143670, 1907878, 1660744, 1421410, 1208784, 1035015, 901184, 797068, 704382, 601509, 468008, 288127, 53113, -237612, -575924, -945065, -1321061, -1676849, -1989047, -2244882, -2445357, -2602295]
33733b602295j28376j10328r5258p7608n5410k8394L867M1378Q2089J22045J57550
33722b690740J86929K10298K28504K42775K54722K65591K74900K80011K77292
33713d69718K63594K36590J94100J34299N7886k9115j14827j84860k27898k40199
33703c80148k26777j99154j70879j52243j46112j46931j43486j23970q1063j5579
33693a786342O2290J35020J83321J93354J62361J00406K7808l0780n4047l0834
33683a037443L6897J36039K47577L52167M34547M86380N07331N03563M83951M55920
33673B606929M23033L85040L39558K84145K17925J42435O1610j8763r1650j48928
33663D201334j81545j80822j41902o8363K5448J17671J87414K23421K27087K08185
$$ y = [-2602295, -2730671, -2840999, -2936257, -3013865, -3069275, -3097669, -3093802, -3052424, -2970335, -2848290, -2690740, -2503811, -2293513, -2065009, -1822234, -1567512, -1301921, -1027021, -747010, -469718, -206124, 30466, 224566, 358865, 416751, 387636, 272809, 87949, -139949, -380148, -606925, -806079, -976958, -1129201, -1275313, -1422244, -1565730, -1689700, -1770763, -1786342, -1724052, -1589032, -1405711, -1212357, -1049996, -949590, -921782, -952562, -1006609, -1037443, -1000546, -864507, -616930, -264763, 169784, 656164, 1163495, 1667058, 2151009, 2606929, 3029962, 3415002, 3754560, 4038705, 4256630, 4399065, 4460675, 4441912, 4350262, 4201334, 4019789, 3838967, 3697065, 3628702, 3654150, 3771821, 3959235, 4182656, 4409743, 4617928]
33653D617928J77267J40217R7617M7412j1948p9616j51859k22664k84746l30215
33643C999393l50361l35623k77543j73354l0755J31043K86066M10200M89371N23728
33633D672165N26611N19160N22827N52910O16067P12379Q39574R95777J179096
33624A1136566J384975J603899J821711K023579K200250K352770K491607K629524
33616B7644881K772103K911251L024477L078931L037452K864736K533454K031141
33608D9898426J367879N81680k63707j091223j829147k427016k861928l135032
33600D0239932l263058l269982l181523l022811k817636k587279k348464k112088
33592A7637091j884303j668891j468685j285548j120497r74703q49893p46763
$$ y = [4617928, 4795195, 4935412, 5033029, 5080441, 5068493, 4988877, 4837018, 4614354, 4329608, 3999393, 3649032, 3313409, 3035866, 2862512, 2831757, 2962800, 3248866, 3659066, 4148437, 4672165, 5198776, 5717936, 6240763, 6793673, 7409740, 8122119, 8961693, 9957470, 11136566, 12521541, 14125440, 15947151, 17970730, 20170980, 22523750, 25015357, 27644881, 30416984, 33328235, 36352712, 39431643, 42469095, 45333831, 47867285, 49898426, 51266305, 51847985, 51584278, 50493055, 48663908, 46236892, 43374964, 40239932, 36976874, 33706892, 30525369, 27502558, 24684922, 22097643, 19749179, 17637091, 15752788, 14083897, 12615212, 11329664, 10209167, 9234464, 8384571, 7637808]
33584G637808o62431n89471n17922m39576l52132k60663j74855j03486m9989j2321
33574D474962J3459K9421L4855K8332J0692j3340l6309n1420n6146n3353m9166
33563D331987m9439n7537p4595j00821j36020j78902k26304k73740l17084l53958
33553B563587l83384m03960m12442m04263l75549l25010k54662j70058q0562J274
33543b45029O2437R3483R0975N6731m608q7030j83088k83804l79558m61259n21177
33532a861927n53709n56406n30478m80075m10747l28300k38421j46886n9954J5440
33522e151463P2535J06889J18480J11886R4105P1748M9662L1638K2101K7007N2524
33511d392888J01735J71424K51720L29581L94309M41567M73571M96004N14467
$$ y = [7637808, 6975377, 6385906, 5867984, 5428408, 5076276, 4815613, 4640758, 4537272, 4487283, 4474962, 4488421, 4517842, 4552697, 4581029, 4591721, 4578381, 4542072, 4490652, 4434506, 4381153, 4331987, 4282548, 4225011, 4150416, 4049595, 3913575, 3734673, 3508369, 3234629, 2917545, 2563587, 2180203, 1776243, 1363801, 959538, 583989, 258979, 4317, -165741, -246303, -245029, -182592, -89109, 1866, 58597, 53989, -33041, -216129, -499933, -879491, -1340750, -1861927, -2415636, -2972042, -3502520, -3982595, -4393342, -4721642, -4960063, -5106949, -5166903, -5151463, -5078928, -4972039, -4853559, -4741673, -4647568, -4575820, -4526158, -4494520, -4472419, -4445412, -4392888, -4291153, -4119729, -3868009, -3538428, -3144119, -2702552, -2228981, -1732977, -1218510]
33502a218510N32972N54416N80913O12674O46303O74256O85972O70061O17310
33493D356367N24187L95449K43710Q5861o1440j84975k76344l32019l52132l38374
33483D060290k92626k17786j19980r485J01054K00111K80048L37690L72855L86102
33473E098273L77339L46407K95149K29125J57122Q8360K9096j9107n8578r3122
33463F450064j25819j57619j86443k06668k10349j90964j47915q8065k2557L8546
33453E152211Q9561J28792J56373J72729J77532J68191J39013Q3814J847r7729
33443F172334j98047k82695l43441l81380m01627m06783l94242l58347k94949
33434C110823k05107r6285J8603J23440K02500K45673K53768K39988K24676K25537
$$ y = [-1218510, -685538, -131122, 449791, 1062465, 1708768, 2383024, 3068996, 3739057, 4356367, 4880554, 5276003, 5519713, 5605574, 5544134, 5359159, 5082815, 4750796, 4398664, 4060290, 3767664, 3549878, 3429898, 3420413, 3521467, 3721578, 4001626, 4339316, 4712171, 5098273, 5475612, 5822019, 6117168, 6346293, 6503415, 6591775, 6620871, 6601764, 6543186, 6450064, 6324245, 6166626, 5980183, 5773515, 5563166, 5372202, 5224287, 5136222, 5113665, 5152211, 5241772, 5370564, 5526937, 5699666, 5877198, 6045389, 6184402, 6268216, 6270063, 6172334, 5974287, 5691592, 5348151, 4966771, 4565144, 4158361, 3764119, 3405772, 3110823, 2905716, 2809431, 2828034, 2951474, 3153974, 3399647, 3653415, 3893403, 4118079, 4343616]
33424D343616K49446K90524L34113L62816L61553L21188K40986J29265J300j25396
33414F509411k36129l21964l79568m09275m13490l96034l61768l15801k63185
33405C412197k10028j65260j40467j45904j84087k45273l09220l53348l62811
33396A295799l36212k84113k22493j65792j22706r5318q0972p5615p6729q3607
33386b47758r4968j06628j12149j06298q7886n9568k5600R546M0499O0335O2249
33375f68226M3329P243l6941p9220j13074j36942j53019j65674j80624k03767
33365a686915k38832k85299l38630l92492m40397m75657m91504m83075m49669
33356e282470l94299l20459k29519j21694J91J27357K44728L34232L80920L79578
$$ y = [4343616, 4593062, 4883586, 5217699, 5580515, 5942068, 6263256, 6504242, 6633507, 6634807, 6509411, 6273282, 5951318, 5571750, 5162475, 4748985, 4352951, 3991183, 3675382, 3412197, 3202169, 3036909, 2896442, 2750538, 2566451, 2321178, 2011958, 1658610, 1295799, 959587, 675474, 452981, 287189, 164483, 69165, -11807, -87422, -164151, -247758, -342726, -449354, -561503, -667801, -755687, -815255, -840855, -831309, -790810, -730475, -668226, -624897, -617654, -654595, -733815, -846889, -983831, -1136850, -1302524, -1483148, -1686915, -1925747, -2211046, -2549676, -2942168, -3382565, -3858222, -4349726, -4832801, -5282470, -5676769, -5997228, -6226747, -6348441, -6348250, -6220893, -5976165, -5641933, -5261013, -4881435]
33346d881435L38144K75109K11642J62916J33480J18549J09512J00264R1299Q9780
33336c250740J05805J46952K14225L01519L98236M92352N71695O23947O38220
33327B42211O09681N44530M60503L81017L26592L09287L32170L91143M75681N68453
33317D641268O46640O86845O72309N99050M77734L29908J79900M6135o3729j51742
33307H064318k24343k86898l41307l87132m24060m52693m72423m78154m59710
33298D537598m06008l11851j82537l3328J15091K42225L32425L77755L78307L39499
33288E389176K68110J70145N2029p7010k05006l20945m19296n01186n71030o31588
33278C153399o82011p20117p45817p61627p69929p70286p59538p34262o92858
$$ y = [-4881435, -4543291, -4268182, -4056540, -3893624, -3760144, -3641595, -3532083, -3431819, -3340520, -3250740, -3144935, -2997983, -2783758, -2482239, -2084003, -1591651, -1019956, -396009, 242211, 851892, 1396422, 1856925, 2237942, 2564534, 2873821, 3205991, 3597134, 4072815, 4641268, 5287908, 5974753, 6647062, 7246112, 7723846, 8053754, 8233654, 8279789, 8216060, 8064318, 7839975, 7553077, 7211770, 6824638, 6400578, 5947885, 5475462, 4997308, 4537598, 4131590, 3819739, 3637202, 3603874, 3718965, 3961190, 4293615, 4671370, 5049677, 5389176, 5657286, 5827431, 5879460, 5802450, 5597444, 5276499, 4857203, 4356017, 3784987, 3153399, 2471388, 1751271, 1005454, 243827, -526102, -1296388, -2055926, -2790188, -3483046]
33269c483046o36033n66057m85703l97205l01514j98339q7019L2093J55953K77432
33259e689438L85717M69835N23942N50497N58715N59854N63170N74449N95860
33250i07399O25559O57433O82591O92827O84442O59792O25128N85998N43840M96708
33240E346919M43129L84885L26149K70854K21926J82692J57566J49978J59419
33231G643517J80785K06620K29818K44191K43090K18469J62810P3734m1753j67010
33221H994271k80799l65006m10733m19712m01217l66960l26968k87979k54039
33212E880858k27701k10782k04576k10011k27657k57221k96737l41821l85559
33203C518793m19165m33982m24839l93320l48389l02844k67207k44333k27766
$$ y = [-3483046, -4119079, -4685136, -5170839, -5568044, -5869558, -6067897, -6154916, -6122823, -5966870, -5689438, -5303721, -4833886, -4309944, -3759447, -3200732, -2640878, -2077708, -1503259, -907399, -281840, 375593, 1058184, 1751011, 2435453, 3095245, 3720373, 4306371, 4850211, 5346919, 5790048, 6174933, 6501082, 6771936, 6993862, 7176554, 7334120, 7484098, 7643517, 7824302, 8030922, 8260740, 8504931, 8748021, 8966490, 9129300, 9203034, 9161281, 8994271, 8713472, 8348466, 7937733, 7518021, 7116804, 6749844, 6422876, 6134897, 5880858, 5653157, 5442375, 5237799, 5027788, 4800131, 4542910, 4246173, 3904352, 3518793, 3099628, 2665646, 2240807, 1847487, 1499098, 1196254, 929047, 684714, 456948]
33194D56948k04824j63458r9891k2761M9354R5951J03476P0321O752o8659j34390
33183H8819j71931j70630j29419n5185M0163J42297K37103L14080L69159M04277
33173A068733M23870M31486M29334M19944M06999L93952L81954L69258L52911
33164D678441L31588L07527K85994K72366K68989K74111K83016K89787K88598
33155G280417K74889K46425K02848J43446O5947l0759j41407k52324l46118m10020
33145G033344m41483m47673m40644m31642m26632m24098m16366l94680l55517
33136C254609l03784k50252k04850j70963j45400j24119j08455j05626j22327
33127A718833j56992j97924k29240k39750k27984k00531j66488j33066j05347
$$ y = [456948, 252124, 88666, -11225, -33986, 15368, 111319, 214795, 285116, 291868, 223209, 88819, -83112, -253742, -383161, -438346, -398183, -255886, -18783, 295297, 664456, 1068733, 1492603, 1924089, 2353423, 2773367, 3180366, 3574318, 3956272, 4325530, 4678441, 5010029, 5317556, 5603550, 5875916, 6144905, 6419016, 6702032, 6991819, 7280417, 7555306, 7801731, 8004579, 8148025, 8213972, 8183213, 8041806, 7789482, 7443364, 7033344, 6591861, 6144188, 5703544, 5271902, 4845270, 4421172, 4004806, 3610126, 3254609, 2950825, 2700573, 2495723, 2324760, 2179360, 2055241, 1946786, 1841160, 1718833, 1561841, 1363917, 1134677, 894927, 666943, 466412, 299924, 166858, 61511]
33118F1511q8907r1255j19043j72255k40307l04250l44638l49860l19722k63123
33108b231849j92648j19710n1617R470O5898J22245J82349K47353L15594L83355
33098a269560M45226M93896N20327N15141M71237L86957K68400J29133j3367j42803
33088A804587k47599l21400l61897l70335l52060l16326k73928k33682k00104
33079h72744j73397j50722j27537r9256o3824k3944J3284L9928N1352M8063L4792
33068a324005J8191M267l687n585k745M432J6606L3222N0731O3573O7031N9515
33056a018454M3233K3542O771l145p227j0642j8559l1971m6689n5979n4650m1694
33044a215464j9764Q124M1750Q3649J35397J93521K48965K91051L12942L14518
$$ y = [61511, -27396, -118651, -237694, -409949, -650256, -954506, -1299144, -1649004, -1968726, -2231849, -2424497, -2544207, -2595824, -2586354, -2520456, -2398211, -2215862, -1968509, -1652915, -1269560, -824334, -330438, 189889, 705030, 1176267, 1563224, 1831624, 1960757, 1947390, 1804587, 1556988, 1235588, 873691, 503356, 151296, -165030, -438958, -672640, -872744, -1046141, -1196863, -1324400, -1423656, -1487480, -1511424, -1498140, -1458212, -1406860, -1358797, -1324005, -1305814, -1301547, -1305234, -1310819, -1313564, -1309132, -1292526, -1259304, -1208573, -1145000, -1077969, -1018454, -975221, -951679, -944908, -948053, -955280, -965922, -984481, -1016452, -1063141, -1119120, -1173770, -1215464, -1235228, -1227104, -1185354, -1101705, -966308, -772787, -523822, -232771, 80171, 394689]
33034C94689L00669K76747K44981K04589J55157J00430M9594J4895O594K7814
33024A776159P2241J26179J73671K01686K03410J79608J38406R2642N4294K8249
33014C046545R635j2471m6930r3594j42579j80334j98079j96730j85629j76917
33004A822917j79581j95994k21330k45178k54819k39648j95606j28036n1206J5925
32994A27444N6278O0425K8915k9297j00448j69618k23615k53457k56484k37274
32984i97131k06362j76622j58585j56810j68993j88014k05621k15567k14673k01704
32974b890082j75661j35512q1850j8832M5582J01606J40343J55761J45659J12069
32964b600917O1135J777n6877j08205j49099j78603j95501j97161j80557j43998
$$ y = [394689, 695358, 972105, 1217086, 1421675, 1576832, 1677262, 1726856, 1741751, 1748345, 1776159, 1848400, 1974579, 2148250, 2349936, 2553346, 2732954, 2871360, 2964002, 3018296, 3046545, 3056180, 3043709, 2996779, 2903185, 2760606, 2580272, 2382193, 2185463, 1999834, 1822917, 1643336, 1447342, 1226012, 980834, 726015, 486367, 290761, 162725, 111519, 127444, 183722, 244147, 273062, 243765, 143317, -26301, -249916, -503373, -759857, -997131, -1203493, -1380115, -1538700, -1695510, -1864503, -2052517, -2258138, -2473705, -2688378, -2890082, -3065743, -3201255, -3283105, -3301937, -3256355, -3154749, -3014406, -2858645, -2712986, -2600917, -2539782, -2538005, -2594882, -2703087, -2852186, -3030789, -3226290, -3423451, -3604008, -3748006]
32954c748006q7643j2857P7753J78912K81786L75683M51346N02737N26035N18301
32944i35953M78545M10540L23810K30976J43207O7214M965m4762q4445j15856
32934D78241j38372j48165j39242j06512m9925K2666R6413J54824J86844J91048
32924E47820J74319J46721J16572Q8205O1960L4760Q42m6499j11763j93740k83857
32913E35340l67976m30844m60446m49840l96847l04063j80164m0550R5542K11130
32903a788718K97232L54598L90825M15080M33413M46714M51701M43925M20664
32894A865434L82330L32310K75814K18041J62260J09021N7567Q431l5314o9646
32884C306248r2616j06189j15624j27368j46805j76444k14773k56130k91820l12117
$$ y = [-3748006, -3835649, -3848506, -3770753, -3591841, -3310055, -2934372, -2483026, -1980289, -1454254, -935953, -457408, -46868, 276942, 507918, 651125, 718339, 723304, 678542, 594097, 478241, 339869, 191704, 52462, -54050, -103975, -81309, 15104, 169928, 356772, 547820, 722139, 868860, 985432, 1073637, 1135597, 1170357, 1171199, 1124700, 1012937, 819197, 535340, 167364, -263480, -723926, -1173766, -1570613, -1874676, -2054840, -2095390, -1999848, -1788718, -1491486, -1136888, -746063, -330983, 102430, 549144, 1000845, 1444770, 1865434, 2247764, 2580074, 2855888, 3073929, 3236189, 3345210, 3402777, 3411208, 3375894, 3306248, 3213632, 3107443, 2991819, 2864451, 2717646, 2541202, 2326429, 2070299, 1778479, 1466362]
32874A466362l08522k76226k16587j38691n8377N898L8910L3427q430p7392j60842
32863B99530k45759l19787l71292l90114l69835l10441k19462j10441N30R8488
32853a938583J72059K14854K26285K11708J80800J43801J06853O9089K3510l8354
32843f27978j19936k14548l04619l66591l79914l35910k42119j19901L182J02279
32833b606055J61740J77220J54109J04085M1418k0287p0713j04015j18004j12338
32823b392840q8059m9380n535L0710M8173M2237J5801k3831o8740j12002j47119
32812b750585j67157j65386j37712q5491j6242N8925J29546J88320K30556K52621
32802b462605K52138K29946J91365J45137J00499O3918L6855J5822m598k7186
$$ y = [1466362, 1157840, 881614, 665027, 526336, 467959, 473857, 512767, 546194, 537764, 460372, 299530, 53771, -266016, -637308, -1027422, -1397257, -1707698, -1927160, -2037601, -2037071, -1938583, -1766524, -1551670, -1325385, -1113677, -932877, -789076, -682223, -613134, -589624, -627978, -747914, -962462, -1267081, -1633672, -2013586, -2349496, -2591615, -2711516, -2708334, -2606055, -2444315, -2267095, -2112986, -2008901, -1967483, -1987770, -2058483, -2162498, -2280502, -2392840, -2480899, -2530279, -2535814, -2505104, -2456931, -2414694, -2398893, -2422724, -2491464, -2603466, -2750585, -2917742, -3083128, -3220840, -3306331, -3322573, -3263648, -3134102, -2945782, -2715226, -2462605, -2210467, -1980521, -1789156, -1644019, -1543520, -1479602, -1442747, -1426925, -1431523, -1458709]
32792a458709m9458o5355o9864o2650m7942l1434j6953n091N909J8041L1756M5607
32780a706143N7718O8031P9352R5537J17321J38760J47766J31458Q3486Q770p7073
32769h55017j53223k01322k12031j87872j41298q8924m4577j4561K675J2603J9192
32758a864355K1470J3824j0681n6369j22512k03230k89249l70073m35282m75243
32748c791700m82285m52591l86998k89595j65564k1027J34905K88547M22806N20463
32738d223039N67888N58337M94346L88010K58278J26594J3039o6395j02171r2996
32728b078109m5885K5759J04880J73890K18894K34431K25717K05829J89427J87290
32718e57877K04380K40324K89975L43519L87922M10778M04936L70228L10484K28819
$$ y = [-1458709, -1508167, -1573522, -1643386, -1706036, -1753978, -1785412, -1802365, -1807456, -1801547, -1783506, -1751750, -1706143, -1648425, -1580394, -1501042, -1405505, -1288184, -1149424, -1001658, -870200, -786714, -777944, -855017, -1008240, -1209562, -1421593, -1609465, -1750763, -1839687, -1884264, -1898825, -1896150, -1883547, -1864355, -1842885, -1829061, -1839742, -1896111, -2018623, -2221853, -2511102, -2881175, -3316457, -3791700, -4273985, -4726576, -5113574, -5403169, -5568733, -5589760, -5454855, -5166308, -4743502, -4223039, -3655151, -3096814, -2602468, -2214458, -1956180, -1829586, -1816547, -1882942, -1985113, -2078109, -2123994, -2098235, -1993355, -1819465, -1600571, -1366140, -1140423, -934594, -745167, -557877, -353497, -113173, 176802, 520321, 908243, 1319021, 1723957, 2094185, 2404669, 2633488]
32708B633488J26435O973j17932k28137l01543l23447k92877k22928j35625n4047
32698A090360M909L4113L5343J5592j6727n4315r2053j26640j55059j73009j75054
32687C87460j57050j19417o8518j4456L3840P2964J04997J32567J52977J57076
32677F82440J34779Q3007R466p0611j41752j94009k24202k33430k23883j97306
32667c75501j55851j04049m9694j801L3735N7718P7283J01448J35671J79101K25398
32656A23458K65172K88007K84021K46198J73368P1756m6661j68371k82406l82171
32646E72371m64500n26861n64571n70449n38140m67018l64173k41149j08392K7294
32636c245588J60352K82470L81369M43696M59894M28353L57207K63059J66788
$$ y = [2633488, 2759923, 2766896, 2648964, 2420827, 2119284, 1795837, 1502960, 1280032, 1144407, 1090360, 1095269, 1129382, 1164725, 1180317, 1163590, 1109275, 1017222, 890582, 735523, 562514, 387460, 230410, 110993, 42475, 28019, 61859, 134823, 239820, 372387, 525364, 682440, 817219, 900226, 909692, 839081, 697329, 503320, 279118, 45688, -178195, -375501, -531352, -635401, -685095, -686896, -653161, -595443, -518160, -416712, -281041, -101940, 123458, 388630, 676637, 960658, 1206856, 1380224, 1451980, 1405319, 1236948, 954542, 572371, 107871, -418990, -983561, -1554010, -2092150, -2559168, -2923341, -3164490, -3272882, -3245588, -3085236, -2802766, -2421397, -1977701, -1517807, -1089454, -732247, -469188, -302400]
32627c02400Q7515L6888J6124J7325K8386L8575M1636L5493K0043m929m1088r1617
32615a18049j58990k40501l24669l92986m27863m21808l80709l18487k47437j72029
32605c203528r0729l467Q2236J52051J92058J96866J72779J34048R4889O2360
32595b210437L4458M036l4781q2430j34157j83175k23803k52925k69818k74959
32585c627991k68562k50001k18943j77284j29577q0721l2484J8007P6245J45933
32575d545378K24840L03246L66262L99756L97209L63162L10664K54604K05986
32566a719649J70424J49681J43252J48573J60848J73569J79928J74932J57648
32557b60794J32196J06064Q6373P6942P8182Q8997J07899J32353J57969J79502
$$ y = [-302400, -214885, -177997, -161873, -144548, -116162, -77587, -35951, -458, 19585, 14656, -26432, -118049, -277039, -517540, -842209, -1235195, -1663058, -2084866, -2465575, -2784062, -3031499, -3203528, -3294257, -3297724, -3215488, -3063437, -2871379, -2674513, -2501734, -2367686, -2272797, -2210437, -2175979, -2171943, -2206724, -2289154, -2423311, -2606486, -2830289, -3083214, -3353032, -3627991, -3896553, -4146554, -4365497, -4542781, -4672358, -4753079, -4785563, -4767556, -4691311, -4545378, -4320538, -4017292, -3651030, -3251274, -2854065, -2490903, -2180239, -1925635, -1719649, -1549225, -1399544, -1256292, -1107719, -946871, -773302, -593374, -418442, -260794, -128598, -22534, 63839, 140781, 218963, 307960, 415859, 548212, 706181, 885683]
32547H85683J93291J98539J95624J82894J55737J09887M6594k5118r1128j37118
32537A714885j51721j27121n9686M7427J81545L21245M42409N26912N68848N74609
32527D039352N57105N27920M91790M45770L82717K96876J88733O6430n7202j70348
32517F769143k66905l46666m11338m60400m91388n04526n06283n06831n12509
32508B762297n20528n21184n05690m72955m30707l91823l68895l69353l92496
32499a211334m29639m67513m93016m96586m73146m21544l43956k45917j36778
32490d719429k9506O1024J21384J43215J25771P6890J2346m7204q2233q1300m4816
32479d463858J7063R0633J64386K31328K88252L34147L69011L93063M05948M06007
$$ y = [885683, 1078974, 1277513, 1473137, 1656031, 1811768, 1921655, 1968249, 1943131, 1852003, 1714885, 1563164, 1436043, 1376357, 1423784, 1605329, 1926574, 2368983, 2895895, 3464743, 4039352, 4596457, 5124377, 5616167, 6061937, 6444654, 6741530, 6930263, 6996693, 6939491, 6769143, 6502238, 6155572, 5744234, 5283834, 4792446, 4287920, 3781637, 3274806, 2762297, 2241769, 1720585, 1214895, 741940, 311233, -80590, -449485, -818838, -1211334, -1640973, -2108486, -2601502, -3098088, -3571234, -3992778, -4336734, -4582651, -4719429, -4748935, -4687911, -4566527, -4423312, -4297541, -4220651, -4208305, -4255509, -4337742, -4419042, -4463858, -4446795, -4356162, -4191776, -3960448, -3672196, -3338049, -2969038, -2575975, -2170027, -1764020]
32469a764020L89942L53656K94662K15206J23966L4264m0891r3918j24371j36285
32459g47789j33758j18676r2389n9162k7619q324r385l3069p4604j22343j59328
32448a586446j67555j35342o4445K8461J18611J85000K19850K29876K29308K30280
32438g12402K36945K45784K49876K43509K25480K00973J81498J81522K11919K73310
32428A538414L53747M32608M88419N06006M79734M12814L14695J98165P6269m0885
32418D759986j48353k46033l35797m18161m91018n50897n94918o21359o28669
32409G24781o14689n77622n18176m40695l52271k60624j72417r2365k2593L7655
32399b289016R1102J40117J84244K19313K38500K34499K01674J37781M5069o9382
$$ y = [-1764020, -1374078, -1020422, -725760, -510554, -386588, -352324, -393215, -487133, -611504, -747789, -881547, -1000223, -1092612, -1151774, -1179393, -1187717, -1197102, -1230171, -1304775, -1427118, -1586446, -1754001, -1889343, -1953788, -1925327, -1806716, -1621716, -1401866, -1171990, -942682, -712402, -475457, -229673, 20203, 263712, 489192, 690165, 871663, 1053185, 1265104, 1538414, 1892161, 2324769, 2813188, 3319194, 3798928, 4211742, 4526437, 4724602, 4800871, 4759986, 4611633, 4365600, 4029803, 3611642, 3120624, 2569727, 1974809, 1353450, 724781, 110092, -467530, -985706, -1426401, -1778672, -2039296, -2211713, -2304078, -2326671, -2289016, -2197914, -2057797, -1873553, -1654240, -1415740, -1181241, -979567, -841786, -796717, -866099]
32389h66099j94369l16177m20525m94371n27582n14767m57061l62769k45756j21672
32379d521148l179J03645J99866K90222L77216M56399N16129N41823N22052M53769
32369a063206L45595K18039R9241J6216j4876N924O4554J41031K18278K86730
32359C17526L43532L89062M24589M52003M73766M91657N05437N12991N11446M97590
32349D919599M67785M18835L50163K65654J73583Q4545Q202n0046r0828j19427
32339F428065j41867j61345j77295j87078j88645j82975j75360j74390j88606
32330D850504k22455k73959l34813l92344m32954m46566m30693l91655l41988
32321A583077k95354k61636k44340k41193k47162k57665k69862k81880k91550
$$ y = [-866099, -1060468, -1376645, -1797170, -2291541, -2819123, -3333890, -3790951, -4153720, -4399476, -4521148, -4524327, -4420682, -4220816, -3930594, -3553378, -3096979, -2580850, -2039027, -1516975, -1063206, -717611, -499572, -400331, -384115, -398991, -393067, -328513, -187482, 30796, 317526, 661058, 1050120, 1474709, 1926712, 2400478, 2892135, 3397572, 3910563, 4422009, 4919599, 5387384, 5806219, 6156382, 6422036, 6595619, 6680164, 6688366, 6638320, 6547492, 6428065, 6286198, 6124853, 5947558, 5760480, 5571835, 5388860, 5213500, 5039110, 4850504, 4628049, 4354090, 4019277, 3626933, 3193979, 2747413, 2316720, 1925065, 1583077, 1287723, 1026087, 781747, 540554, 293392, 35727, -234135, -516015, -807565]
32312h07565k95801k90276k68902k24851j54406o2096L7450J24004J80653K01257
32302a560533J92014J67328J43463J33131J42268J69317K07208K46949K80429
32293A21574L00638L00559K73653K16463J30659K1961j02834k36959l71417m92212
32283A62085n81055o20539o00652n22651l98382k45742q2829P6524K23905L54446
32273b234890M64126N48691O04548O30181O26672N97260N46711M80276M02047
32264B665622L13162K11622R4834l6129j73392l02790m08082m76340n01563m85359
32254I01585m35779l65857k91891k30434j93694j85429k00305k27724k57471k82990
32244a769989l00546l06626k97116k68865k21367j56897p9971K642Q2117J49630
$$ y = [-807565, -1103366, -1393642, -1662544, -1887395, -2041801, -2103897, -2066447, -1942443, -1761790, -1560533, -1368519, -1201191, -1057728, -924597, -782329, -613012, -405804, -158855, 121574, 422212, 722771, 996424, 1212887, 1343546, 1365507, 1262673, 1025714, 654297, 162085, -418970, -1039509, -1640161, -2162812, -2561194, -2806936, -2889765, -2813241, -2589336, -2234890, -1770764, -1222073, -617525, 12656, 639328, 1236588, 1783299, 2263575, 2665622, 2978784, 3190406, 3285240, 3249111, 3075719, 2772929, 2364847, 1888507, 1386944, 901585, 465806, 99949, -191942, -422376, -616070, -801499, -1001804, -1229528, -1486999, -1769989, -2070535, -2377161, -2674277, -2943142, -3164509, -3321406, -3401377, -3398735, -3316618, -3166988]
32234c166988J99893K33687K57482K80329L09717L48267L93011M37801M77252
32225b29549N09291N34562N53817N65373N63849N40471M85374L92053K62331J08692
32215D286264m8098j85101k83614l33132l32339k88591k16675j36271o7286k4091
32205B371066j1486k4721n3361q6349j15460j35992j45771j44214j32352j13160
32195A408200r1094p0433n3029l6506j4111K2777P9853J55289K38552L13779L65839
32184B319116L85807L73644L37473K89773K42013J99808J60632J14958N0393m2574
32174D431043j65482l09658m57688n87632o78207p13688o87633o04541m79011
32165b52497l32945j91236p6094j024L3023L6608K6187J7021J7653K7464L7607
$$ y = [-3166988, -2967095, -2733408, -2475926, -2195597, -1885880, -1537613, -1144602, -706801, -229549, 279742, 814304, 1368121, 1933494, 2497343, 3037814, 3523188, 3915241, 4177572, 4286264, 4238166, 4053065, 3769451, 3436319, 3103980, 2815389, 2598714, 2462443, 2395157, 2371066, 2359580, 2334859, 2281498, 2195149, 2079689, 1943697, 1797926, 1653712, 1521360, 1408200, 1317106, 1246673, 1193644, 1157138, 1143027, 1165804, 1245657, 1400946, 1639498, 1953277, 2319116, 2704923, 3078567, 3416040, 3705813, 3947826, 4147634, 4308266, 4423224, 4473617, 4431043, 4265561, 3955903, 3498215, 2910583, 2232376, 1518688, 831055, 226514, -252497, -585442, -776678, -852772, -853796, -820773, -784165, -757978, -740957, -723304, -695840, -658233]
32154f58233L5683J2952k9590q0370j22802j43882j40420j19368r3030p2792o4920
32143a476772o9331q0493q9626q8132p1410m1273n148K7504M9530N8542N6436
32132a730173M6696L1770J2473j0309l3475n1186n6528m4052j1465M0035J06117
32121a700097J79465K49758L04706L32893L27542K89023K24366J44332O0241j7588
32111C94641p9866j18564j28874j12334p8548m3090k1621k2823m3900p1377q7420
32100d13776p8754m3324R413O4382J08751J36631J48532J47479J35692J14312
32090C29338Q5643N4876K8680J1340J737n986j8498l8925o4609q7584r7298q4714
32078A14000m6527J2503Q0850J44536J91552K13442K04401J60824Q3179k1755
$$ y = [-658233, -622550, -609598, -639188, -719558, -842360, -986242, -1126662, -1246030, -1339060, -1411852, -1476772, -1546103, -1626596, -1716222, -1804354, -1875764, -1917037, -1922185, -1894681, -1845151, -1786609, -1730173, -1683477, -1651707, -1639234, -1649543, -1683018, -1734204, -1790732, -1834784, -1846249, -1806214, -1700097, -1520632, -1270874, -966168, -633275, -305733, -16710, 207656, 351988, 412229, 394641, 314775, 196211, 67337, -44997, -123545, -166635, -188256, -211079, -254979, -326356, -413776, -492530, -535854, -526441, -462059, -353308, -216677, -68145, 79334, 215026, 329338, 414981, 469857, 498537, 509877, 511614, 505628, 487130, 448205, 383596, 296012, 198714, 114000, 67473, 79976, 160826, 305362, 496914, 710356, 914757, 1075581, 1158760, 1137005]
32068A137005j41608k62233l71145m58196n14989n35989n21199m77334m15264
32059b560952l44935k70930j91226j00046O519J25228K44337L47240M18956M51598
32049a874211M46285M11004L55826K88062K10086J21187K1895q2307j80372k58271
32039e40816l03319l08457k75123k13627j40381p2354k0846J2259L3399N1560
32029a777705P1070Q7559R0119O8692K1749m1231j04247j52468j77315j76270
32019b090047j49899j00260l2347M3822J13566J61248J75252J51424R3614J1796
32009a621831q0982j72005k51847l16044l64677m00481m26685m45301m55642m53213
31999d988708m30283l78902k94967j80828m5403R7436K31384L41377M17880M59590
$$ y = [1137005, 995397, 733164, 362019, -96177, -611166, -1147155, -1668354, -2145688, -2560952, -2905887, -3176817, -3368043, -3468089, -3461570, -3336342, -3092005, -2744765, -2325809, -1874211, -1427926, -1016922, -661096, -373034, -162948, -41761, -19866, -102173, -282545, -540816, -844135, -1152592, -1427715, -1641342, -1781723, -1854077, -1874923, -1862664, -1829265, -1777705, -1706635, -1619076, -1528957, -1460265, -1438516, -1479747, -1583994, -1736462, -1913777, -2090047, -2239946, -2340206, -2372553, -2328731, -2215165, -2053917, -1878665, -1727241, -1633627, -1621831, -1702813, -1874818, -2126665, -2442709, -2807386, -3207867, -3634552, -4079853, -4535495, -4988708, -5418991, -5797893, -6092860, -6273688, -6319091, -6221655, -5990271, -5648894, -5231014, -4771424]
31989d771424M72469M65555M46534M19516L85417L43777K94382K37759J74498
31980a531517J04759K9265m8598j21798j81504k20902k38476k38830k30776k23644
31970b902021k23033k27758k29672k16968j79474j13318k2563Q2497J89029K85068
31960c558213L61680M14040M42144M50808M48263M43260M41816M45089M49237
31951C38124M47354M32664M01750L56482L03925K54372K17905K00599K01776K13425
31941C368376K22083K12687J73796J02887Q919r0329j75420k32544k56527k49173
31931C084755k16067j64680j03820m2891R854M9242P3849Q4844Q3783P0907M4887
31920B974663M253n0076j12187j70441k10042k18178j88681j24038l5079O0456
$$ y = [-4771424, -4298955, -3833400, -3386866, -2967350, -2581933, -2238156, -1943774, -1706015, -1531517, -1426758, -1397493, -1446091, -1567889, -1749393, -1970295, -2208771, -2447601, -2678377, -2902021, -3125054, -3352812, -3582484, -3799452, -3978926, -4092244, -4114807, -4032310, -3843281, -3558213, -3196533, -2782493, -2340349, -1889541, -1441278, -998018, -556202, -111113, 338124, 785478, 1218142, 1619892, 1976374, 2280299, 2534671, 2752576, 2953175, 3154951, 3368376, 3590459, 3803146, 3976942, 4079829, 4088748, 3998419, 3822999, 3590455, 3333928, 3084755, 2868688, 2704008, 2600188, 2557297, 2567151, 2616393, 2690242, 2775086, 2858869, 2929776, 2974663, 2978916, 2928840, 2816653, 2646212, 2436170, 2217992, 2029311, 1905273, 1870194, 1930650]
31910A930650J40935J86751J87367J45087P2740j2886r7564j73275k38469k95381
31900A845955l45613l86800m12963m18216m00501l62581l10386k50657j88824
31891a230586j27268o4705K082P4527J49246K18201K71947L03308L09180K90513
31881A96445K52122K03179J57246J29881J33289J70585K34038L09619L85172M55989
31871B627565N23878N91647O58537P19734P68459P97619Q00340P70807P06181
31862H964767O08296M83556L41228J91954M7828p6948j67118k10382k02380j49404
31852I831397o7317K2181R6253J36143J32413Q8129J7421o0440j28152j75065
31842I892963j98296k01185j90571j73828j56660j42592j33950j32947j41242
$$ y = [1930650, 2071585, 2258336, 2445703, 2590790, 2663530, 2650644, 2553080, 2379805, 2141336, 1845955, 1500342, 1113542, 700579, 282363, -118138, -480719, -791105, -1041762, -1230586, -1357854, -1422559, -1420477, -1345950, -1196704, -978503, -706556, -403248, -94068, 196445, 448567, 651746, 808992, 938873, 1072162, 1242747, 1476785, 1786404, 2171576, 2627565, 3151443, 3743090, 4401627, 5121361, 5889820, 6687439, 7487779, 8258586, 8964767, 9573063, 10056619, 10397847, 10589801, 10637629, 10560681, 10393563, 10183181, 9980801, 9831397, 9764080, 9786261, 9882514, 10018657, 10151070, 10239199, 10256620, 10196180, 10068028, 9892963, 9694667, 9493482, 9302911, 9129083, 8972423, 8829831, 8695881, 8562934, 8421692]
31833H421692j58091j78960j96639k04715k00964j88088j71408j55457j42058
31824F825312j31058j22859j20585j29726j54973j96321k47346k97249l35623
31815E089572l57246l64058l63265l62743l66974l76219l88825m03758m20740
31806A685744m38130m51177m53036m38097m05410l59794l10285k67209k39375
31797a676769k31866k44156k69003k93390l02574k85906k41334j75778j01359
31788c822135k9879L1494Q1701J24384J64766K06685K51723L00709L55467M18023
31778a917062M87054N54806O08002O32848O20896N72259M95352M03796L11820
31769B769771K29369J59362R9061M4853l535m3313p2670r3802j11023j25721j33789
$$ y = [8421692, 8263601, 8084641, 7888002, 7683287, 7482323, 7294235, 7122827, 6967370, 6825312, 6694254, 6571395, 6450810, 6321084, 6166111, 5969790, 5722444, 5425195, 5089572, 4732326, 4368268, 4005003, 3642260, 3275286, 2899067, 2510242, 2106484, 1685744, 1247614, 796437, 343401, -94696, -500106, -859900, -1170185, -1437394, -1676769, -1908635, -2152791, -2421794, -2715184, -3017758, -3303664, -3544998, -3720776, -3822135, -3852014, -3820520, -3738819, -3614435, -3449669, -3242984, -2991261, -2690552, -2335085, -1917062, -1430008, -875202, -267200, 365648, 986544, 1558803, 2054155, 2457951, 2769771, 2999140, 3158502, 3257563, 3302416, 3298881, 3255568, 3182898, 3089096, 2978073, 2852352, 2718563]
31758B718563j28761j08006p6712m6965l2985m5262q5820j46927k14601k75587
31748A556937l23375l59464l90110m21853m58534n00046n42202n77937n99870
31739b616454o02773n83795n40254m67706l61101k18720m5683J45652L38127N13283
31729d439424O54733P51174P98180P97980P57594O86814N96581M97025L95546
31720A496203K96455K02902J19257N1192L211k4326l6393m1858m9857o5630q8193
31709A862963j11410j27533j30547j17504q8140m3925J2698P8839J51458K27600
31699A714499L04709L80791M53710N19493N70645N96053N83603N24903M19963
31690F068369K78881J19231l9272j79521k89089l60287l90237l81861l44497k92202
$$ y = [2718563, 2589802, 2481796, 2405084, 2358119, 2325134, 2279872, 2194052, 2047125, 1832524, 1556937, 1233562, 874098, 483988, 62135, -396399, -896445, -1438647, -2016584, -2616454, -3219227, -3803022, -4343276, -4810982, -5172083, -5390803, -5436486, -5290834, -4952707, -4439424, -3784691, -3033517, -2235337, -1437357, -679763, 7051, 603632, 1100657, 1496203, 1792658, 1995560, 2114817, 2166009, 2169220, 2144894, 2108501, 2066643, 2016786, 1951156, 1862963, 1751553, 1624020, 1493473, 1375969, 1287829, 1243904, 1256602, 1335441, 1486899, 1714499, 2019208, 2399999, 2853709, 3373202, 3943847, 4539900, 5123503, 5648406, 6068369, 6347250, 6466481, 6427209, 6247688, 5958599, 5598312, 5208075, 4826214, 4481717, 4189515]
31680D189515k39424j96477j68011j55344j59948j84703k32344l03199l93814
31671B156251m96143n97024o79393p26833p30294o92806o28576n56202m90031
31662c441051m35038l88224l44927l04960k74076k59841k65156k84039l02827
31653f300139l06194k84267k36715j72641j07711n9860m3680o4074j12181j66805
31643g854267k01552j94122j33207k0587J31027L02183M71022O17100P24789P85436
31633e372178P97003P61596O83275N68100M25439K68025J09979l5968j60724k60004
31623b215457l33991l84780m12966m16038l89936l31975k42558j25504J1574J56764
31613d684867K95212M13417N04287N68944O13522O43355O58872O55681O27873
$$ y = [4189515, 3950091, 3753614, 3585603, 3430259, 3270311, 3085608, 2853264, 2550065, 2156251, 1660108, 1063084, 383691, -343142, -1073436, -1766242, -2394818, -2951020, -3441051, -3876089, -4264313, -4609240, -4914200, -5188276, -5448117, -5713273, -5997312, -6300139, -6606333, -6890600, -7127315, -7299956, -7407667, -7467527, -7511207, -7575281, -7687462, -7854267, -8055819, -8249941, -8383148, -8403735, -8272708, -7970525, -7499503, -6882403, -6157614, -5372178, -4575175, -3813579, -3130304, -2562204, -2136765, -1868740, -1758761, -1794729, -1955453, -2215457, -2549448, -2934228, -3347194, -3763232, -4153168, -4485143, -4727701, -4853205, -4841631, -4684867, -4389655, -3976238, -3471951, -2903007, -2289485, -1646130, -987258, -331577, 296296]
31604B96296N71973M89717L88992K82135J81597R4931K2656l9057r3238j38637
31594B057365j70395j83384j75422j48698j09292o5187k2992J5403N3747R8167
31584A349312J51369K08685K59108K90269K93269K64798K06819J25236K8335p4489
31574C102711j73173k57022l15970l43763l41053l15364k77377k36224j96926
31565F45839j61032j28953j02101q3554p7446q7678j16280j61674k17992k77126
31555g67997l33201l85825m38420m92379n42403n77651n87732n68495n23631m62407
31545e680141l96092l34766k84500k45011k09056j65115j02974j9283Q0519J85212
31535g171207K83656L69470M41802N02790N54482N97607O31859O55775O65407
$$ y = [296296, 868269, 1357986, 1746978, 2029113, 2210710, 2305641, 2328297, 2289240, 2196002, 2057365, 1886970, 1703586, 1528164, 1379466, 1270174, 1204987, 1181995, 1197398, 1251145, 1349312, 1500681, 1709366, 1968474, 2258743, 2552012, 2816810, 3023629, 3148865, 3177200, 3102711, 2929538, 2672516, 2356546, 2012783, 1671730, 1356366, 1078989, 842765, 645839, 484807, 355854, 253753, 170199, 92753, 5075, -111205, -272879, -490871, -767997, -1101198, -1487023, -1925443, -2417822, -2960225, -3537876, -4125608, -4694103, -5217734, -5680141, -6076233, -6410999, -6695499, -6940510, -7149566, -7314681, -7417655, -7436938, -7356419, -7171207, -6887551, -6518081, -6076279, -5573489, -5019007, -4421400, -3789541, -3133766, -2468359]
31526b468359O53406O11060N33268M23509K95033J67006N7578k2385p1768r6914
31516H1434j06222j04941r2884o5627j7690N3989J47037K51742L51694M27768
31506I26300M64038M52000L91133K87259J51449n0j47045k69305l52028l90260
31496A513491l90196l66389l35354l08364k87681k68716k45918k17530j86211
31487a092868j56346j30851j09336q8142o2191k7876J4406N9439R8313J20846
31477a374606J18506Q7308K9756m5191j24540j95123k47224k76823k86055k81590
31467b595582k70736k56666k36294k03285j54332r2976k7278L6210R5994J53801
31457c551144K10055K61645L03863L34017L52786L61728L59460L40828L00849
$$ y = [-2468359, -1814953, -1203893, -670625, -247116, 47917, 214923, 272501, 250116, 178348, 81434, -24788, -129729, -222613, -288240, -305930, -251941, -104904, 146838, 498532, 926300, 1390338, 1842338, 2233471, 2520730, 2672179, 2672129, 2525084, 2255779, 1903751, 1513491, 1123295, 756906, 421552, 113188, -174493, -443209, -689127, -906657, -1092868, -1249214, -1380065, -1489401, -1577543, -1639734, -1667610, -1653204, -1593765, -1495452, -1374606, -1256100, -1168792, -1139036, -1184227, -1308767, -1503890, -1751114, -2027937, -2313992, -2595582, -2866318, -3122984, -3359278, -3562563, -3716895, -3809871, -3837149, -3800939, -3704945, -3551144, -3341089, -3079444, -2775581, -2441564, -2088778, -1727050, -1367590, -1026762, -725913]
31448g25913K40404J68550R9318M5568J4062M006Q677J8857K6299K5652J4367
31437f0153q208m0952q0180j19272j49607j62405j50331j08407l4520O9753J97865
31426f46417L37622M72221N83372O55129O77170O46497N67420M49799L06305J50336
31416D199454m581j44869k58122l35887l76034l82841l64590l30292k87498k41741
$$ y = [-725913, -485509, -316959, -217641, -172073, -158011, -154005, -145328, -126471, -100172, -74520, -60153, -68361, -109313, -189493, -308765, -458372, -620777, -771108, -879515, -914035, -844282, -646417, -308795, 163426, 746798, 1401927, 2079097, 2725594, 3293014, 3742813, 4049118, 4199454, 4194873, 4050004, 3791882, 3455995, 3079961, 2697120, 2332530, 2002238, 1714740, 1472999]
$$ [...]
##END NTUPLES=NMR SPECTRUM
##END=
