##TITLE=31Pdec_DE-27sr1
 D2O
 24 sc
 13.2.2024
##JCAMPDX= 6.0         $$ Bruker NMR JCAMP-DX V2.0
##DATA TYPE= NMR SPECTRUM
##DATA CLASS= NTUPLES
##ORIGIN= UXNMR, Bruker Analytische Messtechnik GmbH
##OWNER= root
$$ XWIN-NMR		Version 3.5
$$ Tue Feb 13 14:15:02 2024 Russian Standard Time (UT+4h)  she@DPX200
##.OBSERVE FREQUENCY= 81.013821
##.OBSERVE NUCLEUS= ^31P
##.ACQUISITION MODE= SIMULTANEOUS
##.ACQUISITION SCHEME= undefined
##.AVERAGES= 24
##.DIGITISER RES= 16
##SPECTROMETER/DATA SYSTEM= spect
##.PULSE SEQUENCE= zgpg30
##.SOLVENT NAME= CDCl3
##.SHIFT REFERENCE= (INTERNAL, CDCl3, 0, 248.564)
##AUDIT TRAIL= $$ (NUMBER, WHEN, WHO, WHERE, WHAT)
$$ ##TITLE= Audit trail, XWIN-NMR		Version 3.5
$$ ##JCAMPDX= 5.01
$$ ##ORIGIN= Bruker BioSpin GmbH
$$ ##OWNER= she
$$ F:/spectra/data/she/nmr/P31/1/pdata/1/auditp.txt
$$ ##AUDIT TRAIL=  $$ (NUMBER, WHEN, WHO, WHERE, WHAT)
(   1,<2024-02-13 14:14:11.78 +0400>,<she>,<DPX200>,
      <created by zg, POWCHK disabled, PULCHK disabled
       configuration hash MD5:
       00 E9 B6 7A A2 85 ED C7 34 08 36 98 17 FE 4E 26
       data hash MD5: 32K
       C7 E8 DE 17 6A 76 30 A7 91 9C 76 CD AD A1 48 23>)
(   2,<2024-02-13 14:14:14.32 +0400>,<she>,<DPX200>,
      <Start of raw data processing
       efp BC_mod = 2 LB = 10 FT_mod = 6 PKNL = 1 PHC0 = -12907.96 PHC1 = 111.6835 SI = 64K 
       data hash MD5: 64K
       56 FA F7 B0 DD A1 B2 3A 31 19 6E 96 B5 5C 91 20>)
(   3,<2024-02-13 14:14:30.21 +0400>,<she>,<DPX200>,
      <pk PHC0 = -3.545689 PHC1 = 0 
       data hash MD5: 64K
       70 02 C5 A6 09 2B 13 32 C7 3F B2 8B DB D6 F0 30>)
(   4,<2024-02-13 14:14:36.03 +0400>,<she>,<DPX200>,
      <abs ABSG = 5 
       data hash MD5: 64K
       8E A7 07 E2 E1 97 95 0D 3A CE A5 05 74 AC 40 75>)
$$ ##END=
$$ 
$$ hash MD5
$$ 1D EC 5E 78 68 EE E7 47 48 AA D4 5D 0F 84 D6 EE
##$RELAX= 
##$RELAX= 
##$RELAX= 
##$RELAX= 
##$RELAX= 
##$RELAX= 
##$RELAX= 
##$RELAX= 
##$RELAX= 
$$ Bruker specific parameters
$$ --------------------------
##$DU= <F:/spectra>
##$EXPNO= 1
##$NAME= <P31>
##$PROCNO= 1
##$TYPE= <nmr>
##$USER= <she>
##$AMP= (0..31)
100 100 100 100 100 100 100 100 100 100 100 100 100 100 100 100 100 100 
100 100 100 100 100 100 100 100 100 100 100 100 100 100 
##$AQSEQ= 0
##$AQ_mod= 1
##$AUNM= <au_zg>
##$AUTOPOS= <>
##$BF1= 81.014009
##$BF2= 200.13
##$BF3= 200.13
##$BF4= 200.13
##$BF5= 200.13
##$BF6= 200.13
##$BF7= 200.13
##$BF8= 200.13
##$BYTORDA= 1
##$CFDGTYP= 0
##$CFRGTYP= 5
##$CHEMSTR= <none>
##$CNST= (0..31)
1 1 145 1 1 1 1 1 1 1 1 1 1 1 1 1 1 1 1 1 1 1 1 1 1 1 1 1 1 1 1 1 
##$CPDPRG= <waltz16>
##$CPDPRG1= <>
##$CPDPRG2= <waltz16>
##$CPDPRG3= <>
##$CPDPRG4= <mlev>
##$CPDPRG5= <mlev>
##$CPDPRG6= <mlev>
##$CPDPRG7= <mlev>
##$CPDPRG8= <mlev>
##$CPDPRGB= <>
##$CPDPRGT= <>
##$D= (0..31)
0 1 0 0 0 0 0 0 0 0 0 0.03 2e-05 3e-06 0 0 0 0 0 0 0 0 0 0 0 0 0 0 0 0 
0 0 
##$DATE= 1707819251
##$DBL= (0..7)
120 120 120 11 120 120 24 19 
##$DBP= (0..7)
150 150 150 150 150 150 150 150 
##$DBP07= 0
##$DBPNAM0= <>
##$DBPNAM1= <>
$$ [...]
##$SUBNAM3= <"">
##$SUBNAM4= <"">
##$SUBNAM5= <"">
##$SUBNAM6= <"">
##$SUBNAM7= <"">
##$SUBNAM8= <"">
##$SUBNAM9= <"">
##$SW= 501.771253377433
##$SWIBOX= (0..15)
0 1 3 0 0 0 0 0 0 0 0 0 0 0 0 0 
##$SW_h= 40650.406504065
##$TD= 32768
##$TD0= 1
##$TE= 0
##$TE2= 300
##$TE3= 300
##$TEG= 300
##$TL= (0..7)
0 120 53 12 22 120 120 120 
##$TP= (0..7)
150 150 150 150 150 150 150 150 
##$TP07= 0
##$TPNAME0= <>
##$TPNAME1= <>
##$TPNAME2= <>
##$TPNAME3= <>
##$TPNAME4= <>
##$TPNAME5= <>
##$TPNAME6= <>
##$TPNAME7= <>
##$TPOAL= (0..7)
0.5 0.5 0.5 0.5 0.5 0.5 0.5 0.5 
##$TPOFFS= (0..7)
0 0 0 0 0 0 0 0 
##$TUNHIN= 0
##$TUNHOUT= 0
##$TUNXOUT= 0
##$USERA1= <user>
##$USERA2= <user>
##$USERA3= <user>
##$USERA4= <user>
##$USERA5= <user>
##$V9= 5
##$VALIST= <valist>
##$VCLIST= <CCCCCCCCCCCCCCC>
##$VD= 0
##$VDLIST= <DDDDDDDDDDDDDDD>
##$VPLIST= <PPPPPPPPPPPPPPP>
##$VTLIST= <TTTTTTTTTTTTTTT>
##$WBST= 1024
##$WBSW= 4
##$XGAIN= (0..3)
0 0 0 0 
##$XL= 0
##$YL= 0
##$YMAX_a= 1679
##$YMIN_a= -1604
##$ZGOPTNS= <>
##$ZL1= 120
##$ZL2= 120
##$ZL3= 120
##$ZL4= 120
##$ABSF1= 248.5645
##$ABSF2= -253.2056
##$ABSG= 5
##$ABSL= 3
##$ALPHA= 0
##$AQORDER= 0
##$ASSFAC= 0
##$ASSFACI= 0
##$ASSFACX= 0
##$ASSWID= 0
##$AUNMP= <proc_1d>
##$AZFE= 0.1
##$AZFW= 0.5
##$BCFW= 0
##$BC_mod= 2
##$BYTORDP= 0
##$COROFFS= 0
##$CY= -3
##$DATMOD= 1
##$DC= 0
##$DFILT= <>
##$DTYPP= 0
##$F1P= 0
##$F2P= 0
##$FCOR= 1
##$FTSIZE= 65536
##$FT_mod= 6
##$GAMMA= 0
##$GB= 0
##$INTBC= 1
##$INTSCL= 6.047779e-11
##$ISEN= 30
##$LB= 10
##$LEV0= 0
##$LPBIN= 0
##$MAXI= 10000
##$MC2= 0
##$MEAN= 0
##$ME_mod= 0
##$MI= 50
##$NCOEF= 0
##$NC_proc= -10
##$NLEV= 6
##$NOISF1= 182.463
##$NOISF2= 159.3651
##$NSP= 0
##$NTH_PI= 0
##$NZP= 0
##$OFFSET= 248.5645
##$PC= 4
##$PHC0= -12911.51
##$PHC1= 111.6835
##$PH_mod= 1
##$PKNL= yes
##$PPARMOD= 0
##$PSCAL= 0
##$PSIGN= 0
##$REVERSE= no
##$SF= 81.0140089999694
##$SI= 65536
##$SIGF1= 159.3651
##$SIGF2= -187.1042
##$SINO= 113.3802
##$SIOLD= 16384
##$SREGLST= <1H.CDCl3>
##$SSB= 0
##$STSI= 65536
##$STSR= 0
##$SW_p= 40650.406504065
##$SYMM= 0
##$S_DEV= 0
##$TDeff= 32768
##$TDoff= 0
##$TI= <>
##$TILT= no
##$TM1= 0
##$TM2= 0
##$TOPLEV= 0
##$USERP1= <user>
##$USERP2= <user>
##$USERP3= <user>
##$USERP4= <user>
##$USERP5= <user>
##$WDW= 1
##$XDIM= 65536
##$YMAX_p= 263245360
##$YMIN_p= -265107482
$$ End of Bruker specific parameters
$$ ---------------------------------
##NTUPLES= NMR SPECTRUM
##VAR_NAME=  FREQUENCY,     SPECTRUM/REAL,   SPECTRUM/IMAG
##SYMBOL=    X,             R,               I
##VAR_TYPE=  INDEPENDENT,   DEPENDENT,       DEPENDENT
##VAR_FORM=  AFFN,          ASDF,            ASDF
##VAR_DIM=   65536,         65536,           65536
##UNITS=     HZ,            ARBITRARY UNITS, ARBITRARY UNITS
##FACTOR=    0.620285442955139, 1,           1
##FIRST=     20137.2065510682, 0,            0
##LAST=      -20513.1999529968, 0,           0
##MIN=       -20513.1999529968, -265107482,  0
##MAX=       20137.2065510682, 263245360,    0
$$ Real data points
##PAGE= N=1
##DATA TABLE= (X++(R..R)), XYDATA
$$ [...]
##PAGE= N=2
##DATA TABLE= (X++(I..I)), XYDATA
13153H61587j81034l0818J62294L57948N18163O17894O49039O17039N33532M10419
13143D516063K58609R0076q1129k41761l84339n09293o21266p21679q03287q51056
13133F50938q49047p89025o75863n27137l67127k18240r4429m59O3262R5455R4115
13122b617557O2707J6724j6370o090O7239K01058L68188N26009O33342O65741
13112i9009O20702N11826L58317J76687k3308k38961m70517p12805r47543j143853
13102a968464j268954j302019j241253j100586r00714o62007m03467j45808Q7224
13093h906048K73850M03838M84887N39035N89727O47565P03419P32757P08803
13084c822167O17239M63766K70084O2280j38866l19022m64896n59712n84830n26857
$$ y = [861587, 680553, 649735, 812029, 1169977, 1688140, 2306034, 2955073, 3572112, 4105644, 4516063, 4774672, 4864748, 4783619, 4541858, 4157519, 3648226, 3026960, 2305281, 1501994, 650938, -198109, -987134, -1662997, -2190134, -2557261, -2775501, -2869930, -2870389, -2807127, -2711672, -2617557, -2554850, -2538126, -2554496, -2560586, -2493347, -2292289, -1924101, -1398092, -764750, -99009, 521693, 1033519, 1391836, 1568523, 1545215, 1306254, 835737, 122932, -824611, -1968464, -3237418, -4539437, -5780690, -6881276, -7781990, -8443997, -8847464, -8993272, -8906048, -8632198, -8228360, -7743473, -7204438, -6614711, -5967146, -5263727, -4530970, -3822167, -3204928, -2741162, -2471078, -2408798, -2547664, -2866686, -3331582, -3891294, -4476124, -5002981]
13074e002981l85408j77018O6709L05710N00699O22961O62050O27478N41609M26895
13064a811296K96293J53767K583j47788k82188l85440m47140m63225m36121l74620
13054c895175k92149k02974j18970m9931n880L669k4347q0258j42480j87037j98936
13043e194468j77137j31690p8020l2639r784j7155n2049j01238j45500j66441
13033f106121j52351j01094j9208Q1670J87581K81598L42361L48153K88340J74279
13023d674792L8979p6655j42057j48428j08960n0247K45K5748K5569J1445k081
13012e101234o021Q37J4651L0124M3014N2251O1588P9475J16089J78665K67121
13001d263440L71994M76255N61312O14513O33425O24297N97079N61462N25542
$$ y = [-5002981, -5388389, -5565407, -5498698, -5192988, -4692289, -4069328, -3407278, -2779800, -2238191, -1811296, -1515003, -1361236, -1358653, -1506441, -1788629, -2174069, -2621209, -3084434, -3520555, -3895175, -4187324, -4390298, -4509268, -4559199, -4565079, -4561410, -4585757, -4666015, -4808495, -4995532, -5194468, -5371605, -5503295, -5581315, -5613954, -5623738, -5640893, -5692942, -5794180, -5939680, -6106121, -6258472, -6359566, -6378774, -6297104, -6109523, -5827925, -5485564, -5137411, -4849071, -4674792, -4635813, -4712468, -4854525, -5002953, -5111913, -5162160, -5161915, -5136167, -5110598, -5099153, -5101234, -5107255, -5106418, -5091767, -5061643, -5018629, -4966378, -4904790, -4825315, -4709226, -4530561, -4263440, -3891446, -3415191, -2853879, -2239366, -1605941, -981644, -384565, 176897, 702439]
12992G02439M94957M71102M50327M26374L94528L53136L01176K35961J55542O4371
12982D049913k4645r6107j42131j67015j81757j93340j98742j88938j58414j11140
12972B587684n8210j0853K3763M0730L3629n277p9905j84761l03278m10375m77774
12961A155373m82245m16156k94736j52346k7224N4991Q7295P5409K9295l8977
12951i321j11583j63846j71980j26987m4555L8256P9262N0088n3510k13069l95435
12940a122680n61774o75950p11870o57990n18011l09795o4107J79560L83239N23238
12930c536140N96332O14436N93353N45554M81037M11485L50739L09782K90585
12921F57163K84326K75882K51515K05023J39591O6073l4m1741m4589k262P8241
$$ y = [702439, 1197396, 1668498, 2118825, 2545199, 2939727, 3292863, 3594039, 3830000, 3985542, 4049913, 4025268, 3929161, 3787030, 3620015, 3438258, 3244918, 3046176, 2857238, 2698824, 2587684, 2529474, 2518621, 2542384, 2583114, 2616743, 2611466, 2531561, 2346800, 2043522, 1633147, 1155373, 673128, 256972, -37764, -190110, -217334, -162343, -75048, 361, 29656, -9321, -120904, -284750, -456730, -583717, -628272, -590016, -510754, -460666, -514176, -727245, -1122680, -1684454, -2360404, -3072274, -3730264, -4248275, -4558070, -4622177, -4442617, -4059378, -3536140, -2939808, -2325372, -1732019, -1186465, -705428, -293943, 56796, 366578, 657163, 941489, 1217371, 1468886, 1673909, 1813500, 1879573, 1879539, 1837798, 1793209, 1790947, 1869188]
12910A869188J76346K65329L24111L45582L36003L07586K70383K27541J73970
12901D296039R8119j2624j64430l51914n58846p63244r42633j077009j149807
12892f26349j147866j061556q87038o31530l18425J3504L19236N60181P12724
12883c067119P69166P34277O22172M54582K58296O0872j13159k43515l14652l19112
12873a158192k63423j70650p4170m336K3459J1631k6241p5151j24570j68720k04608
12862b234971k31438k51134k66751k77992k77654k53720j97096j09784p560Q4922
12852d023178J43881J55586J20022M8080m4033j38395k16371k60753k61441k21178
12842d697780j55156q3058j9216L1840P2766J08389J43157J80995K24142K69946
$$ y = [1869188, 2045534, 2310863, 2634974, 2980556, 3316559, 3624145, 3894528, 4122069, 4296039, 4394158, 4381534, 4217104, 3865190, 3306344, 2543100, 1600467, 523458, -626349, -1774215, -2835771, -3722809, -4354339, -4672764, -4659260, -4340024, -3779843, -3067119, -2297953, -1563676, -941504, -486922, -228626, -167754, -280913, -524428, -839080, -1158192, -1421615, -1592265, -1666435, -1670771, -1647312, -1635681, -1661922, -1737073, -1861643, -2030363, -2234971, -2466409, -2717543, -2984294, -3262286, -3539940, -3793660, -3990756, -4100540, -4108100, -4023178, -3879297, -3723711, -3603689, -3555609, -3599642, -3738037, -3954408, -4215161, -4476602, -4697780, -4852936, -4935994, -4955210, -4923370, -4850604, -4742215, -4599058, -4418063, -4193921, -3923975]
12832c923975L09130L29348L22746K91517K46813K02100J66325J41295J23417
12823a791284J07022Q6721N8647K1679k1329o3891r8792j21554j31059j26019
12813b079859j00256m1352O4794K25059M30426O52984Q51743R85936J029964R83160
12803C002599Q69953P30117O02850N11833M59138M30920M09619L82755L42618
12794G742402K80623J85029M6847j29753l21282m89156n93274o07776n31155l86933
12784E195572k16028o4520K8936M1907k9407j73334l67872n85297p97004r79450
12774B053503j118466j208101j245230j226504j151787j029855q78536p17344
12766f522320n58538m03797k48528r0493O2691J92297K75956L00740K73341K19336
$$ y = [-3923975, -3614845, -3285497, -2962751, -2671234, -2424421, -2222321, -2055996, -1914701, -1791284, -1684262, -1597541, -1538894, -1517215, -1538544, -1602435, -1701227, -1822781, -1953840, -2079859, -2180115, -2221467, -2156673, -1931614, -1501188, -848204, 3539, 989475, 2019439, 3002599, 3872552, 4602669, 5205519, 5717352, 6176490, 6607410, 7017029, 7399784, 7742402, 8023025, 8208054, 8254901, 8125148, 7803866, 7314710, 6721436, 6113660, 5582505, 5195572, 4979544, 4915024, 4943960, 4985867, 4956460, 4783126, 4415254, 3829957, 3032953, 2053503, 935037, -273064, -1518294, -2744798, -3896585, -4926440, -5804976, -6522320, -7080858, -7484655, -7733183, -7823676, -7760985, -7568688, -7292732, -6991992, -6718651, -6499315]
12756f499315J70984J51404J65268K00928K40819K72029K90400K97717K96935
12747d412831K90202K80047K70822K68480K79698L11954L73837M72641O07535
12738a257615P61344Q98087R71997R45702Q07048N73529K82447k4989l15009n63743
12728C078798p54462q75706r22844r00658q23222p10220n82253m57171l47123
12719c294861k55191j73505q6401K0836J52629K99331M40534N51385O07716N89703
12709a147824M86538L02116N7745k12027m69427o83634q36198r21164r42361r10045
12699e276281q37879p40737o33124n26903m27668l32224k31017j16007J1040J36406
12689h974394K40445L07636L34093L28480L07154K87116K79990K88400L05432
$$ y = [-6499315, -6328331, -6176927, -6011659, -5810731, -5569912, -5297883, -5007483, -4709766, -4412831, -4122629, -3842582, -3571760, -3303280, -3023582, -2711628, -2337791, -1865150, -1257615, -496271, 401816, 1373813, 2319515, 3126563, 3700092, 3982539, 3957550, 3642541, 3078798, 2324336, 1448630, 525786, -374872, -1198094, -1908314, -2490567, -2947738, -3294861, -3550052, -3723557, -3809958, -3789122, -3636493, -3337162, -2896628, -2345243, -1737527, -1147824, -661286, -359170, -301425, -513452, -982879, -1666513, -2502711, -3423875, -4366236, -5276281, -6114160, -6854897, -7488021, -8014924, -8442592, -8774816, -9005833, -9121840, -9110800, -8974394, -8733949, -8426313, -8092220, -7763740, -7456586, -7169470, -6889480, -6601080, -6295648]
12680f295648L17869L12137K79269K15735J21348j358j44815k94703m32477n40735
12670f463378o06699o22004n81519m84367l36678j52866M6634K40125M08951N39292
12660h012509O21978O52839O35045N81897N16184M63822M43977M61108N03309
12651c132350N46935N64486N33166M42727K99793J24936n7226k27479l72764m79048
12641a756824n26334m94113l74377j81731M7231K64767M26928N05497M92752L99265
12631a196939K48424P0295j05632k59168l85713m94569n99250p06599q11995r02321
12621e143467r63073r84839r65808r09592q20841p02746n58283l93046k16290
12612a1657985l9329J26937K73511L93500M81803N35315N53736N39993M99302
$$ y = [-6295648, -5977779, -5665642, -5386373, -5170638, -5049290, -5050648, -5195463, -5490166, -5922643, -6463378, -7070077, -7692081, -8273600, -8757967, -9094645, -9247511, -9200877, -8960752, -8551801, -8012509, -7390531, -6737692, -6102647, -5520750, -5004566, -4540744, -4096767, -3635659, -3132350, -2585415, -2020929, -1487763, -1045036, -745243, -620307, -677533, -905012, -1277776, -1756824, -2283158, -2777271, -3151648, -3333379, -3286148, -3021381, -2594453, -2088956, -1596204, -1196939, -948515, -878220, -983852, -1243020, -1628733, -2123302, -2722552, -3429151, -4241146, -5143467, -6106540, -7091379, -8057187, -8966779, -9787620, -10490366, -11048649, -11441695, -11657985, -11697314, -11570377, -11296866, -10903366, -10421563, -9886248, -9332512, -8792519, -8293217]
12603h293217M37769L62267K81173K03261J33900P2312J4093m2427r2813j30658
12593g054340j55956j79515k18147k83344l71771m64537n35498n62676n36002
12584a0361786m58595l42915k04982n9789Q0173K03838L00819L63022L87014L73848
12574i719353L26448K48482J47241L7479n9533j23518j45002j30774j01071p9514
12564i599115q1069j04818j35583j52664j39747r0992j2573P8605J58845K05356
12554i873755K06081J65848J03523M1673l612k6190k7016j0180J9078N5719R7507
12543i251324J47264K11657K96392M01646N21375O46145P65917Q69848R43680
12534d447400R68174R22254P91352N77225L03454J2756k43625m20611m92684m60932
$$ y = [-8293217, -7855448, -7493181, -7212008, -7008747, -6874847, -6802535, -6788442, -6830869, -6923682, -7054340, -7210296, -7389811, -7607958, -7891302, -8263073, -8727610, -9263108, -9825784, -10361786, -10820381, -11163296, -11368278, -11428067, -11347894, -11144056, -10843237, -10480215, -10093201, -9719353, -9392905, -9144423, -8997182, -8959703, -9019236, -9142754, -9287756, -9418530, -9519601, -9599115, -9680184, -9785002, -9920585, -10073249, -10212996, -10303988, -10316561, -10237956, -10079111, -9873755, -9667674, -9501826, -9398303, -9356630, -9360242, -9386432, -9413448, -9423628, -9404550, -9348831, -9251324, -9104060, -8892403, -8596011, -8194365, -7672990, -7026845, -6260928, -5391080, -4447400, -3479226, -2556972, -1765620, -1188395, -884941, -872185, -1115810, -1536421, -2029105, -2490037]
12524b490037l50642k00774n0800O8956J41150J61118J34745P5057k482q4605
12514b598314j63079k35545l05274l79814m67068n68553o73146p56790p90973
12505f938556p56167o51507m94236l10513j25128M3768J85076K93386L66816M03492
12495g983569L98580L46072K46048J11264l4241j64886k63846l25673l50824l38959
12485h360034k87866j98178p8074N7359J92128L15701M24517N17550N90246O33617
12475f193034O41613O21804N98721O03299O53292P38395Q21390Q55980Q11291
12466A52751O89237N24970L70128K68531K37588K63147L06783L19915K60165J06363
12456C499578j32478m18702o98765r22531j061077j115259j110974j084233j064824
$$ y = [-2490037, -2840679, -3041453, -3092253, -3023297, -2882147, -2721029, -2586284, -2511227, -2513709, -2598314, -2761393, -2996938, -3302212, -3682026, -4149094, -4717647, -5390793, -6147583, -6938556, -7694723, -8346230, -8840466, -9150979, -9276107, -9232339, -9047263, -8753877, -8387061, -7983569, -7584989, -7238917, -6992869, -6881605, -6915846, -7080732, -7344578, -7670251, -8021075, -8360034, -8647900, -8846078, -8924152, -8866793, -8674665, -8358964, -7934447, -7416897, -6826651, -6193034, -5551421, -4929617, -4330896, -3727597, -3074305, -2335910, -1514520, -658540, 152751, 841988, 1366958, 1737086, 2005617, 2243205, 2506352, 2813135, 3133050, 3393215, 3499578, 3367100, 2948398, 2249633, 1327102, 266025, -849234, -1960208, -3044441, -4109265]
12447d109265j066350j084233j098938j083021j011826q74481o78464m44660j97576
12438a1648814M1833K57703M37731N71692O51207O70594O28441N28981L82296
12429g478336K03429J1412j71739l23405m25276m69570m62575m21438l64043k97863
12419a0199404k15911j02747N4419K57320M94557P44620R81761J183379J336880
12410e465126J443098J514521J568449J616626J654694J657769J587588J409578
12402F987197J110402P06316K39549k34034o61056j005142j253858j414971j505547
12393B968856j541804j534809j491380j416871j317470j200761j073992r41196
12385g549427q02098o54734n00607l48978k16744j22310p5619p0811q7984j03915
$$ y = [-4109265, -5175615, -6259848, -7358786, -8441807, -9453633, -10328114, -11006578, -11451238, -11648814, -11606981, -11349278, -10911547, -10339855, -9688648, -9018054, -8389613, -7860632, -7478336, -7274907, -7263495, -7435234, -7758639, -8183915, -8653485, -9116060, -9537498, -9901541, -10199404, -10415315, -10518062, -10463643, -10206323, -9711766, -8967146, -7985385, -6802006, -5465126, -4022028, -2507507, -939058, 677568, 2332262, 3990031, 5577619, 6987197, 8097599, 8803915, 9043464, 8809430, 8148374, 7143232, 5889374, 4474403, 2968856, 1427052, -107757, -1599137, -3016008, -4333478, -5534239, -6608231, -7549427, -8351525, -9006259, -9506866, -9855844, -10072588, -10194898, -10270517, -10341328, -10429312, -10533227]
12375a0533227j03631q4125m9273k438N6504J28508K10751K94731L69272M26859
12365i286069M68560N03422N42353N90788O45250O95875P33234P55368P70664
12356c580555P94131Q38320R03429R72433J014966R99082R05234P34932N09629
12347D091601K61693K3869j76919l20484l92540l86017l04258j61970J8897K15594
12337B869466M07359N72845O86978P22762O57890M81862K00694j60887n60605
12328E878364r45032j260461j463541j527412j443904j225300r06429n43108k01642
12319c638465O0864K17418K80573K92737L02324L40540M11610M98525N76887O27826
12309b9161O44582O31929O00699N60911N16322M62515L89997K91372J67594K7419
$$ y = [-10533227, -10636858, -10720983, -10770256, -10772694, -10716190, -10587682, -10376931, -10082200, -9712928, -9286069, -8817509, -8314087, -7771734, -7180946, -6535696, -5839821, -5106587, -4351219, -3580555, -2786424, -1948104, -1044675, -72242, 942724, 1941806, 2847040, 3581972, 4091601, 4353294, 4377163, 4200244, 3879760, 3487220, 3101203, 2796945, 2634975, 2653872, 2869466, 3276825, 3849670, 4536648, 5259410, 5917300, 6399162, 6599856, 6438969, 5878364, 4933332, 3672871, 2209330, 681918, -761986, -1987286, -2893715, -3436823, -3638465, -3577601, -3360183, -3079610, -2786873, -2484549, -2144009, -1732399, -1233874, -656987, -29161, 615421, 1247350, 1848049, 2408960, 2925282, 3387797, 3777794, 4069166, 4236760, 4264179]
12299D264179j19455k67910m15199n54122o69971p44667p63520p18995o11140
12290f00800m47630k44800k7871J72360L27375M20705M54151M46268M24447M15838
12280A340043M40554N06319O03658P04402P67823P54649O43145M38601J70642
12271F369836j20029l97216o38418q35000r87593j101534j183566j238899j269095
12262a401514j272228j245008j184837j090381r61357p99036o08519m02069k00840
12253i165789l1948P9096J17092Q2946m703j11923j96604k20485j62846k9486
12243i644650J48235L24872M58471N26461N32269M99968M61129M41193M50404
12234e801648M81048N11679N17670M83469M09907L13708K21857J64137J64312
$$ y = [4264179, 4144724, 3876814, 3461615, 2907493, 2237522, 1492855, 729335, 10340, -600800, -1048430, -1293230, -1321101, -1148741, -821366, -400661, 53490, 499758, 924205, 1340043, 1780597, 2286916, 2890574, 3594976, 4362799, 5117448, 5760593, 6199194, 6369836, 6249807, 5852591, 5214173, 4379173, 3391580, 2290046, 1106480, -132419, -1401514, -2673742, -3918750, -5103587, -6193968, -7155325, -7954361, -8562880, -8964949, -9165789, -9197737, -9118641, -9001549, -8918603, -8923306, -9035229, -9231833, -9452318, -9615164, -9644650, -9496415, -9171543, -8713072, -8186611, -7654342, -7154374, -6693245, -6252052, -5801648, -5320600, -4808921, -4291251, -3807782, -3397875, -3084167, -2862310, -2698173, -2533861]
12225b533861K31262L55160N13203O81811Q46089J000266J140778J258576J335978
12216D829262J349892J280227J119619Q79309N87520K80763q010k58829m66818
12207I592935o35776p67822q57023q91585q61394p64136o06872m05321j82844
12198C620162L2722K16411L54666M48665N09547N49400N74368N82478N64740N08192
12188G961351M01659K44567N4756j31549k71305l33233l12382k31482j28666l9807
12178G213909J4675L3435K9186J9104J5776K3362M0708O7945J09396J68600K39257
12167G975353L01302L28155L01625K23969J18062J5279o0956j05565j30479j53871
12157H812874j88298k35982k93387l60030m43799n58611p16133r16702j144447
$$ y = [-2533861, -2302599, -1947439, -1434236, -752425, 93664, 1093930, 2234708, 3493284, 4829262, 6179154, 7459381, 8579000, 9458309, 10045829, 10326592, 10318582, 10059753, 9592935, 8957159, 8189337, 7332314, 6440729, 5579335, 4815199, 4208327, 3803006, 3620162, 3652884, 3869295, 4223961, 4672626, 5182173, 5731573, 6305941, 6888419, 7453159, 7961351, 8363010, 8607577, 8662333, 8530784, 8259479, 7926246, 7613864, 7382382, 7253716, 7213909, 7228584, 7262019, 7291205, 7310309, 7326085, 7349447, 7390155, 7458100, 7567496, 7736096, 7975353, 8276655, 8604810, 8906435, 9130404, 9248466, 9263745, 9202789, 9097224, 8966745, 8812874, 8624576, 8388594, 8095207, 7735177, 7291378, 6732767, 6016634, 5099932, 3955485]
12148C955485j369546j557239j679022j719638j676347j553346j357298j097157
12140h054108p86702m46433j03054K13822M77590O71947P96407Q66359R06088
12131e458084R37234R68756R94830J002594R84013R42197Q86916Q23865P47860
12122B830181O46449N11210L47845J77453K8328p5784j23598j16969o6233J5865
12112D174747J18705K35539L62068M92890O18360P24092P92912Q07730P55079
12103I082122O30089M42004K16171j1483k06572l48989m39401m97115n52015o34556
12093G680255p65775r48308j161617j365986j515989j576885j534732j395882
12085b584919j179321r08780o08942l05195k3573K11892L84071M87227N28272
$$ y = [3955485, 2585939, 1028700, -650322, -2369960, -4046307, -5599653, -6956951, -8054108, -8840810, -9287243, -9390297, -9176475, -8698885, -8026938, -7230531, -6364172, -5458084, -4520850, -3552094, -2557264, -1554670, -570657, 371540, 1258456, 2082321, 2830181, 3476630, 3987840, 4335685, 4513138, 4541466, 4465682, 4342084, 4225115, 4158882, 4174747, 4293452, 4528991, 4891059, 5383949, 6002309, 6726401, 7519313, 8327043, 9082122, 9712211, 10154215, 10370386, 10358903, 10152331, 9803342, 9363941, 8866826, 8314811, 7680255, 6914480, 5966172, 4804555, 3438569, 1922580, 345695, -1189037, -2584919, -3764240, -4673020, -5281962, -5587157, -5610730, -5398838, -5014767, -4527540, -3999268]
12076c999268N23732M92653M47566L88311L04402J86280L7295j23945k73236l94266
12066b410476m85185n53869o06115o35834o25399n57426m29960k63395r4042M0498
12056f621203J15051J24305Q2585J6129m9432r9621j33265j56693j76360j94746
12046g093250k09386k13381j97328j52596p4069L9203J84047L51969N27533O89183
12036f148075Q13673Q82031Q84162Q20539P01162N42478L63446J82186J4235j27682
12026a071845k33915k99302l25008l18380k89588k47194j96096j39047p9356k1844
12016c221575K8372O7860R6512J18857J44474J85841K52513L43460M42216N19554
12006a021916N44212M96917L80036K17351M4339j05336k10067k63609k72446k50615
$$ y = [-3999268, -3475536, -2982883, -2535317, -2147006, -1842604, -1656324, -1619029, -1742974, -2016210, -2410476, -2895661, -3449530, -4055645, -4691479, -5316878, -5874304, -6304264, -6567659, -6661701, -6621203, -6506152, -6381847, -6299262, -6283133, -6332565, -6432186, -6565451, -6722144, -6898504, -7093250, -7302636, -7516017, -7713345, -7865941, -7940010, -7900807, -7716760, -7364791, -6837258, -6148075, -5334402, -4452371, -3568209, -2747670, -2046508, -1504030, -1140584, -958398, -944163, -1071845, -1305760, -1605062, -1930070, -2248450, -2538038, -2785232, -2981328, -3120375, -3199731, -3221575, -3193203, -3125343, -3028831, -2909974, -2765500, -2579659, -2327146, -1983686, -1541470, -1021916, -477704, 19213, 399249, 616600, 660939, 555603, 345536, 81927, -190519, -441134]
11996d41134k14397j77664j49049j32453j30185j44918j77419k22339k67618k99428
11986b356604l08346k91194k48406j81340r2697J1851J24288K37554L48077M54620
11976b302197N54430O40211O99943P18925O83220N84876M28403K34766L8047j25701
11966B154923k32206k77545k76377k50553k15175j71837j13864l8328M6606J25500
11956G51144J85989K25635K49909K64491K69161K58138K26269J76162J20810Q0013
11946B807721P2993J10583J89603K92089L92060M67672N10215N22431N08767M68577
11936F342711L98993L02685J90830P7854k7220j26214k31038l57527n16814p08408
11926E345852r18118j120605j284233j377142j375365j271368j077783q22226
$$ y = [-441134, -655531, -833195, -982244, -1114697, -1244882, -1389800, -1567219, -1789558, -2057176, -2356604, -2664950, -2956144, -3204550, -3385890, -3478587, -3466736, -3342448, -3104894, -2756817, -2302197, -1747767, -1107556, -407613, 311312, 994532, 1579408, 2007811, 2242577, 2280624, 2154923, 1922717, 1645172, 1368795, 1118242, 903067, 731230, 617366, 579038, 625644, 751144, 937133, 1162768, 1412677, 1677168, 1946329, 2204467, 2430736, 2606898, 2727708, 2807721, 2880714, 2991297, 3180900, 3472989, 3865049, 4332721, 4842936, 5365367, 5874134, 6342711, 6741704, 7044389, 7235219, 7313073, 7285853, 7159639, 6928601, 6571074, 6054260, 5345852, 4427734, 3307129, 2022896, 645754, -729611, -2000979, -3078762, -3900988]
11918c900988n35889k43859L7664K98674N31757P29751Q83994R83114J014077
11909b01705R66766Q40483O48784M19335J87300j5864j72656k82117l52474l89321
11899A648531l88777l40853k39613r1791Q2064K53620L95686M89743N29870N22276
11889B860756M80941M21339L55636K91886K36472J96127J76228J76034J85342
11880E380761J86932J64814J13020L8562m3481j18507j77847k18305k39103k40953
11870D845893k28196k10474k00812k10756k45521l01135l64301m16060m39586
11861B229052m28850l91902l45428l04698k77151k63580k63016k74613k94833
11852f15019l14348l19972l01766k59926k05663j55701j25439j25650j61683k30976
$$ y = [-3900988, -4436877, -4680736, -4643072, -4344398, -3812641, -3082890, -2198896, -1215782, -201705, 765061, 1605544, 2254328, 2673663, 2860963, 2845099, 2672443, 2390326, 2037852, 1648531, 1259754, 918901, 679288, 587497, 669561, 923181, 1318867, 1808610, 2338480, 2860756, 3341697, 3763036, 4118672, 4410558, 4647030, 4843157, 5019385, 5195419, 5380761, 5567693, 5732507, 5845527, 5884089, 5840608, 5722101, 5544254, 5325949, 5086846, 4845893, 4617697, 4407223, 4206411, 3995655, 3750134, 3448999, 3084698, 2668638, 2229052, 1800202, 1408300, 1062872, 758174, 481023, 217443, -45573, -320186, -615019, -929367, -1249339, -1551105, -1811031, -2016694, -2172395, -2297834, -2423484, -2585167, -2816143]
11842b816143l18883l99271m44573m40311l92874l24682k61565k21582k10396
11833e830280k22635k46617k70137k84971k88170k80001k60664k28629j81854
11824h093958j20543m8376K9139J07162J81596K47227K97724L29262L43653L45676
11814f381438L35001K99689K18536P3157j36731l84808o23261p99886q77424q44393
11804i121558p13368n10953k66815o718K49938M90307P08176R03480J079334J236409
11794e951768J368214J461131J499304J470986J373464J215773J018530Q09968
11786D265602O18408M64013L53286K78543K22936J69128J07069L6277l7569j07434
11776F370259j67484k14256k48822k79077l17983l76078m52199n29540n81723
$$ y = [-2816143, -3135026, -3534297, -3978870, -4419181, -4812055, -5136737, -5398302, -5619884, -5830280, -6052915, -6299532, -6569669, -6854640, -7142810, -7422811, -7683475, -7912104, -8093958, -8214501, -8262877, -8233738, -8126576, -7944980, -7697753, -7400029, -7070767, -6727114, -6381438, -6046437, -5746748, -5528212, -5455055, -5591786, -5976594, -6599855, -7399741, -8277165, -9121558, -9834926, -10345879, -10612694, -10619412, -10369474, -9879167, -9170991, -8267511, -7188177, -5951768, -4583554, -3122423, -1623119, -152133, 1221331, 2437104, 3455634, 4265602, 4884010, 5348023, 5701309, 5979852, 6202788, 6371916, 6478985, 6515262, 6477693, 6370259, 6202775, 5988519, 5739697, 5460620, 5142637, 4766559, 4314360, 3784820, 3203097]
11767C203097n86768n41032m64207l91593l57952l82308m61846n76933p02644
11758a262186q19189r16083r89770j038036j054824j028043r42314p86638n63183
11749i400266k90594J419K82632N30747P33890Q88850R98327J067993J102635
11740d084367J102388J062052R75033Q39432O61787M56339K41445L5784j45280
11731A144613k93272m08121m94596n54686n82021n63944m89877l59345j84278
11722b785527J4382K12872L91152N38027O52421P39266Q02534Q41258Q52573Q39242
11712C098200Q14549P99387Q13038Q63816R45185J038357J118441J160604J145164
11703A1796741J062370R16244P23618N05909K78056M3911j97923m44697o86303
$$ y = [3203097, 2616329, 2075297, 1611090, 1219497, 861545, 479237, 17391, -559542, -1262186, -2081375, -2997458, -3987228, -5025264, -6080088, -7108131, -8050445, -8837083, -9400266, -9690860, -9689441, -9406809, -8876062, -8142172, -7253322, -6254995, -5187002, -4084367, -2981979, -1919927, -944894, -105462, 556325, 1012664, 1254109, 1289893, 1144613, 851341, 443220, -51376, -606062, -1188083, -1752027, -2241904, -2601249, -2785527, -2771145, -2558273, -2167121, -1629094, -976673, -237407, 565127, 1406385, 2258958, 3098200, 3912749, 4712136, 5525174, 6388990, 7334175, 8372532, 9490973, 10651577, 11796741, 12859111, 13775355, 14498973, 15004882, 15282938, 15326849, 15128926, 14684229, 13997926]
11694A3997926r09256j100607j247546j336617j357316j307682j196103j038269
11686D504530q53513o62992m87376l41427k27639j34566m3221O1370J81072L04017
11676B300255M11407M85090N11140M81158L94773K62142J01600o8004k33944l89259
11666D256358n27283o38822p16185p59319p75882p73292p50423o98151o08945
11657a991944m86120l44156k01566p4229K6814R6185J36717J61093J87852K32051
11647b257303K96406L68770M27461M52111M35260L88797L40360L20070L44836
11638A116768M09723M91206N58628N85604N55389M60664L02191Q9469j57712m10549
11628D001381o37095q10271r13309r40290q93987p84700o30344m54822k82785
$$ y = [13997926, 13088670, 11988063, 10740517, 9403900, 8046584, 6738902, 5542799, 4504530, 3651017, 2988025, 2500649, 2159222, 1931583, 1797017, 1753796, 1815166, 1996238, 2300255, 2711662, 3196752, 3707892, 4189050, 4583823, 4845965, 4947565, 4879561, 4645617, 4256358, 3729075, 3090253, 2374068, 1614749, 838867, 65575, -684848, -1382999, -1991944, -2478064, -2822220, -3023786, -3098015, -3071201, -2975016, -2838299, -2677206, -2489354, -2257303, -1960897, -1592127, -1164666, -712555, -277295, 111502, 451862, 771932, 1116768, 1526491, 2017697, 2576325, 3161929, 3717318, 4177982, 4480173, 4569642, 4411930, 4001381, 3364286, 2554015, 1640706, 700416, -193571, -978271, -1608615, -2063437, -2346222]
11619b346222j33119j5243P0119J26972J59096J66529J45940R5222J8572p3142
11609a785276j67649k57380l41100m20154m93046n52752n89155n95615n75431
11600e777558n42721n15994n08546n22583n50331n79816o00492o05825n92762
11591a0796628n59747n05282m28553l32179k24884j21139l6709J7245L7476K7610
11581a2922790m955n0934r8816j34325j42027j09878l5281P0945J86587K86678
11571a2954796L53583L81128L70402L22639K36745J13472l8491k00642l48959
11562a1764919m61307n23341n30257m85288l97139k77351j37392J3516J67749
11553a4395729L15903M44397N37430N82596N76482N27628M55582L84669L33092
$$ y = [-2346222, -2479341, -2494584, -2424465, -2297493, -2138397, -1971868, -1825928, -1730706, -1712134, -1785276, -1952925, -2210305, -2551405, -2971559, -3464605, -4017357, -4606512, -5202127, -5777558, -6320279, -6836273, -7344819, -7867402, -8417733, -8997549, -9598041, -10203866, -10796628, -11356375, -11861657, -12290210, -12622389, -12847273, -12968412, -13005121, -12987876, -12950400, -12922790, -12927745, -12978679, -13077495, -13211820, -13353847, -13463725, -13499006, -13428061, -13241474, -12954796, -12601213, -12220085, -11849683, -11527044, -11290299, -11176827, -11215318, -11415960, -11764919, -12226226, -12749567, -13279824, -13765112, -14162251, -14439602, -14576994, -14563478, -14395729, -14079826, -13635429, -13097999, -12515403, -11938921, -11411293, -10955711, -10571042, -10237950]
11544a0237950L03501K83319K55872K12857J57611R8488M1010j3877o6070j12733
11534i077972j48906j71580j83005j89018j92776j89897j71113j30973p3905j1508
11524a0540653M5603R3426J34726J77355K33580L17886M39867N94212P54796Q78710
11514f870492R19798Q45479O48964L52128n63l53474o53098q60755r61108r62327
11504g895448q87235p61016o03354m28043k46543p0247R0156K26235L31918M01923
11494i841654M30024M08943L32677K00740K2738j78992l70992n15903n83859n63413
11484a0659691m66452l24145j75520n3424K6544O9764R7224J33568J94527K80126
11474a0877479L75956M59910N09821N09592M53833L50619K19773Q5237l4900j33182
$$ y = [-10237950, -9934449, -9651130, -9395258, -9182401, -9024790, -8926302, -8885292, -8899169, -8965239, -9077972, -9226878, -9398458, -9581463, -9770481, -9963257, -10153154, -10324267, -10455240, -10529145, -10540653, -10495050, -10401624, -10266898, -10089543, -9855963, -9538077, -9098210, -8503998, -7749202, -6870492, -5950694, -5105215, -4456251, -4104123, -4104686, -4458160, -5111258, -5972013, -6933121, -7895448, -8782683, -9543699, -10147053, -10575096, -10821639, -10891886, -10801730, -10575495, -10243577, -9841654, -9411630, -9002687, -8670010, -8469270, -8446532, -8625524, -8996516, -9512419, -10096278, -10659691, -11126143, -11450288, -11625808, -11679232, -11652688, -11582924, -11485700, -11352132, -11157605, -10877479, -10501523, -10041613, -9531792, -9022200, -8568367, -8217748, -7997975, -7912738, -7947638, -8080820]
11464h080820k08590k57979k72019k39245j53378j6938J60052L62295N69484P56735
11454g380403Q98415R74378R74435Q98614P55100N58834L31108R8570j09422k65013
11444b265384l47586l50299k84653j79332p2157K108K3632n193o0503j07178j14682
11433c761227p0254J7658J25988K28118L03206L40549L39218L05808K53360K01394
11423a716182J73289J88671K54701L63406M97595O40429P81819R19024J053473
11414C156225J186610J316490J435947J532627J590953J595693J536128J408514
11406A4759187J214853R59391O47433K89940q9122m50541p48308r45721j029209
11397A4607903j011665r25265q10125p03896o32733o03654o02381o01441n76610
$$ y = [-8080820, -8289410, -8547389, -8819408, -9058653, -9212031, -9228969, -9068917, -8706622, -8137138, -7380403, -6481988, -5507610, -4533175, -3634561, -2879461, -2320627, -1989519, -1890949, -2000371, -2265384, -2612970, -2963269, -3247922, -3427254, -3499411, -3497303, -3473671, -3478864, -3539367, -3646545, -3761227, -3831481, -3813823, -3687835, -3459717, -3156511, -2815962, -2476744, -2170936, -1917576, -1716182, -1542893, -1354222, -1099521, -736115, -238520, 401909, 1183728, 2102752, 3156225, 4342835, 5659325, 7095272, 8627899, 10218852, 11814545, 13350673, 14759187, 15974040, 16933431, 17580864, 17870804, 17781682, 17331141, 16582833, 15637112, 14607903, 13596238, 12670973, 11860848, 11156952, 10524219, 9920565, 9318184, 8716743, 8140133]
11388H140133n21563m49940l82933l31799k88979k34887j54310m8336O6473J66977
11378E960836K29889K32719J55368j2843k64714n72890q96007j189341j415111
11369B227906j549783j586892j534683j409945j231620j017639p85944n57069
11361g445669l53657j94468q5895j7852L1739Q5507J53921K27876K81921K88862
11351g027715K37933J43716L9109m1474p6825o5245k3444K0148L7064J1909n0513
11340f795337j28971j97600k37777k43411k18261j69272j02034k1870O1940J34628
11330g917965J80191J88797J62345J14563O5442L3236K9218N8073J21105K16876
11320f748119L38049M68828N86944O69315O98415O67508N83287M63264L27621
$$ y = [8140133, 7618570, 7168630, 6785697, 6453898, 6164919, 5930032, 5775722, 5727386, 5793859, 5960836, 6190725, 6423444, 6578812, 6565969, 6301255, 5728365, 4832358, 3643017, 2227906, 678123, -908769, -2443452, -3853397, -5085017, -6102656, -6888600, -7445669, -7799326, -7993794, -8079689, -8097541, -8065802, -7980295, -7826374, -7598498, -7316577, -7027715, -6789782, -6646066, -6606957, -6648431, -6725256, -6790501, -6813945, -6793797, -6756733, -6744824, -6795337, -6924308, -7121908, -7359685, -7603096, -7821357, -7990629, -8092663, -8114533, -8052593, -7917965, -7737774, -7548977, -7386632, -7272069, -7206627, -7173391, -7144173, -7086100, -6964995, -6748119, -6410070, -5941242, -5354298, -4684983, -3986568, -3319060, -2735773, -2272509, -1944888]
11311a944888J90320N5594p8918k15935l52525m75947n63811n91576n45626m33518
11301d956830k82990j29610j510Q9528J47478J85042K15054K43789K68066K77251
11291c944732K59707K10857J38478O2020N849j0750J7443P7673J42628J80454
11281b860373J67698R9875n128j13208j87829k05187j63470q2526M485O3050O8634
11270c213979J3900r0761k23199l58015m72565n48691n72606n36387m42120l06492
11260f750915j61597m8347l022m3267j61806l31246n15603o80962q01291q60455
11250a0358511q52854p83284o65442n19121l66536k27701j14833k7612M7235J29730
11240a3738929K35820L67819N11951O44196P40513P85857P78913P32353O68825
$$ y = [-1944888, -1754568, -1698974, -1777892, -1993827, -2346352, -2822299, -3386110, -3977686, -4523312, -4956830, -5239820, -5369430, -5370940, -5281412, -5133934, -4948892, -4733838, -4490049, -4221983, -3944732, -3685025, -3474168, -3335690, -3273670, -3267821, -3278571, -3261128, -3183455, -3040827, -2860373, -2692675, -2592800, -2597928, -2711136, -2898965, -3104152, -3267622, -3350148, -3345663, -3282613, -3213979, -3200079, -3290840, -3514039, -3872054, -4344619, -4893310, -5465916, -6002303, -6444423, -6750915, -6912512, -6960859, -6963881, -7007148, -7168954, -7500200, -8015803, -8696765, -9498056, -10358511, -11211365, -11994649, -12660091, -13179212, -13545748, -13773449, -13888282, -13915894, -13868659, -13738929, -13503109, -13135290, -12623339, -11979143, -11238630, -10452773, -9673860, -8941507, -8272682]
11231h272682O12456N77975N63180N50273N15474M40131L16905J50494m3474k39661
11221d828929m06175n11909n36908m81317l67600k32804j12936k7664K4675N9197
11211g422370R1703J32340J88213K66866L72662M98431O22552P17356P63668P60728
11201c007851P24747O77795O33981N91002N32129M37730K98849J23784o5835k45151
11191G01180l94934n04909n72106n97337n82927n32904m54475l58434k57405j63242
11181c717493q5481l1402o607j4708n5052j19259j89713k43288k59227k25602
11171d947832j40392r392J54419L29968M89484O03768O48368O08110M80549K78604
11161a504346K9460k32016m72186o65060p95107q58337q61443q17229p38009o32340
$$ y = [-8272682, -7660226, -7082251, -6519071, -5968798, -5453324, -5013193, -4696288, -4545794, -4589268, -4828929, -5235104, -5747013, -6283921, -6765238, -7132838, -7365642, -7478578, -7506242, -7481567, -7422370, -7330667, -7198327, -7010114, -6743248, -6370586, -5872155, -5249603, -4532247, -3768579, -3007851, -2283104, -1605309, -971328, -380326, 151803, 589533, 888382, 1012166, 946331, 701180, 306246, -198663, -770769, -1368106, -1951033, -2483937, -2938412, -3296846, -3554251, -3717493, -3802974, -3834376, -3840983, -3855691, -3910743, -4030002, -4219715, -4463003, -4722230, -4947832, -5088224, -5097616, -4943197, -4613229, -4123745, -3519977, -2871609, -2263499, -1782950, -1504346, -1474886, -1706902, -2179088, -2844148, -3639255, -4497592, -5359035, -6176264, -6914273, -7546613]
11151g546613n07346l72108k36694j07681J4306J32095K47218L56621M51693N18846
11141g049663N41961N07578M11382K62517Q3308r5266k40652l27343l45731l07595
11131f559504k42698j84426j51100j35918j14279o3444K1104J24557K24448L02903
11121f778357L50822L65746L49289L06282K43581J67440Q1478j2619j12118k10537
11111e248993k97422l61057l92637l89453l55129k96737k20072j25764r339J33176
11101g563427K96671M61603N96666O68571O53282N43442L50116R9303j75275m40346
11091d509394o68754q40717r41981r62214q96135p47310n32109k80702l3169J69065
11081a0243420K94301L30491K89383K01608J04489K9655k793J6674Q9176K06675
$$ y = [-7546613, -8053959, -8426067, -8662761, -8770442, -8756136, -8624041, -8376823, -8020202, -7568509, -7049663, -6507702, -6000124, -5588742, -5326225, -5242917, -5338183, -5578835, -5906178, -6251909, -6559504, -6802202, -6986628, -7137728, -7273646, -7387925, -7451369, -7430265, -7305708, -7081260, -6778357, -6427535, -6061789, -5712500, -5406218, -5162637, -4995197, -4913719, -4926338, -5038456, -5248993, -5546415, -5907472, -6300109, -6689562, -7044691, -7341428, -7561500, -7687264, -7696603, -7563427, -7266756, -6805153, -6208487, -5539916, -4886634, -4343192, -3993076, -3893773, -4069048, -4509394, -5178148, -6018865, -6960846, -7923060, -8819195, -9566505, -10098614, -10379316, -10412485, -10243420, -9949119, -9618628, -9329245, -9127637, -9023148, -8993493, -8996286, -8979612, -8890436, -8683761]
11071h683761L50047M90694N97652O47512O31765N57028M37729K86386J09514
11062d575434q7126k89185m70454o01272o63692o61815o19167n65110n20090m88797
11052i542142m63052m29742l77685l00286j94575n9791J01776K82330M68521O46301
11042i868345Q07530R51790J080751J189375J261071J270676J194143J020342
11034a092667P59240M42191J14057j79421m04123n45606o09355o13034n75887
11025b704605n12604m33732l47408k57801j63183n9696M9840J50473K19646K38960
11015c820110K04390J28276L2987n8732j30505j72810j78966j41989n6512P4728
11005d119243K34567L90815N03958N40616M85700L46384J46570q3230l14109n22255
$$ y = [-8683761, -8333714, -7843020, -7245368, -6597856, -5966091, -5409063, -4971334, -4684948, -4575434, -4662560, -4951745, -5422199, -6023471, -6687163, -7348978, -7968145, -8533255, -9053345, -9542142, -10005194, -10434936, -10812621, -11112907, -11307482, -11367273, -11265497, -10983167, -10514646, -9868345, -9060815, -8109025, -7028274, -5838899, -4577828, -3307152, -2113009, -1092667, -333427, 108764, 222821, 43400, -360723, -906329, -1515684, -2128718, -2704605, -3217209, -3650941, -3998349, -4256150, -4419333, -4479029, -4429189, -4278716, -4059070, -3820110, -3615720, -3487444, -3454457, -3513189, -3643694, -3816504, -3995470, -4137459, -4193971, -4119243, -3884676, -3493861, -2989903, -2449287, -1963587, -1617203, -1470633, -1553863, -1867972, -2390227]
10995b390227o89383q02894q56863q52465p95946o94241n51548l70793j60255
10986h164615N9822K57204L96485M52274M18784L10324J53376k3808j97555l49045
10976f686754m61728n20579n14685m40670l03923j17562R8525L17207N04253O22314
10966g503602O39420N39184L28602M0566k70376n39472p08529p43024o42958m42676
10956i302865j99130K7440J93029K81872L06839L00162L00105L38418M30971N73409
10946f749750P43868R12332J051862J145421J185662J170355J098054R66604P74107
10937B298515N20815K11011j45043n29068r13872j265895j552180j749240j848435
10928d973392j854655j780226j639410j446592j216654r64731p05061m50839k15491
$$ y = [-2390227, -3079610, -3882504, -4739367, -5591832, -6387778, -7082019, -7633567, -8004360, -8164615, -8104793, -7847589, -7451104, -6998830, -6580046, -6269722, -6116346, -6140154, -6337709, -6686754, -7148482, -7669061, -8183746, -8624416, -8928339, -9045901, -8947376, -8630169, -8125916, -7503602, -6864182, -6324998, -5996396, -5955830, -6226206, -6765678, -7474207, -8217231, -8860189, -9302865, -9501995, -9474555, -9281526, -8999654, -8692815, -8392653, -8092548, -7754130, -7323159, -6749750, -6005882, -5093550, -4041688, -2896267, -1710605, -540250, 557804, 1524408, 2298515, 2819330, 3030341, 2885298, 2356230, 1442358, 176463, -1375717, -3124957, -4973392, -6828047, -8608273, -10247683, -11694275, -12910929, -13875660, -14580721, -15031560, -15247051]
10919a5247051j3518J40691K35502K64811K30931J47532M0274n8415j20557j34285
10909a4514085j08185o4968k8432j1823j3619k1164j8231Q280O4771J49752K53285
10898a4304419L57236M38832M78569M68823M16774L39345K54884J78130J19944
10889a1251882Q8232Q7435J17733J75494K53809L41646M23269M81385N04359M92842
10879h285678M60088M24495L98842L83636L69051L43517L02107K48535J89861
10870e165546J28214N5616m3898j84770l67778n72980p63525q99358r52933r17959
10860i684917q07721o46646m61346k74697j02842M5512J67432K62230L27975L59482
10850a0815538L47754K81444J52394l5082k57331m74444o43759p35862p43847
$$ y = [-15247051, -15260569, -15119878, -14884376, -14619565, -14388634, -14241102, -14200828, -14259243, -14379800, -14514085, -14622270, -14687238, -14715670, -14727493, -14741112, -14762276, -14780507, -14772227, -14707456, -14557704, -14304419, -13947183, -13508351, -13029782, -12560959, -12144185, -11804840, -11549956, -11371826, -11251882, -11163650, -11076215, -10958482, -10782988, -10529179, -10187533, -9764264, -9282879, -8778520, -8285678, -7825590, -7401095, -7002253, -6618617, -6249566, -5906049, -5603942, -5355407, -5165546, -5037332, -4981716, -5025614, -5210384, -5578162, -6151142, -6914667, -7814025, -8766958, -9684917, -10492638, -11139284, -11600630, -11875327, -11978169, -11932657, -11765225, -11502995, -11175020, -10815538, -10467784, -10186340, -10033946, -10069028, -10326359, -10800803, -11444562, -12180424, -12924271]
10841a2924271o82393n79074m62952l55961k70348k10503j74777j55843j42893
10832a5959015j27485j08800r2796q5705q7668r0977q3152n2819M417Q3998J76485
10821a6423517K74458L76215M84115O01422P31724Q80113J052546J252145J474123
10812i296656J701861J906076K049167K095627K025544J844172J580448J273684
10804E179923R56465O45272L43965N4257k17539m62112o72543q46474r83148j078750
10794B919316j124293j108271j024001q78661o98023n20995l83991l03436k68039
10785c390394k46669k06467j28993j5052J21400K62364L90873M91489N50928N62600
10775a607921N32995M83331M41765M29204M48249M83125N09870N08609M69887
$$ y = [-12924271, -13606664, -14185738, -14648690, -15004651, -15274999, -15485502, -15660279, -15816122, -15959015, -16086500, -16195300, -16288096, -16373801, -16461469, -16552446, -16635598, -16688417, -16684000, -16600002, -16423517, -16149059, -15772844, -15288729, -14687307, -13955583, -13075470, -12022924, -10770779, -9296656, -7594795, -5688719, -3639552, -1543925, 481619, 2325791, 3906239, 5179923, 6136388, 6781660, 7125625, 7179882, 6962343, 6500231, 5827688, 4981214, 3998066, 2919316, 1795023, 686752, -337249, -1215910, -1913933, -2434928, -2818919, -3122355, -3390394, -3637063, -3843530, -3972523, -3987575, -3866175, -3603811, -3212938, -2721449, -2170521, -1607921, -1074926, -591595, -149830, 279374, 727623, 1210748, 1720618, 2229227, 2699114]
10766B699114L93193K81417J36420m1400k49896m80925p18004r37660j114361
10757c2102j227054j264289j225868j121419r67868p86849o01497m32214k92908
10748g952068j89710j22797q9894q9096j18920j75650k50894l32792m10732m79401
10738a0211954n38565n89259o29779o54095o53696o22383n61419m80765l94792
10729a5336707l15793k50158j98565j58617j28096j07373r8484j00617j06621
10720a6801031j05933r2408o9108m5292k9592k6401l7175o2708j03190j57106
10710a7529944k21407k92679l66777m35895m85934m97846m53049l39309j54386
10701b0777226R2253L79579O78891R61420J204684J393145J515659J566250J549171
$$ y = [2699114, 3092307, 3373724, 3510144, 3468744, 3218848, 2737923, 2019919, 1082259, -32102, -1259156, -2523445, -3749313, -4870732, -5838600, -6625449, -7226946, -7659160, -7952068, -8141778, -8264575, -8354469, -8443565, -8562485, -8738135, -8989029, -9321821, -9732553, -10211954, -10750519, -11339778, -11969557, -12623652, -13277348, -13899731, -14461150, -14941915, -15336707, -15652500, -15902658, -16101223, -16259840, -16387936, -16495309, -16593793, -16694410, -16801031, -16906964, -16999372, -17068480, -17113772, -17143364, -17169765, -17206940, -17269648, -17372838, -17529944, -17751351, -18044030, -18410807, -18846702, -19332636, -19830482, -20283531, -20622840, -20777226, -20684973, -20305394, -19626503, -18665083, -17460399, -16067254, -14551595, -12985345, -11436174]
10692a1436174J481737J389443J295480J211503J134662J051533R46366Q08835
10684b116615O37581M39439K27483J9399j65194l09620m05581m56381m76539m87480
10674c093508n10247n58301o34003p29181q27146r04897r37634r06680q07611
10665i909208o53505m71406k93933j49946n7887k3567m1140r5430j66130k34986
10655a2097138k92795l39985l79687m10385m25471m18540l87715l35561k66590
10646a5353867j85257r4869K542J04849K07143K99476L67026L93634L67866K88595
10636a3602862J65984J6506j44719l09285m76476o50682q35959j028158j207672
10627a8073323j339212j382972j313598j135816q86135o19150l86973k22525j32224
$$ y = [-11436174, -9954437, -8564994, -7269514, -6058011, -4923349, -3871816, -2925450, -2116615, -1479034, -1039595, -812112, -792713, -957907, -1267527, -1673108, -2129489, -2606028, -3093508, -3603755, -4162056, -4796059, -5525240, -6352386, -7257283, -8194917, -9101597, -9909208, -10562713, -11034119, -11328052, -11477998, -11535885, -11559452, -11600592, -11696022, -11862152, -12097138, -12389933, -12729918, -13109605, -13519990, -13945461, -14364001, -14751716, -15087277, -15353867, -15539124, -15633993, -15631451, -15526602, -15319459, -15019983, -14652957, -14259323, -13891457, -13602862, -13436878, -13420372, -13565091, -13874376, -14350852, -15001534, -15837493, -16865651, -18073323, -19412535, -20795507, -22109105, -23244921, -24131056, -24750206, -25137179, -25359704, -25491928]
10618b5491928r7753q4906n6718J4274J39977L17733N33853P65563R82004J148040
10608b1829861J232860J221007J119853R57235P68900N83561M15308K65807J30725
10599a5134605N244j11910k16020k98021l50520l73188l72554l57503l35366l10757
10589a7855200k86275k64267k49384k49512k72591l20594l85562m51676n02719
10580b0837780n30158n36170n29563n18631n07643m99434m99951n19252n67314
10571b5545896o46763p46235q38894q88997q63992p45028n30964k37021J08630
10562c0935160M69778Q08693J092488J297257J409958J428408J358756J211020
10554b1858802R95832P24510M11080P4397k60013n59905p91461r29776r68720
$$ y = [-25491928, -25589681, -25674587, -25731305, -25717031, -25577054, -25259321, -24725468, -23959905, -22977901, -21829861, -20597001, -19375994, -18256141, -17298906, -16530006, -15946445, -15531137, -15265330, -15134605, -15129361, -15241271, -15457291, -15755312, -16105832, -16479020, -16851574, -17209077, -17544443, -17855200, -18141475, -18405742, -18655126, -18904638, -19177229, -19497823, -19883385, -20335061, -20837780, -21367938, -21904108, -22433671, -22952302, -23459945, -23959379, -24459330, -24978582, -25545896, -26192659, -26938894, -27777788, -28666785, -29530777, -30275805, -30806769, -31043790, -30935160, -30465382, -29656689, -28564201, -27266944, -25856986, -24428578, -23069822, -21858802, -20862970, -20138460, -19727380, -19652983, -19912996, -20472901, -21264362, -22194138, -23162858]
10545b3162858r23434q24593p08508o07911n47044n41669n99882p19182q82534
10536b9517615j061938j231242j378116j504708j618257j720963j805717j858464
10528d1697020j864961j818009j721480j591843j460140j371249j372745j495047
10520e4392494j737482k070725k449561k824339l149989l397019l561427l665762
10512g7248798l750075l858151m023788m262056m571761m947858n391425n907876
10504a13961788o499255p161119p885122q664145r500840j0415729j1441242j2596662
10496a88125902j3859272j5145319j6293132j7039043j6999081j5679282j2535451
10489b95676482p121106O43104J0163591K0083582K8631725L4309550L6485410
$$ y = [-23162858, -24086292, -24910885, -25619393, -26227304, -26774348, -27316017, -27915899, -28635081, -29517615, -30579553, -31810795, -33188911, -34693619, -36311876, -38032839, -39838556, -41697020, -43561981, -45379990, -47101470, -48693313, -50153453, -51524702, -52897447, -54392494, -56129976, -58200701, -60650262, -63474601, -66624590, -70021609, -73583036, -77248798, -80998873, -84857024, -88880812, -93142868, -97714629, -102662487, -108053912, -113961788, -120461043, -127622162, -135507284, -144171429, -153672269, -164087998, -175529240, -188125902, -201985174, -217130493, -233423625, -250462668, -267461749, -283141031, -295676482, -302797588, -302154484, -291990893, -271907311, -243275586, -208966036, -172480626]
10482a72480626L5503864L2317606K7984768K3345496J8936028J5031917J1725857
10475g635090R006548O820598N103340L787379K807696K105470J623894J302260
10467B4922095J080158R08812P57412O11612M69458L36110K16576J11186J7568
10458B9430987o5983j41616k14003k87818l64213m42593n25214o17272p22192
10449B6050083q37869r55886j061859j137223j164215j132155j040889r00294
10441A7819693p27334n41626l61493k03698q6158k7451l9642j19891k48344l93160
10431A5070896n18830n95469o07522n57466m61429l39977k10355q2899L8591J52278
10421A1887818K51159L19495L37499K90718J76025J406k16421m52813o75539q48108
$$ y = [-172480626, -136976762, -104659156, -76674388, -53328892, -34392864, -19360947, -7635090, 1371458, 8192056, 13295396, 17082775, 19890471, 21995941, 23619835, 24922095, 26002253, 26911065, 27668477, 28280089, 28749547, 29085657, 29302233, 29413419, 29430987, 29365004, 29223388, 29009385, 28721567, 28357354, 27914761, 27389547, 26772275, 26050083, 25212214, 24256328, 23194469, 22057246, 20893031, 19760876, 18719987, 17819693, 17092359, 16550733, 16189240, 15985542, 15899384, 15871933, 15832291, 15712400, 15464056, 15070896, 14552066, 13956597, 13349075, 12791609, 12330180, 11990203, 11779848, 11696949, 11735540, 11887818, 12138977, 12458472, 12795971, 13086689, 13262714, 13264120, 13047699, 12594886, 11919347, 11071239]
10411A1071239r37896r26983q19710o40994m25632k05909m481J66678L03938M08138
10401G988388M81144N26274N52485N75560O10067O56171O93459O89805O21257
10392A3394610M89919L27261J79044Q0796M0223L7545M0909K4611k0112q4766
10382A4510040j51426k03675k34405k46419k47229k43066k36104k25624k11535
10373A2510557j97398j89893j94092k08012k20807k16298j79659j03588R107J46988
10363A1156905K92847M25052N18407N48038M96560L60326J51602j02413l62921
10354A3484403n87332p41807q12390q07017p47100o54756n43431m16518k73450
10345G900602j17646M0172J84318K97263L60675L57839K80320J34642n7708k66860
$$ y = [11071239, 10133343, 9206360, 8386650, 7745656, 7320024, 7114115, 7109634, 7276312, 7580250, 7988388, 8469532, 8995806, 9548291, 10123851, 10733918, 11390089, 12083548, 12773353, 13394610, 13884529, 14211790, 14390834, 14471630, 14511853, 14549398, 14590307, 14614918, 14594806, 14510040, 14358614, 14154939, 13920534, 13674115, 13426886, 13183820, 12947716, 12722092, 12510557, 12313159, 12123266, 11929174, 11721162, 11500355, 11284057, 11104398, 11000810, 11009917, 11156905, 11449752, 11874804, 12393211, 12941249, 13437809, 13798135, 13949737, 13847324, 13484403, 12897071, 12155264, 11342874, 10535857, 9788757, 9134001, 8590570, 8174052, 7900602, 7782956, 7823128, 8007446, 8304709, 8665384, 9023223, 9303543, 9438185, 9380477, 9113617]
10335I113617m61987o16663p13713p49837p36583o95178o47166o05412n69824
10326C317254n30199m74741l98389l05412k05951j10657k6700M4099J04690J59634
10316A573628K10909K55332K84966K90557K67315K20264J64305J17187R0231Q4023
10306C558717R1086J02412J14468J33784J74717K48327L48878M50055N15829N18075
10296F256348M48342L18163J51298k5668j89697l23406m14477m54882m41250l75789
10286D948982k66790j28334K0794J59084K65497L24345L30941K94231K32115J60991
10276F341856Q7952J2601o4358j35094j86477k06960j92783j50245r3533l9213
10266E373746j00J8607J9942J2549N139M25n515j5281j9660M347Q3211K31816
$$ y = [9113617, 8651630, 8034967, 7321254, 6571417, 5834834, 5139656, 4492490, 3887078, 3317254, 2787055, 2312314, 1913925, 1608513, 1402562, 1291905, 1265205, 1309304, 1413994, 1573628, 1784537, 2039869, 2324835, 2615392, 2882707, 3102971, 3267276, 3384463, 3474694, 3558717, 3649803, 3752215, 3866683, 4000467, 4175184, 4423511, 4772389, 5222444, 5738273, 6256348, 6704690, 7022853, 7174151, 7148483, 6958786, 6635380, 6220903, 5766021, 5324771, 4948982, 4682192, 4553858, 4574652, 4733736, 4999233, 5323578, 5654519, 5948750, 6180865, 6341856, 6429808, 6442409, 6378051, 6242957, 6056480, 5849520, 5656737, 5506492, 5412959, 5373746, 5373646, 5392253, 5412195, 5424744, 5429883, 5430308, 5424793, 5409512, 5389852, 5394199, 5477410, 5709226]
10254E709226M43841O91510R33071J124922J234665J250057J180379J050600Q91762
10245A4510033P31762N90396M79750M06653L72329L68833L76881L68734L15338
10236A8520709J95290L830k41725n05256p44692r27285j038552j082786j079006
10227A3100527j055008j038998j049784j090528j150237j211311j256840j273599
10219C974222j252266j188738j086869r58839q20691o85391n58042m35031l06351
10210c317996j60594Q460J97268L93857N83961P56320R03561J020187J100852
10201A485876J140317J135126J086351J000822Q88049P54274N99317M20010K17880
10192H728022N469j93321l50837m49371m92896n06846n24322n68851o45848p44890
$$ y = [5709226, 6153067, 6844577, 7777648, 8902570, 10137235, 11387292, 12567671, 13618271, 14510033, 15241795, 15832191, 16311941, 16718594, 17090923, 17459756, 17836637, 18205371, 18520709, 18715999, 18719829, 18478104, 17972848, 17228156, 16300871, 15262319, 14179533, 13100527, 12045519, 11006521, 9956737, 8866209, 7715972, 6504661, 5247821, 3974222, 2721956, 1533218, 446349, -512490, -1333181, -2018572, -2576614, -3011645, -3317996, -3478590, -3470130, -3272862, -2879005, -2295044, -1538724, -635163, 385024, 1485876, 2626193, 3761319, 4847670, 5848492, 6736541, 7490815, 8090132, 8510142, 8728022, 8733491, 8540170, 8189333, 7739962, 7247066, 6740220, 6215898, 5647047, 5001199, 4256309]
10182D256309q46480r28103r69723r59632q98725q00373o85029n71359m67974
10173b871089l70953k69314j54669k8001J00520K17222L11324L77818M15575M23440
10163a848127L99085L42391K59393J61869O3033k5511r2717j25894j12024m3239
10153a021741P7385K34402M04983N67996P11547Q33843R37447J022145J082165
10144D850172J108622J093256J029223R08953P23318M66370J44967k13202n60678
10135I551001q42715j015746j062254r94575q46939o60967m71653k98825j46403
10126C210924r145J16902K27098L09085L50076L43534K90435J96768P1694p2120
10116E035251k17855l45593m35567m72935m52610l81719k78021j64444o1826J7873
$$ y = [4256309, 3409829, 2481726, 1512003, 552371, -346354, -1146727, -1831756, -2403115, -2871089, -3242042, -3511356, -3666025, -3694026, -3593506, -3376284, -3064960, -2687142, -2271567, -1848127, -1449042, -1106651, -847258, -685389, -622356, -647867, -740584, -866478, -978502, -1021741, -944356, -709954, -304971, 263025, 974572, 1808415, 2745862, 3768007, 4850172, 5958794, 7052050, 8081273, 8990226, 9713544, 10179914, 10324881, 10111679, 9551001, 8708286, 7692540, 6630286, 5635711, 4788772, 4127805, 3656152, 3357327, 3210924, 3201779, 3318681, 3545779, 3854864, 4204940, 4548474, 4838909, 5035677, 5107371, 5035251, 4817396, 4471803, 4036236, 3563301, 3110691, 2728972, 2450951, 2286507, 2224681, 2242554]
10106B242554P5541J23963J81525K63063L72573N02165O38003P68918Q90126R98240
10096G056671J082737J123871J100851J003023Q34345O10010L52059Q8339j48946
10087A3102960l30400m40582m85004m86980m76504m78314n04322n51166o02330
10078H747358o35409o33326n93709n29703m61388m04011l60331l20170k67012
10069D542299j89429r2022J864N9618N6032j3312j28838k53349l43537l62544
10059C276782k90628j30842R2665L43296N83528P83678R24958R98714J005841
10050G587992R57037Q70557P65526O54111N38158M11911K67842J02025q2324k73812
10040A1799023m55235o09051p23098p93325q22741q18673p90295p46572o94266
$$ y = [2242554, 2318095, 2442058, 2623583, 2886646, 3259219, 3761384, 4399387, 5168305, 6058431, 7056671, 8139408, 9263279, 10364130, 11367153, 12201498, 12811508, 13163567, 13251906, 13102960, 12772560, 12331978, 11846974, 11359994, 10883490, 10405176, 9900854, 9349688, 8747358, 8111949, 7478623, 6884914, 6355211, 5893823, 5489812, 5129481, 4809311, 4542299, 4352870, 4260848, 4262712, 4322330, 4378362, 4365050, 4236212, 3982863, 3639326, 3276782, 2986154, 2855312, 2947977, 3291273, 3874801, 4658479, 5583437, 6582151, 7587992, 8545029, 9415586, 10181112, 10835223, 11373381, 11785292, 12053134, 12155159, 12072835, 11799023, 11343788, 10734737, 10011639, 9218314, 8395573, 7576900, 6786605, 6040033, 5345767]
10031E345767o37420n80091n30150m98464m91277n02066n12084n00486m55410
10022F38319l77627k76962j66613n7944M4273J44395K52187L72650M95849N95469
10012A663996O38991O03316M85160K99926P2316j72552m12031o24493p88345q84334
10002H81950r00565q37304p08072n35552l45192j60693j953J17317J92305K26767
9992b070992K28966K08855J79721J60141J70533K25500L28484M71924O40073Q11246
9982A354451R59847J060480J094971J060152R71209Q55600P39119O33406N34060
9973I263295M29339L11039J79763M3148q9135k08529l06479l72133l94681l71251
9963H484376l13315k44283j89405j65469j75562k09554k49627k79355k91619k90352
$$ y = [5345767, 4708347, 4128256, 3598106, 3099642, 2608365, 2106299, 1594215, 1093729, 638319, 260692, -16270, -182883, -240827, -196554, -52159, 200028, 572678, 1068527, 1663996, 2302987, 2906303, 3391463, 3691389, 3763705, 3591153, 3179122, 2554629, 1766284, 881950, -18615, -855919, -1563991, -2099543, -2444735, -2605428, -2607381, -2490064, -2297759, -2070992, -1842026, -1633171, -1453450, -1293309, -1122776, -897276, -568792, -96868, 543205, 1354451, 2314298, 3374778, 4469749, 5529901, 6501110, 7356710, 8095829, 8729235, 9263295, 9692634, 10003673, 10183436, 10226584, 10137449, 9928920, 9622441, 9250308, 8855627, 8484376, 8171061, 7926778, 7737373, 7571904, 7396342, 7186788, 6937161, 6657806, 6366187, 6075835]
9953F075835k86515k93080l21037l74544m45111n09552n36054m97348l84790k15026
9943B212778k3433J53613K95715M01965M79751N30645N45769N12575M25145K89398
9933E823921J20793o1330k37370l88404m98296n58577n71656n47978m99596m36605
9923B144902l68456l06428k63467k51075k75184l33735m18110n17241o20624p19434
9913a928852q09127q94247r90286j119594j305744j570323j930349k396116k975254
9904a5919892l682118m539032n559933o722107p930847q976962r518279r157192
9896g2006362p641647n077191j959353J043021L400987M905076N627797N773916
9888f5933756N558738N158524M700721M265292L893194L597989L372890L196288
$$ y = [6075835, 5789320, 5496240, 5175203, 4800659, 4355548, 3845996, 3309942, 2812594, 2427804, 2212778, 2189345, 2342958, 2638673, 3040638, 3520389, 4051034, 4596803, 5109378, 5534523, 5823921, 5944714, 5883384, 5646014, 5257610, 4759314, 4200737, 3629081, 3081103, 2581507, 2144902, 1776446, 1470018, 1206551, 955476, 680292, 346557, -71553, -588794, -1209418, -1928852, -2737979, -3632226, -4622512, -5742106, -7047850, -8618173, -10548522, -12944638, -15919892, -19602010, -24141042, -29700975, -36423082, -44353929, -53330891, -62849170, -72006362, -79648009, -84725200, -86684553, -85641532, -82240545, -77335469, -71707672, -65933756, -60375018, -55216494, -50515773, -46250481, -42357287, -38759298, -35386408, -32190120]
9880c2190120L043279K898712K760259K630802K509827K389892K257954K101166
9872a1598229J915593J711377J508851J328893J184797J078401J000010R33666
9864i36641Q67228P99921P40051O95296O64323O34577N85621M97140L59608J81044
9854E088168j6837k11244l89857n53256p07626q52910r74082j042476j028126
9845f88246r15889p15570m61004j98511L1329K10621L49006M71774N99392P32912
9835e84186Q52993R29962R38318Q69383P36306N68798M01781K65578J80556J53665
9825E313154J75548K21266K57287K52763J90314P2000q2242k43405l84687m88706
9815E283292n48179n63014n37580m78829l94541k92440j81550p5401O049L9583
$$ y = [-32190120, -29146841, -26248129, -23487870, -20857068, -18347241, -15957349, -13699395, -11598229, -9682636, -7971259, -6462408, -5133515, -3948718, -2870317, -1870307, -936641, -69413, 730508, 1470559, 2165855, 2830178, 3464755, 4050376, 4547516, 4907124, 5088168, 5071331, 4860087, 4470230, 3916974, 3209348, 2356438, 1382356, 339880, -688246, -1604135, -2319705, -2780709, -2979220, -2947891, -2737270, -2388264, -1916490, -1317098, -584186, 268807, 1198769, 2137087, 3006470, 3742776, 4311574, 4713355, 4978933, 5159489, 5313154, 5488702, 5709968, 5967255, 6220018, 6410332, 6482332, 6400090, 6156685, 5771998, 5283292, 4735113, 4172099, 3634519, 3155690, 2761149, 2468709, 2287159, 2211758, 2217807, 2257390]
9805B257390P886r0015k34597l91442n22462n95952n92938n10816l63925j79277
9795a216148J1502J80014L06455L83299M16646M22227M16229M07282L96196L82565
9785B106267L70720L69098L84389M16572M59276N04283N45697N80977O09554O30731
9775F977564O41243O33588N98279N31257M41245L49064K77260K37383K23690K15958
9765A1126531J88324J19844L138j51882l20530m70600n71571o03532n63640m67154
9755H288928l41526k16019j12259l9883K636K4640L9573O0748R5937J42810J89749
9744H135334K23562K38412K37570K26908K08436J82313J55139J43644J66244K26880
9734A0144442L04360L57649L45867K50322Q4083j16059l07831m59357n55465n96104
$$ y = [2257390, 2265276, 2175261, 1940664, 1549222, 1026760, 430808, -162130, -672946, -1036871, -1216148, -1204646, -1024632, -718177, -334878, 81768, 503995, 920224, 1327506, 1723702, 2106267, 2476987, 2846085, 3230474, 3647046, 4106322, 4610605, 5156302, 5737279, 6346833, 6977564, 7618807, 8252395, 8850674, 9381931, 9823176, 10172240, 10449500, 10686883, 10910573, 11126531, 11314855, 11434699, 11437837, 11285955, 10965425, 10494825, 9923254, 9319722, 8756082, 8288928, 7947402, 7731383, 7619124, 7579241, 7581877, 7606517, 7646090, 7706838, 7802775, 7945585, 8135334, 8358896, 8597308, 8834878, 9061786, 9270222, 9452535, 9607674, 9751318, 9917562, 10144442, 10448802, 10806451, 11152318, 11402640, 11486723, 11370664, 11062833, 10603476, 10048011, 9451907]
9724I451907n92719n65646n40937n43799n89063o73504p75544q63440r07631q90927
9714B508697q12604o86211n33325l76724k35848j25047n2575j9248j8591m0745
9704c92221p8634j31478k02531k92924l95860m94351n63594n77941n20470l90673
9694d040677k05934L635K03793L64767M67994N09136M95608M39930L54116K49286
9684a158346J38572L7665l9081q3544r6021q5015o6554o2362r4715j78655l15348
9673b003404m89763o72910q27692r17834r18816q27683o67167m80860l20112k27915
9663h354156k27015l16013m71377o51277q01281q65789q05691o14494l22578J3736
9653a3415935L31301N77257P19162P49429O86063N67916M41893L44953K90672
$$ y = [9451907, 8859188, 8293542, 7752605, 7208806, 6619743, 5946239, 5170695, 4307255, 3399624, 2508697, 1696093, 1009882, 476557, 99833, -136015, -261062, -313637, -332885, -351476, -392221, -470855, -602333, -804864, -1097788, -1493648, -1987999, -2551593, -3129534, -3650004, -4040677, -4246611, -4242976, -4039183, -3674416, -3206422, -2697286, -2201678, -1761748, -1407632, -1158346, -1019774, -982109, -1021190, -1104734, -1200755, -1285770, -1352324, -1414686, -1509401, -1688056, -2003404, -2493167, -3166077, -3993769, -4911603, -5830419, -6658102, -7325269, -7806129, -8126241, -8354156, -8581171, -8897184, -9368561, -10019838, -10821119, -11686908, -12492599, -13107093, -13429671, -13415935, -13084634, -12507377, -11788215, -11038786, -10352723, -9784807, -9342914, -8997961, -8707289]
9644h707289K69522K62332K56022K49694K48432K52632K53298K36938J95195J31274
9634f351950N9362j025l1972k3210K3929R6475J74866K40613K81972K95449K85029
9623d950462K61294K39634K35399K56579K97988L41235L62064L42547K82213K01594
9613b129915J35628J20322J79271L15278N09162P25478R23385J068995J144713
9604B992317J152010J106690J029075R34741Q32244P29233O40066N85013N78535
9595A0579924O15598O68171O95862O63495N54762L75699J48535r9513l46752n82079
9585A3273702q02923j008450j193061j344281j445749j483043j449197j347808
9577C199190j193107j007250q15297o38650m88959l65455k57900j53814m5838
$$ y = [-8707289, -8437767, -8175435, -7919413, -7669719, -7421287, -7168655, -6915357, -6678419, -6483224, -6351950, -6292588, -6293613, -6325585, -6348795, -6324866, -6228391, -6053525, -5812912, -5530940, -5235491, -4950462, -4689168, -4449534, -4214135, -3957556, -3659568, -3318333, -2956269, -2613722, -2331509, -2129915, -1994287, -1873965, -1694694, -1379416, -870254, -144776, 778609, 1847604, 2992317, 4144327, 5251017, 6280092, 7214833, 8047077, 8776310, 9416376, 10001389, 10579924, 11195522, 11863693, 12559555, 13223050, 13777812, 14153511, 14302046, 14202533, 13855781, 13273702, 12470779, 11462329, 10269268, 8924987, 7479238, 5996195, 4546998, 3199190, 2006083, 998833, 183536, -455114, -944073, -1309528, -1567428, -1721242, -1767080]
9568a767080O4717J68911K54072L08170L23286K97578K36076J50748N8983k1529
9558G3932q0870j22676j61450k11935k78409l51617m14002m48737m48447m20743
9548b864954l87174l73579l96380m54272n30712o03021o49945o54668o06681n05420
9538h026806l63526k05325n8965N4564J29636J76495K13237K54030L01101L45231
9528g180328L73705L80463L72991L72144M03735M84994O13406P65197R04186R94746
9518a514761J012253R49006Q16463O42841M64225L11361J98848J22780O6988J3372
9508C083376m8842j18523j84603k33483k57397k58859k49973k48837k74770l41975
9498H66114m52213n90300p26415q24805q54579p98454o58118m55687k30272k9404
$$ y = [-1767080, -1702363, -1533452, -1279380, -971210, -647924, -350346, -114270, 36478, 95461, 73932, -6938, -129614, -291064, -502999, -781408, -1133025, -1547027, -1995764, -2444211, -2864954, -3252128, -3625707, -4022087, -4476359, -5007071, -5610092, -6260037, -6914705, -7521386, -8026806, -8390332, -8595657, -8654622, -8600058, -8470422, -8293927, -8080690, -7826660, -7525559, -7180328, -6806623, -6426160, -6053169, -5681025, -5277290, -4792296, -4178890, -3413693, -2509507, -1514761, -502508, 446498, 1262961, 1905802, 2370027, 2681388, 2880236, 3003016, 3070004, 3083376, 3034534, 2916011, 2731408, 2497925, 2240528, 1981669, 1731696, 1482859, 1208089, 866114, 413901, -176399, -902814, -1727619, -2582198, -3380652, -4038770, -4494457, -4724729, -4754133]
9488d754133J02342J34317N8138j08236l23354n33707o90547p63853p46417o48360
9478h273810m88673k89625p4524J34345L19731M74185O02645P20183Q44148R83088
9468e048307J128244J253802J327601J326789J249245J114287R53268P96382O62878
9459D764189N59089M83532M34072M10854M12805M31776M50764M48160M03955L03419
9449I102615J38985q6546l56274o40340r04626j121934j277633j367088j389881
9440B097278j347345j245054j096580r23327p48779n90746m57866l53258k81394
9431d947071k51017k71089l43263m56330n85596o97960p62315p61854p01275o03332
9421a0381102m97114m05953l40887k99839k70818k39023j96202j46892j06070
$$ y = [-4754133, -4651791, -4517474, -4459336, -4567572, -4890926, -5424633, -6115180, -6879033, -7625450, -8273810, -8762483, -9052108, -9126632, -8992287, -8672556, -8198371, -7595726, -6875543, -6031395, -5048307, -3920063, -2666261, -1338660, -11871, 1237374, 2351661, 3304929, 4101311, 4764189, 5323278, 5806810, 6240882, 6651736, 7064541, 7496317, 7947081, 8395241, 8799196, 9102615, 9241600, 9155054, 8798780, 8158440, 7253814, 6131880, 4854247, 3487159, 2097278, 749933, -495121, -1591701, -2515028, -3263807, -3854553, -4312419, -4665677, -4947071, -5198088, -5469177, -5812440, -6268770, -6854366, -7552326, -8314641, -9076495, -9777770, -10381102, -10878216, -11284169, -11625056, -11924895, -12195713, -12434736, -12630938, -12777830, -12883900]
9412a2883900q9344j02968j40741j89045k35724k76313l12747l45310l64868l53874
9402a5294834k97778j98479p8566K7794R1092R9321O1169K81n4769q0583o6172
9391a5791524j5098N8384J37036K07373K61279K92284K90625K42697J38126j8856
9381a4197674k03301l76801n05132n72376n80268n36358m44963l09089j37957
9372a7863919M9938K31279L85053M97314N62763N84437N72147N39651N00899M66915
9362a3473523M45447M43953M72462N41134O52107P92453R35655J051312J116010
9353g022990J119755J067494R76821Q71658P73377O94375O38203O04164N90069
9344C12926N89889N89823N69186N08365L99909K55443J03805j8962q3076p6791
$$ y = [-12883900, -12973244, -13076212, -13216953, -13405998, -13641722, -13918035, -14230782, -14576092, -14940960, -15294834, -15592612, -15791091, -15869657, -15841863, -15750771, -15651450, -15590281, -15590000, -15644769, -15725352, -15791524, -15806622, -15748238, -15611202, -15403829, -15142550, -14850266, -14559641, -14316944, -14178818, -14197674, -14400975, -14777776, -15282908, -15855284, -16435552, -16971910, -17416873, -17725962, -17863919, -17813981, -17582702, -17197649, -16700335, -16137572, -15553135, -14980988, -14441337, -13940438, -13473523, -13028076, -12584123, -12111661, -11570527, -10918420, -10125967, -9190312, -8139000, -7022990, -5903235, -4835741, -3858920, -2987262, -2213885, -1519510, -881307, -277143, 312926, 902815, 1492638, 2061824, 2570189, 2970098, 3225541, 3329346, 3310384, 3227308, 3150517]
9334C150517j2254P7463J49971J68939J15547q485j85058l86983n86072p60916
9324A722669r01454j006556j075149j097963j058280r42850p54833n18240k70305
9315e902961m7424J26625K45810L21007L74953M33603N15145O20630P31050Q13449
9305a768113Q34250P73890O34967M39109K15196j2029k25488m11959n57714o49010
9295g26901o76690o40516n49886m20842k71296j16884L0880J64061K77095L67204
9285b563775M36761M94580N52397O16654O81324P28559P38051O98964O16628N10630
9275C510773M06092L22474K65025K23342J78135J11868J6339j06711k50150m06205
9265D270982n67809p26213q67699r72945j020778r94996q91144p20514n09337
$$ y = [3150517, 3138263, 3215726, 3365697, 3534636, 3650183, 3641698, 3456640, 3069657, 2483585, 1722669, 821215, -185341, -1260490, -2358453, -3416733, -4359583, -5114416, -5632656, -5902961, -5950385, -5823760, -5577950, -5256943, -4881990, -4448387, -3933242, -3312612, -2581562, -1768113, -933863, -159973, 474994, 914103, 1129299, 1117270, 891782, 479823, -77891, -726901, -1403591, -2044107, -2593993, -3014835, -3286131, -3403015, -3372135, -3208074, -2930979, -2563775, -2127014, -1632434, -1080037, -463383, 217941, 946500, 1684551, 2383515, 3000143, 3510773, 3916865, 4239339, 4504364, 4727706, 4905841, 5017709, 5034048, 4927337, 4677187, 4270982, 3703173, 2976960, 2109261, 1136316, 115538, -879458, -1770602, -2491116, -3000453]
9256c000453k91517r6160O3805J93760L07848M14827N09777N76462N96815N60467
9246a64369M69470L37359J84377L1599j04092k13779k98681l68904m37005n08647
9236a072672n77235o27775o47673o35886o03866n68931n45499n39028n44721n51299
9226f914585n48141n31597n06027m78701m52101m18350l59288k53669r0099J20628
9216a0431930L42714N26077O24914O13369M91782K84399L2141k17347m20740n48155
9206h702776n87465n43474m33509k80944j08172O8372K38621L95224N29825O33235
9196h791063O99975P33585P48054P62965P94141Q45111R04998R54508R76144R61853
9186d09729R13978Q40870P51579O52206N43298M17789K62126O3773j77212m41015
$$ y = [-3000453, -3291970, -3388130, -3324325, -3130565, -2822717, -2407890, -1898113, -1321651, -724836, -164369, 305101, 642460, 826837, 858436, 754344, 540565, 241884, -127020, -564025, -1072672, -1649907, -2277682, -2925355, -3561241, -4165107, -4734038, -5279537, -5818565, -6363286, -6914585, -7462726, -7994323, -8500350, -8979051, -9431152, -9849502, -10208790, -10462459, -10552558, -10431930, -10089216, -9563139, -8938225, -8324856, -7833074, -7548675, -7516534, -7733881, -8154621, -8702776, -9290241, -9833715, -10267224, -10548168, -10656340, -10587968, -10349347, -9954123, -9424298, -8791063, -8091088, -7357503, -6609449, -5846484, -5052343, -4207232, -3302234, -2347726, -1371582, -409729, 504249, 1345119, 2096698, 2748904, 3292202, 3709991, 3972117, 4035890, 3858678, 3417663]
9176C417663o92599q96029j028405j084548j072371j005131q95894p55016n90351
9167d602681m10313k28279o3910O1509J32669J44912J04151K5353o8174j47343
9157e052106j84334j61686p7395N6976K22933M01887N78598P39951Q71248R55266
9147a648662R77620R35393Q40979P16507N82741M51039L23214J97045P1849m9134
9137C398591j58844k47376l04286l23431l08136k71203k27726j86261j46332j03493
9127A121503n5897p171L4231N7506N4142K3579k5306q0480j36243j96827k70610
9116E18427l60385m57278n41524n88519n76701m93884l40640j32202R9718L08214
9106b564774M40765M56743L43783J22922j59164m44693o79267q23301q58769p89843
$$ y = [3417663, 2725064, 1829035, 800630, -283918, -1356289, -2361420, -3257314, -4012330, -4602681, -5012994, -5241273, -5305183, -5243674, -5111005, -4966093, -4861942, -4836589, -4904763, -5052106, -5236440, -5398126, -5475521, -5418545, -5195612, -4793725, -4215127, -3475176, -2603928, -1648662, -671042, 264351, 1105330, 1821837, 2404578, 2855617, 3178831, 3375876, 3447725, 3398591, 3239747, 2992371, 2688085, 2364654, 2056518, 1785315, 1557589, 1371328, 1224996, 1121503, 1065606, 1058435, 1092666, 1150172, 1204314, 1227893, 1202587, 1122107, 985864, 789037, 518427, 158042, -299236, -840760, -1429279, -2005980, -2499864, -2840504, -2972706, -2872988, -2564774, -2124009, -1667266, -1323483, -1200561, -1359725, -1804418, -2483685, -3306986, -4165755, -4955598]
9096d955598o37821m33650k11332k633J68100K88431L58798L88043L85851L57871
9086d293940L07850K44822J87602J60026J78949K44607L41625M49465N53242O46628
9076i79124P26599P86479Q13841P94846P21662N98210M41183K76137J30569K6730
9066D337132k3423k0069K5652R4917J65867K18743K40086K24378J72617Q9044
9056E524944k1755j55945l09759m78065o53036q23178r72974j083840j137586
9047a11194j122167j036894q93314p10483n08256l03754j12264N1388J75300K56281
9037d315357L03573L36001L73145M26170M94371N69589O44979P21195Q04924R00937
9027A259527J004367J099790J167790J193491J170564J099138R81825Q23092O32383
$$ y = [-4955598, -5593419, -6027069, -6238401, -6241034, -6072934, -5784503, -5425705, -5037662, -4651811, -4293940, -3986090, -3741268, -3553666, -3393640, -3214691, -2970084, -2628459, -2178994, -1625752, -979124, -252525, 533954, 1347795, 2142641, 2864303, 3462513, 3903696, 4179833, 4310402, 4337132, 4313709, 4293640, 4319292, 4414209, 4580076, 4798819, 5038905, 5263283, 5435900, 5524944, 5503189, 5347244, 5037485, 4559420, 3906384, 3083206, 2110232, 1026392, -111194, -1233361, -2270255, -3163569, -3874052, -4382308, -4686062, -4798326, -4746938, -4571638, -4315357, -4011784, -3675783, -3302638, -2876468, -2382097, -1812508, -1167529, -446334, 358590, 1259527, 2263894, 3363684, 4531474, 5724965, 6895529, 7994667, 8976492, 9799584, 10431967]
9018A0431967M26012K23307L8593j24244k69684m02948n23180o22197o88387p11922
9008G777317o87726o15464m98787l46231j73461l605J36758K24541K46647K03882
8998F263871J11641m191j17301k13282k95996l82553m90195o23719p69659q98754
8988B579862r76345r78242r04736p83233o56493n64511n31109n59898o36747p35024
8978d746476q22310q67562q46680p45814n63631l12886j9378K82719N57157P71108
8968g313753R00245R34634Q83348P73248O40196N16815M23377L65583L38282L31787
8958a206238L37599L51640L74116M05926M43438M75421M85594M60422L97028L05656
8948B830602K05267J15578M9591Q832j7380m7314r7263j71393k57467l31703l69329
$$ y = [10431967, 10857979, 11081286, 11119879, 10995635, 10725951, 10323003, 9799823, 9177626, 8489239, 7777317, 7089591, 6474127, 5975340, 5629109, 5455648, 5452043, 5588801, 5813342, 6059989, 6263871, 6375512, 6371321, 6254020, 6040738, 5744742, 5362189, 4871994, 4248275, 3478616, 2579862, 1603517, 625275, -279461, -1062694, -1719187, -2283698, -2814807, -3374705, -4011452, -4746476, -5568786, -6436348, -7283028, -8028842, -8592473, -8905359, -8924737, -8642018, -8084861, -7313753, -6413508, -5478874, -4595526, -3822278, -3182082, -2665267, -2241890, -1876307, -1538025, -1206238, -868639, -516999, -142883, 263043, 706481, 1181902, 1667496, 2127918, 2524946, 2830602, 3035869, 3151447, 3201038, 3209870, 3192490, 3145176, 3047913, 2876520, 2619053, 2287350, 1918021]
8937A918021l53850k80829j57582j903J59774K96602L79791L88638L14474J63148
8927B826284m4323k75774m97301o82630q15932q88609q96748q42556p35451n88285
8917c441325m12073k16137j3883J73913L24687M25200M78931N04571N27780N71253
8907a077083O46421P49009Q60628R56438J014417J020765R70652Q67876P24815
8898F733938N59410L87637K17258M9929j09915k49334l50918m02844m06693l78994
8888F049474l47237l41162l80877m66988n79726o88309p64076p89278p59209o80630
8878B51982n69825m50486l49668k90904k86138l30260m02156m73597n22995n46894
8868c970941n61285n89888o45916p20093p83728q04017p60259o51267m92572l08152
$$ y = [1918021, 1564171, 1283342, 1125760, 1123857, 1283631, 1580233, 1960024, 2348662, 2663136, 2826284, 2781961, 2506187, 2008886, 1326256, 510324, -378285, -1275033, -2117589, -2853040, -3441325, -3853398, -4069535, -4083418, -3909505, -3584818, -3159618, -2680687, -2176116, -1648336, -1077083, -430662, 318347, 1178975, 2135413, 3149830, 4170595, 5141247, 6009123, 6733938, 7293348, 7680985, 7898243, 7948172, 7838257, 7588923, 7238005, 6835161, 6428468, 6049474, 5702237, 5361075, 4980198, 4513210, 3933484, 3245175, 2481099, 1691821, 932612, 251982, -317843, -768329, -1117997, -1408901, -1695039, -2025299, -2427455, -2901052, -3424047, -3970941, -4532226, -5122114, -5768030, -6488123, -7271851, -8075868, -8836127, -9487394, -9979966, -10288118]
8858a0288118j22193M5731J81634K76307L25794L33906L14011K86581K72306K84290
8848h089751L23861L82204M46647N07702N62633O13726O63196P08568P41147P47423
8838b392644P12311O23754M78416K86549P2418j31540k94197l93594m20239l77385
8828a836151k80347j54166k8073P1692J26505J26246O9455l4951j67084l01110
8818b407984m15123m98878n52821n79581n76256n35558m55721l50341k48353j82373
8808f802989j73300k21140l06111l97083m62375m79247m39652l50523k29200r7073
8798i958693K5675J23788J89706K24553K35791K32218K19879K01938J82144J68179
8788h154822J71052J99539K52995L18783L78480M19612M43595M62807M89559N27125
$$ y = [-10288118, -10410311, -10364580, -10182946, -9906639, -9580845, -9246939, -8932928, -8646347, -8374041, -8089751, -7765890, -7383686, -6937039, -6429337, -5866704, -5252978, -4589782, -3881214, -3140067, -2392644, -1680333, -1056579, -578163, -291614, -219196, -350736, -644933, -1038527, -1458766, -1836151, -2116498, -2270664, -2298737, -2227045, -2100540, -1974294, -1904839, -1939790, -2106874, -2407984, -2823107, -3321985, -3874806, -4454387, -5030643, -5566201, -6021922, -6372263, -6620616, -6802989, -6976289, -7197429, -7503540, -7900623, -8362998, -8842245, -9281897, -9632420, -9861620, -9958693, -9933018, -9809230, -9619524, -9394971, -9159180, -8926962, -8707083, -8505145, -8323001, -8154822, -7983770, -7784231, -7531236, -7212453, -6833973, -6414361, -5970766, -5507959, -5018400, -4491275]
8778d491275N70209O12357O51796O90163P26586P54574P66365P61622P51651P53476
8768B547524P77491Q18968Q59922Q78434Q57875P91774O84736N50288M05701K65370
8758I438083J36827K1744q0179j69166k47110l20469l99457m91793n95054o94760
8748F598666p71183q09798q07195p69778p09739o42779n86325n54835n53180n73525
8738a79671n99391o14431o09940n86435n49189n01503m40560l58510k47739j06523
8728d793892N8397K33715M04154N56226O78789P62120P99280P90440P45475O80069
8718I14773O06958N29493M42690L40317K22191R7101j9851j13794j77399k15598
8708B626881k45405k90110l69043m86904o28787p65148q63886r01344q66425p59462
$$ y = [-4491275, -3921066, -3308709, -2656913, -1966750, -1240164, -485590, 280775, 1042397, 1794048, 2547524, 3325015, 4143983, 5003905, 5882339, 6740214, 7531988, 8216724, 8767012, 9172713, 9438083, 9574910, 9596654, 9516475, 9347309, 9100199, 8779730, 8380273, 7888480, 7293426, 6598666, 5827483, 5017685, 4210490, 3440712, 2730973, 2088194, 1501869, 947034, 393854, -179671, -779062, -1393493, -2003433, -2589868, -3139057, -3640560, -4081120, -4439630, -4687369, -4793892, -4735495, -4501780, -4097626, -3541400, -2862611, -2100491, -1301211, -510771, 234704, 914773, 1521731, 2051224, 2493914, 2834231, 3056422, 3153523, 3133672, 3019878, 2842479, 2626881, 2381476, 2091366, 1722323, 1235419, 606632, -158516, -1022402, -1923746, -2790171, -3549633]
8698c549633n90922l81088j57706M9533K14636L18165L48642L04934J98625N2417
8688c192397j07070k58687l92363n07122o02809o71541o95784o55111n36719l42480
8678g962083q9706J92165M67052P00620Q70546R73244J021550J034741J027933
8669a763938J006728R68298R07516Q25785P37666O68990O44987O75396P46865
8660E418293Q27459Q79640Q74256P99252O60261M73887K58256K6951k09958m39840
8650I568457o42982p95747q81506r01972q79618q47785q34350q48912q80089r03014
8640A152482q92628q36491p40729o25602n13653m18401l40957k75360k17110j67996
8630c876445j34205j20317j24650j39258j52893j52935j25223n4981O8216K43277
$$ y = [-3549633, -4140555, -4521643, -4679349, -4629816, -4415180, -4097015, -3748373, -3443439, -3244814, -3192397, -3299467, -3558154, -3950517, -4457639, -5060448, -5731989, -6427773, -7082884, -7619603, -7962083, -8051789, -7859624, -7392572, -6691952, -5821406, -4848162, -3826612, -2791871, -1763938, -757210, 211088, 1118604, 1944389, 2682055, 3351045, 3996032, 4671428, 5418293, 6245752, 7125392, 7999648, 8798900, 9459161, 9933048, 10191304, 10218255, 10008297, 9568457, 8925475, 8129728, 7248222, 6346250, 5466632, 4618847, 3784497, 2935585, 2055496, 1152482, 259854, -576637, -1317366, -1942968, -2456621, -2875022, -3215979, -3491339, -3708449, -3876445, -4010650, -4130967, -4255617, -4394875, -4547768, -4700703, -4825926, -4880907, -4812691, -4569414]
8620d569414M53474O68934Q54554R79594J025609R90851Q89956P48469N93917
8611B635944M47552L20763K16571J32621O2124o643q8455j95293l30090m85343
8601B709751o47656q03712r42372j052141j118261j124325j058991r22983p30224
8592e690914n01349k54706k504K45106M73428O62474P94565Q63870Q78705Q54105
8582a677220Q01317P23374O19936M96299L68219K58390J87037J63020J80685K23371
8572B344428K70692L05506L17566L03245K63217K00877J22836L9922l4043q6818
8562D047428j14022j23543j34543j69875k45363l62728n10248o67843q10113r06593
8552B557r25313q43240o57682l89470p6125K38750N14154P17967Q31792Q53061
$$ y = [-4569414, -4115940, -3447006, -2592452, -1612858, -587249, 403602, 1293558, 2042027, 2635944, 3083496, 3404259, 3620830, 3753451, 3815575, 3808932, 3720477, 3525184, 3195094, 2709751, 2062095, 1258383, 316011, -736130, -1854391, -2978716, -4037707, -4960690, -5690914, -6192263, -6446969, -6449473, -6204367, -5730939, -5068465, -4273900, -3410030, -2531325, -1677220, -875903, -152529, 467407, 963706, 1331925, 1590315, 1777352, 1940372, 2121057, 2344428, 2615120, 2920626, 3238192, 3541437, 3804654, 4005531, 4128367, 4168289, 4134246, 4047428, 3933406, 3809863, 3675320, 3505445, 3260082, 2897354, 2387106, 1719263, 909150, 2557, -922756, -1765996, -2423678, -2813148, -2889273, -2650523, -2136369, -1418402, -586610, 266451]
8542B66451P93099O72511N16283L49626J94610O7727k2116p5475j02479j18891
8532B541346j39780j76118k36204l26605m47580n86966p21674q28902q98276r34719
8522b755478r50957r56755r52247r28171q71608p73821o36162m71196k98807j39471
8512i734673p757R1260J61181K09320K39774K48196K22096J47816K0514j49864
8502h552137l40922n25851o80602p86609q30544q03529p00332n19444k66180M1257
8492a3964893L68231O68628Q97828J026300J046389R70258Q21974O28568M14643
8483g122074K02400J4308j26929k03146k06323j39670j3911J56698L55051N59775
8473f523821P45430Q85871R59267R52527Q64235P05672M99101K72611N2775j41557
$$ y = [266451, 1059550, 1732061, 2248344, 2597970, 2792580, 2860307, 2838191, 2762716, 2660237, 2541346, 2401566, 2225448, 1989244, 1662639, 1215059, 628093, -93581, -922483, -1820759, -2755478, -3706435, -4663190, -5615437, -6543608, -7415216, -8189037, -8825199, -9296395, -9595202, -9734673, -9742430, -9651170, -9489989, -9280669, -9040895, -8792699, -8570603, -8422787, -8402273, -8552137, -8893059, -9418910, -10099512, -10886121, -11716665, -12520194, -13220526, -13739970, -14006150, -13964893, -13596662, -12928034, -12030206, -11003906, -9957517, -8987259, -8165285, -7536717, -7122074, -6919674, -6905366, -7032295, -7235441, -7441764, -7581434, -7595345, -7438647, -7083596, -6523821, -5778391, -4892520, -3933253, -2980726, -2116491, -1410819, -911718, -639107, -586332, -727889]
8463g27889l01585m26936n22317n94249o48323o87212p10382p15730p01679o67864
8453f704166o14536n42495m54451l56532k58008j68684r4921l6414J3412O2074
8443i154721J10622J50779J70640J64902J40632J13898J01639J16456J66381K55201
8433g663571L79651N25655O68975P82158Q44045Q46571P96172P10298O10728N15926
8423i83392M35481L69682L14101K65430K23856J90753J64043J35354R1720K2376
8413A229404p2675j78581k71034l28957l45772l31422l04898k83200k72876k67311
8403a427322k50750k07578j32093l2754P1567J60100K17633K36925K15838J52806
8393i95628M5824j02748k80019m62217o21764p35243p85876p62243o59827m86648
$$ y = [-727889, -1029474, -1456410, -1978727, -2572976, -3221299, -3908511, -4618893, -5334623, -6036302, -6704166, -7318702, -7861197, -8315648, -8672180, -8930188, -9098872, -9193793, -9230207, -9216795, -9154721, -9044099, -8893320, -8722680, -8557778, -8417146, -8303248, -8201609, -8085153, -7918772, -7663571, -7283920, -6758265, -6089290, -5307132, -4463087, -3616516, -2820344, -2110046, -1499318, -983392, -547911, -178229, 135872, 401302, 625158, 815911, 979954, 1115308, 1207028, 1229404, 1156729, 978148, 707114, 378157, 32385, -299037, -603935, -887135, -1160011, -1427322, -1678072, -1885650, -2017743, -2050497, -1978930, -1818830, -1601197, -1364272, -1148434, -995628, -949804, -1052552, -1332571, -1794788, -2416552, -3151795, -3937671, -4699914, -5359741, -5846389]
8383e846389k66590l4523J74838L37111M42308M93078N00296M78611M43080M06609
8373b871571L77876L59904L50112L42024L27620K99312K51612J83523J01653K2117
8363b55818l1610l5818K3838J44899L06149M71721O00341O58330O32662N37464
8353C052158M08482K87302K04342J69771J74853J99926K23093K25901J95602J25969
8343E267399J8154j19512k74341m33321n84521p14952q08872q50276q28508p42892
8333g1642o04044m31756k49935q0462N9974J58391K03805J90831J26458L1613
8323f66767o6199j43129j84442j84383j44405p1846K1221J18392J98861K40439
8313h82258K28388J65287P2385k1047r2824j36604j59954j75322j90340k02515
$$ y = [-5846389, -6112979, -6147502, -5972664, -5635553, -5193245, -4700167, -4199871, -3721260, -3278180, -2871571, -2493695, -2133791, -1783679, -1441655, -1114035, -814723, -563111, -379588, -277935, -255818, -287428, -323246, -299408, -154509, 151640, 623361, 1223702, 1882032, 2514694, 3052158, 3460640, 3747942, 3952284, 4122055, 4296908, 4496834, 4719927, 4945828, 5141430, 5267399, 5285553, 5166041, 4891700, 4458379, 3873858, 3158906, 2350034, 1499758, 671250, -71642, -675686, -1107442, -1357377, -1437839, -1377865, -1219474, -1015669, -824838, -698380, -666767, -732966, -876095, -1060537, -1244920, -1389325, -1461171, -1439950, -1321558, -1122697, -882258, -653870, -488583, -416198, -437245, -530069, -666673, -826627, -1001949, -1192289, -1394804]
8303a394804k00702j72337j12168k7695O1322J28829J51547J17655L2054q2929
8293a499228j91294k51849k31531j19944O2950K72464M56283N73588O06796N62310
8283B40545M62501L33791J96550O1418o7189j84639k83048l54500l97207m17929
8273d09707m27068m30059m22882l96076l43619k68570j81380r4294j8106L7013
8263b954748O0267M2765j6558j06601k06248k93165l53791l87491m02172m05058
8253e022800l95162l61437k86660j55472L5545K69991N11768P15673Q43575Q77009
8243b967970Q20069O93446N24638L39262J56444j0888j52662k58771l19181l26897
8233a502510k81991j94714q5264K2127J09599J73770K24253K72767L21939L63196
$$ y = [-1394804, -1595506, -1767843, -1880011, -1907706, -1846384, -1717555, -1566008, -1448353, -1416299, -1499228, -1690522, -1942371, -2173902, -2293846, -2230896, -1958432, -1502149, -928561, -321765, 240545, 703046, 1036837, 1233387, 1294805, 1227616, 1042977, 759929, 405429, 8222, -409707, -836775, -1266834, -1689716, -2085792, -2429411, -2697981, -2879361, -2973655, -2991761, -2954748, -2894481, -2851716, -2868274, -2974875, -3181123, -3474288, -3828079, -4215570, -4617742, -5022800, -5417962, -5779399, -6066059, -6221531, -6185986, -5915995, -5404227, -4688554, -3844979, -2967970, -2147901, -1454455, -929817, -590555, -434111, -444999, -597661, -856432, -1175613, -1502510, -1784501, -1979215, -2064479, -2042352, -1932753, -1758983, -1534730, -1261963, -940024, -576828]
8223e76828L84549L80452L55422L19682K81869K45121K08646J71542J34128R5477
8213B000060N0567q759q8383j85767k87602l72995m20495m15913l58381k62661
8203c50329j55838o8250k2214k4900o9130j39978k21657l01517l71490m28081
8193b153384m71144n02075n22948n36720n46759n54938n60023n58360n46403n23422
8183g476176m93297m64722m49073m56477m92542n57168o44045p39657q24144q76879
8173a3474180q84707q46920p73660o79919n78970m77573l74763k65723j48701
8164a8505116k9105Q3276J80900K62166L29253L83626M24194M49267M59433M58168
8154a5503938M49683M36317M17990L94422L68782L50457L54589L96792M84733
$$ y = [-576828, -192279, 188173, 543595, 863277, 1145146, 1390267, 1598913, 1770455, 1904583, 2000060, 2050627, 2041868, 1953485, 1767718, 1480116, 1107121, 686626, 270713, -87668, -350329, -506167, -574417, -596631, -621531, -690661, -830639, -1052296, -1353813, -1725303, -2153384, -2624528, -3126603, -3649551, -4186271, -4733030, -5287968, -5847991, -6406351, -6952754, -7476176, -7969473, -8434195, -8883268, -9339745, -9832287, -10389455, -11033500, -11773157, -12597301, -13474180, -14358887, -15205807, -15979467, -16659386, -17238356, -17715929, -18090692, -18356415, -18505116, -18534221, -18450945, -18270045, -18007879, -17678626, -17295000, -16870806, -16421539, -15962106, -15503938, -15054255, -14617938, -14199948, -13805526, -13436744, -13086287, -12731698, -12334906, -11850173]
8145a1850173O12228P61042R09056J037386J131565J179635J172952J110057R98680
8136b937572Q52986O88828N20677L60000K12917P8110n0985j78651k99531l99190
8126a152411m63759m90627m90429m79006m67206m56526m41505m14518l69505l03820
8116e529312k18139j15108J598J26763K53665L76694M94278O07671P15311Q08107
8106b478472Q70417Q86192Q46597P55597O30502M95726L72685K73412K02482J63116
8096C018254J59209J90786K48090L10209L49424L39165K63301J23513n9726k54938
8086D687287m32343n73356o71269p24906p32410o90671n99689m66680l06234j37290
8076f47561K0407J49262K36524K76565K71972K33445J78647J28901J02920J09944
$$ y = [-11850173, -11237945, -10476903, -9567847, -8530461, -7398896, -6219261, -5046309, -3936252, -2937572, -2084586, -1395758, -875081, -515081, -302164, -224054, -275039, -453690, -753221, -1152411, -1616170, -2106797, -2597226, -3076232, -3543438, -3999964, -4441469, -4855987, -5225492, -5529312, -5747451, -5862559, -5860961, -5734198, -5480533, -5103839, -4609561, -4001890, -3286579, -2478472, -1608055, -721863, 124734, 880331, 1510833, 2006559, 2379244, 2652656, 2855138, 3018254, 3177463, 3368249, 3616339, 3926548, 4275972, 4615137, 4878438, 5001951, 4942225, 4687287, 4254944, 3681588, 3010319, 2285413, 1553003, 862332, 262643, -204037, -510271, -647561, -627154, -477892, -241368, 35197, 307169, 540614, 719261, 848162, 951082, 1061026]
8066A061026J46917K01623K58635L03580L24790L14621K71956K04092J25217N0849
8056C263306q987n3513q9161j22655j53649j72619j67032j32789q2245m0669l1956
8045B208031o3923j24145j88144k32613k45386k28462j94064j55886j20132q2126
8035E73150l0460M4700J43737K52151L39390L65770K98758J31354j09925l74333
8025A634292o08179p75475q67216q96526q85035q50041p99303p33225o49162n43941
8015e973811m14992k61540q5288J10102L19235N32804P34396R00242J004286J026581
8005b107985R60592Q15935O15400L87568J58124n6144k47964m15189n54881o60379
7995a104923p23674p41444p19809o73539o19246n66666n13896m50018l63629k51945
$$ y = [1061026, 1207943, 1409566, 1668201, 1971781, 2296571, 2611192, 2883148, 3087240, 3212457, 3263306, 3254319, 3200806, 3111645, 2988990, 2835341, 2662722, 2495690, 2362901, 2280656, 2239987, 2208031, 2144108, 2019963, 1831819, 1599206, 1353820, 1125358, 931294, 775408, 655276, 573150, 542690, 587390, 731127, 983278, 1322668, 1688438, 1987196, 2118550, 2008625, 1634292, 1026113, 250638, -616578, -1513104, -2398139, -3248180, -4047483, -4780708, -5429870, -5973811, -6388803, -6650343, -6735631, -6625529, -6306294, -5773490, -5039094, -4138852, -3134566, -2107985, -1147393, -331458, 283942, 671510, 829634, 773490, 525526, 110337, -444544, -1104923, -1828597, -2570041, -3289850, -3963389, -4582635, -5149301, -5663197, -6113215, -6476844, -6728789]
7985f728789j24878j934R5943J54846J72268J55641J17311P0356K7643K152M870
7974f054571L9554R8090J60641K01734J99738J45180M3351r0014k35984l76254
7964e868535m91888n62131n69029n06140l83582k24056n2217J15453K74225M26676
7954g841224N73750P08197Q15769Q83028R04658Q84406Q30444P50458O49987N33749
7944c06778M08640K87217J89307J38326J51707K30206L53199M83417N78573O03916
7934C117730N40788L89317J66121j00722l77082o27477q19571r29504r47809q83058
7924d71267p59753o09710m61191l32105k30272j57894j14741r7672r8584j04146
7914c437335r8098o4515R445J31446L02037N12754P44846R70020J154798J268554
$$ y = [-6728789, -6853667, -6855601, -6759658, -6604812, -6432544, -6276903, -6159592, -6089236, -6061593, -6059441, -6054571, -6015017, -5916927, -5756286, -5554552, -5354814, -5209634, -5166283, -5256297, -5492281, -5868535, -6360423, -6922554, -7491583, -7997723, -8381305, -8605361, -8657578, -8542125, -8267900, -7841224, -7267474, -6559277, -5743508, -4860480, -3955822, -3071416, -2240972, -1490514, -840527, -306778, 101862, 389079, 578386, 716712, 868419, 1098625, 1451824, 1935241, 2513814, 3117730, 3658518, 4047835, 4213956, 4113234, 3736152, 3108675, 2289104, 1359600, 411791, -471267, -1231020, -1840730, -2301921, -2634026, -2864298, -3022192, -3136933, -3234605, -3333189, -3437335, -3535433, -3599948, -3590503, -3459057, -3157020, -2644266, -1899420, -929400, 225398, 1493952]
7904A493952J291929J220717J062987Q32562N44165K12663j45570n11994q65902
7895E135509j183547j437229j597824j643255j570131j401351j183341r72008
7887e853177q13101p25858o97455o90293o57889n61813l83421j28289J75670M84914
7877i850712P51072R34693J018177J011647R47054Q62664P87740P37119P16184
7868b084362P27277P69624Q34205R00949R42169R29618Q41771O70307M25038J34216
7858E090812j62139m24184o24777p57633q36747q85131r17563r28758q96429p96953
7848b139502o21837l84719j17973J36303L36882M53839M76717M17340L05029J75307
7838i62614N7645l0519q0543q6101m3077M2073J44746K26251K49329J94180O4741
$$ y = [1493952, 2785881, 4006598, 5069585, 5902147, 6446312, 6658975, 6513405, 6001411, 5135509, 3951962, 2514733, 916909, -726346, -2296477, -3697828, -4881169, -5853177, -6666278, -7392136, -8089591, -8779884, -9437773, -9999586, -10383007, -10511296, -10335626, -9850712, -9099640, -8164947, -7146770, -6135123, -5188069, -4325405, -3537665, -2800546, -2084362, -1357085, -587461, 246744, 1147693, 2089862, 3019480, 3861251, 4531558, 4956596, 5090812, 4928673, 4504489, 3879712, 3122079, 2285332, 1400201, 482638, -446120, -1342549, -2139502, -2761339, -3146058, -3264031, -3127728, -2790846, -2337007, -1860290, -1442950, -1137921, -962614, -904969, -935488, -1016031, -1102132, -1145209, -1103136, -958390, -732139, -482810, -288630, -223889]
7827b23889j15810l14283m95771o29168o91043o69817n70610m18064k52582j18447
7817d499484m8814n6083j32525k58875m14469n84089p59541r35958j104776j248569
7807a0043183j343188j367097j310293j175377r71461p08834m00006o4530K69129
7798a7114840N68155Q04201R61521J040445J054890J026017R75899R23552Q82643
7789h877517Q59819Q55059Q65811Q93393R46595J038356J176138J351219J534025
7780F42898J680641J749100J716787J588521J391686J163645R39470P44160N89360
7771A2206268M73529L84772L05256K16166J02978l9408k03685l71853n21545o33829
$$ y = [-223889, -339699, -653982, -1149753, -1778921, -2469964, -3139781, -3710391, -4128455, -4381037, -4499484, -4548298, -4604381, -4736906, -4995781, -5410250, -5994339, -6753880, -7689838, -8794614, -10043183, -11386371, -12753468, -14063761, -15239138, -16210599, -16919433, -17319439, -17383969, -17114840, -16546685, -15742484, -14780963, -13740518, -12685628, -11659611, -10683712, -9760160, -8877517, -8017698, -7162639, -6296828, -5403435, -4456840, -3418484, -2242346, -891127, 642898, 2323539, 4072639, 5789426, 7377947, 8769633, 9933278, 10872748, 11616908, 12206268, 12679797, 13064569, 13369825, 13585991, 13688969, 13649561, 13445876, 13074023, 12552478, 11918649]
$$ [...]
##END NTUPLES=NMR SPECTRUM
##END=
