##TITLE=31Pdec_DE-27sr0
 D2O
 24 sc
 14.2.2024
##JCAMPDX= 6.0         $$ Bruker NMR JCAMP-DX V2.0
##DATA TYPE= NMR SPECTRUM
##DATA CLASS= NTUPLES
##ORIGIN= UXNMR, Bruker Analytische Messtechnik GmbH
##OWNER= root
$$ XWIN-NMR		Version 3.5
$$ Wed Feb 14 15:40:06 2024 Russian Standard Time (UT+4h)  she@DPX200
##.OBSERVE FREQUENCY= 81.013821
##.OBSERVE NUCLEUS= ^31P
##.ACQUISITION MODE= SIMULTANEOUS
##.ACQUISITION SCHEME= undefined
##.AVERAGES= 64
##.DIGITISER RES= 16
##SPECTROMETER/DATA SYSTEM= spect
##.PULSE SEQUENCE= zgpg30
##.SOLVENT NAME= MeOD
##.SHIFT REFERENCE= (INTERNAL, MeOD, 0, 248.564)
##AUDIT TRAIL= $$ (NUMBER, WHEN, WHO, WHERE, WHAT)
$$ ##TITLE= Audit trail, XWIN-NMR		Version 3.5
$$ ##JCAMPDX= 5.01
$$ ##ORIGIN= Bruker BioSpin GmbH
$$ ##OWNER= she
$$ F:/spectra/data/she/nmr/P31/1/pdata/1/auditp.txt
$$ ##AUDIT TRAIL=  $$ (NUMBER, WHEN, WHO, WHERE, WHAT)
(   1,<2024-02-14 15:39:20.96 +0400>,<she>,<DPX200>,
      <continue with go, POWCHK disabled, PULCHK disabled
       configuration hash MD5:
       00 E9 B6 7A A2 85 ED C7 34 08 36 98 17 FE 4E 26
       data hash MD5: 32K
       23 EF E3 4B 41 7C 18 4E EA 6C D1 DA 15 05 96 A8>)
(   2,<2024-02-14 15:39:22.43 +0400>,<she>,<DPX200>,
      <Start of raw data processing
       efp BC_mod = 2 LB = 10 FT_mod = 6 PKNL = 1 PHC0 = -12758.22 PHC1 = -218.7166 SI = 64K 
       data hash MD5: 64K
       0E F4 7E 45 41 2B AB EB EF 92 51 C5 EC 20 EC C1>)
(   3,<2024-02-14 15:39:37.85 +0400>,<she>,<DPX200>,
      <pk PHC0 = -20.68442 PHC1 = 0 
       data hash MD5: 64K
       6D C5 72 C8 A0 38 54 BE 06 5C B8 19 DF C4 13 C4>)
(   4,<2024-02-14 15:39:41.21 +0400>,<she>,<DPX200>,
      <abs ABSG = 5 
       data hash MD5: 64K
       3C 7B 1B 0B FB 19 99 AD 64 C4 40 83 ED EA 3F A0>)
$$ ##END=
$$ 
$$ hash MD5
$$ 65 42 2B F6 0D 41 CD 9C 30 05 10 B6 EC E4 28 16
##$RELAX= 
##$RELAX= 
##$RELAX= 
##$RELAX= 
##$RELAX= 
##$RELAX= 
##$RELAX= 
##$RELAX= 
##$RELAX= 
$$ Bruker specific parameters
$$ --------------------------
##$DU= <F:/spectra>
##$EXPNO= 1
##$NAME= <P31>
##$PROCNO= 1
##$TYPE= <nmr>
##$USER= <she>
##$AMP= (0..31)
100 100 100 100 100 100 100 100 100 100 100 100 100 100 100 100 100 100 
100 100 100 100 100 100 100 100 100 100 100 100 100 100 
##$AQSEQ= 0
##$AQ_mod= 1
##$AUNM= <au_zg>
##$AUTOPOS= <>
##$BF1= 81.014009
##$BF2= 200.13
##$BF3= 200.13
##$BF4= 200.13
##$BF5= 200.13
##$BF6= 200.13
##$BF7= 200.13
##$BF8= 200.13
##$BYTORDA= 1
##$CFDGTYP= 0
##$CFRGTYP= 5
##$CHEMSTR= <none>
##$CNST= (0..31)
1 1 145 1 1 1 1 1 1 1 1 1 1 1 1 1 1 1 1 1 1 1 1 1 1 1 1 1 1 1 1 1 
##$CPDPRG= <waltz16>
##$CPDPRG1= <>
##$CPDPRG2= <waltz16>
##$CPDPRG3= <>
##$CPDPRG4= <mlev>
##$CPDPRG5= <mlev>
##$CPDPRG6= <mlev>
##$CPDPRG7= <mlev>
##$CPDPRG8= <mlev>
##$CPDPRGB= <>
##$CPDPRGT= <>
##$D= (0..31)
0 1 0 0 0 0 0 0 0 0 0 0.03 2e-05 3e-06 0 0 0 0 0 0 0 0 0 0 0 0 0 0 0 0 
0 0 
##$DATE= 1707910683
##$DBL= (0..7)
120 120 120 11 120 120 24 19 
##$DBP= (0..7)
150 150 150 150 150 150 150 150 
##$DBP07= 0
##$DBPNAM0= <>
##$DBPNAM1= <>
$$ [...]
##$SUBNAM3= <"">
##$SUBNAM4= <"">
##$SUBNAM5= <"">
##$SUBNAM6= <"">
##$SUBNAM7= <"">
##$SUBNAM8= <"">
##$SUBNAM9= <"">
##$SW= 501.771253377433
##$SWIBOX= (0..15)
0 1 3 0 0 0 0 0 0 0 0 0 0 0 0 0 
##$SW_h= 40650.406504065
##$TD= 32768
##$TD0= 1
##$TE= 0
##$TE2= 300
##$TE3= 300
##$TEG= 300
##$TL= (0..7)
0 120 53 12 22 120 120 120 
##$TP= (0..7)
150 150 150 150 150 150 150 150 
##$TP07= 0
##$TPNAME0= <>
##$TPNAME1= <>
##$TPNAME2= <>
##$TPNAME3= <>
##$TPNAME4= <>
##$TPNAME5= <>
##$TPNAME6= <>
##$TPNAME7= <>
##$TPOAL= (0..7)
0.5 0.5 0.5 0.5 0.5 0.5 0.5 0.5 
##$TPOFFS= (0..7)
0 0 0 0 0 0 0 0 
##$TUNHIN= 0
##$TUNHOUT= 0
##$TUNXOUT= 0
##$USERA1= <user>
##$USERA2= <user>
##$USERA3= <user>
##$USERA4= <user>
##$USERA5= <user>
##$V9= 5
##$VALIST= <valist>
##$VCLIST= <CCCCCCCCCCCCCCC>
##$VD= 0
##$VDLIST= <DDDDDDDDDDDDDDD>
##$VPLIST= <PPPPPPPPPPPPPPP>
##$VTLIST= <TTTTTTTTTTTTTTT>
##$WBST= 1024
##$WBSW= 4
##$XGAIN= (0..3)
0 0 0 0 
##$XL= 0
##$YL= 0
##$YMAX_a= 3907
##$YMIN_a= -1791
##$ZGOPTNS= <>
##$ZL1= 120
##$ZL2= 120
##$ZL3= 120
##$ZL4= 120
##$ABSF1= 248.5645
##$ABSF2= -253.2056
##$ABSG= 5
##$ABSL= 3
##$ALPHA= 0
##$AQORDER= 0
##$ASSFAC= 0
##$ASSFACI= 0
##$ASSFACX= 0
##$ASSWID= 0
##$AUNMP= <proc_1d>
##$AZFE= 0.1
##$AZFW= 0.5
##$BCFW= 0
##$BC_mod= 2
##$BYTORDP= 0
##$COROFFS= 0
##$CY= -3
##$DATMOD= 1
##$DC= 0
##$DFILT= <>
##$DTYPP= 0
##$F1P= 0
##$F2P= 0
##$FCOR= 1
##$FTSIZE= 65536
##$FT_mod= 6
##$GAMMA= 0
##$GB= 0
##$INTBC= 1
##$INTSCL= 6.047779e-11
##$ISEN= 30
##$LB= 10
##$LEV0= 0
##$LPBIN= 0
##$MAXI= 10000
##$MC2= 0
##$MEAN= 0
##$ME_mod= 0
##$MI= 50
##$NCOEF= 0
##$NC_proc= -9
##$NLEV= 6
##$NOISF1= 182.463
##$NOISF2= 159.3651
##$NSP= 0
##$NTH_PI= 0
##$NZP= 0
##$OFFSET= 248.5645
##$PC= 4
##$PHC0= -12778.9
##$PHC1= -218.7166
##$PH_mod= 1
##$PKNL= yes
##$PPARMOD= 0
##$PSCAL= 0
##$PSIGN= 0
##$REVERSE= no
##$SF= 81.0140089999694
##$SI= 65536
##$SIGF1= 159.3651
##$SIGF2= -187.1042
##$SINO= 113.3802
##$SIOLD= 16384
##$SREGLST= <1H.CDCl3>
##$SSB= 0
##$STSI= 65536
##$STSR= 0
##$SW_p= 40650.406504065
##$SYMM= 0
##$S_DEV= 0
##$TDeff= 32768
##$TDoff= 0
##$TI= <>
##$TILT= no
##$TM1= 0
##$TM2= 0
##$TOPLEV= 0
##$USERP1= <user>
##$USERP2= <user>
##$USERP3= <user>
##$USERP4= <user>
##$USERP5= <user>
##$WDW= 1
##$XDIM= 65536
##$YMAX_p= 143106686
##$YMIN_p= -133794111
$$ End of Bruker specific parameters
$$ ---------------------------------
##NTUPLES= NMR SPECTRUM
##VAR_NAME=  FREQUENCY,     SPECTRUM/REAL,   SPECTRUM/IMAG
##SYMBOL=    X,             R,               I
##VAR_TYPE=  INDEPENDENT,   DEPENDENT,       DEPENDENT
##VAR_FORM=  AFFN,          ASDF,            ASDF
##VAR_DIM=   65536,         65536,           65536
##UNITS=     HZ,            ARBITRARY UNITS, ARBITRARY UNITS
##FACTOR=    0.620285442955139, 1,           1
##FIRST=     20137.2065510682, 0,            0
##LAST=      -20513.1999529968, 0,           0
##MIN=       -20513.1999529968, -133794111,  0
##MAX=       20137.2065510682, 143106686,    0
$$ Real data points
##PAGE= N=1
##DATA TABLE= (X++(R..R)), XYDATA
$$ [...]
##PAGE= N=2
##DATA TABLE= (X++(I..I)), XYDATA
13222A841405k88641j63231l3335Q1751J68398K21359K41198K30200J91034J27981
13212B618119M7895m0970j31484k19621l04318l84805m56869n11000n34553n17181
13202d34787m55914l56325k29413q7312N8582J96638L14084L98476M40748M37503
13192B82280L91853L13586K18275J23979M5769r015m2064o2078q1348j12209j63153
13181I05875k34349l13962l78493l99863l57760k50651r7798O9409K20793L36717
13171e00082M09129M36720M20111L61664K69510J61077O1108o530k8919r568L4723
13160A608943Q4340J27849J65420K02375K39527K69934K84833K82210K69581K58695
13150C793707K56455K58561K50431K15243J43630L7592r3468k38880l88002n26325
$$ plain form
13222 1841405 1552764 1389533 1356198 1437949 1606347 1827706 2068904 2299104 2490138 2618119
13212 2618119 2666014 2625044 2493560 2273939 1969621 1584816 1127947 616947 82394 -434787
13202 -434787 -890701 -1247026 -1476439 -1563751 -1505169 -1308531 -994447 -595971 -155223 282280
13192 282280 674133 987719 1205994 1329973 1375742 1366727 1324663 1262585 1181237 1069028 905875
13181 905875 671526 357564 -20929 -420792 -778552 -1029203 -1127001 -1057592 -836799 -500082
13171 -500082 -90953 345767 765878 1127542 1397052 1558129 1619237 1612707 1583788 1574220 1608943
13160 1608943 1693283 1821132 1986552 2188927 2428454 2698388 2983221 3265431 3535012 3793707
13150 3793707 4050162 4308723 4559154 4774397 4918027 4955619 4862151 4623271 4235269 3708944
13140C708944o32645o82892o60294n65867m22041k65468j32351m5523j0871k2477
13130B68515o8985j35289k00443k37240k17920j25362L6718K42813M56353O44717
13120F63877P86909Q70091Q82201Q10832O50495M11299J20610j84632m69837p11088
13110C830757q95594j016897j070799j055216r72281q29813o41679m27490k10888
13101c289900j5498J40186K46325L02311L14914K94887K52863J96246J28831N3117
13091a375718k6655j02431j61716j88670j67550q8345M7326K23139M10260N75245
13081h55115O90973P45215P42182O96840O26857N47529M71003M07209L63604L43372
13071D779669L43631L55570L67580L70397L60893L40779L10655K65353J96311
$$ plain form
13140 3708944 3076299 2393407 1733113 1167246 745205 479737 347386 301863 290992 268515
13130 268515 199530 64241 -136202 -373442 -591362 -716724 -680006 -437193 19160 663877
13120 663877 1450786 2320877 3203078 4013910 4664405 5075704 5196314 5011682 4541845 3830757
13110 3830757 2935163 1918266 847467 -207749 -1180030 -2009843 -2651522 -3079012 -3289900
13101 -3289900 -3305398 -3165212 -2918887 -2616576 -2301662 -2006775 -1753912 -1557666 -1428835 -1375718
13091 -1375718 -1402373 -1504804 -1666520 -1855190 -2022740 -2111085 -2063759 -1840620 -1430360 -855115
13081 -855115 -164142 581073 1323255 2020095 2646952 3194481 3665484 4072693 4436297 4779669
13071 4779669 5123300 5478870 5846450 6216847 6577740 6918519 7229174 7494527 7690838
13062G690838R9228k1430j56319k98801m47309o00479p51977q91456j009758j101770
13052B510767j164135j191305j174813j107174r87943q27509o44948m60341k86832
13043e334233j28446J5566J44796K55207L40797L97155M24967M31788M29988M30281
13033b592134M34880M36334M24205L94845L56813L28034L26672L61146M24288
13024H95083M94177N41002N37206M67159L32818J53320m1061k17735l50004m22644
13014B389321m34307l96402l28343k50877j80627j27970r7425q8471r6288j13407
13004B75204j32587j49605j64585j81483k06054k42744k91658l47603m02078m46820
12994b290013m76102m86558m75783m42216l87348l18846k51546k04295j93195
$$ plain form
13062 7690838 7790066 7768636 7612317 7313516 6866207 6265728 5513751 4622295 3612537 2510767
13052 2510767 1346632 155327 -1019486 -2126660 -3114603 -3942112 -4587060 -5047401 -5334233
13043 -5334233 -5462679 -5447113 -5302317 -5047110 -4706313 -4309158 -3884191 -3452403 -3022415 -2592134
13033 -2592134 -2157254 -1720920 -1296715 -901870 -545057 -217023 109649 470795 895083
13024 895083 1389260 1930262 2467468 2934627 3267445 3420765 3379704 3161969 2811965 2389321
13014 2389321 1955014 1558612 1230269 979392 798765 670795 573370 484899 388611 275204
13004 275204 142617 -6988 -171573 -353056 -559110 -801854 -1093512 -1441115 -1843193 -2290013
12994 -2290013 -2766115 -3252673 -3728456 -4170672 -4558020 -4876866 -5128412 -5332707 -5525902
12985e525902k24500k90867l73446m49514n02118n26160n27308n15208m96684
12976i431707m73434m44041m07143l63271l14571k62588k05390j37294n3496M2877
12966a2050058J37543K09790K42678K32296J91022J43618J17936J34172J97744
12957a0443259K99285M20894N44375O57227P54680Q37768R08630R65785J002925
12948d051690J012640R92487R48582Q93821Q41783Q00551P70660P48305P30303
12939C687442P16031P05101O94886O81796O64902O46500O27968O05293N69362
12930I599281N10529M22540L02695J49974l5064k46912m70261o78206q37749r22311
12920G794516r24446q59440p55960o39716n21633l98414k63809j21175J2696J15416
$$ plain form
12985 -5525902 -5750402 -6041269 -6414715 -6864229 -7366347 -7892507 -8419815 -8935023 -9431707
12976 -9431707 -9905141 -10349182 -10756325 -11119596 -11434167 -11696755 -11902145 -12039439 -12092935 -12050058
12966 -12050058 -11912515 -11702725 -11460047 -11227751 -11036729 -10893111 -10775175 -10641003 -10443259
12957 -10443259 -10143974 -9723080 -9178705 -8521478 -7766798 -6929030 -6020400 -5054615 -4051690
12948 -4051690 -3039050 -2046563 -1097981 -204160 637623 1438174 2208834 2957139 3687442
12939 3687442 4403473 5108574 5803460 6485256 7150158 7796658 8424626 9029919 9599281
12930 9599281 10109810 10532350 10835045 10985019 10949955 10703043 10232782 9554576 8716827 7794516
12920 7794516 6870070 6010630 5254670 4614954 4093321 3694907 3431098 3309923 3322619 3438035
12910C438035J72400J85725J72724J56750J57009J82721K32748K99265L73177
12901E370554M48520N23439N97444O67390P25395P60038P59648P15263O22104
12892A1189795M80158K94904P8044j52886l76488n70515p15395p98157q15497
12883H613963p73877o86071n66853m30982k93419j69117p1000p503J8846J2185
12873E646172j6339n0048p1469o8926m1329J706M4604P3482Q3611Q2974Q9620
12862E774058J23795J99256L18088M70142O35298P86915Q96584R40761R07584
12853A1052481Q00364O35326M34874K20288P429j93641l76351n34774o62065p51099
12843A0632832p97112q00979p71047p21819o69320o25380n94320n74209n61472
$$ plain form
12910 3438035 3610435 3796160 3968884 4125634 4282643 4465364 4698112 4997377 5370554
12901 5370554 5819074 6342513 6939957 7607347 8332742 9092780 9852428 10567691 11189795
12892 11189795 11669953 11964857 12042901 11890015 11513527 10943012 10227617 9429460 8613963
12883 8613963 7840086 7154015 6587162 6156180 5862761 5693644 5622644 5615141 5633987 5646172
12873 5646172 5629833 5579785 5508316 5439390 5398061 5399767 5444371 5517853 5601464 5684438 5774058
12862 5774058 5897853 6097109 6415197 6885339 7520637 8307552 9204136 10144897 11052481
12853 11052481 11852845 12488171 12923045 13143333 13150762 12957121 12580770 12045996 11383931 10632832
12843 10632832 9835720 9034741 8263694 7541875 6872555 6247175 5652855 5078646 4517174
12834D517174n54896n55752n64175n75665n81554n73491n47620n04557m45895
12825c86431l71697k81203j74498n2239Q5470K37814L99398N57332O92534P84579
12815A491059Q16984P79985O70253M89205K42908n5246l81569p03081r83745j193170
12805A173583j313831j344546j299456j202521j079092r47716q15180o76324n18846
12796h023929l31991j15352J16981L39035N20059O32667O60438O03677M80957
12787e117458L24769J72862N8615K715Q109O0914J38124K17975K86438L37571
12777c509366L70921L89336L97297L98745L95387L86708L70947L45441L06770
12768a47814K52573J84909J11717M3140j5955p0823j33195k10615k97670l77226
$$ plain form
12834 4517174 3962278 3406526 2842351 2266686 1685132 1111641 564021 59464 -386431
12825 -386431 -758128 -1039331 -1213829 -1266068 -1180598 -942784 -543386 13946 706480 1491059
12815 1491059 2308043 3088028 3758281 4247486 4490394 4435148 4053579 3350498 2366753 1173583
12805 1173583 -140248 -1484794 -2784250 -3986771 -5065863 -6013579 -6828759 -7505083 -8023929
12796 -8023929 -8355920 -8471272 -8354291 -8015256 -7495197 -6862530 -6202092 -5598415 -5117458
12787 -5117458 -4792689 -4619827 -4561212 -4558497 -4550388 -4489474 -4351350 -4133375 -3846937 -3509366
12777 -3509366 -3138445 -2749109 -2351812 -1953067 -1557680 -1170972 -800025 -454584 -147814
12768 -147814 104759 289668 401385 444525 428570 357747 224552 13937 -283733 -660959
12758f60959m30687m48569m34126m00038l62398l35213l26386l36040l57914l82930
12748d475260m02593m10539m02234l74312l25231k57733j81441j12643p0422p1021
12738g083429j22753k22017l51170m81243n81458o31817o30185n88551n22254
12729a1214877m41531l51680k59330j76614j17270q6963p6528o5324l2810L0682
12719a2792245J21724K29479L42699M52751N53387O41175P17898P91533Q71731
12710h069868R60875J047604J109233J122099J072378R60628P99635O09273M11062
12701B2919K23093N6038q8125k14233l30128m42167n50701o47029p14373p33758
12691c418464o92310n89777m40459k69707j05730L0675J33844K14367K92886L89288
$$ plain form
12758 -660959 -1091646 -1540215 -1974341 -2374379 -2736777 -3071990 -3398376 -3734416 -4092330 -4475260
12748 -4475260 -4877853 -5288392 -5690626 -6064938 -6390169 -6647902 -6829343 -6941986 -7012408 -7083429
12738 -7083429 -7206182 -7428199 -7779369 -8260612 -8842070 -9473887 -10104072 -10692623 -11214877
12729 -11214877 -11656408 -12008088 -12267418 -12444032 -12561302 -12648265 -12724793 -12790117 -12822927 -12792245
12719 -12792245 -12670521 -12441042 -12098343 -11645592 -11092205 -10451030 -9733132 -8941599 -8069868
12710 -8069868 -7108993 -6061389 -4952156 -3830057 -2757679 -1797051 -997416 -388143 22919
12701 22919 246012 302050 213925 -308 -330436 -772603 -1323304 -1970333 -2684706 -3418464
12691 -3418464 -4110774 -4700551 -5141010 -5410717 -5516447 -5485772 -5351928 -5137561 -4844675 -4455387
12681d455387N11701O50723P83232Q84935R42940R58216R36519Q77173P70525
12672B860577O05810L82429J16412j61343m13797o09174p30025p76445p63176
12663E11268p12373o44771n72417m96602m11671l11334j93057n9935P8084K04419
12653b608389L00701L55933L73217L67298L54195L41450L26330L01619K62754
12644C75108K10509J48785Q1242J0440o0448j25832j77542k06068k02536j61716
12634a08058q5703J3739J16393J98883K42325K39285J96942J34283P4357L5090
12624A057536K2436K7928L1782J1883m4284j31723k30006l14240l66957l83393
12614c19038l68842l32230k80940k19573j52281q5614k8207J3524M0165N9926
$$ plain form
12681 -4455387 -3943686 -3292963 -2509731 -1624796 -681856 276360 1212879 2090052 2860577
12672 2860577 3466387 3848816 3965228 3803885 3390088 2780914 2050889 1274444 511268
12663 511268 -201105 -845876 -1418293 -1914895 -2326566 -2637900 -2830957 -2890892 -2812808 -2608389
12653 -2608389 -2307688 -1951755 -1578538 -1211240 -857045 -515595 -189265 112354 375108
12644 375108 585617 734402 815644 826084 765636 639804 462262 256194 53658 -108058
12634 -108058 -193761 -180022 -63629 135254 377579 616864 813806 948089 1022446 1057536
12624 1057536 1079972 1107900 1139682 1151565 1107281 975558 745552 431312 64355 -319038
12614 -319038 -687880 -1020110 -1301050 -1520623 -1672904 -1758518 -1786725 -1773201 -1733036 -1673110
12604a673110Q4229J22391J79893K60118L65160M92453O29496P52480Q32126Q44326
12594B889562P79686O47658M74492K96703J52245P1119O7223J33560K43191L57154
12584F112593M37521M60716M25433L51884K72681K19188K09497K43590L07167
12575I040270L80334M45458M90772N10081N00728M62084L95577L05379J97799
12566A2728482P9311m3901j62966k63385l28147l47407l27267k89472k61420k63214
12556A0520614k98726l53710m00872m10432l62491k55642j07574N1898J90546
12547H573611K81269L06040K58417J46609m455j56551k69239l14643k87480k04376
12537H329202r3615J7522J10941J79102K21823K42064K43031K27421J98410J60769
$$ plain form
12604 -1673110 -1588881 -1466490 -1286597 -1026479 -661319 -168866 460630 1213110 2045236 2889562
12594 2889562 3669248 4316906 4791398 5088101 5240346 5311465 5378688 5512248 5755439 6112593
12584 6112593 6550114 7010830 7436263 7788147 8060828 8280016 8489513 8733103 9040270
12575 9040270 9420604 9866062 10356834 10866915 11367643 11829727 12225304 12530683 12728482
12566 12728482 12807793 12763892 12600926 12337541 12009394 11661987 11334720 11045248 10783828 10520614
12556 10520614 10221888 9868178 9467306 9056874 8694383 8438741 8331167 8383065 8573611
12547 8573611 8854880 9160920 9419337 9565946 9561491 9404940 9135701 8821058 8533578 8329202
12537 8329202 8235587 8253109 8364050 8543152 8764975 9007039 9250070 9477491 9675901 9836670
12527I836670J20107P9935L9247o070n8058j11915j56363j79787j77895j56859
12517I229012j28936j03662q2247o0323l6187j6014j0885k8799o8657j19551j64468
12506H409283j86758j77725j41652r4199n4754l8804n5154j07104j93471l08058
12496G051604m39253n71479o88346p76527q28934q45688q32604p99228p58177
12487E11368p24580p12749p30265p73665q29419q79503r07206q99615q46901p41790
12477g534325n82454l78159j52215O3008K38055L57768M24723M54053M65171M75821
12467f168554M99667N45074O13090O95459P75496Q33087Q51291Q20290P37649
12458B02549O07919M44066K68418J08474j2802q6451j20151j32352j42222j61545
$$ plain form
12527 9836670 9956777 10036712 10075959 10069889 10011831 9899916 9743553 9563766 9385871 9229012
12517 9229012 9100076 8996414 8914167 8853844 8817657 8801643 8790758 8761959 8693302 8573751 8409283
12506 8409283 8222525 8044800 7903148 7808949 7754195 7715391 7660237 7553133 7359662 7051604
12496 7051604 6612351 6040872 5352526 4575999 3747065 2901377 2068773 1269545 511368
12487 511368 -213212 -925961 -1656226 -2429891 -3259310 -4138813 -5046019 -5945634 -6792535 -7534325
12477 -7534325 -8116779 -8494938 -8647153 -8584145 -8346090 -7988322 -7563599 -7109546 -6644375 -6168554
12467 -6168554 -5668887 -5123813 -4510723 -3815264 -3039768 -2206681 -1355390 -535100 202549
12458 202549 810468 1254534 1522952 1631426 1618624 1532173 1412022 1279670 1137448 975903
12448I75903j92324k29572k65677k93040l04936k96785k68634k26370j78629j30174
12438a410238p6910p167R1124K23012L84313N65030P54288R42583J120758J277610
12428C864403J398096J463634J455753J362862J186874R45365O67877L88926J40888
12419A2874678n2181j79520k45625k67043k64440k53731k40934k23273j95515
12410A0952416j57508j18087r2995r8541j45014k32819l52035m84786o09897p09054
12400G951680p72771q03613q14358q21197q35402q58621q84439r03897r09918
12391C47464q97895q63986q04510p17911o07674m83329l57896k43041j45209o5346
12381d839333j891M5523P4198P9235N7000R999m9824j02785j28399j13344n5197
$$ plain form
12448 975903 783579 554007 288330 -4710 -309646 -606431 -875065 -1101435 -1280064 -1410238
12438 -1410238 -1487148 -1494315 -1403191 -1180179 -795866 -230836 523452 1466035 2586793 3864403
12428 3864403 5262499 6726133 8181886 9544748 10731622 11676987 12344864 12733790 12874678
12419 12874678 12822497 12642977 12397352 12130309 11865869 11612138 11371204 11147931 10952416
12410 10952416 10794908 10676821 10583826 10485285 10340271 10107452 9755417 9270631 8660734 7951680
12400 7951680 7178909 6375296 5560938 4739741 3904339 3045718 2161279 1257382 347464
12391 347464 -550431 -1414417 -2218927 -2936838 -3544512 -4027841 -4385737 -4628778 -4773987 -4839333
12381 -4839333 -4841224 -4795701 -4721503 -4642268 -4585268 -4575269 -4625093 -4727878 -4856277 -4969621 -5024818
12370e024818L8842J55032K75540L81557M58840N03629N23929N33919N44974N59579
12360a048977N71392N69988N46720M98941M31452L54578K79181K10938J47334
12351B561547P9473k387j02771k16955l29871m18567m58962m35666l50147k21507
12341A04187p8538N1789J52156K16073K45310K47883K37359K30793K42945K78745
12331A928702L29106L74259L93292L73863L16260K30932J33143L8933l6198p7292
12321D005000p1173j0423J01377K47470M02458N41818O49816P20726P54702P53750
12311H095521P20937O61428N82628M93107M01809L18082K51275K08714J93066
12302A1926567K01436K27256K62884L00029L27975L32983L01879K28841J21051
$$ plain form
12370 -5024818 -4985976 -4830944 -4555404 -4173847 -3715007 -3211378 -2687449 -2153530 -1608556 -1048977
12360 -1048977 -477585 92403 639123 1138064 1569516 1924094 2203275 2414213 2561547
12351 2561547 2641020 2638633 2535862 2318907 1989036 1570469 1111507 675841 325694 104187
12341 104187 25649 77438 229594 445667 690977 938860 1176219 1407012 1649957 1928702
12331 1928702 2257808 2632067 3025359 3399222 3715482 3946414 4079557 4118490 4082292 4005000
12321 4005000 3933827 3923404 4024781 4272251 4674709 5216527 5866343 6587069 7341771 8095521
12311 8095521 8816458 9477886 10060514 10553621 10955430 11273512 11524787 11733501 11926567
12302 11926567 12128003 12355259 12618143 12918172 13246147 13579130 13881009 14109850 14230901
12293A4230901r99j09791j81232k03822j81498j29525o7873j6517P436o633n8755
12282A3281692j37412k23921k99936l53965l84022l95371l94550l83718l60190
12273A0348607l21443k70081k13106j56024r7354k8324O1249J73175K92357L86597
12263A0175653M18549L64088K24254K2137k11037m48154o68775q55012r89380
12254H032323j059061j062997j015112r40368q66021q12952p90491p95278q13282
12245a23239q24259q08444p54603o66220n61613m66311m01609l76340l85793m15635
12235e784066m46641m58739m35617l69329k62119j24200L0074J84262L20111M18550
12225f927714M63303M46185L71218K54402J17802j9421j47120k62904l65448m49235
$$ plain form
12293 14230901 14229902 14120111 13938879 13735057 13553559 13424034 13356161 13339644 13347080 13340447 13281692
12282 13281692 13144280 12920359 12620423 12266458 11882436 11487065 11092515 10708797 10348607
12273 10348607 10027164 9757083 9543977 9387953 9290599 9262275 9323524 9496699 9789056 10175653
12263 10175653 10594202 10958290 11182544 11204681 10993644 10545490 9876715 9021703 8032323
12254 8032323 6973262 5910265 4895153 3954785 3088764 2275812 1485321 690043 -123239
12245 -123239 -947498 -1755942 -2510545 -3176765 -3738378 -4204689 -4606298 -4982638 -5368431 -5784066
12235 -5784066 -6230707 -6689446 -7125063 -7494392 -7756511 -7880711 -7850637 -7666375 -7346264 -6927714
12225 -6927714 -6464411 -6018226 -5647008 -5392606 -5274804 -5294225 -5441345 -5704249 -6069697 -6518932
12215f518932n05355n26243n08592m51872l55031k15453l1519J93114M46478P08661
12205g764744R55531J163683J314209J394722J400813J337246J216882J056000
12197B074342Q68098O60841M38355K06320k4650k39581m22615n61099o48641o86100
12187A665270o79979o38908n70798m83078l85339k90154k08662j43377q5407k0622
12177a841054N9206J49569K36199L04580L48082L69560L77115L78079L74755L63607
12167A119698L37704K91177K23376J40264N1753l2966j08198j70691k17284k45100
12157A389733k54265k48972k34418k12449j80479j34492p2916J368Q1051J55553
12147B89714K13259K44531K44312K13008J55405P8672q857r7055j72510k19271
$$ plain form
12215 -6518932 -7024287 -7550530 -8059122 -8510994 -8866025 -9081478 -9112997 -8919883 -8473405 -7764744
12205 -7764744 -6809213 -5645530 -4331321 -2936599 -1535786 -198540 1018342 2074342
12197 2074342 2942440 3603281 4041636 4247956 4223306 3983725 3561110 3000011 2351370 1665270
12187 1665270 985291 346383 -224415 -707493 -1092832 -1382986 -1591648 -1735025 -1820432 -1841054
12177 -1841054 -1781848 -1632279 -1396080 -1091500 -743418 -373858 3257 381336 756091 1119698
12167 1119698 1457402 1748579 1971955 2112219 2163972 2131006 2022808 1852117 1634833 1389733
12157 1389733 1135468 886496 652078 439629 259150 124658 51742 53110 134161 289714
12147 289714 502973 747504 991816 1204824 1360229 1438901 1430044 1332989 1160479 941208
12137I41208k23694j81158r9630K542J02614J79417K17615K10128J58262O9082
12127A376386m8523j86100l35048m85127o24597p42072q28342q77580q88883q68263
12117d508149q28288p83063p40435o97318o42053n61981m50817l12120j58835
12108i683059j0163J13505J96938K35738K38715K25016K16448K28439K64546L17425
12098g656452L74394M23096M54816M66339M61365M50259M46868M63721N07981
12089c607613N78755O65444P48760Q07006Q25965Q05521P57163O94362O24262
12080B899625N47133M61999L71504K81031J93643J06674J4083q7230j92977k92727
12070D302758l74440m26729m36987l89836k71076p6591J79767M64729P31935R34161
$$ plain form
12137 941208 717514 536356 436726 439268 541882 721299 938914 1149042 1307304 1376386
12127 1376386 1327863 1141763 806715 321588 -303009 -1045081 -1873423 -2751003 -3639886 -4508149
12117 -4508149 -5336437 -6119500 -6859935 -7557253 -8199306 -8761287 -9212104 -9524224 -9683059
12108 -9683059 -9693222 -9579717 -9382779 -9147041 -8908326 -8683310 -8466862 -8238423 -7973877 -7656452
12098 -7656452 -7282058 -6858962 -6404146 -5937807 -5476442 -5026183 -4579315 -4115594 -3607613
12089 -3607613 -3028858 -2363414 -1614654 -807648 18317 823838 1581001 2275363 2899625
12080 2899625 3446758 3908757 4280261 4561292 4754935 4861609 4875692 4788462 4595485 4302758
12070 4302758 3928318 3501589 3064602 2674766 2403690 2327099 2506866 2971595 3703530 4637691
12060D637691J037419J030505R24169P40985N04875K38374l4188k86258m95694
12051H297878o53220p64657q44702r06726r54979r83404r81580r44019q76679
12042C87912p96533p25477o83131o81987p25040q04723r02703r91415j039023
12033f962120j018282r16779p43223n25490l00901j03566M5755J43773K01830
12024a0179003K37786K67210K98849L35899L79670M30942M87737N42446N82092
12015f616372N92659N65195N00420M10015L14449K38348K04644K28675L13232
12006c248735M45901O00622P44890Q50602R02681R00350Q51760P67608O58125
11997C473804N32632L99019K63033J29010K207j09534j96664k51309k71438k62953
$$ plain form
12060 4637691 5675110 6705615 7629784 8370769 8875644 9114018 9079830 8793572 8297878
12051 8297878 7644658 6880001 6035299 5128573 4173594 3190190 2208610 1264591 387912
12042 387912 -408621 -1134098 -1817229 -2499216 -3224256 -4028979 -4931682 -5923097 -6962120
12033 -6962120 -7980402 -8897181 -9640404 -10165894 -10466795 -10570361 -10524606 -10380833 -10179003
12024 -10179003 -9941217 -9674007 -9375158 -9039259 -8659589 -8228647 -7740910 -7198464 -6616372
12015 -6616372 -6023713 -5458518 -4958098 -4548083 -4233634 -3995286 -3790642 -3561967 -3248735
12006 -3248735 -2802834 -2202212 -1457322 -606720 295961 1196311 2048071 2815679 3473804
11997 3473804 4006436 4405455 4668488 4797498 4799705 4690171 4493507 4242198 3970760 3707807
11987C707807k37413k05913j73384j37531r2755l6019K8337Q6757J19463J08385
11977C167734M5871o1706j96745l35257m49905n12676n00484m03072k28740m286
11967E20734K31462M38548N87332O65004O73701O22792N22164L81486K14104M0336
11957D897663j13890k22943k68658k44960j58220k4568J33500K90306M20680N04711
11947E213621N32524N07380M46000L75175L23973L12800L44103M00933M55233
11938H911742M80436M59939L87926K66117J01634r3583l04868n19246p28925r30846
11928H030326j122894j299764j450735j561068j617529j615579j562339j471153
11920c670735j350758j197494r97009p34958m10224m2830L28685O59498R13170
$$ plain form
11987 3707807 3470394 3264481 3091097 2953566 2860811 2824792 2853129 2939886 3059349 3167734
11977 3167734 3213605 3151899 2955154 2619897 2169992 1657316 1156832 753760 525020 520734
11967 520734 752196 1190744 1778076 2443080 3116781 3739573 4261737 4643223 4857327 4897663
11957 4897663 4783773 4560830 4292172 4047212 3888992 3864424 3997924 4288230 4708910 5213621
11947 5213621 5746145 6253525 6699525 7074700 7398673 7711473 8055576 8456509 8911742
11938 8911742 9392178 9852117 10240043 10506160 10607794 10514211 10209343 9690097 8961172 8030326
11928 8030326 6907432 5607668 4156933 2595865 978336 -637243 -2199582 -3670735
11920 -3670735 -5021493 -6218987 -7215996 -7950954 -8361178 -8404008 -8075323 -7415825 -6502655
11911f502655J070539J129996J102924J008965Q72306P17798N66758M33741L25508
11902G25880K42186J79903J33344R7122O6621L9863J9916J4619L1945P3766J32879
11891A758044J95010K43876K66655K58154K21916J67317J04550M1587j4951n7344
11881C184814p6363o3969j7519N6432J40538K09112K35501K02220J09097k4675
11871C955188j65471k75071l22286k93297j97531o5817O0531J46458J77678J64417
11861C184799J31942J03920Q9130P9242N7612J2512n3972j26399j84787k15948
11851C078051k21217k17206k29736k83329l90279n43872p18813q78626r86887
11842a391914j018180r64988q38048o60258m57313k49774m9608J38698L14451
$$ plain form
11911 -6502655 -5432116 -4302120 -3199196 -2190231 -1317925 -600127 -33369 400372 725880
11902 725880 968066 1147969 1281313 1378435 1445056 1484919 1504835 1519454 1551399 1625165 1758044
11891 1758044 1953054 2196930 2463585 2721739 2943655 3110972 3215522 3257109 3242158 3184814
11881 3184814 3108451 3044482 3026963 3083395 3223933 3433045 3668546 3870766 3979863 3955188
11871 3955188 3789717 3514646 3192360 2899063 2701532 2635715 2696246 2842704 3020382 3184799
11861 3184799 3316741 3420661 3509791 3589033 3646645 3659157 3605185 3478786 3293999 3078051
11851 3078051 2856834 2639628 2409892 2126563 1736284 1192412 473599 -405027 -1391914
11842 -1391914 -2410094 -3375082 -4213130 -4873388 -5330701 -5580475 -5630083 -5491385 -5176934
11833e176934M76966O23680P50477Q52510R23927R57352R46099Q89530P97652
11824B041259O89728N86075M97791M21135L40374K37689J03998n5936k26228l86545
11814D249340n17409o03016o33929o10012n40223m37273l10877j65781n960J59742
11804E84602L16029M44486N29015N60390N38472M71291L71202K50133J17043k0972
11794D161691j55806k76613l70409m24069m26947l74119k69551j26229L8859K12611
11784A989418L90096N70460P46830Q98721R94815J006497R24360P66929N75455
11775H863581L97379K68276K02209J93580K25605K77674L28294L56267L44417
11766A1457282K85904J88448P2041l9381j27407j84658k14579k26692k30309k30107
$$ plain form
11833 -5176934 -4699968 -4076288 -3325811 -2473301 -1549374 -592022 354077 1243607 2041259
11824 2041259 2730987 3317062 3814853 4235988 4576362 4814051 4918049 4862113 4635885 4249340
11814 4249340 3731931 3128915 2494986 1884974 1344751 907478 596601 430820 424860 584602
11804 584602 900631 1345117 1874132 2434522 2972994 3444285 3815487 4065620 4182663 4161691
11794 4161691 4005885 3729272 3358863 2934794 2507847 2133728 1864177 1737948 1776807 1989418
11784 1989418 2379514 2949974 3696804 4595525 5590340 6596837 7521197 8288126 8863581
11775 8863581 9260960 9529236 9731445 9925025 10150630 10428304 10756598 11112865 11457282
11766 11457282 11743186 11931634 12003675 11964294 11836887 11652229 11437650 11210958 10980649 10750542
11756A0750542k25844k15655j99451j79737j60273j45125j38969j47202j74739
11747I163547k24424k96360l87695m91733n96675o85772p39767p41220o79652
11738D320249n56314l86368j96144j5711J29526K24411K65820K61890K29149J87159
11728D463667J52178J33179J32351J48316J78849K21613K73517L29443L80991
11719F414104M16928M26937M07325L64185L10444K58543K14471J77555J45187
11710I135679J17534R7821Q8047Q4237P5954N1259L599o4531j43696k23187k95530
11699H927186l56719m03055m28270m23709l81564k99188j82577m7559Q2810J85104
11689F672459K44168K58427K38204J98352J50751J01475N2833O539l5313p0934
$$ plain form
11756 10750542 10524698 10309043 10109592 9929855 9769582 9624457 9485488 9338286 9163547
11747 9163547 8939123 8642763 8255068 7763335 7166660 6480888 5741121 4999901 4320249
11738 4320249 3763935 3377567 3181423 3165712 3295238 3519649 3785469 4047359 4276508 4463667
11728 4463667 4615845 4749024 4881375 5029691 5208540 5430153 5703670 6033113 6414104
11719 6414104 6831032 7257969 7665294 8029479 8339923 8598466 8812937 8990492 9135679
11710 9135679 9253213 9351034 9439081 9523318 9599272 9650531 9654130 9589599 9445903 9222716 8927186
11699 8927186 8570467 8167412 7739142 7315433 6933869 6634681 6452104 6404545 6487355 6672459
11689 6672459 6916627 7175054 7413258 7611610 7762361 7863836 7916669 7923208 7887895 7816961
11679G816961r8619j15164j15876r8289o6969l4265j5814k4568o7295j43330k43547
11668F793225l50047m38719m84949m70237l87499k43864n9782J36172L14713M51624
11658E260637N30550N44998N01216M19354L28487K55509K13827J99385J96578
11649H450541J89516J70584J41179J06224O8551K7711j6936o2379j00933j23435
11639H850623j25270j10704r1305p8769p7871q4878r1253q8501p1690m2049q581
11628G979752J3636R654k7633r3380j72656k46430k97983l17286l02890k61594
11618F283190k05720j48161r7050n3600j5085J9595M6864O0599N6827L6277K838
11607E986574l9832r0247j48286k13148k82249l51779m17947m77897n30596n78139
$$ plain form
11679 7816961 7718342 7603178 7487302 7389013 7322044 7287779 7271965 7247397 7180102 7036772 6793225
11668 6793225 6443178 6004459 5519510 5049273 4661774 4417910 4358128 4494300 4809013 5260637
11658 5260637 5791187 6336185 6837401 7256755 7585242 7840751 8054578 8253963 8450541
11649 8450541 8640057 8810641 8951820 9058044 9126595 9154306 9137370 9074991 8974058 8850623
11639 8850623 8725353 8614649 8523344 8444575 8366704 8281826 8190573 8102072 8030382 7988333 7979752
11628 7979752 7993388 8003042 7975409 7882029 7709373 7462943 7164960 6847674 6544784 6283190
11618 6283190 6077470 5929309 5832259 5778659 5763574 5783169 5830033 5890632 5947459 5983736 5986574
11607 5986574 5946742 5856495 5708209 5495061 5212812 4861033 4443086 3965189 3434593 2856454
11597B856454o26195o81831p49214q26214r04070r69157j005109r95197r25789
11588d826322p90049n90065l37161n1590K38413N00195P03734Q30019Q76642Q57338
11578b588846P94616P08571O08283M91867L54714J98464L3421j25824k65953l77232
11568a67919m52904m88181m80244m29409l41153k27412j04834J0356J07823J84786
11558b389091K42893K82987L01348K89714K39079J45484J4433j39034k94676m32899
11548a739762n38814o03523o23634o00119n36672m37676l06618j46192L9542K42504
11538e250964M49880O46729Q20505R63939J073523J144724J168593J133985J034620
11529C185534Q75532O73682M52882K37599M9447r4374j83575k18942k15137j98091
$$ plain form
11597 2856454 2230259 1548428 799214 -27000 -931070 -1900227 -2905336 -3900533 -4826322
11588 -4826322 -5616371 -6206436 -6543597 -6595187 -6356774 -5856579 -5152845 -4322826 -3446184 -2588846
11578 -2588846 -1794230 -1085659 -477376 14491 369205 567669 601090 475266 209313 -167919
11568 -167919 -620823 -1109004 -1589248 -2018657 -2359810 -2587222 -2692056 -2681700 -2573877 -2389091
11558 -2389091 -2146198 -1863211 -1561863 -1272149 -1033070 -887586 -873153 -1012187 -1306863 -1739762
11548 -1739762 -2278576 -2882099 -3505733 -4105852 -4642524 -5080200 -5386818 -5533010 -5493468 -5250964
11538 -5250964 -4801084 -4154355 -3333850 -2369911 -1296388 -151664 1016929 2150914 3185534
11529 3185534 4061066 4734748 5187630 5425229 5474676 5380302 5196727 4977785 4762648 4564557
11519D564557j96130k28557k98031l91498m89284n76694o50726p17465p81889
11510B34283q37473q64165q37874p45394n93913m08768k22658o4500M6945J04657
11500d188860J12120Q0596K5995l4276q5400j20675j44950j71010k09030k56799
11490d992289k98568l13046k84500k11185j08371m339P0725R8758Q2435M2558
11480e917822O285n837J3108N7080J12649J65493K05184K27268K32484K23759
11470d680349K02946J70014J25390P2930K0121k4721n5478o9441o7327n3227l3904
11459d393046j6322m340K817Q896J6774K5092K7615J6168j4073n9677j07258j36272
11447d633626j25550o1219N7174K14947L85671N38218O45112O90008O71902O03725
$$ plain form
11519 4564557 4368427 4139870 3841839 3450341 2961057 2384363 1733637 1016172 234283
11510 234283 -603190 -1467355 -2305229 -3050623 -3644536 -4053304 -4275962 -4340462 -4293517 -4188860
11500 -4188860 -4076740 -3996144 -3970149 -4004425 -4089825 -4210500 -4355450 -4526460 -4735490 -4992289
11490 -4992289 -5290857 -5603903 -5888403 -6099588 -6207959 -6212298 -6141573 -6042815 -5960380 -5917822
11480 -5917822 -5911537 -5917374 -5904266 -5847186 -5734537 -5569044 -5363860 -5136592 -4904108 -4680349
11470 -4680349 -4477403 -4307389 -4181999 -4109069 -4088948 -4113669 -4169147 -4238588 -4305915 -4359142 -4393046
11459 -4393046 -4409368 -4413708 -4410891 -4401995 -4385221 -4360129 -4332514 -4316346 -4330419 -4390096 -4497354 -4633626
11447 -4633626 -4759176 -4820395 -4763221 -4548274 -4162603 -3624385 -2979273 -2289265 -1617363 -1013638
11437a013638N05281L94270K80822J68131N6672n2926j60920k71398l92802n33559
11427a020067o95016q66568j026393j147013j202282j173525j054740q56619o06782
11418i649005l42958r9759J04289K70869M14506N49806O82656Q08922R16910R89364
11408e354400J006399R53047Q29893O58924M77914L25145K23582J73546J56507
11399e49443J45636J15925M9573o2341k18488m05851o01517p79900r22115j021324
11389d249845j080836j107471j105394j074431j013491r26182q23490p19559o22008
11380a2722707n23931m05100k43064k6804K36529N25128Q11202J067539J269781
11371a0011427J397970J440286J396999J280975J114459R24599P38795N79302
$$ plain form
11437 -1013638 -508357 -114087 166735 334866 391538 338612 177692 -93706 -486508 -1020067
11427 -1020067 -1715083 -2581651 -3608044 -4755057 -5957339 -7130864 -8185604 -9042223 -9649005
11418 -9649005 -9991963 -10091722 -9987433 -9716564 -9302058 -8752252 -8069596 -7260674 -6343764 -5354400
11408 -5354400 -4348001 -3394954 -2565061 -1906137 -1428223 -1103078 -879496 -705950 -549443
11399 -549443 -403807 -287882 -238309 -300650 -519138 -924989 -1526506 -2306406 -3228521 -4249845
11389 -4249845 -5330681 -6438152 -7543546 -8617977 -9631468 -10557650 -11381140 -12100699 -12722707
11380 -12722707 -13246638 -13651738 -13894802 -13921606 -13685077 -13159949 -12348747 -11281208 -10011427
11371 -10011427 -8613457 -7173171 -5776172 -4495197 -3380738 -2456139 -1717344 -1138042
11363a138042M58507L78557L35868L25786L42391L74776M05584M15455L91239
11354B290121L32674K53543J76563J24620J12469J41750J99826K62756L03586
11345D197908L04558K66722K09306J58456J33571J39978J69590K05410K26398
11336F011897K12709J52033M5326r2117k36988l69469m82299n80233o69796p47497
11326C243566p95766p89533p09111n51862l36579r8355J23257K96781M06877M56154
11316A245429M61041M42757M16866L87942L53647L14414K78811K58398K56004
11307D415309K58024K38218J71397M7847j20682l05793m72864n90287o35002n95580
11297B410587m73840k84497n2971J87779M02078N59873O47332O73627O67744O65152
$$ plain form
11363 -1138042 -679535 -300978 34890 360676 703067 1077843 1483427 1898882 2290121
11354 2290121 2622795 2876338 3052901 3177521 3289990 3431740 3631566 3894322 4197908
11345 4197908 4502466 4769188 4978494 5136950 5270521 5410499 5580089 5785499 6011897
11336 6011897 6224606 6376639 6421965 6329848 6092860 5723391 5241092 4660859 3991063 3243566
11326 3243566 2447800 1658267 949156 397294 60715 -37640 85617 382398 789275 1245429
11316 1245429 1706470 2149227 2566093 2954035 3307682 3622096 3900907 4159305 4415309
11307 4415309 4673333 4911551 5082948 5130795 5010113 4704320 4231456 3641169 3006167 2410587
11297 2410587 1936747 1652250 1599279 1787058 2189136 2749009 3396341 4069968 4737712 5402864
11287E402864O91058P49103Q21251Q78203Q93876Q55615P65824O36850M84151
11278A2178795L21463J59042M293j36675k58257l56095m28676m78162n09292n26538
11268I969898n31235n21132m93031m46320l84432l14071k44201j84861j43426
11259F707189j18445r6584n8468Q307R8146J86808K41985K38285J67911M2172
11249G417306j14939k75761m16276n20922n85542o17445o30571o36648o37355
11240B981847o23129n80186n01391l93539k75605j69066q7155l0235J0515M4618
11230C76674P4759R4949R5261O9634K1154l8130r0961j19454j10236o0862J5342
11219C28130R1093J35191J25993O1047m1836j52205k39256k82416k75297k23523
$$ plain form
11287 5402864 6093922 6843025 7664276 8542479 9436355 10291970 11057794 11694644 12178795
11278 12178795 12500258 12659300 12663593 12526918 12268661 11912566 11483890 11005728 10496436 9969898
11268 9969898 9438663 8917531 8424500 7978180 7593748 7279677 7035476 6850615 6707189
11259 6707189 6588744 6492160 6433692 6441999 6540145 6726953 6968938 7207223 7375134 7417306
11249 7417306 7302367 7026606 6610330 6089408 5503866 4886421 4255850 3619202 2981847
11240 2981847 2358718 1778532 1277141 883602 607997 438931 351776 321541 332056 376674
11230 376674 451433 546382 641643 711277 732431 694301 603340 483886 373650 312788 328130
11219 328130 419223 554414 680407 741454 699618 547413 308157 25741 -249556 -473079
11209d73079j41228m9195K7172O3106M2195l7591j62947l09751m51243n66774
11199b059335o46920o91973p04947o84542o23644n14564l57018j63051M4316K37886
11189f163792L94752N02467N60514N77251N64888N35434M98360M58375M12926
11180a658825L52324K65196J46858M208j46550k86779m01977m85516n39092n69138
11170c319291n79458n64446n09400m00111k35611l4101J73513L58235N05171O15161
11160c990338O97220P60161Q09450Q47350Q71045Q68940Q21456P10530N32879
11151B928693L06772O6879j48915l12060m09708m44652m30866l86210l24797k53272
11141E91864j74028r2845k3812J3576L710n5646j49045k46085l10245l10893k34048
$$ plain form
11209 -473079 -614307 -663502 -636330 -573224 -531029 -568620 -731567 -1041318 -1492561 -2059335
11199 -2059335 -2706255 -3398228 -4103175 -4787717 -5411361 -5925925 -6282943 -6445994 -6401678 -6163792
11189 -6163792 -5769040 -5266573 -4706059 -4128808 -3563920 -3028486 -2530126 -2071751 -1658825
11180 -1658825 -1306501 -1041305 -894447 -890239 -1036789 -1323568 -1725545 -2211061 -2750153 -3319291
11170 -3319291 -3898749 -4463195 -4972595 -5372706 -5608317 -5642418 -5468905 -5110670 -4605499 -3990338
11160 -3990338 -3293118 -2532957 -1723507 -876157 -5112 863828 1685284 2395814 2928693
11151 2928693 3235465 3302344 3153429 2841369 2431661 1987009 1556143 1169933 845136 591864
11141 591864 417836 324991 301179 314755 318465 262819 113774 -132311 -442556 -753449 -987497
11130i87497q7414J02116K96904M59683N63854N99766N74920N08669M24606L43864
11120B799471K80572K39321K15467J99382J83270J66011J52186J46452J48628
11111D530760J53683J56216J56174J62647J93391K67911L95119N62373P35267
11102G313541Q71118R38285R28656Q56459P46745O22466M97649L78554K69213
11093A3422686J75269J02452N1605J5751j7318n8931j15008j86048k70059l64741
11083A2755658m67121n72007o71572p56660q18648q51104q51538q23072p74259
11074F169677p16059o57632o04005n56577n14955m78689m48959m29943m28217
11065A334641m49201m92621n50484o09007o52894o69531o51945o00297n21518
$$ plain form
11130 -987497 -1074911 -972795 -675891 -216208 347646 947412 1522332 2031001 2455607 2799471
11120 2799471 3080043 3319364 3534831 3734213 3917483 4083494 4235680 4382132 4530760
11111 4530760 4684443 4840659 4996833 5159480 5352871 5620782 6015901 6578274 7313541
11102 7313541 8184659 9122944 10051600 10908059 11654804 12277270 12774919 13153473 13422686
11093 13422686 13597955 13700407 13752012 13767763 13750445 13691514 13576506 13390458 13120399 12755658
11083 12755658 12288537 11716530 11044958 10288298 9469650 8618546 7767008 6943936 6169677
11074 6169677 5453618 4795986 4191981 3635404 3120449 2641760 2192801 1762858 1334641
11065 1334641 885440 392819 -157665 -766672 -1419566 -2089097 -2741042 -3341339 -3862857
11056c862857m26608l26440k28147j34171m3994M3479J29198K14947L03662L96984
11046c933947M91047N74394O31537O51294O34649N96131N56927N34068N32615
11037A268715N44879N55530N48972N16053M57826L83887L04959K24858J39225
11028D944904M2742o2400j65305k53025l18378l63159l96253m28390m64965n00065
11018B035706n16805m95631m24913l06016j50864K3167J96516L48910M61547N20970
11008A692587N23100M74860L91487K90462J86178Q9393J0637l7634m3951m055
10998C573064P4536J72928K66169L31298L54903L36802K87990K24142J58327R6944
10988E877103M0872r743n1779q0294r2966r2085q1264o0886k8144J8067P2791
$$ plain form
11056 -3862857 -4289465 -4615905 -4844052 -4978223 -5022217 -4978738 -4849540 -4634593 -4330931 -3933947
11046 -3933947 -3442900 -2868506 -2236969 -1585675 -951026 -354895 202032 736100 1268715
11037 1268715 1813594 2369124 2918096 3434149 3891975 4275862 4580821 4805679 4944904
11028 4944904 4987646 4925246 4759941 4506916 4188538 3825379 3429126 3000736 2535771 2035706
11018 2035706 1518901 1023270 598357 292341 141477 164644 361160 710070 1171617 1692587
11008 1692587 2215687 2690547 3082034 3372496 3558674 3648067 3658704 3621070 3577119 3573064
10998 3573064 3647600 3820528 4086697 4417995 4772898 5109700 5397690 5621832 5780159 5877103
10988 5877103 5917975 5908232 5856453 5776159 5683193 5591108 5509844 5448958 5420814 5438881 5511672
10977E511672J25111J61664J70589J44877Q4949r95j00007j98593k84484l45767
10967E269016l71371l55633l03499k30184j54047q8511l9591r164J577p002k8713
10956C682878m8656m5800j561Q9613K14493L45473M53767N23358N56700N69424
10946F339689N78702N93450O11787O25283O25247O06978N71468N25767M81342
10937A1559713M49325M35148M37579M53063M79476N13497N43710N47800M98993
10928A5918304L78699J87391n2666l04202n27464o91970p82377p97758p47076
10919A2580881o43633m99935l24486j22430R9555L27282N36875O99301P89778
10910A3443188P96323P22158N81607L93861J79027m3322k55542m44180o01666
$$ plain form
10977 5511672 5636783 5798447 5969036 6113913 6198862 6197867 6097860 5899267 5614783 5269016
10967 5269016 4897645 4542012 4238513 4008329 3854282 3765771 3726180 3717016 3718593 3711591 3682878
10956 3682878 3634222 3588422 3586861 3676474 3890967 4236440 4690207 5213565 5770265 6339689
10946 6339689 6918391 7511841 8123628 8748911 9374158 9981136 10552604 11078371 11559713
10937 11559713 12009038 12444186 12881765 13334828 13814304 14327801 14871511 15419311 15918304
10928 15918304 16297003 16484394 16431728 16127526 15600062 14908092 14125715 13327957 12580881
10919 12580881 11937248 11437313 11112827 10990397 11089952 11417234 11954109 12653410 13443188
10910 13443188 14239511 14961669 15543276 15937137 16116164 16072842 15817300 15373120 14771454
10901A4771454p25721q16954q76252r03598q98769q63106q00718p18777o27831
10892G539728n42074m77126m43602m39596m48164m42931l98999l03441j61355
10883C882440L844J55281K51847K60653J70554J451j97707l65226m50624m33338
10873C279175l27008j69895q362J19377J94257K18719K09714J85874J55892J14971
10863C972714N1924l7419j40528k30631k80084k73985k14074j12941J4043J53316
10853B902335K94334M29384N52159O54854P25835P50749P17363O21658M72290
10844H120961K91720J12935k8616j05761j08106m3621O6821J97469L23124M20602
10834I247528M68706M49618L52272J75793o9174l61894o74753r77419j241587
$$ plain form
10901 14771454 14045733 13228779 12352527 11448929 10550160 9687054 8886336 8167559 7539728
10892 7539728 6997654 6520528 6076926 5637330 5189166 4746235 4347236 4043795 3882440
10883 3882440 3886284 4041565 4293412 4554065 4724619 4726070 4528363 4163137 3712513 3279175
10873 3279175 2952167 2782272 2773910 2893287 3087544 3306263 3515977 3701851 3857743 3972714
10863 3972714 4024638 3987219 3846691 3616060 3335976 3061991 2847917 2734976 2749019 2902335
10853 2902335 3196669 3626053 4178212 4833066 5558901 6309650 7027013 7648671 8120961
10844 8120961 8412681 8525616 8497000 8391239 8283133 8239512 8306333 8503802 8826926 9247528
10834 9247528 9716234 10165852 10518124 10693917 10624743 10262849 9588096 8610677 7369090
10825G369090j445356j574969j623103j586905j470158j288813j072919q59675
10817c552808o80590n51155m68531m16465l73751l22703k54478j69600p5018J8999
10807f846100J01055J61280J94956K04723J99136J88272J79263J74376J72744
10798e270295J74258J81513J96637K15413K25299K10669J60843P3907m5323j88657
10788d065736l44724m96342o19546o88175o83570o04028m67623l06287j54483
10779h430514l7940L3459O6429P8535Q9326J13846J61261K35807L35870M51373
10769f902548N63475O49099O88584O72717O05836N03485L85608K69412J66308
10760b398024Q3843K9123R755L1191R2541J83995K88301L86388M64285N16947
$$ plain form
10825 7369090 5923734 4348765 2725662 1138757 -331401 -1620214 -2693133 -3552808
10817 -3552808 -4233398 -4784553 -5253084 -5669549 -6043300 -6366003 -6620481 -6790081 -6865099 -6846100
10807 -6846100 -6745045 -6583765 -6388809 -6184086 -5984950 -5796678 -5617415 -5443039 -5270295
10798 -5270295 -5096037 -4914524 -4717887 -4502474 -4277175 -4066506 -3905663 -3831756 -3877079 -4065736
10788 -4065736 -4410460 -4906802 -5526348 -6214523 -6898093 -7502121 -7969744 -8276031 -8430514
10779 -8430514 -8468454 -8434995 -8368566 -8290031 -8200705 -8086859 -7925598 -7689791 -7353921 -6902548
10769 -6902548 -6339073 -5689974 -5001390 -4328673 -3722837 -3219352 -2833744 -2564332 -2398024
10760 -2398024 -2314181 -2285058 -2275303 -2244112 -2151571 -1967576 -1679275 -1292887 -828602 -311655
10750c11655N46431N55993N44643N06041M32129L18871J71021M040j57789k87416
10740B322309l63730l78671l38645k60309j64586p2087N47M4503O1534O2645O2092
10729I75602O9802Q6877J07496J26238J45517J76939K35027L28337M54449O00902
10719C307186P49116Q77767R64934R91074R44480Q27841O60982M75326L01096
10710A0099802J54812L5075p1664j80752l01621m35898n79392p23858q57208r64488
10700F174808j031855j051386j022330r48169q33842o86290n16280l37911j66041
10691d19296j4204J06519J89073K32047K39303K17826J76678J27911Q6619O7210
10681A009686P7414J14799J68809K26386K76305L09564L18193K96522K44973J71622
$$ plain form
10750 -311655 234776 790769 1335412 1841453 2273582 2592453 2763474 2767514 2609725 2322309
10740 2322309 1958579 1579908 1241263 980954 816368 744281 744828 789331 850865 913510 975602
10729 975602 1045404 1132281 1239777 1366015 1511532 1688471 1923498 2251835 2706284 3307186
10719 3307186 4056302 4934069 5899003 6890077 7834557 8662398 9323380 9798706 10099802
10710 10099802 10254614 10289689 10218025 10037273 9735652 9299754 8720362 7996504 7139296 6174808
10700 6174808 5142953 4091567 3069237 2121068 1287226 600936 84656 -253255 -419296
10691 -419296 -433500 -326981 -137908 94139 333442 551268 727946 855857 942476 1009686
10681 1009686 1087100 1201899 1370708 1597094 1873399 2182963 2501156 2797678 3042651 3214273
10671C214273Q8266L894p8460j59384k38828l14439l83478m45390n01204n49005
10661F36245n79754n79618n39798m66703l83366l19830k98830l25344l84612m47943
10651c689553m82293m59476l63338j94965K5297K62200M76598O37218P26601P40825
10641b320886O87722N85963M62326L44788K53695J95496J62039J36120J01630
10632F08893N3491J152l6868m3315j0547N7038J46018K39449L22117L83545M18127
10621B139100M23016L95538L32699K34478J09435k2426j33852k00241k08395j58289
10611B911063n8318Q0065K43002M10893N57197O54341O84188O44823N48363M13068
10601G088685K56979R6531n2050j72158k49043k74938k54408k05051j50851j11830
$$ plain form
10671 3214273 3302539 3306433 3227973 3068589 2829761 2515322 2131844 1686454 1185250 636245
10661 636245 56491 -523127 -1062925 -1529628 -1912994 -2232824 -2531654 -2856998 -3241610 -3689553
10651 -3689553 -4171846 -4631322 -4994660 -5189625 -5164328 -4902128 -4425530 -3788312 -3061711 -2320886
10641 -2320886 -1633164 -1047201 -584875 -240087 13608 209104 371143 507263 608893
10632 608893 662384 663536 626668 583353 572806 629844 775862 1015311 1337428 1720973 2139100
10621 2139100 2562116 2957654 3290353 3524831 3634266 3611840 3477988 3277747 3069352 2911063
10611 2911063 2852745 2932810 3175812 3586705 4143902 4798243 5482431 6127254 6675617 7088685
10601 7088685 7345664 7442195 7390145 7217987 6968944 6694006 6439598 6234547 6083696 5971866
10591E971866r6947j03342j19584j30118j20676q4419k6153L8465Q8787J07252
10581E525131Q5696K7127n7116j52367k45033l25465l88745m32793m55008m51723
10571C129704m22899l77956l35482l15103l27177l67177m17172m52778m52097
10562c38137m02562l03335j64705o996J41422K50054K95976K72410J91129P7662
10552A2918l8102j31932j91643k17879k20430k12966k07546k09826k17178k21423
10542a856007k14012j90073j50369j02203n8159l1160k8437m9570q9492j42784
10532b912266k06382k80650l68598m72707n91751p21102q55686r91349j123424
10523h523915j245637j351402j436481j502099j557529j618981j702740j817141
$$ plain form
10591 5971866 5874919 5771577 5651993 5521875 5401199 5316780 5290627 5329092 5417879 5525131
10581 5525131 5610827 5637954 5580838 5428471 5183438 4857973 4469228 4036435 3581427 3129704
10571 3129704 2706805 2328849 1993367 1678264 1351087 983910 566738 113960 -338137
10562 -338137 -740699 -1044034 -1208739 -1215735 -1074313 -824259 -528283 -255873 -64744 12918
10552 12918 -25184 -157116 -348759 -566638 -787068 -1000034 -1207580 -1417406 -1634584 -1856007
10542 -1856007 -2070019 -2260092 -2410461 -2512664 -2570823 -2601983 -2630420 -2679990 -2769482 -2912266
10532 -2912266 -3118648 -3399298 -3767896 -4240603 -4832354 -5553456 -6409142 -7400491 -8523915
10523 -8523915 -9769552 -11120954 -12557435 -14059534 -15617063 -17236044 -18938784 -20755925
10515b0755925j960329k123946k297106k468439k628814k774725k909087l039721
10507d0958092l178668l341734l545743l806548m142319m578284n145600n876708
10499g4573696o804740p964389r385710j1083526j3051455j5253904j7598450
10492a55715870j9888372k1776029k2740479k2126124j9307631j4003340o596331
10485b82154176J808551R742069J5960051J9873609K1577415K1571547K0446965
10478a71173969J8706238J6714563J4710480J2834845J1162915R727256Q529424
10471g8788248P549988O758980O118471N578702N081897M578960M046340L490593
10463c5584317K941580K440320K024339J714770J511949J400152J353930J341272
$$ plain form
10515 -20755925 -22716254 -24840200 -27137306 -29605745 -32234559 -35009284 -37918371 -40958092
10507 -40958092 -44136760 -47478494 -51024237 -54830785 -58973104 -63551388 -68696988 -74573696
10499 -74573696 -81378436 -89342825 -98728535 -109812061 -122863516 -138117420 -155715870
10492 -155715870 -175604242 -197380271 -220120750 -242246874 -261554505 -275557845 -282154176
10485 -282154176 -280345625 -270603556 -254643505 -234769896 -213192481 -191620934 -171173969
10478 -171173969 -152467731 -135753168 -121042688 -108207843 -97044928 -87317672 -78788248
10471 -78788248 -71238260 -64479280 -58360809 -52782107 -47700210 -43121250 -39074910 -35584317
10463 -35584317 -32642737 -30202417 -28178078 -26463308 -24951359 -23551207 -22197277 -20856005
10455b0856005J327133J281208J187201J047889Q83158P21252N86491M90048M28854
10446a2902771L90482L57968L12985K40162J32554n397j58661l04486m17498m78391
10436a2833053m82237m39139l66009k76710j77476o8122N3585J86353L20937M39373
10426a3642498N18148N33888M71509L33584J44484n7392k35797l68699m48942
10417a2751715m78441m64074m16274l46631k64323j74483p9954J5281J03454J73265
10407a4683895K14214K23093K07623J83527J66706J65800J79569K00105K19553
10398a2923705K35516K51131K70288K92611L12361L21424L13900K89464K53530
10389a0383480K13814J75748J40356J05784P0569L6317Q569n084L99K3503N7372
$$ plain form
10455 -20856005 -19528872 -18247664 -17060463 -16012574 -15129416 -14408164 -13821673 -13331625 -12902771
10446 -12902771 -12512289 -12154321 -11841336 -11601174 -11468620 -11474017 -11632678 -11937164 -12354662 -12833053
10436 -12833053 -13315290 -13754429 -14120438 -14397148 -14574624 -14642746 -14589161 -14402808 -14081871 -13642498
10426 -13642498 -13124350 -12590462 -12118953 -11785369 -11640885 -11698277 -11934074 -12302773 -12751715
10417 -12751715 -13230156 -13694230 -14110504 -14457135 -14721458 -14895941 -14975895 -14960614 -14857160 -14683895
10407 -14683895 -14469681 -14246588 -14038965 -13855438 -13688732 -13522932 -13343363 -13143258 -12923705
10398 -12923705 -12688189 -12437058 -12166770 -11874159 -11561798 -11240374 -10926474 -10637010 -10383480
10389 -10383480 -10169666 -9993918 -9853562 -9747778 -9677209 -9640892 -9632323 -9637407 -9637008 -9613505 -9556133
10378i556133R6341J41456J98783K71716L54660M34031M95651N31981N43168N31523
10368e956823M95039M26529L20070J80066K5385j16118k20347k77739k93443k77897
10358e695278k38360j79629j10140m3431Q224M1506O4166R0886J35898K05165
10348e720993K91623L77123M40326M64619M41252L69129K54824J12662l7989j78517
10338c185941k96425l86949m50827m90940n10776n15446n12401n08424n03355
10329g361484m85830m35946l34765j75646K8833K48835M48072N97831O85862P15879
10319f068359P00566O54507N90825N20786M53620L94706L43158K92329K35561
10310a882301J74033J19913R1247J02467J57595K49641L64618M86582O01070O96121
$$ plain form
10378 -9556133 -9459792 -9318336 -9119553 -8847837 -8493177 -8059146 -7563495 -7031514 -6488346 -5956823
10368 -5956823 -5461784 -5035255 -4715185 -4535119 -4509734 -4625852 -4846199 -5123938 -5417381 -5695278
10358 -5695278 -5933638 -6113267 -6223407 -6266838 -6258614 -6217108 -6152942 -6062056 -5926158 -5720993
10348 -5720993 -5429370 -5052247 -4611921 -4147302 -3706050 -3336921 -3082097 -2969435 -3007424 -3185941
10338 -3185941 -3482366 -3869315 -4320142 -4811082 -5321858 -5837304 -6349705 -6858129 -7361484
10329 -7361484 -7847314 -8283260 -8618025 -8793671 -8764838 -8516003 -8067931 -7470100 -6784238 -6068359
10319 -6068359 -5367793 -4713286 -4122461 -3601675 -3148055 -2753349 -2410191 -2117862 -1882301
10310 -1882301 -1708268 -1588355 -1497108 -1394641 -1237046 -987405 -622787 -136205 464865 1160986
10300A160986P61916P90851P78113P21075O17018M62269K56248R508k50295m80763
10290D826926o36477o84720o17075m51914k28563L034J94662L12650L47498L14939
10280C380960K46807J76625J27295J05444J02768J02578Q8147M8964j7021j03984
10270D258583j99607k87306l50176l76159l62387l17155k58650k09881j90363
10261A706899k07548k52450l02652l32149l23222k73533j94326j02148j0659P2860
10251b18928J46887K13308K74341L28937L70562L88122L69794L08126K05005P4758
10241B460912n7417j62869k19651k19813j70394q8821M320R1741J62858K13544
10231B014410K43669K54139K44533K12590J56802Q0790n031q7437j57216k12522
$$ plain form
10300 1160986 1922902 2713753 3491866 4212941 4829959 5292228 5548476 5557984 5307689 4826926
10290 4826926 4190449 3505729 2888654 2436740 2208177 2211211 2405873 2718523 3066021 3380960
10280 3380960 3627767 3804392 3931687 4037131 4139899 4242477 4330624 4379588 4362567 4258583
10270 4258583 4058976 3771670 3421494 3045335 2682948 2365793 2107143 1897262 1706899
10261 1706899 1499351 1246901 944249 612100 288878 15345 -178981 -281129 -291788 -218928
10251 -218928 -72041 141267 415608 744545 1115107 1503229 1873023 2181149 2386154 2460912
10241 2460912 2403495 2240626 2020975 1801162 1630768 1541947 1546267 1638008 1800866 2014410
10231 2014410 2258079 2512218 2756751 2969341 3126143 3206933 3201902 3114465 2957249 2744727
10221B744727k56419k92211l21564l46231l69940l97041m28162m56507m68144
10212e91492m46221l76422k51789p6731J30992L43132N29325O66692P45132P66499
10202A439117P40067O77297N88146M80561L62834K45614J40762N8429N873j1816
10192D726884P784O1932J41418K32917L22844L99249M51642M71480M54615M03978
10182G674743L29852K46510J66714R7621M0798m453l8157n9376o7175o0433l6899
10171H289745N900O7062J38935K07961K60817K92231L08529L23584L49819L90683
10161A0635266M39217M82017N05151M99845M67080M19107L74926L50363L48540
10152A4521512L57571L56692L25783K52440J34771j8445j88785l50936m77932
$$ plain form
10221 2744727 2488308 2196097 1874533 1528302 1158362 761321 333159 -123348 -591492
10212 -591492 -1037713 -1414135 -1665924 -1742655 -1611663 -1268531 -739206 -72514 672618 1439117
10202 1439117 2179184 2856481 3444627 3925188 4288022 4533636 4674398 4732827 4738700 4726884
10192 4726884 4734668 4796600 4938018 5170935 5493779 5893028 6344670 6816150 7270765 7674743
10182 7674743 8004595 8251105 8417819 8515440 8556238 8551785 8513628 8454252 8387077 8326644 8289745
10171 8289745 8295645 8362707 8501642 8709603 8970420 9262651 9571180 9894764 10244583 10635266
10161 10635266 11074483 11556500 12061651 12561496 13028576 13447683 13822609 14172972 14521512
10152 14521512 14879083 15235775 15561558 15813998 15948769 15930324 15741539 15390603 14912671
10143A4912671n48174n51373m90541l79200k36462q3741N6342J62298K19793K27875
10133A3289488J98860J50064R3133K8671n0946j53315k77428m09783n28304o12364
10123A1728076o52398o52618o26307n88365n49682n14638m81506m45589m03620
10114F813353l55882l03583k43862j68442o9440N1138J76246K78204L30483L19537
10104F827752K50170J42527K2844q7219j77189k47199l01975l44634l74021l85773
10094E325283l75503l42551k92152k33890j77429j29983r8033q9782j12699j66490
10084C306771k38326l06434l50684l62822l49638l27959l15669l23874l52797
10075C78568l91417m21076m23041l87213l16378k23340j24412l4858L2615O9448
$$ plain form
10143 14912671 14364497 13813124 13322583 12943383 12706921 12623180 12679522 12841820 13061613 13289488
10133 13289488 13488348 13638412 13731545 13760216 13709270 13555955 13278527 12868744 12340440 11728076
10123 11728076 11075678 10423060 9796753 9208388 8658706 8144068 7662562 7216973 6813353
10114 6813353 6457471 6153888 5910026 5741584 5672144 5723282 5899528 6177732 6508215 6827752
10104 6827752 7077922 7220449 7243293 7156074 6978885 6731686 6429711 6085077 5711056 5325283
10094 5325283 4949780 4607229 4315077 4081187 3903758 3773775 3675742 3585960 3473261 3306771
10084 3306771 3068445 2762011 2411327 2048505 1698867 1370908 1055239 731365 378568
10075 378568 -12849 -433925 -856966 -1244179 -1560557 -1783897 -1908309 -1943167 -1910552 -1841104
10065a841104P4195N4466K5037K518q69J8129N2387Q6535J01582Q0776J6342q4168
10053a414174j95698k81824l08245k56469j30101M8444K47105M33797N83228O80405
10043e93532P21567P12607O64854N89639M94761L84744K63296J35601J0536r6246
10033C287827j60779j55523o1138J21090L64369O22309Q42119R79188J008465
10024F847927R30322P69940N69833L77070K29643J47998J34575J78619K61391
10015A0447318L59713M49502N10449N30657N08984M53516L75743K82203J68725
10006A4086810K2785j65677l91954o31793q48146j005794j085092j086861j026474
9997G867804r22470p87942o29395m51768k64586q4244O9607J81037K42291K52444
$$ plain form
10065 -1841104 -1766909 -1712443 -1687406 -1684888 -1685757 -1667628 -1615241 -1528706 -1427124 -1346348 -1330006 -1414174
10053 -1414174 -1609872 -1891696 -2199941 -2456410 -2586511 -2538067 -2290962 -1857165 -1273937 -593532
10043 -593532 128035 840642 1505496 2095135 2589896 2974640 3237936 3373537 3384073 3287827
10033 3287827 3127048 2971525 2910387 3031477 3395846 4018155 4860274 5839462 6847927
10024 6847927 7778249 8548189 9118022 9495092 9724735 9872733 10007308 10185927 10447318
10015 10447318 10807031 11256533 11766982 12297639 12806623 13260139 13635882 13918085 14086810
10006 14086810 14109595 13943918 13551964 12920171 12072025 11066231 9981139 8894278 7867804
9997 7867804 6945334 6157392 5527997 5076229 4811643 4727399 4797006 4978043 5220334 5472778
9987E472778K13503J29950J2480j19397k40670l28496l69408l62726l19697k59130
9977C829187k00971j60122j42319j42952j49336j45762j18630n8583L9795J77376
9967B927683L47885N36644P23665Q89459J019654J107000J151434J158034J132255
9958A0993713J074660R79636Q40591O58503M47413K32606M3002r6903j71878j78070
9948A4823273j24022k9499P9815J79944K53568K89929K82704K30234J38422K3026
9938A6147394r2163j81882k27516k22030j69260p9798L3229J57773K86397M17349
9928A6069493N50613O81745P99848Q91506R46533R62185R46042R16265Q95566
9919B3659796Q99944R30981R78674J031849J087583J154051J245983J374585J537218
$$ plain form
9987 5472778 5686281 5816231 5828711 5709314 5468644 5140148 4770740 4408014 4088317 3829187
9977 3829187 3628216 3468094 3325775 3182823 3033487 2887725 2769095 2710512 2750307 2927683
9967 2927683 3275568 3812212 4535877 5425336 6444990 7551990 8703424 9861458 10993713
9958 10993713 12068373 13048009 13888600 14547103 14994516 15227122 15270124 15173221 15001343 14823273
9948 14823273 14699251 14669752 14749567 14929511 15183079 15473008 15755712 15985946 16124368 16147394
9938 16147394 16055231 15873349 15645833 15423803 15254543 15174745 15207974 15365747 15652144 16069493
9928 16069493 16620106 17301851 18101699 18993205 19939738 20901923 21847965 22764230 23659796
9919 23659796 24559740 25490721 26469395 27501244 28588827 29742878 30988861 32363446 33900664
9910C3900664J714096J874147J984219K014914J941471J740507J383239Q29507
9902D7382764L0128j059992k460897m136694n953990p656134q904901r407526
9894G832758r062290q013028o567360n045376l666877k526845j631117r43097
9886b9623232m17390j8515K73314M66702N67705N87347N46599M77401M17012L96981
9876b6326076M33359N23684O50427P87934R10670J000291J048521J055143J023689
9867a8892358R57690Q59073P29656N75353M09319K49670J12514O087o9937j21499
9857a5184432j57206j86057k14689k44165k68437k76758k60106k18046j60202
9848a7170098r9696m3333J3267Q2174J75284K97845M45740O06413P63041R00435
$$ plain form
9910 33900664 35614760 37488907 39473126 41488040 43429511 45170018 46553257 47382764
9902 47382764 47412892 46352900 43892003 39755309 33801319 26145185 17240284 7832758
9894 7832758 -1229532 -9242560 -15809920 -20855296 -24522173 -27049018 -28680135 -29623232
9886 -29623232 -30040622 -30059137 -29785823 -29319121 -28751416 -28164069 -27617470 -27140069 -26723057 -26326076
9876 -26326076 -25892717 -25369033 -24718606 -23930672 -23020002 -22019711 -20971190 -19916047 -18892358
9867 -18892358 -17934668 -17075595 -16345939 -15770586 -15361267 -15111597 -14999083 -14992996 -15062933 -15184432
9857 -15184432 -15341638 -15527695 -15742384 -15986549 -16254986 -16531744 -16791850 -17009896 -17170098
9848 -17170098 -17269794 -17313127 -17299860 -17217686 -17042402 -16744557 -16298817 -15692404 -14929363 -14028928
9838a4028928J009507J088002J138218J163591J165184J139229J077974R74897
9830e272326Q31629O61952M89927L42454K39194J84856J68940J73871J85795J99890
9820a793818K17079K36706K52684K56857K46586K29428K19460K26986K50452K78465
9810F20885L00490L15731L31528L53362L76513L86609L67106L06877K03901O5511
9800C628513r3264k53157l95563n06956n80694o16193o16938n88781n39145m76875
9790a039053m11869l53152l05531k67297k31998j94066j54324j20688j03317j07975
9780c289270j32518j68400k05365k35851k56795k67882k67245k48118k01149j22841
9770e395434k3403P4596J47530J83175J84787J65468J38860J12451Q6369N7056
$$ plain form
9838 -14028928 -13019421 -11931419 -10793201 -9629610 -8464426 -7325197 -6247223 -5272326
9830 -5272326 -4440697 -3778745 -3288818 -2946364 -2707170 -2522314 -2353374 -2179503 -1993708 -1793818
9820 -1793818 -1576739 -1340033 -1087349 -830492 -583906 -354478 -135018 91968 342420 620885
9810 620885 921375 1237106 1568634 1921996 2298509 2685118 3052224 3359101 3563002 3628513
9800 3628513 3535249 3282092 2886529 2379573 1798879 1182686 565748 -23033 -562178 -1039053
9790 -1039053 -1450922 -1804074 -2109605 -2376902 -2608900 -2802966 -2957290 -3077978 -3181295 -3289270
9780 -3289270 -3421788 -3590188 -3795553 -4031404 -4288199 -4556081 -4823326 -5071444 -5272593 -5395434
9770 -5395434 -5418837 -5344241 -5196711 -5013536 -4828749 -4663281 -4524421 -4411970 -4325601 -4268545
9760d268545K2605j4712n0219p9544r8301j00254p8757l2207L1534R6286J42994
9749d429120J55347J23586M6959o5032j93629l14674m04503m45960m31947l65173
9739f324146k55312j16525L3686J76146K93870L76799M24287M43679M45922M40616
9729d060978M33194M25337M17158M08301L97315L81365L57817L26291K89072K50039
9719c75089K13344J81795J54506J25482Q5768K9171m1891j14531j69400j89425
9709a00270j68745j15732m7288K1125Q1278J29728J61664J68619J42871Q4156
9699C57406K431q5578j62731k15514k34294k13242j53432o7225K1915Q7045J08907
9688e54312Q3747K3978m7391j05483j32277j22483q4636l6986M75J4926O565j2167
$$ plain form
9760 -4268545 -4245940 -4260652 -4310871 -4390415 -4488716 -4588970 -4667727 -4699934 -4668400 -4572114 -4429120
9749 -4429120 -4273773 -4150187 -4103228 -4168260 -4361889 -4676563 -5081066 -5527026 -5958973 -6324146
9739 -6324146 -6579458 -6695983 -6662297 -6486151 -6192281 -5815482 -5391195 -4947516 -4501594 -4060978
9729 -4060978 -3627784 -3202447 -2785289 -2376988 -1979673 -1598308 -1240491 -914200 -625128 -375089
9719 -375089 -161745 20050 174556 300038 385806 414977 373086 258555 89155 -100270
9709 -100270 -269015 -384747 -432035 -410910 -329632 -199904 -38240 130379 273250 357406
9699 357406 359837 274259 111528 -103986 -338280 -551522 -704954 -772179 -750264 -663219 -554312
9688 -554312 -470565 -446587 -493978 -599461 -731738 -854221 -938857 -975843 -975368 -960442 -953877 -966044
9676i66044k4024j6918R304M2303O2668N2499L303q0789j85791k93743l87389
9665a784621m51902m75277m49136l70038k40867p2288J16735L01419M57465N68632
9655b399878O31594O55637O57316O52067O46596O36518O11092N61476M86261L91408
9645C530087K87298J86654J03283M8758K6569K7927L4134K5666p787o3090j27401
9634D072098j86449k32113k66261k99923l47739m18996n09912o03346o77905p20722
9624a91268p34410p33411p33404p41763p54450p59035p40219o84809n85344m42718
9614g100831k67809q0902R2585K30116L20811L69767L94165M12828M36166M63317
9604d729787M86952M99870M97458M75585M28298L48915K34263Q9328p0474k21676
$$ plain form
9676 -966044 -990068 -1006986 -997682 -955379 -892711 -840212 -836909 -917698 -1103489 -1397232 -1784621
9665 -1784621 -2236523 -2711800 -3160936 -3530974 -3771841 -3844129 -3727394 -3425975 -2968510 -2399878
9655 -2399878 -1768284 -1112647 -455331 196736 843332 1479850 2090942 2652418 3138679 3530087
9645 3530087 3817385 4004039 4107322 4156080 4182649 4210576 4244710 4270376 4262589 4199499 4072098
9634 4072098 3885649 3653536 3387275 3087352 2739613 2320617 1810705 1207359 529454 -191268
9624 -191268 -925678 -1659089 -2392493 -3134256 -3888706 -4647741 -5387960 -6072769 -6658113 -7100831
9614 -7100831 -7368640 -7449542 -7356957 -7126841 -6806030 -6436263 -6042098 -5629270 -5193104 -4729787
9604 -4729787 -4242835 -3742965 -3245507 -2769922 -2341624 -1992709 -1758446 -1669118 -1739592 -1961268
9594a961268l40933m16174m52715m66739m68371m47964l79567k41127l4970K08659
9584e001169M47194O46553P91884Q84296R30846R36549R02052Q25798P08089N54676
9574B626768L77941J95166K4908j17451k24670l01708l65371m36620n28087o34868
9564F16008p35553q02914q16744p71242o74592n43199l94555k41841r1921N3002
9554d403551J91445L18541M24433M96908N27551N17223M75683M14874L41349K54244
9544d41300J49448K5290j13930k56335l82126m66713m89376m43815l42548k10332
9534b971737p0825O3530J91501L14874M29928N24808N82792N87748N29339M07750
9524E89708K36774M2446j43860k94624l92805m33884m24564l79765l18596k59734
$$ plain form
9594 -1961268 -2302201 -2718375 -3171090 -3637829 -4106200 -4554164 -4933731 -5174858 -5209828 -5001169
9584 -5001169 -4553975 -3907422 -3115538 -2231242 -1300396 -363847 538205 1364003 2072092 2626768
9574 2626768 3004709 3199875 3224783 3107332 2882662 2580954 2215583 1778963 1250876 616008
9564 616008 -119545 -922459 -1739203 -2510445 -3185037 -3728236 -4122791 -4364632 -4456553 -4403551
9554 -4403551 -4212106 -3893565 -3469132 -2972224 -2444673 -1927450 -1451767 -1036893 -695544 -441300
9544 -441300 -291852 -266562 -380492 -636827 -1018953 -1485666 -1975042 -2418857 -2761405 -2971737
9534 -2971737 -3042562 -2979032 -2787531 -2472657 -2042729 -1517921 -935129 -347381 181958 589708
9524 589708 826482 868928 725068 430444 37639 -396245 -820809 -1200574 -1519170 -1778904
9514a778904k16878j94731j86657j76719j47431q9760q533Q0353J57913K09393
9504b351954K27998K15372J79733J32363Q4269M5086K4000K9687O7182J33318
9494a212946K14642K90596L41265L56080L38650L04335K71022K48359K32504K10381
9484A594888J70475J12161M6823r079m2741m9366l1244N386N2925J04231J54107
9473B108566J99944K40991K77139L08916L38596L70230M06436M42971M65563M53505
9463E612857L89750K71452J13556n7033k12520l33797m14785m61622m88472n11848
9453C907538n45796o00197o81878p95027r37794j096695j244524j345920j368831
9444d709124j295424j127260q83940n97786l06790m6491J58435K99966L86102
$$ plain form
9514 -1778904 -1995782 -2190513 -2377170 -2553889 -2701320 -2791080 -2799613 -2719260 -2561347 -2351954
9504 -2351954 -2123956 -1908584 -1728851 -1596488 -1512219 -1467133 -1443133 -1413446 -1346264 -1212946
9494 -1212946 -998304 -707708 -366443 -10363 328287 632622 903644 1152003 1384507 1594888
9484 1594888 1765363 1877524 1924347 1915268 1872527 1823161 1791917 1797303 1850228 1954459 2108566
9473 2108566 2308510 2549501 2826640 3135556 3474152 3844382 4250818 4693789 5159352 5612857
9463 5612857 6002607 6274059 6387615 6330582 6118062 5784265 5369480 4907858 4419386 3907538
9453 3907538 3361742 2761545 2079667 1284640 346846 -749849 -1994373 -3340293 -4709124
9444 -4709124 -6004548 -7131808 -8015748 -8613534 -8920324 -8966815 -8808380 -8508414 -8122312
9435h122312M33003M54506M56101M36721L95276L35797K68015K04662J58072J37182
9425d842977J44904J76870K22937K71444L14013L48036L75523L99511M20983M38795
9415a729961M52010M61189M66342M63629M45485M05308L42441K62380J72736P9690
9405A821249j2311r9697j80564k55750l27130l93187m46191m74404m67837m23221
9395a259043l45369k45036j34758k4558Q0242J77262K62416L26495L57004L45012
9385d60333K92173K12689J28816O2916L0473L6527P5471J33079J89912K25939
9375I27662K25987J84609J07826R548r6412k04044l16977m42723n83302p28892
9365i16718q59109r51518r91958r79897r25384q40742p33872o07555m63327l05532
$$ plain form
9435 -8122312 -7689309 -7234803 -6778702 -6341981 -5946705 -5610908 -5342893 -5138231 -4980159 -4842977
9425 -4842977 -4698073 -4521203 -4298266 -4026822 -3712809 -3364773 -2989250 -2589739 -2168756 -1729961
9415 -1729961 -1277951 -816762 -350420 113209 558694 964002 1306443 1568823 1741559 1821249
9405 1821249 1808938 1709241 1528677 1272927 945797 552610 106419 -367985 -835822 -1259043
9395 -1259043 -1604412 -1849448 -1984206 -2008764 -1928522 -1751260 -1488844 -1162349 -805345 -460333
9385 -460333 -168160 44529 173345 236261 266734 303261 378732 511811 701723 927662
9375 927662 1153649 1338258 1446084 1455632 1359220 1155176 838199 395476 -187826 -916718
9365 -916718 -1775827 -2727345 -3719303 -4699200 -5624584 -6465326 -7199198 -7806753 -8270080 -8575612
9355h575612j42750J3914J55291K79343L93043N07505O28532P49476Q52303R16223
9345d222732R28203Q88900Q10947P11312O03671M96252L95283L08445K43409K02377
9335A366067J78036J55133J17514N7035k0534r6543j47533j55979j17698m2550
9325A292948N1096J45261K30421L08213L86590M70521N54765O23396O55731O34849
9315E353791N54749M22886K56984P7965r6755k56179l94528n07531n88588o27865
9305D194929o16877n56582m62025l57953k67895k05221j71632j61238j65542j77528
9295A052436j94587k18436k50069k82772l00433k85101k28642j38527l2797P0812
9285h08116J61957K36364K90032L16207L08088K64046J90644J01983J6790m5439
$$ plain form
9355 -8575612 -8718362 -8704448 -8549157 -8269814 -7876771 -7369266 -6740734 -5991258 -5138955 -4222732
9345 -4222732 -3294529 -2405629 -1594682 -883370 -279699 216553 611836 920281 1163690 1366067
9335 1366067 1544103 1699236 1816750 1873785 1853251 1756708 1609175 1453196 1335498 1292948
9325 1292948 1344044 1489305 1719726 2027939 2414529 2885050 3439815 4063211 4718942 5353791
9315 5353791 5908540 6331426 6588410 6666375 6569620 6313441 5918913 5411382 4822794 4194929
9305 4194929 3578052 3021470 2559445 2201492 1933597 1728376 1556744 1395506 1229964 1052436
9295 1052436 857849 639413 389344 106572 -193861 -478962 -707604 -846131 -878928 -808116
9285 -808116 -646159 -409795 -119763 196444 504532 768578 959222 1061205 1077995 1032556
9275A032556o8962m6038K1017J21306K39452L60008M70174N60035O21029O44802
9265C955379O24677N59792M58832L39840K25206J34167P6349M8896L8189K5373
9255F486700o870o9215j63684k84275m19064n53005o70424p56431p98015p87114
9245A978603p25932o30130n24221m29323l51665k81198k01392j01815J5624J38687
9235a112762K50434L34053L76541L72159L24419K44106J43423L0350r1765k18290
9225F52668l35937m21709m51753m14663l18608j86280m2442R5870K21140L31941
9215h69773M29455N15757N92930O62388P24481P77837Q18509Q40563Q39317Q14762
9205F146226P70817P09950O28544N18850L76975K09898L4963j28174k66692l78093
$$ plain form
9275 1032556 963594 917556 938573 1059879 1299331 1659339 2129513 2689548 3310577 3955379
9265 3955379 4580056 5139848 5598680 5938520 6163726 6297893 6374242 6423138 6461327 6486700
9255 6486700 6479830 6410615 6246931 5962656 5543592 4990587 4320163 3563732 2765717 1978603
9245 1978603 1252671 622541 98320 -331003 -682668 -963866 -1165258 -1267073 -1251449 -1112762
9235 -1112762 -862328 -528275 -151734 220425 544844 788950 932373 962723 870958 652668
9225 652668 316731 -104978 -556731 -971394 -1290002 -1476282 -1518724 -1422854 -1201714 -869773
9215 -869773 -440318 75439 668369 1330757 2055238 2833075 3651584 4492147 5331464 6146226
9205 6146226 6917043 7626993 8255537 8774387 9151362 9361260 9396223 9268049 9001357 8623264
9195H623264m66251n34014n77785n87091n48373m50690k91398q0346J58848L91734
9185E637898N79920O89668O99271O03410M14090J57991j29853m14125o64782q57124
9175F716364r69152r82892q92879p15988m92485k73597j01798M020M9865N5547
9165B397005M0208J3753k2984p3611j42658k34359l50956m88473o32223p56625
9155b50923q31904q35379p61583o25344m55909k85257j37010k1376O2456J19506
9145d022723J52817J61624J44131J02002M2801k1518p9326j24177j56326j79533
9135c980228j95418j99928j84566j40972o5272L9948J65911K99202M24033N24770
9125c312520N88340O06760N79842N16756M34329L51835K84914K41963K24234K28155
$$ plain form
9195 8623264 8157013 7622999 7045214 6458123 5909750 5459060 5167662 5087316 5246164 5637898
9185 5637898 6217818 6907486 7606757 8210167 8624257 8782248 8652395 8238270 7573488 6716364
9175 6716364 5747212 4764320 3871441 3155453 2662968 2389371 2287573 2291593 2341458 2397005
9165 2397005 2437213 2450966 2427982 2354371 2211713 1977354 1626398 1137925 505702 -250923
9155 -250923 -1082827 -1918206 -2679789 -3305133 -3761042 -4046299 -4183309 -4204685 -4142229 -4022723
9145 -4022723 -3869906 -3708282 -3564151 -3462149 -3419348 -3440866 -3520192 -3644369 -3800695 -3980228
9135 -3980228 -4175646 -4375574 -4560140 -4701112 -4766384 -4726436 -4560525 -4261323 -3837290 -3312520
9125 -3312520 -2724180 -2117420 -1537578 -1020822 -586493 -234658 50256 292219 516453 744608
9115G44608K47589K75100L03079L25821L41624L52287L59110L58648L42954L04913
9105C955733K43948J66838Q3205r6q1141j60236k34576k94376l23843l07195k36577
9094B811684j17798K8867J73461K85248L41937L34711K67397J52672R208j39713
9084D147674k68834l56115l88178l62512k85774j70072k9409J22459K72320M06216
9074C087775N08447N63219N59012M92781L70643K05210J2828j86969l71136n15086
9064D726724n97922o08735n50709m40773l04353j66987m6678M9107J21081J73424
9054B354179K10383K35283K50799K59309K63202K65201K68011K72266K73057K58042
9044D909732K11206J23007O93j30121k35823k90581k87319k38857j71321j14503
$$ plain form
9115 744608 992197 1267297 1570376 1896197 2237821 2590108 2949218 3307866 3650820 3955733
9105 3955733 4199681 4366519 4449724 4449628 4368487 4208251 3973675 3679299 3355456 3048261 2811684
9094 2811684 2693886 2722753 2896214 3181462 3523399 3858110 4125507 4278179 4287387 4147674
9084 4147674 3878840 3522725 3134547 2772035 2486261 2316189 2286780 2409239 2681559 3087775
9074 3087775 3596222 4159441 4718453 5211234 5581877 5787087 5799915 5612946 5241810 4726724
9064 4726724 4128802 3520067 2969358 2528585 2224232 2057245 2010567 2059674 2180755 2354179
9054 2354179 2564562 2799845 3050644 3309953 3573155 3838356 4106367 4378633 4651690 4909732
9044 4909732 5120938 5243945 5244638 5114517 4878694 4588113 4300794 4061937 3890616 3776113
9034C776113r2409j16070j80620k67852l53354m15294m41127m29294l85706l18119
9024G76268k32553j33606k7304P6757J66388K31241K67976K81769K82023K75687
9014A964646K64224K46767K25330K06225J96135J97029K04995K13797K19161K19357
9004D157666K12078J92330J55152J01530M1741p582l1055k2221J3004N9303J00123
8993D972069J25904J36251J35159J25370J08455R0163Q3978J07155J70656K70254
8983F325414L85639M88977N57724N83648N73132N40796N02741M73580M65958M88394
8973A1386003N39702O03348O47709O35560N39313L53427R7098j92713m72381p01863
8963A3435203q52558r12737q89564q06534o96656n93027n19158m81961m70880
$$ plain form
9034 3776113 3683704 3567634 3387014 3119162 2765808 2350514 1909387 1480093 1094387 776268
9024 776268 543715 410109 382805 459562 625950 857191 1125167 1406936 1688959 1964646
9014 1964646 2228870 2475637 2700967 2907192 3103327 3300356 3505351 3719148 3938309 4157666
9004 4157666 4369744 4562074 4717226 4818756 4860497 4852915 4821860 4799639 4812643 4871946 4972069
8993 4972069 5097973 5234224 5369383 5494753 5603208 5693371 5777349 5884504 6055160 6325414
8983 6325414 6711053 7200030 7757754 8341402 8914534 9455330 9958071 10431651 10897609 11386003
8973 11386003 11925705 12529053 13176762 13812322 14351635 14705062 14802160 14609447 14137066 13435203
8963 13435203 12582645 11669908 10780344 9973810 9277154 8684127 8164969 7683008 7212128
8954G212128m64500m41742l91641l17142k32579j57702j10957j03655j36373j99265
8944D656572k76472l52013m13614m53586m68785m61046m36472m01966l61182l13992
8934G17444k60051k02038j44569q9939l5666K3142Q8103J53068K04882K29955
8924F84331K22743J89806J45888J04659P0500L6353j1675q5375j85570k98476
8914H73184m00730m70938n00000m93233m64064m25711l87245l55111l36294l38750
8904c298892l68209m24078m97887n75597o42054o84761o95153o67554n97264m79902
8894h931351l13217j01014J43169L95286O24223P98697Q95592R07054Q43433P30412
8884d007716O01222M86982M08735L73332L74277L97113M27096M55023M78175M96590
$$ plain form
8954 7212128 6747628 6305886 5914245 5597103 5364524 5206822 5095865 4992210 4855837 4656572
8944 4656572 4380100 4028087 3614473 3160887 2692102 2231056 1794584 1392618 1031436 717444
8934 717444 457393 255355 110786 20847 -14819 8323 96426 249494 454376 684331
8924 684331 907074 1096880 1242768 1347427 1417927 1454280 1442605 1357230 1171660 873184
8914 873184 472454 1516 -498484 -991717 -1455781 -1881492 -2268737 -2623848 -2960142 -3298892
8904 -3298892 -3667101 -4091179 -4589066 -5164663 -5806717 -6491478 -7186631 -7854185 -8451449 -8931351
8894 -8931351 -9244568 -9345582 -9202413 -8807127 -8182904 -7384207 -6488615 -5581561 -4738128 -4007716
8884 -4007716 -3406494 -2919512 -2510777 -2137445 -1763168 -1366055 -938959 -483936 -5761 490829
8874D90829N08123N05864M79935M22993L36144K30474J21934K3052o2106j36594
8864B920648k05676k72232l33506l79143l92980l60361k77257j53552p912J40492
8854F78521K76749L90870M77872N38759N80242O11398O38292O59532O65429O42300
8844F159964N80105M78232L44910J91568K8032j37223k93606m26378n18771n57436
8834E849397n38297m69509l69471k61002j65308r8636p1278q6666j39320k12783
8824C437127k80210l10201k77676j75057j7041J63976L28674M42341M84171M52798
8814D248902L65308K47460J18760j7983j74317l61670n74837p85719r52480j037912
8804A075512j024114r14993p29158m92176k33141J6973K29289L83016M69832M94380
$$ plain form
8874 490829 998952 1504816 1984751 2407744 2743888 2974362 3096296 3119348 3057242 2920648
8864 2920648 2714972 2442740 2109234 1730091 1337111 976750 699493 545941 538029 678521
8854 678521 955270 1346140 1824012 2362771 2943013 3554411 4192703 4852235 5517664 6159964
8844 6159964 6740069 7218301 7563211 7754779 7782811 7645588 7351982 6925604 6406833 5849397
8834 5849397 5311100 4841591 4472120 4211118 4045810 3947174 3875896 3789230 3649910 3437127
8824 3437127 3156917 2846716 2569040 2393983 2376942 2540918 2869592 3311933 3796104 4248902
8814 4248902 4614210 4861670 4980430 4962447 4788130 4426460 3851623 3065904 2113424 1075512
8804 1075512 51398 -863595 -1592753 -2084929 -2318070 -2301097 -2071808 -1688792 -1218960 -724580
8794g24580M70884M16897L46197K64520J71281O6010m6037j54091k47362l20496
8784B43223l74156m10860m30666m30408m06234l56449k83100j92629r5657n110
8774b742046O7144J13215J30641J23222J01572Q1526P8677J01110J45136J97090
8764a602713K40094K61869K59779K41275K20625K14062K34381K85106L56166M25267
8754A135911M66711M63119M12729L28938K34280J51965R7116P0929O2116N5927
8744C479741M4189K8972J8887K3431M9870J02128J78870K70552L58511M19056
8734D974207M31720L87087K89662J55030M516j39406k56351l30737l53861l24272
8724D837595k46545j29951J1640J58956K87354L69732L83359L18875J86630J5530
$$ plain form
8794 -724580 -253696 163201 509398 773918 945199 1011209 965172 811081 563719 243223
8784 243223 -130933 -541793 -972459 -1402867 -1809101 -2165550 -2448650 -2641279 -2736936 -2742046
8774 -2742046 -2674902 -2561687 -2431046 -2307824 -2206252 -2124726 -2046049 -1944939 -1799803 -1602713
8764 -1602713 -1362619 -1100750 -840971 -599696 -379071 -165009 69372 354478 710644 1135911
8754 1135911 1602622 2065741 2478470 2807408 3041688 3193653 3290769 3361698 3423814 3479741
8744 3479741 3523930 3552902 3571789 3595220 3645090 3747218 3926088 4196640 4555151 4974207
8734 4974207 5405927 5793014 6082676 6237706 6242222 6102816 5846465 5515728 5161867 4837595
8724 4837595 4591050 4461099 4472739 4631695 4919049 5288781 5672140 5991015 6177645 6193175
8714F193175j56449k95670l84023m23411m32520m37619m61366n14358n92561o80704
8704A814494p58826q08650q17585p80256o98564n80900m40068k89557j39856K704
8694c497064J34020K49977L46754M23423M83881N36036N88678O47708P12871P76013
8684A402297Q21772Q30920P85129O72154M91554K59823J0936k11981l72351m54557
8674D235696m67648m36039l83982l23934k55714j75840q9458j4985K3068Q245
8664B119409n7213j52179k45631l08478l22536k83770j99445q1851N6429K02282
8654G27017L39211M47604N10849N23708M96709M53097M19549M15026M43370M93436
8644E269576N45713N80051N79913N33509M35075K87507J04028r3190k77269m22266
$$ plain form
8714 6193175 6036726 5741056 5357033 4933622 4501102 4063483 3602117 3087759 2495198 1814494
8704 1814494 1055668 247018 -570567 -1350823 -2049387 -2630287 -3070355 -3359912 -3499768 -3497064
8694 -3497064 -3363044 -3113067 -2766313 -2342890 -1859009 -1322973 -734295 -86587 626284 1402297
8684 1402297 2224069 3054989 3840118 4512272 5003826 5263649 5274585 5062604 4690253 4235696
8674 4235696 3768048 3332009 2948027 2624093 2368379 2192539 2103081 2088096 2111164 2119409
8664 2119409 2062196 1910017 1664386 1355908 1033372 749602 550157 468306 524735 727017
8654 727017 1066228 1513832 2024681 2548389 3045098 3498195 3917744 4332770 4776140 5269576
8644 5269576 5815289 6395340 6975253 7508762 7943837 8231344 8335372 8242182 7964913 7542647
8634G542647n09441n33244n04562m48162l93155l59397l46924l35683k97118k10303
8624C604658p1956J04349K95250M74291O16568P03357P26422O88931O02041M80549
8614H224460L40716J99592P3278k5958r1556j22222j20527r2622m9227n483K3095
8603H353546K7722J1265j4504l8705o0909r3098j52650k51028l84278n29925o52340
8592F215096p14966o93862n86334m11971k07411j7006J19075J76620J54084P0338
8582D103663m5467j65749k71487l52259m02628m19570m02586l54340k79621j83317
8572A226639o9432N8223J94655L32001M57508N52891N98018N79396M98899L76061
8562D804859K41010J21825L4313j9717m6679n4786n2603n1082o3057r7777j55072
$$ plain form
8634 7542647 7033206 6499962 5995400 5547238 5154083 4794686 4447762 4112079 3814961 3604658
8624 3604658 3532702 3637051 3932301 4406592 5023160 5726517 6452939 7141870 7743911 8224460
8614 8224460 8565176 8764768 8838046 8812088 8720532 8598310 8477783 8385161 8335934 8330451 8353546
8603 8353546 8381268 8392533 8378029 8339324 8278415 8185317 8032667 7781639 7397361 6867436 6215096
8592 6215096 5500130 4806268 4219934 3807963 3600552 3583546 3702621 3879241 4033325 4103663
8582 4103663 4058196 3892447 3620960 3268701 2866073 2446503 2043917 1689577 1409956 1226639
8572 1226639 1157207 1215430 1410085 1742086 2199594 2752485 3350503 3929899 4428798 4804859
8562 4804859 5045869 5167694 5202007 5182290 5135611 5080825 5028222 4977140 4914083 4816306 4661234
8551D661234k25006k93342l47739l80470l88051l70872l34134k87988k44157k09689
8541A579786j82775j55174j20279q0608m8994m2786p4540j43563k32534l12003
8531A86530l51876l34019k58652j41665o071J26236K38276L17601L55406L48343
8521D80109L02009K31793J58492J01166P1484P1271R2544J20123J37095J30692
8511A896778R4525K6315p5287k10968l77932n66059p54993r14582j011091j018433
8501b911727r28412p53352n20379k62579j1885K05665L73545M86456N48217N66418
8491c208033N47902M98992M29576L55648K95545K61373K52905K59892K71178K82960
8481B47938K99918L29683L75801M33756M91676N35032N53125N43570N11453M63925
$$ plain form
8551 4661234 4436228 4142886 3795147 3414677 3026626 2655754 2321620 2033632 1789475 1579786
8541 1579786 1397011 1241837 1121558 1040950 991956 949170 874630 731067 498533 186530
8531 186530 -165346 -499365 -758017 -899682 -905753 -779517 -541241 -223640 131766 480109
8521 480109 782118 1013911 1172403 1273569 1345053 1416324 1508868 1628991 1766086 1896778
8511 1896778 1991303 2017618 1942331 1731363 1353431 787372 32379 -882203 -1893294 -2911727
8501 -2911727 -3840139 -4593491 -5113870 -5376449 -5388334 -5182669 -4809124 -4322668 -3774451 -3208033
8491 -3208033 -2660131 -2161139 -1731563 -1375915 -1080370 -818997 -566092 -306200 -35022 247938
8481 247938 547856 877539 1253340 1687096 2178772 2713804 3266929 3810499 4321952 4785877
8471D785877M05347L37617K64721J96098J44816J21612J29206J60518K01784K38704
8461F986300K61953K68665K59836K36724J99416J47647Q2594R219o0988j09257
8451H282109j14027n9955N4247K14862L98951N81596P39603Q51761Q99654Q72392
8441A2721193P73479O23539M53756K92279J52456L0795q5473k08327l43079m87947
8431A3922671o36172p78065r02507r98352j055791j067622j031111r50799q40499
8422E661753p21619o16966n43461n08582n11777n47672o07551o79325p48556q01552
8412f25308q28758q26660p98253p52440p01508o56094o19971n88778n54212n09941
8402g461923m54025l86627l06704k11800j01231K0212J41092K45534L17945L47882
$$ plain form
8471 4785877 5191224 5528841 5793562 5989660 6134476 6256088 6385294 6545812 6747596 6986300
8461 6986300 7248253 7516918 7776754 8013478 8212894 8360541 8443135 8452354 8391366 8282109
8451 8282109 8168082 8108127 8162374 8377236 8776187 9357783 10097386 10949147 11848801 12721193
8441 12721193 13494672 14118211 14571967 14864246 15016702 15047497 14962024 14753697 14410618 13922671
8431 13922671 13286499 12508434 11605927 10607575 9551784 8484162 7453051 6502252 5661753
8422 5661753 4940134 4323168 3779707 3271125 2759348 2211676 1604125 924800 176244 -625308
8412 -625308 -1454066 -2280726 -3078979 -3831419 -4532927 -5189021 -5808992 -6397770 -6951982 -7461923
8402 -7461923 -7915948 -8302575 -8609279 -8821079 -8922310 -8902098 -8761006 -8515472 -8197527 -7849645
8392g849645L32295K74095J78825N2789r5893k55048m08075n37041o27546o71764
8382i607008o67483o15598n20751l95733k63198j48310o5450j0677L2613Q0399
8372a2181196J39549K09503K88307L74820M66319N57139O42072P21546Q02825
8363g979116Q95261J003174J121292J234780J322987J365648J350054J276185
8355A590265J156295J008858Q51096O94678N44958M01392K58335J07824n5097
8346F558604k27066l94530n36744o32494o68042o42927n70582m73287l74723k94448
8336A743761k45827k35465k61879l13851l71152m09505m08531l58863k64840j41685
8326a267837r498J12674K10755K77766L14771L30146L36528L46227L67261M01304
$$ plain form
8392 -7849645 -7517350 -7243255 -7064430 -7011641 -7107534 -7362582 -7770657 -8307698 -8935244 -9607008
8382 -9607008 -10274491 -10890089 -11410840 -11806573 -12069771 -12218081 -12283531 -12294208 -12261595 -12181196
8372 -12181196 -12041647 -11832144 -11543837 -11169017 -10702698 -10145559 -9503487 -8781941 -7979116
8363 -7979116 -7083855 -6080681 -4959389 -3724609 -2401622 -1035974 314080 1590265
8355 1590265 2746560 3755418 4606514 5301192 5846150 6247542 6505877 6613701 6558604
8346 6558604 6331538 5937008 5400264 4767770 4099728 3456801 2886219 2412932 2038209 1743761
8336 1743761 1497934 1262469 1000590 686739 315587 -93918 -502449 -861312 -1126152 -1267837
8326 -1267837 -1277335 -1164661 -953906 -676140 -361369 -31223 305305 651532 1018793 1420097
8316A420097M43299M82380N05002N00371M65843M08684L42807K82459K36312K04560
8306E291814J80119J53428J18286P5433L2109j286j5187m260L0031P8210J24209
8295F062906J50447J45432J09820N5960m19n0877r8654j53041k18890k90224l52166
8284E360294l88155l86825l45748k72588j84649j06007o1068o5756j20705k10871
8274C217922l11729l98012m50396m58431m20102l39053k21269p3806R3349K64842
8264I03315M20689N41281O14069O38228O24822N91734N55110N21769M86991M38564
8254F336572L63847K55809J16013m5860k15214l76795n17928o29914p08261p52441
8244C825828p65015p50193p12432o55603n82806m97229m04305l13346k35614j78345
$$ plain form
8316 1420097 1863396 2345776 2850778 3351149 3816992 4225676 4568483 4850942 5087254 5291814
8306 5291814 5471933 5625361 5743647 5819080 5851189 5849903 5834716 5830456 5860487 5938697 6062906
8295 6062906 6213353 6358785 6468605 6524565 6524146 6473269 6374615 6221574 6002684 5712460 5360294
8284 5360294 4972139 4585314 4239566 3966978 3782329 3676322 3615254 3549498 3428793 3217922
8274 3217922 2906193 2508181 2057785 1599354 1179252 840199 618930 545124 638473 903315
8264 903315 1324004 1865285 2479354 3117582 3742404 4334138 4889248 5411017 5898008 6336572
8254 6336572 6700419 6956228 7072241 7026381 6811167 6434372 5916444 5286530 4578269 3825828
8244 3825828 3060813 2310620 1598188 942585 359779 -137450 -541755 -855101 -1090715 -1269060
8234a269060j38974j05166o1969j661P0569J39111J87128K06094J99247J77566
8224e97115J52277J29004J05491P2576J8232o5462j74874k91243l84313m22711
8214a458138l86860k78189j19361N4954K11368L27907L97575M26931M31976M31704
8204C9867M39844M58481M78091M84205M65387M17008L40316K40736J27628J3251
8194C504814r1990j85648k74295l66554m63638n56338o31330o80802p07025p19095
8184a171901p25573p28320p20552o89274o20848n07179l49456j57440N4774K73362
8174e342407M86790O84605Q54757R82319J051973J054158R91296Q79072P40946
8165B383509N99867M73371L73978L11097K89796L06580L46347L84284L93040L52599
$$ plain form
8234 -1269060 -1408034 -1513200 -1575169 -1576830 -1506261 -1367150 -1180022 -973928 -774681 -597115
8224 -597115 -444838 -315834 -210343 -137767 -119535 -184997 -359871 -651114 -1035427 -1458138
8214 -1458138 -1844998 -2123187 -2242548 -2187594 -1976226 -1648319 -1250744 -823813 -391837 39867
8204 39867 479711 938192 1416283 1900488 2365875 2782883 3123199 3363935 3491563 3504814
8194 3504814 3412824 3227176 2952881 2586327 2122689 1566351 935021 254219 -452806 -1171901
8184 -1171901 -1897474 -2625794 -3346346 -4035620 -4656468 -5163647 -5513103 -5670543 -5615769 -5342407
8174 -5342407 -4855617 -4171012 -3316255 -2333936 -1281963 -227805 763491 1642563 2383509
8165 2383509 2983376 3456747 3830725 4141822 4431618 4738198 5084545 5468829 5861869 6214468
8155F214468K58814J26283j6567j38106k14332k35033k04156j36258n1154L1783
8145E635742R7902J38148J46474J17361M7909n5703j73985k79209l48556l75439
8135D950644l69839l48559l24619l03485k85859k71805k62297k58056k57887k58441
8125B009797k55748k46962k30633k06066j73918j38545j09441r8948j16944j65799
8115B66793k38296l19188l89846m34506m44959m20524l63609k75157j54102j117
8105b774511J76751L64065N39288O80742P73394Q12416Q01123P45138O48241N13878
8095C280525L51130J79473K7406p4955j04969n3922P0261K43422M29018N86493
8085D933882O82666P01159O45212N33789L94821K58653J52139R2954Q5745J22430
$$ plain form
8155 6214468 6473282 6599565 6582998 6444892 6230560 5995527 5791371 5655113 5603959 5635742
8145 5635742 5733644 5871792 6018266 6135627 6183536 6127833 5953848 5674639 5326083 4950644
8135 4950644 4580805 4232246 3907627 3604142 3318283 3046478 2784181 2526125 2268238 2009797
8125 2009797 1754049 1507087 1276454 1070388 896470 757925 648484 549536 432592 266793
8115 266793 28497 -290691 -680537 -1115043 -1560002 -1980526 -2344135 -2619292 -2773394 -2774511
8105 -2774511 -2597760 -2233695 -1694407 -1013665 -240271 572145 1373268 2118406 2766647 3280525
8095 3280525 3631655 3811128 3838534 3763579 3658610 3604688 3674949 3918371 4347389 4933882
8085 4933882 5616548 6317707 6962919 7496708 7891529 8150182 8302321 8395275 8481020 8603450
8075H603450J86753K60126L25659L69920L84235L66296L20509K55071J77088Q9499
8065A1338606p742j14093k25735l34657m28554m92232n12928m88326m30640l60836
8055G942863k95876k39670j85634j27984p1385l1322k6409o9371j61824k93605
8045F439783m45229n92661p13819p94904q33804q39255q26646q12338q08380q19513
8035a046766q43815q75678r07704r29651r26896q82624p84757o33815m46700k53615
8025h532021q8525K3047P3193P3165M8094K9667M9607J32169K84502M90083P12974
8014f704045R13110J062428J150529J178680J150812J069889R40403P72006N80519
8005B114331L86133K10000P0005k3173o7720o9266l8286J1191O1930R5704R8557
$$ plain form
8075 8603450 8790203 9050329 9375988 9745908 10130143 10496439 10816948 11072019 11249107 11338606
8065 11338606 11330864 11216771 10991036 10656379 10227825 9735593 9222665 8734339 8303699 7942863
8055 7942863 7646987 7407317 7221683 7093699 7022314 6990992 6964583 6895212 6733388 6439783
8045 6439783 5994554 5401893 4688074 3893170 3059366 2220111 1393465 581127 -227253 -1046766
8035 -1046766 -1890581 -2766259 -3673963 -4603614 -5530510 -6413134 -7197891 -7831706 -8278406 -8532021
8025 -8532021 -8620546 -8597499 -8524306 -8451141 -8403047 -8373380 -8323773 -8191604 -7907102 -7417019 -6704045
8014 -6704045 -5790935 -4728507 -3577978 -2399298 -1248486 -178597 761806 1533812 2114331
8005 2114331 2500464 2710464 2780469 2757296 2689576 2620310 2582024 2593215 2655145 2750849 2849406
7994B849406O6352O607o4730j29735j75722k01029k16783k42279k95033l81357
7984A215697m93771o15939p29227q15558q57807q43198p70477o54185n19445l89655
7974e473565k76628j79515r0165J033J00947K10074L19896M13854M72581M80114
7964d021374M28018L17969J64558l186j46016k26287k22721j39493l557J48545
7954c703544K86746L97184M80705N42668N82558N91545N59259M83108L72085K43000
7944H35314J13807j307r4492j66267k26188k89517l69776m71286n85977o95476
7934a951165p76585q07955p76031o78202n22040l22014r6578J33209L45047N18367
7924d933947O37847O95058O87918O20634N06262L69573K44799J65513J50826J96854
$$ plain form
7994 2849406 2915758 2922365 2857635 2727900 2552178 2351149 2134366 1892087 1597054 1215697
7984 1215697 721926 105987 -623240 -1438798 -2296605 -3139803 -3910280 -4564465 -5083910 -5473565
7974 -5473565 -5750193 -5929708 -6019873 -6018840 -5917893 -5707819 -5387923 -4974069 -4501488 -4021374
7964 -4021374 -3593356 -3275387 -3110829 -3114015 -3260031 -3486318 -3709039 -3848532 -3852089 -3703544
7954 -3703544 -3416798 -3019614 -2538909 -1996241 -1413683 -822138 -262879 220229 592314 835314
7944 835314 949121 947814 853322 687055 460867 171350 -198426 -669712 -1255689 -1951165
7934 -1951165 -2727750 -3535705 -4311736 -4989938 -5511978 -5833992 -5930570 -5797361 -5452314 -4933947
7924 -4933947 -4296100 -3601042 -2913124 -2292490 -1786228 -1416655 -1171856 -1006343 -855517 -658663
7914f58663K79721L68314M38479M80519M97982N01428N01991N06917N17341N28700
7904C962729N34358N30782N20314N08522M97373M79519M39190L60832K40570R1980
7894H166169n9110j87661k80886l40933l79653m11356m47414m92954n45530n96937
7884D423735o37949o63030o72196o70037o63212o56902o50921o38164o07882n52360
7874a988918m72038l75678k76474j87367j17534p0559m4567l4145l2677l3439
7864c633396k9859j7233L064J9590J2120l9591j43264k85338m31849n38987n68405
7853e653148n00841l43146j26247J05424L08797M54680N32523N46940N10254M36514
7843c728250L39526K33871J35692O1026K2061K3777O3196J31191K15226L01885
$$ plain form
7914 -658663 -378942 -10628 427851 908370 1406352 1907780 2409771 2916688 3434029 3962729
7904 3962729 4497087 5027869 5548183 6056705 6554078 7033597 7472787 7833619 8074189 8166169
7894 8166169 8107059 7919398 7638512 7297579 6917926 6506570 6059156 5566202 5020672 4423735
7884 4423735 3785786 3122756 2450560 1780523 1117311 460409 -190512 -828676 -1436558 -1988918
7874 -1988918 -2460956 -2836634 -3113108 -3300475 -3418009 -3488568 -3533135 -3567280 -3599957 -3633396
7864 -3633396 -3663255 -3680488 -3677424 -3657834 -3645714 -3685305 -3828569 -4113907 -4545756 -5084743 -5653148
7853 -5653148 -6153989 -6497135 -6623382 -6517958 -6209161 -5754481 -5221958 -4675018 -4164764 -3728250
7843 -3728250 -3388724 -3154853 -3019161 -2958135 -2936074 -2912297 -2849101 -2717910 -2502684 -2200799
7833b200799L79067M37637M71746M77578M52010L92828L00145J77254K9867j35148
7823G82185l09995m85101o48729p88496q94578r62193r90904r80630r27842q26103
7813g032386o71508m68951k33958J1173K43606M44305N99520P01605P51027P57741
7803d897826P38428P09309O79230O48583O14655N78648N48671N36228N47880N76988
7793A280794O01890N93780N30773M09436K47250P6232o7883j56701j77239j33861
7783C204471m3068P4659K00023L15473M05318M58964M75610M65460M45206M30017
7773F432133M26676M31231M32187M17589L82575L33274K84338K51409K43665K61365
7763I896442K97942L41905L76770L83524L49203K76286J82602Q9781J0350n5516
$$ plain form
7833 -2200799 -1821732 -1384095 -912349 -434771 17239 410067 710212 887466 917333 782185
7823 782185 472190 -12911 -661640 -1450136 -2344714 -3306907 -4297811 -5278441 -6206283 -7032386
7813 -7032386 -7703894 -8172845 -8406803 -8395630 -8152024 -7707719 -7108199 -6406594 -5655567 -4897826
7803 -4897826 -4159398 -3450089 -2770859 -2122276 -1507621 -928973 -380302 155926 703806 1280794
7793 1280794 1882684 2476464 3007237 3416673 3663923 3740155 3672272 3515571 3338332 3204471
7783 3204471 3161403 3236062 3436085 3751558 4156876 4615840 5091450 5556910 6002116 6432133
7773 6432133 6858809 7290040 7722227 8139816 8522391 8855665 9140003 9391412 9635077 9896442
7763 9896442 10194384 10536289 10913059 11296583 11645786 11922072 12104674 12194455 12204805 12149289
7753A2149289j13828j69989k27240k88265l55687m30558n11009n92419o68759
7744H791535p34238p84586q17392q30956q21919p83362p06362n86088m29022k54805
7734B042805q9977M1867J26148J57482J37248P1803k9373j56595l02084m58652
7724A540672o15861p57390q62031r07764q77239p63661n75444l37008q3642J48221
7714d091147L30592M48617M99074M85467M13830K91539J28666n9657k51521m18795
7704b223335n31629n66669n15258l86707k04432K432K07397L92084N48043O74923
7694b603151P75515Q50529Q97075R11781Q94560Q48324P75338O75472N49184M01709
7684D976336K43025Q3491o9473k09925l29546m17054m62750m64375m29166l71105
$$ plain form
7753 12149289 12035461 11865472 11638232 11349967 10994280 10563722 10052713 9460294 8791535
7744 8791535 8057297 7272711 6455319 5624363 4802444 4019082 3312720 2726632 2297610 2042805
7734 2042805 1952828 1994695 2120843 2278325 2415573 2487376 2458003 2301408 1999324 1540672
7724 1540672 924811 167421 -694610 -1602374 -2479613 -3243274 -3818718 -4155726 -4239368 -4091147
7714 -4091147 -3760555 -3311938 -2812864 -2327397 -1913567 -1622028 -1493362 -1553019 -1804540 -2223335
7704 -2223335 -2754964 -3321633 -3836891 -4223598 -4428030 -4425598 -4218201 -3826117 -3278074 -2603151
7694 -2603151 -1827636 -977107 -80032 831749 1726309 2574633 3349971 4025443 4574627 4976336
7684 4976336 5219361 5302852 5233379 5023454 4693908 4276854 3814104 3349729 2920563 2549458
7674B549458l06346k49652k11881j97627k04094k23026k45008k62686k70769k64388
$$ plain form
7674 2549458 2243112 1993460 1781579 1583952 1379858 1156832 911824 649138 378369 113981
$$ [...]
##END NTUPLES=NMR SPECTRUM
##END=
