##TITLE=31Pdec_DE-27k2
 D2O, 64 sc
 9.10.2024
##JCAMPDX= 6.0         $$ Bruker NMR JCAMP-DX V2.0
##DATA TYPE= NMR SPECTRUM
##DATA CLASS= NTUPLES
##ORIGIN= UXNMR, Bruker Analytische Messtechnik GmbH
##OWNER= root
$$ XWIN-NMR		Version 3.5
$$ Wed Oct  9 15:50:21 2024 Russian Standard Time (UT+4h)  she@DPX200
##.OBSERVE FREQUENCY= 81.013821
##.OBSERVE NUCLEUS= ^31P
##.ACQUISITION MODE= SIMULTANEOUS
##.ACQUISITION SCHEME= undefined
##.AVERAGES= 64
##.DIGITISER RES= 17
##SPECTROMETER/DATA SYSTEM= spect
##.PULSE SEQUENCE= zgpg30
##.SOLVENT NAME= CDCl3
##.SHIFT REFERENCE= (INTERNAL, CDCl3, 0, 198.062)
##AUDIT TRAIL= $$ (NUMBER, WHEN, WHO, WHERE, WHAT)
$$ ##TITLE= Audit trail, XWIN-NMR		Version 3.5
$$ ##JCAMPDX= 5.01
$$ ##ORIGIN= Bruker BioSpin GmbH
$$ ##OWNER= she
$$ F:/spectra/data/she/nmr/P31/2/pdata/1/auditp.txt
$$ ##AUDIT TRAIL=  $$ (NUMBER, WHEN, WHO, WHERE, WHAT)
(   1,<2024-10-09 15:48:03.32 +0400>,<she>,<DPX200>,
      <created by zg, POWCHK disabled, PULCHK disabled
       configuration hash MD5:
       00 E9 B6 7A A2 85 ED C7 34 08 36 98 17 FE 4E 26
       data hash MD5: 32K
       89 CA 31 3F 78 A2 77 49 69 E7 14 6C 00 30 BC 12>)
(   2,<2024-10-09 15:49:20.56 +0400>,<she>,<DPX200>,
      <Start of raw data processing
       efp BC_mod = 2 LB = 1.5 FT_mod = 6 PKNL = 1 PHC0 = 2610.934 PHC1 = 117.4875 SI = 64K 
       data hash MD5: 64K
       E7 6F 9E 9B 71 C2 58 D4 42 59 BF 2F DB E1 89 27>)
(   3,<2024-10-09 15:49:35.46 +0400>,<she>,<DPX200>,
      <pk PHC0 = -7.843074 PHC1 = 2.2 
       data hash MD5: 64K
       9D 6B ED 71 2A F2 86 D1 23 3F E9 15 49 AC 2D 40>)
(   4,<2024-10-09 15:49:38.81 +0400>,<she>,<DPX200>,
      <abs ABSG = 5 
       data hash MD5: 64K
       19 8F 0E DC 3F 16 E6 53 7D 06 E3 53 43 42 65 2F>)
$$ ##END=
$$ 
$$ hash MD5
$$ F3 3C 97 0A 82 E1 DB 95 FC 25 95 77 B4 6F 59 54
##$RELAX= 
##$RELAX= 
##$RELAX= 
##$RELAX= 
##$RELAX= 
##$RELAX= 
##$RELAX= 
##$RELAX= 
$$ Bruker specific parameters
$$ --------------------------
##$DU= <F:/spectra>
##$EXPNO= 2
##$NAME= <P31>
##$PROCNO= 1
##$TYPE= <nmr>
##$USER= <she>
##$AMP= (0..31)
100 100 100 100 100 100 100 100 100 100 100 100 100 100 100 100 100 100 
100 100 100 100 100 100 100 100 100 100 100 100 100 100 
##$AQSEQ= 0
##$AQ_mod= 1
##$AUNM= <au_zg>
##$AUTOPOS= <>
##$BF1= 81.014009
##$BF2= 200.13
##$BF3= 200.13
##$BF4= 200.13
##$BF5= 200.13
##$BF6= 200.13
##$BF7= 200.13
##$BF8= 200.13
##$BYTORDA= 1
##$CFDGTYP= 0
##$CFRGTYP= 5
##$CHEMSTR= <none>
##$CNST= (0..31)
1 1 145 1 1 1 1 1 1 1 1 1 1 1 1 1 1 1 1 1 1 1 1 1 1 1 1 1 1 1 1 1 
##$CPDPRG= <waltz16>
##$CPDPRG1= <>
##$CPDPRG2= <waltz16>
##$CPDPRG3= <>
##$CPDPRG4= <mlev>
##$CPDPRG5= <mlev>
##$CPDPRG6= <mlev>
##$CPDPRG7= <mlev>
##$CPDPRG8= <mlev>
##$CPDPRGB= <>
##$CPDPRGT= <>
##$D= (0..31)
0 1 0 0 0 0 0 0 0 0.06 0 0.03 2e-05 3e-06 0 0 0.0002 0 0 0 0 0 0 0 0 0 
0 0 0 0 0 0 
##$DATE= 1728474482
##$DBL= (0..7)
120 120 120 11 120 120 24 19 
##$DBP= (0..7)
150 150 150 150 150 150 150 150 
##$DBP07= 0
##$DBPNAM0= <>
##$DBPNAM1= <>
$$ [...]
##$SUBNAM3= <"">
##$SUBNAM4= <"">
##$SUBNAM5= <"">
##$SUBNAM6= <"">
##$SUBNAM7= <"">
##$SUBNAM8= <"">
##$SUBNAM9= <"">
##$SW= 400.765351723535
##$SWIBOX= (0..15)
0 1 3 0 0 0 0 0 0 0 0 0 0 0 0 0 
##$SW_h= 32467.5324675325
##$TD= 32768
##$TD0= 1
##$TE= 0
##$TE2= 300
##$TE3= 300
##$TEG= 300
##$TL= (0..7)
0 120 53 12 22 120 120 120 
##$TP= (0..7)
150 150 150 150 150 150 150 150 
##$TP07= 0
##$TPNAME0= <>
##$TPNAME1= <>
##$TPNAME2= <>
##$TPNAME3= <>
##$TPNAME4= <>
##$TPNAME5= <>
##$TPNAME6= <>
##$TPNAME7= <>
##$TPOAL= (0..7)
0.5 0.5 0.5 0.5 0.5 0.5 0.5 0.5 
##$TPOFFS= (0..7)
0 0 0 0 0 0 0 0 
##$TUNHIN= 0
##$TUNHOUT= 0
##$TUNXOUT= 0
##$USERA1= <user>
##$USERA2= <user>
##$USERA3= <user>
##$USERA4= <user>
##$USERA5= <user>
##$V9= 5
##$VALIST= <valist>
##$VCLIST= <CCCCCCCCCCCCCCC>
##$VD= 0
##$VDLIST= <DDDDDDDDDDDDDDD>
##$VPLIST= <PPPPPPPPPPPPPPP>
##$VTLIST= <TTTTTTTTTTTTTTT>
##$WBST= 1024
##$WBSW= 4
##$XGAIN= (0..3)
0 0 0 0 
##$XL= 0
##$YL= 0
##$YMAX_a= 19744
##$YMIN_a= -23202
##$ZGOPTNS= <>
##$ZL1= 120
##$ZL2= 120
##$ZL3= 120
##$ZL4= 120
##$ABSF1= 198.0616
##$ABSF2= -202.7028
##$ABSG= 5
##$ABSL= 3
##$ALPHA= 0
##$AQORDER= 0
##$ASSFAC= 0
##$ASSFACI= 0
##$ASSFACX= 0
##$ASSWID= 0
##$AUNMP= <proc_1d>
##$AZFE= 0.1
##$AZFW= 0.5
##$BCFW= 0
##$BC_mod= 2
##$BYTORDP= 0
##$COROFFS= 0
##$CY= -3
##$DATMOD= 1
##$DC= 0
##$DFILT= <>
##$DTYPP= 0
##$F1P= 0
##$F2P= 0
##$FCOR= 1
##$FTSIZE= 65536
##$FT_mod= 6
##$GAMMA= 0
##$GB= 0
##$INTBC= 1
##$INTSCL= 9.790993e-09
##$ISEN= 30
##$LB= 1.5
##$LEV0= 0
##$LPBIN= 0
##$MAXI= 10000
##$MC2= 0
##$MEAN= 0
##$ME_mod= 0
##$MI= 50
##$NCOEF= 0
##$NC_proc= -5
##$NLEV= 6
##$NOISF1= 182.463
##$NOISF2= 159.3651
##$NSP= 0
##$NTH_PI= 0
##$NZP= 0
##$OFFSET= 198.0616
##$PC= 4
##$PHC0= 2603.091
##$PHC1= 119.6875
##$PH_mod= 1
##$PKNL= yes
##$PPARMOD= 0
##$PSCAL= 0
##$PSIGN= 0
##$REVERSE= no
##$SF= 81.0140089999434
##$SI= 65536
##$SIGF1= 159.3651
##$SIGF2= -187.1042
##$SINO= 113.3802
##$SIOLD= 16384
##$SREGLST= <1H.CDCl3>
##$SSB= 0
##$STSI= 65536
##$STSR= 0
##$SW_p= 32467.5324675325
##$SYMM= 0
##$S_DEV= 0
##$TDeff= 32768
##$TDoff= 0
##$TI= <>
##$TILT= no
##$TM1= 0
##$TM2= 0
##$TOPLEV= 0
##$USERP1= <user>
##$USERP2= <user>
##$USERP3= <user>
##$USERP4= <user>
##$USERP5= <user>
##$WDW= 1
##$XDIM= 65536
##$YMAX_p= 453405834
##$YMIN_p= -44165109
$$ End of Bruker specific parameters
$$ ---------------------------------
##NTUPLES= NMR SPECTRUM
##VAR_NAME=  FREQUENCY,     SPECTRUM/REAL,   SPECTRUM/IMAG
##SYMBOL=    X,             R,               I
##VAR_TYPE=  INDEPENDENT,   DEPENDENT,       DEPENDENT
##VAR_FORM=  AFFN,          ASDF,            ASDF
##VAR_DIM=   65536,         65536,           65536
##UNITS=     HZ,            ARBITRARY UNITS, ARBITRARY UNITS
##FACTOR=    0.49542278885378, 1,            1
##FIRST=     16045.7642231865, 0,            0
##LAST=      -16421.768244346, 0,            0
##MIN=       -16421.768244346, -44165109,    0
##MAX=       16045.7642231865, 453405834,    0
$$ Real data points
##PAGE= N=1
##DATA TABLE= (X++(R..R)), XYDATA
$$ [...]
40035a113747L77137K86141N7400q0127p3690p826P5004K06837L64673L99792
40025D91594J74176k27623n05018m36258j22246J57911K88079L62714M09382K81720
40015H74431p3788m32791n45487m53914l74283l52802k54900o1454O4942O0490
40005a549556R5511L06878N42363N37768K91193R7077J74037L69489L31638m3163
39995A153235m39220m74031j70085N8776p9492l96488m82821k19573J27935K81492
39985f40272K37262J56653J22476Q5663k5753k15384m00643m56607l16302m5206
39975a498113K12933L56525L60098K34375L7021j01874p2236Q0901J88848J33289
39965f8233o4828k93744m01925k57363R7847L75846L04076j6631j91986k8644
$$ plain form
40035 -1113747 -736610 -450469 -393069 -473196 -546886 -554712 -479708 -272871 91802 491594
40025 491594 665770 438147 -66871 -503129 -625375 -467464 -179385 183329 592711 874431
40015 874431 800643 367852 -177635 -631549 -1005832 -1358634 -1613534 -1674988 -1610046 -1549556
40005 -1549556 -1454045 -1147167 -604804 -67036 224157 321234 495271 864760 1196398 1153235
39995 1153235 714015 239984 69899 128675 49183 -347305 -830126 -1049699 -921764 -640272
39985 -640272 -403010 -246357 -123881 -38218 -63971 -279355 -679998 -1136605 -1452907 -1498113
39975 -1498113 -1285180 -928655 -568557 -334182 -297161 -399035 -471271 -390370 -201522 -68233
39965 -68233 -133061 -426805 -828730 -1086093 -988246 -612400 -308324 -324955 -516941 -545585
39955e45585K32716K79210J44982R7554K12942K69430O8899k81368m71048l24641
39945c16909O582K08420J55030L2028N6363J72363J72533M4329l3602l1302j22884
39934C42951l21489l50714o3032K60445K75490N6160o3839M035N4982l1850j71853
39923h714l00965m23211m26354j62442K19214L23218L4985k57522j61202J94193
39913i68800L49288J24570j87314k12060R8020M64605N75736L49329j8861k32641
39903C41872j50293J07115K81071J98658r1483l54437l67529j48739M2829J2551
39893a28385j14466p4474J34333K25394L7472k21137k53491m7330J72182K49367
39883b0535K01267R0480l5200r5813k1165J34081K12007J17174q6288k41303k29592
$$ plain form
39955 -545585 -312869 -33659 111323 208877 421819 691249 760148 478780 7732 -316909
39945 -316909 -310327 -101907 53123 85151 141514 313877 486410 530739 497137 465835 342951
39934 342951 21462 -329252 -392284 -131839 143651 199811 135972 140007 194989 163139 -8714
39923 -8714 -309679 -732890 -1159244 -1321686 -1102472 -779254 -744269 -1001791 -1162993 -968800
39913 -968800 -619512 -494942 -682256 -894316 -796296 -331691 244045 593374 574513 341872
39903 341872 191579 298694 579765 778423 686940 332503 -35026 -183765 -140936 -128385
39893 -128385 -242851 -317325 -182992 42402 79874 -141263 -394754 -442084 -269902 -20535
39883 -20535 180732 271212 236012 140199 119034 253115 465122 582296 496008 254705 25113
39872B5113p0094P5601M6679j22643k19519j15602Q2716K28053L47288N10818
39862G88410O00908M37807R2127j77753l08396m79356p04449o72788k02621L66046
39852b60065N12938J78233j92533k13952N2603K86677K87289J14760j7765L2601
39842G80786J48082M5993l16620n65445l72381J9176Q8768j75065k35906J32420
39832d50192M38819K19083k39903l51596r2309R3113M4610p859l891j41798l71415
39821h63338l45973j5935K19202J31934j7871K996K8942r5277j76704p6387l0326
39810a238737j76934j65200K79824P40065O27049R6161j63913O7585L55822L79462
39800H01184K75629J65786o0752l32861l18962k547J40855j71294n77889o24492
$$ plain form
39872 25113 -44981 30620 77299 -45344 -264863 -380465 -297749 -69696 277592 788410
39862 788410 1389318 1827125 1919252 1741499 1433103 953747 249298 -423490 -626111 -260065
39852 -260065 252873 431106 238573 24621 77224 363901 651190 765950 748185 780786
39842 780786 928868 974861 658241 92796 -279585 -260409 -171641 -346706 -582612 -450192
39832 -450192 -11373 207710 -32193 -383789 -476098 -382985 -338375 -346234 -350125 -491923 -863338
39821 -863338 -1209311 -1225246 -1006044 -874110 -891981 -888985 -860043 -955320 -1132024 -1208411 -1238737
39810 -1238737 -1415671 -1580871 -1301047 -560982 66067 162228 -1685 65900 421722 801184
39800 801184 1076813 1242599 1181847 848986 530024 527477 668332 497038 -80851 -705343
39790g05343m00721k63529k19691r761L50033N19753L14767o0073k85908k52682
39780a013155q3322M6682R0208J50357K88903L71194K54849P8804J02101K47063
39770E33684J41515k70084n12200k03096L97591P41458O52304L38594l3651m09608
39760A376507o12262m38532r723K75181K06431j9889j08984l3394j9870k44104
39750C71361n87133p21295m89984j39776o812j8631K02210O95353R84916P20714
39740A010923J64449k08851k87195k12623j1956K79327L76668P4013l43159m36714
39730D04882k45945j55315k40021k11385J6101J68315P6437r3583j48479q4372
39720e13365L5221J24514K6946k60290l89152p4226L77194M08945L8382j92204
$$ plain form
39790 -705343 -1106064 -1369593 -1589284 -1599045 -1249012 -729259 -414492 -474565 -760473 -1013155
39780 -1013155 -1096477 -1049795 -959587 -809230 -520327 -149133 105716 184520 286621 533684
39770 533684 675199 405115 -107085 -310181 87410 828868 1481172 1819766 1786115 1376507
39760 1376507 764245 325713 315990 591171 797602 777713 668729 635335 615465 371361
39750 371361 -215772 -937067 -1427051 -1566827 -1573639 -1592270 -1390060 -694707 290209 1010923
39740 1010923 1175372 966521 679326 466703 454747 734074 1110742 1184755 841596 404882
39730 404882 158937 3622 -236399 -447784 -431683 -263368 -186931 -280514 -428993 -513365
39720 -513365 -478144 -353630 -326684 -586974 -976126 -1050352 -673158 -264213 -225831 -418035
39710d18035q0666K1261n6581j3375K50830L20368j3727k82339m2992M05025M96313
39699E86082K14324o0950j98446k96061k73025j5480K37768J60324j18586k01544
39689C4406o5289m7263k28449k96768p6256K10942L15144K77688K63165K94715
39679F82035K51379J3649l76798o20659l81146K23531N60097K12014m00976n07965
39669c44839J1868N20563M90642P7618k40084k43620p3951O592j43923l89103
39659c28237m06272r6728J99496J38887j12722j38450P6589J76787P1333N2913
39649c66404K28747L22609J91311P9429J43466J47216q0861k55919o3770K79882
39639F25706K80765j51067n96874o66053l92963r0958L6515R7400L27399O80406
$$ plain form
39710 -418035 -498701 -477440 -534021 -547396 -296566 23802 10075 -272264 -315256 89769 586082
39699 586082 800406 739456 541010 244949 -28076 -43556 194212 354536 235950 34406
39689 34406 -30883 -78146 -306595 -603363 -679619 -468677 -153533 124155 387320 682035
39679 682035 933414 947063 570265 -50394 -431540 -208009 352088 564102 163126 -344839
39669 -344839 -332971 187592 678234 755852 515768 272148 198197 204789 60866 -328237
39659 -328237 -734509 -831237 -631741 -492854 -605576 -744026 -667437 -490650 -419317 -366404
39649 -366404 -137657 184952 376263 455692 599158 746374 665513 409594 345824 625706
39639 625706 906471 755404 158530 -507523 -900486 -991444 -954929 -857529 -530130 150276
39629A50276P30523J98142n26232p43258l41826P3200N2164j46865r5191J59044
39619d90023L29059M05146M93974M14803l9399n68453n94077l7650N37089O30839
39609A081308L30646K6304j17880k38274m54008o27907m84490O969M22900K61873
39599B07441m03544r02924p61519k58834N1076J00517K01248L73624K97179o3449
39589a159185k69968k4181L77781M41342J14034k01397j85101L9545J17496m3609
39579g93243j06107K54002P97166Q90431L32234k96270l53199M7710K77893N4210
39569A104827l28327m90302k95007K11895P68158Q93536L91589k13337k61086
39560A781946P2412J9994n22552p50816k23905L77926K69576k84144m71190j45407
$$ plain form
39629 150276 880799 1078941 552709 -190549 -532375 -459175 -407011 -553876 -649067 -490023
39619 -490023 -160964 244182 738156 1152959 1113560 545107 -48970 -86620 450469 1081308
39609 1081308 1411954 1438258 1320378 1082104 628096 189 -484301 -477332 -54432 207441
39599 207441 -196103 -1099027 -1860546 -2119380 -2068304 -1967787 -1766539 -1392915 -1095736 -1159185
39589 -1159185 -1429153 -1453334 -1075553 -634211 -520177 -721574 -906675 -867130 -749634 -793243
39579 -793243 -899350 -645348 151818 1042249 1374483 1078213 725014 772724 1050617 1104827
39569 1104827 776500 286198 -8809 203086 971244 1864780 2256369 2043032 1781946
39560 1781946 1854358 1874352 1351800 600984 377079 755005 1024581 740437 269247 123840
39550A23840J60958J62136O5801L3496K8849J37274M42115O15665K39022m40041
39540A569115o83839l13739K6057j40731m69296m66497k67477k52207k94602R572
39530a283644N57049P68405M18474l9569j08787J38389K64697O4878k44626l48541
39520A86725j91225O715L3590p1619j12280k4583O5632R3315J62720K96514K87068
39509G32572J1958k65941k04288R5494J96662m0306k74503k30191r8123j81922
39499b58588l88234l52295L6753M85769O42486M11608l9386m19840m78212j91224
39489e51163J79937L26509J94297k0820j34610j25942o5096j1069K8856J12954
39479f6147K90279M51927L85162R5117j02762k2025N1872k12197n68649m58675
$$ plain form
39550 123840 284798 446934 512735 546231 575080 712354 1154469 1770134 2009156 1569115
39540 1569115 885276 571537 597594 456863 -12433 -478930 -746407 -998614 -1293216 -1283644
39530 -1283644 -726595 41810 460284 420715 311928 450317 715014 779892 535266 186725
39520 186725 -4500 2215 35805 -35814 -148094 -172677 -107045 -13730 148990 445504 732572
39509 732572 744530 478589 274301 369795 566457 526151 251648 21457 -76666 -258588
39499 -258588 -646822 -999117 -962364 -476595 165891 577499 538113 118273 -359939 -551163
39489 -551163 -371226 -44717 149580 128760 -5850 -131792 -196888 -207957 -179101 -66147
39479 -66147 224132 676059 1061221 1156338 1053576 1031551 1083423 871226 302577 -156098
39469a56098J18422N11223L29690m2760j05277M8293M1109j33006k05768j24118
39459B81710j1287J51639L74947L92162K1699l63436k58176J78209L19995M8119
39449A135581r7116J54273L41668J9387n41079p51875m65426r782K70668K48646
39439C04945J4601j56398n6660J24488K3634k67509k40269J96892M58050J77403
39429E79177j73026m8835K59314J17782l83873n72831k41567J45920K70154L08236
39419B60451L79789K64461j03495l54694j86047J93917L66879K07075r8960l24670
39409F04706l53206k26455j28362j67652j82351L2026L46611M41915L00812K11111
39399H79155K55425J86786r1524l07767k50964p9666l893L8054J56177K18884
$$ plain form
39469 -156098 -37676 473547 803237 760477 655200 703493 744602 611596 405828 281710
39459 281710 270423 422062 797009 1189171 1210870 847434 589258 767467 1087462 1135581
39449 1135581 1038465 1192738 1534406 1553793 1012714 260839 -204587 -214369 56299 304945
39439 304945 319546 163148 106488 230976 254610 -12899 -253168 -56276 401774 579177
39429 579177 406151 357316 616630 734412 350539 -222292 -463859 -317939 -47785 260451
39419 260451 640240 904701 801206 446512 260465 454382 821261 1028336 929376 604706
39409 604706 251500 25045 -103317 -270969 -453320 -421294 -74683 367232 668044 879155
39399 879155 1134580 1321366 1229842 922075 671111 591445 587552 625606 781783 1000667
39389A000667M4545k83224n08585n02272l26889j17207J2556O4378J93034M81336
39379E8339O94765N23052P7468j85216j03011k677j25394k65048k11513j63407
39369B97358l48327n26714k96144K47270N37200K26240m01712p36183m42205K19460
39359a223757O37297M91196J06629q082J29798Q8569k07247l24340m9501K56803
39349a02635K60215R8322m4922k68666n06630l32987K92359O51548K64535k65974
39339D5165j54867K94309K43315k01025j68825L94811N16061j98305q22763m97964
39329e50088L17362O34788L29758L0169L9444R5659K2156N32J82657M23703M52438
39318A978578J35643l63857o20533l50780J28515J68389l28904o89979m05596
$$ plain form
39389 1000667 1045212 761988 253403 -248869 -575758 -692965 -680409 -616031 -422997 58339
39379 58339 753104 1276156 1353624 1168408 1065397 1062720 937326 672278 460765 297358
39369 297358 -50969 -577683 -873827 -626557 -89357 136883 -264829 -1001012 -1443217 -1223757
39359 -1223757 -586460 -95264 11365 3283 133081 221650 14403 -309937 -359438 -102635
39349 -102635 157580 255902 210980 -57686 -564316 -897303 -604944 46604 311139 45165
39339 45165 -109702 184607 427922 226897 58072 452883 968944 770639 -52124 -550088
39329 -550088 -232726 402062 731820 761989 801433 897092 919248 919780 1102437 1526140 1978578
39318 1978578 2114221 1750364 1129831 779051 907566 1075955 747051 57072 -348524
39309c48524J25682K09122j27680k67407L2057L82814M52864L60690K68986O1448
39299A150052l29645o24024n43375k59534j57389k33036r1336L75256O54160K60196
39289B01325m72133o77585q0507O07141O23567J04453k64838k20720m9458N6899
39279a71856J92944L28312K68881Q6726O4544J37961m3472l78590k83838L30780
39269E32392P02501K73016m43592n90241j34537K72911K74346L3307k71585n59318
39259H9200n86525j71585L61256M90367K38319J11320K92519M00889J42315k57622
39249A110453m35159l52878k16719j80937k56919l28678k12758J21032M07522
39240c45041L69956J03130n2127L8785K15105L10061K69164N9422k57737m36336
$$ plain form
39309 -348524 -222842 -13720 -141400 -408807 -376750 6064 458928 819618 1088604 1150052
39299 1150052 820407 196383 -346992 -606526 -763915 -996951 -1088287 -713031 -58871 201325
39289 201325 -270808 -948393 -1028900 -421759 201808 306261 41423 -179297 -228755 -171856
39279 -171856 21088 349400 618281 705007 769551 907512 864040 485450 201612 532392
39269 532392 1234893 1507909 1064317 474076 339539 612450 886796 920103 648518 89200
39259 89200 -497325 -668910 -307654 182713 421032 532352 824871 1225760 1368075 1110453
39249 1110453 675294 322416 105697 -75240 -332159 -660837 -873595 -752563 -345041
39240 -345041 24915 128045 75918 114703 329808 639869 909033 968455 710718 274382
39230B74382l12481p7990o985l7366N0376J94778J94295J41592K50122L59888
39220A030611J48221k21303k44089J00734K62070l9136m48794o15842o25701n93495
39210a246724l77390K9109L11970L28327L34875M73786N08781L39616K60412L81915
39200A344677L32563p0003l85335k61410o0914k12905m17125j68024L06035L74682
39190G82241L4059j53837k6351J9665j75889k78586r1761J59004L00796M30491
39180I99832N16154K99172k05428n51677m27441l3622K67064L55477K73602P2868
39170A566001r8023n9665R0595K2191l33670o10156m81807p1443K64132L38421
39160F26576K04432K1653m5837K9081O0773r4856k48314j17035J81235K37846
$$ plain form
39230 274382 -38099 -116089 -123074 -160440 -110064 84714 279009 420601 670723 1030611
39220 1030611 1178832 957529 713440 814174 1076244 1037108 588314 -27528 -653229 -1246724
39210 -1246724 -1624114 -1595005 -1283035 -954708 -619833 -146047 362734 702350 962762 1344677
39200 1344677 1677240 1607237 1221902 960492 899578 686673 269548 101524 407559 782241
39190 782241 816300 662463 636112 655777 479888 201302 109541 268545 569341 999832
39180 999832 1515986 1815158 1609730 1058053 630612 596990 864054 1219531 1493133 1566001
39170 1566001 1467978 1408313 1498908 1521099 1187429 577273 95466 24023 288155 626576
39160 626576 831008 852661 806824 835905 896678 801822 553508 436473 617708 855554
39150H55554l1125k78075k91922k48290k84310k64170j31743o2899p0904R7458
39140g10426M40758N42219K24705r8361q6832k5591k65808n49057m36971o8466
39130a033830J06847Q0744J48876K36852M1497k73615k27254J46747L06448J08790
39120c57898J9422K54321L93226J34055j86234k01484j05964j85627k20683J13679
39110c43187N77743O53833L13837j5788j50126l06772n72873o70143l84229P7890
39100h19815L15289J63239j80489l65106k19070O0284J19781q4288k00065J3931
39090a196309L20704L73066K30870J84226K36553J74273N5071J56901M25207M49914
39080A410476J16364j72508j31660l1903k03333m60691m15012j08888Q8286P9027
$$ plain form
39150 855554 824429 546354 254432 6142 -278168 -542338 -674081 -736980 -807884 -710426
39140 -710426 -269668 272551 497256 398895 312063 286472 20664 -528393 -965364 -1033830
39130 -1033830 -926983 -846239 -697363 -460511 -419014 -692629 -919883 -773136 -466688 -357898
39120 -357898 -338476 -84155 309071 443126 256892 55408 -50556 -236183 -456866 -343187
39110 -343187 234556 888389 1202226 1186438 1036312 729540 156667 -513476 -897705 -819815
39100 -819815 -504526 -341287 -521776 -886882 -1105952 -1045668 -925887 -1010175 -1210240 -1196309
39090 -1196309 -875605 -502539 -271669 -87443 149110 323383 378454 535355 960562 1410476
39080 1410476 1526840 1354332 1222672 1190769 987436 526745 111733 2845 91131 170158
39070A70158J00365K34342K79762J66812J12574K19304K43760j8417l65229m63543
39060F79888l29011k48762l01575k49007O5783M63368O73544O42992M71125K09111
39050B077456r9059l04601l08304k56119l35444m16849k04696K22022L84857R1286
39040H50549k07086m0260L84648N08927K36239m9457j64982k87345m21952k91582
39030E17699O9492J55253k63835o85473n62576q1760J86072J17019J3992l8449
39020e72566k31643m87709l96270J82529Q35370J053895P18459P7276m83156o11741
39010H4444k36015K83784M82407L19897J54896J92447K61517J84727M5021k2952
39000A750173k7355L625Q4053J23968r787k07145j90366K6489Q8257j48052l62734
$$ plain form
39070 170158 270523 504865 784627 951439 1064013 1283317 1527077 1508660 1143431 679888
39060 679888 350877 102115 -199460 -448467 -382684 80684 754228 1397220 1868345 2077456
39050 2077456 1978397 1673796 1365492 1109373 773929 357080 152384 374406 759263 850549
39040 850549 643463 603203 987851 1496778 1733017 1683560 1518578 1231233 809281 517699
39030 517699 587191 742444 478609 -206864 -769440 -851200 -665128 -548109 -534117 -572566
39020 -572566 -804209 -1291918 -1688188 -1505659 -670289 383606 1102065 1179341 696185 84444
39010 84444 -151571 132213 614620 934517 1089413 1281860 1543377 1728104 1773125 1750173
39000 1750173 1722818 1726443 1810496 1934464 1924677 1717532 1527166 1553655 1641912 1493860 1131126
38989A131126k84731j15127j62846l43770l63629j90616k7761L9992Q7372J47796
38979h2194K07274K92920L73186L01888M2862k05352k84810k92784l42285l37756
38969c27051k09453j21708j78356j70030O9957K99270K19319k0838p1003N9921
38959d49972J20043J18413K25708K93623K2148m06879m14020J51779P35722P81069
38949A177634L41979j40297l49710k66758j03314j39624l95874n06990k10273
38940e93227J75564J81062m8047L404K81676K02579k82748m70429m8523L38359
38930b60330J59466r7293K25047P74896O90939o2299o86999p21692m45382j65410
38920e89057J43264M02388L28743j3534j23860K02418N10511L45163j05043l43841
$$ plain form
38989 1131126 846395 731268 568422 224652 -138977 -329593 -357354 -317362 -229990 -82194
38979 -82194 125080 418000 791186 1093074 1135936 930584 645774 352990 10705 -327051
38969 -327051 -536504 -658212 -836568 -1006598 -936641 -637371 -418052 -438890 -509893 -449972
38959 -449972 -329929 -211516 14192 307815 329963 -76916 -490936 -339157 396565 1177634
38949 1177634 1519613 1379316 1029606 762848 659534 519910 124036 -382954 -593227
38940 -593227 -417663 -236601 -284648 -281244 432 203011 -79737 -550166 -598689 -260330
38930 -260330 -100864 -198157 26890 801786 1492725 1430426 743427 21735 -423647 -589057
38920 -589057 -445793 -43405 285338 271804 147944 350362 860873 1206036 1100993 757152
38910G57152k69726k08136l90104o75774p49057m32126J37741N58576M90411J9945
38900g61098l93826m05296j11372J62695K77899L69450N83058Q28398Q24207M02645
38890A776760k29243o16238n15702j47262J11597J58503J39002J20607M9783k5270
38880H22537K0971J25513P2544j39126k29457n2086J61445J24130j34946l83155
38870C88370m93728m61548k68690L7972K36262J46283p0654p3303J71131L03721
38860h4184R3341j79785r3450K76107L96809K0213m25475m01159M445K41889J08724
38849d2525l4508P7936J91294J9460k12832j20674J83083K53172L9485m8561J48790
38838D54120K53872k3191l65937k82604J75920M75993L04483p7670k21101l2306
$$ plain form
38910 757152 487426 279290 -110814 -786588 -1535645 -1967771 -1830030 -1271454 -781043 -761098
38900 -761098 -1154924 -1560220 -1671592 -1508897 -1230998 -861548 -278490 549908 1374115 1776760
38890 1776760 1547517 931279 415577 268315 379912 538415 677417 798024 847807 822537
38880 822537 843508 969021 1041565 902439 672982 620896 782341 906471 771525 388370
38870 388370 -105358 -566906 -835596 -797624 -561362 -415079 -485733 -559036 -387905 -84184
38860 -84184 9157 -170628 -264078 12029 408838 429051 3576 -397583 -393138 -151249 -42525
38849 -42525 -77033 903 192197 211657 -1175 -121849 61234 314406 353891 305330 454120
38838 454120 707992 684801 318864 36260 212180 688173 992656 914986 693885 661579
38828F61579J71432Q5169k12170l79587k79847j61476k63680m08649k48588J57054
38818h78763L53738J38168j47973j40452K8029n080k56125m06183k93354q5525
38808a693520L4725R0781J60156K14837K09468J80135J57606R4859j8168n9585
38798f28706P8147K91565L52062J95353o463j08933j82599l05422l03014M7068
38788e70942N66463P37177L45302j92104l54358j56597J3578J7941N2854J83002
38778F42316K00845J7803j58406j66806j19983j42882j51071n7296L5220K4982
38768A24722n104L5898Q6043J03494J78919K97024K32755q1822l30531k45143
38758C96255m7110j08866l48654l70268j08281J03338R6259O4873J27861J13134
$$ plain form
38828 661579 833011 918180 706010 326423 46576 -114900 -378580 -787229 -1035817 -878763
38818 -878763 -525025 -386857 -534830 -675282 -647253 -652333 -908458 -1314641 -1607995 -1693520
38808 -1693520 -1658795 -1568014 -1407858 -1193021 -983553 -803418 -645812 -550953 -569121 -628706
38798 -628706 -550559 -258994 93068 288421 281958 173025 -9574 -314996 -618010 -570942
38788 -570942 -4479 732698 1078000 885896 531538 374941 388519 406460 459314 642316
38778 642316 843161 860964 702558 535752 415769 272887 121816 64520 99740 124722
38768 124722 119618 155516 241559 345053 523972 820996 1053751 971929 641398 396255
38758 396255 349145 240279 -108375 -478643 -586924 -483586 -387327 -322454 -194593 -81459
38748h1459o3596j78796p7797M3131j3781q7553N0526K59395K28119k1041j93316
38737a36168k18403k96096m24745l02669J36828M67735L40634L1959M8605L58015
38727E695M63561K12873L6841K33918M64556K70045k26350n20024m32061k32282
38717B76772j74706k80242m92065o62815m69610K01989Q15047O60636j22214n73646
38707h20854j94497L64351K90380k16202l32521J38456N58675M13519q2740l98834
38697b80267k90288Q3864L47902J93671k67510m96657j53602L81099M73106J10784
38687A02102j42862k4412J38715Q2294M069J04068K05353J17532r148P055M4797
38676F29563m7267j42788j12628j25530l30245m82499k73802J40954L32903K07651
$$ plain form
38748 -81459 -145055 -323851 -401648 -358517 -372298 -459851 -409325 -149930 78189 57148 -136168
38737 -136168 -354571 -650667 -1075412 -1378081 -1241253 -773518 -432884 -400925 -352320 5695
38727 5695 469256 682129 718970 952888 1417444 1687489 1461139 941115 509054 276772
38717 276772 102066 -178176 -670241 -1333056 -1802666 -1600677 -785630 -124994 -247208 -820854
38707 -820854 -1015351 -651000 -360620 -576822 -909343 -770887 -212212 201307 118567 -280267
38697 -280267 -570555 -486691 -138789 54882 -212628 -709285 -862887 -481788 -8682 102102
38687 102102 -40760 -65172 73543 155837 159906 263974 469327 586859 577711 584766 629563
38676 629563 582296 439508 326880 201350 -128895 -611394 -885196 -744242 -411339 -203688
38666b03688N3094M0354M0265n3728j38265j02811N966P8682M8925r1549k39225
38655e61980j90834J17683M34518M38723J25214k21064l69842k92041o1584J68622
38645d12585J84351m1793j97044m844L18467L23750J5174j26255J27078M09042
38635E95341L29888K0208j62273j78960k33498l36202k99709j02698N8140R5142
38625b14621J45289K83270L31935J14978k00711k05972K41734P18782O21201j03699
38615A732186p84996p53790j23076L96321L94828J56382R6814J61888J9878l64939
38605I31496o41571n03598k4335M24676N00311J88404j71605k50945j15955o7255
38595B69623j16459L5475L98075N01081R7830l35236k49512J24563J30391k90166
$$ plain form
38666 -203688 -150594 -110240 -69975 -123703 -261968 -364779 -358813 -280131 -231206 -322755 -561980
38655 -561980 -752814 -635131 -200613 238110 363324 142260 -227582 -519623 -581207 -412585
38645 -412585 -228234 -270027 -467071 -471915 -153448 170302 185476 59221 186299 595341
38635 595341 925229 945437 783164 604204 370706 34504 -265205 -367903 -309763 -214621
38625 -214621 -69332 213938 545873 660851 460140 254168 495902 1214684 1835885 1732186
38615 1732186 947190 193400 70324 466645 861473 1017855 1114669 1276557 1296435 931496
38605 931496 289925 -213673 -238008 186668 686979 875383 703778 452833 336878 269623
38595 269623 153164 188639 586714 1087795 1185625 850389 600877 725440 855831 565665
38585E65665n47325l42068j5629J36055K70005M89369N05582J56694k08383k58156
38575G51809j92791l11084m27959k12910J77458L40020K96796L64231M70911K08259
38565A464740m18737q59753p71343m22652j82072l8238J44243K78659K51062J80939
38555c73152K19952L03739L21215L14668L01973J33273k26189m85028l85711j07455
38545A7285r571j10696j50403o9976n6807j16813R173L81454O37548M51353J2730
38534I95277j96505j1456K59396K70116J8853k69585m60118n47801m89747k35424
38524f66994N4397P1914k03999l49980k7327M72937N51045J26933k32778j00823
38514c04675K71537M00345K27406L5364n8217j65096l02388l49974l05462k85999
$$ plain form
38585 565665 18340 -323728 -339357 -203302 66703 556072 1061654 1218348 1009965 751809
38575 751809 559018 247934 -180025 -392935 -215477 124543 421339 785570 1256481 1464740
38565 1464740 1046003 186250 -585093 -1007745 -1189817 -1228055 -1083812 -805153 -554091 -373152
38555 -373152 -153200 150539 471754 786422 1088395 1221668 995479 510451 124740 17285
38545 17285 7714 -102982 -253385 -323361 -380168 -496981 -487808 -106354 531194 982547 995277
38534 995277 798772 787316 1046712 1316828 1335681 1066096 605978 58177 -431570 -666994
38524 -666994 -612597 -540683 -744682 -1094662 -1121989 -649052 -98007 28926 -203852 -304675
38514 -304675 -33138 367207 594613 629977 571760 406664 104276 -245698 -551160 -837159
38504h37159k61320n1063L51359O70514O57912L65820M0474j48394k09048k30862
38494C48233k39512j51565Q7049L18986K67769j04158m68550m94545k15999J03334
38484e48958L17064M08941L11478o45k99203k75151O0254L69791L96871J90214
38474I30656n3969j74795j05030M8355L4761k09701l58270j12739K68878K57413
38464E25559j55129m02041j66955K04138L10338K62675L20723L41076L6120m24425
38454H52079n39619j77265K34559K89799R2751J8610J58896K15037m0277l64790
38444G39780l14555R1915K75818j17393o07151m71412J90115N32925J48946m05463
38434F3525m72735j41229J18748J85614J87276N2262k86181m84893j74773L64247
$$ plain form
38504 -837159 -1098479 -1149542 -798183 -127669 530243 896063 936537 788143 579095 348233
38494 348233 108721 -42844 44205 363191 630960 526802 58252 -436293 -652292 -548958
38484 -548958 -231894 177047 488525 487880 188677 -86474 -26220 343571 740442 930656
38474 930656 876687 701892 596862 645217 679978 470277 112007 -732 268146 525559
38464 525559 370430 -31611 -198566 5572 315910 578585 899308 1240384 1276504 852079
38454 852079 312460 135195 369754 659553 752304 770914 929810 1144847 1104570 739780
38444 739780 425225 517140 792958 675565 68414 -402998 -212883 320042 468988 63525
38434 63525 -409210 -550439 -431691 -246077 -58801 -6539 -292720 -777613 -952386 -588139
38424e88139M74813N0931l35464k93536q3308o0865j13950N3824L78697N08938
38414h059K97980l2226k03312j91302j78224k55886k72190n9975K33819K58959
38404d10416l9539k84998j83891Q6366K35586L23920N18280O36771M08244L9586
38394A329909j2965J94008J24557l52546o82697m63856o4277m3244l27823l89986
38384f88920l0494M16117N80403M46487K47602J82996K52640K74294R8562j63810
38374A615877k55142j45447r1785k27916l22776j24365K40635M22518K81047k7642
38364A365004k92282l93596k99479r1043O2670Q5294O6373M7358j06725m25725
38354A7849n72585j75096N81711R96286O29653j33032m91903j47788L86715M56952
$$ plain form
38424 -588139 -113326 -62395 -397859 -691395 -774703 -835568 -949518 -895694 -516997 -8059
38414 -8059 289921 257695 54383 -136919 -315143 -571029 -843219 -903194 -669375 -410416
38404 -410416 -449955 -734953 -918844 -832478 -596892 -272972 245308 882079 1290323 1329909
38394 1329909 1316944 1510952 1635509 1282963 600266 136410 72133 28889 -298934 -688920
38384 -688920 -719414 -303297 277106 723593 971195 1154191 1406831 1681125 1779687 1615877
38374 1615877 1360735 1215288 1123503 895587 572811 448446 689081 1111599 1392646 1365004
38364 1365004 1072722 679126 379647 288604 351274 436568 502941 550299 443574 17849
38354 17849 -554736 -729832 -148121 848165 1477818 1344786 852883 705095 1091810 1548762
38344A548762P7333j49080J14441M83032M25890J6345k44641j95866j52413k79716
38334A644087l20889j09346R3625N5618q698J49979K77046m4322o52355q93789
38324A90956m84998J14270L21662J31512n19J95861M86724M58361M3218l70251
38314A086796l84538o7552J61102Q5856q8481j30917j21904k15522k96816j50765
38304a22741J56843L43847K97289J52889K5692j08376k61832l62318l54831k45046
38294d78584m8136J96072L93955M82906M81974L78048R0676l26701o04161n47387
38284A8662k80431l1896J55323L08003L20893J41197k2048K4905J37286J06233
38274H78127O3607K06500K97018l8263n84573o98587k52736J42774K0032l60243
$$ plain form
38344 1548762 1626095 1477015 1591456 2074488 2500378 2516723 2272082 2076216 1923803 1644087
38334 1644087 1323198 1213852 1307477 1363095 1354397 1504376 1781422 1737100 1084745 190956
38324 190956 -294042 -179772 141890 273402 272883 468744 955468 1413829 1457047 1086796
38314 1086796 702258 634706 795808 881664 793183 662266 540362 324840 28024 -122741
38304 -122741 34102 377949 675238 828127 853819 745443 483611 121293 -233538 -478584
38294 -478584 -526720 -330648 63307 546213 1028187 1406235 1496911 1170210 566049 18662
38284 18662 -261769 -293665 -138342 169661 490554 631751 609703 634608 771894 878127
38274 878127 941734 1148234 1445252 1406989 822416 123829 -128907 13867 33899 -326344
38264c26344n16223l59033m0537L59808O85464O51343K85450M6571J45825J47433
38254A079757l12834p99051o54177m5897K47391J5095j21404K54184O86028N38324
38244H87416q9095n34437m21064K5359L78382M10823J31912k87840n59329m46204
38234e04077k7217L17354L20048J62092K10691M34211L65978j85027o78597m77054
38224f1598K16787N58128K25243j65030k6862L47280L35702l5569k38385j31246
38214A024450q5081k71587l99161k40180N4768K89467M50476M73608J95720k71619
38204A220861m92577k66649O6108J10680p3037j94502k06806k60114l61066l69152
38194h26254k33699j4212K43256M76897N66608M71816K94386J03038j18740k59201
$$ plain form
38264 -326344 -842567 -1201600 -1242137 -882329 -196865 454478 739928 786499 932324 1079757
38254 1079757 766923 -32128 -686305 -732202 -484811 -469716 -591120 -336936 349092 887416
38244 887416 798321 263884 -157180 -131821 246561 657384 789296 501456 -57873 -504077
38234 -504077 -531294 -213940 106108 268200 478891 913102 1279080 1094053 415456 -61598
38224 -61598 155189 713317 938560 773530 746668 1093948 1429650 1394081 1155696 1024450
38214 1024450 939369 667782 268621 28441 83209 372676 823152 1296760 1492480 1220861
38204 1220861 728284 461635 527743 638423 565386 370884 164078 -96036 -457102 -826254
38194 -826254 -1059953 -1074165 -830909 -354012 212596 684412 978798 1081836 963096 703895
38184G03895j13164J89348J50813l80295q12674n73568K5678K44320K5940j9022
38174e58729L08920M86837J95085j58163j71771q6611k26763l39075p2240K86420
38164c36090K25691q0198N173N16804P65660L88082j40913k98135k41274l57547
38154D47253n31239l67746Q7408L48031J50251k59287m91280l73819L8452N18470
38144d33506P11249M18164q5304k71516o121K65579J20545k83985m78478l35970
38134c79343j54176j30379q5860J66863M36915L77368m144l10028k55774j409
38124c39967J22985N9550J3599Q7473J45141O9394l9403k8728O9489J02954L0923
38113B93410m6673p3463j22718k66608m39167m76935k73675J10269M64703N65662
$$ plain form
38184 703895 590731 780079 930892 550597 -262077 -835645 -809967 -565647 -539707 -558729
38174 -558729 -249809 237028 432113 273950 102179 15568 -211195 -550270 -622510 -336090
38164 -336090 -110399 -190597 -185424 331380 1097040 1485122 1344209 1046074 804800 447253
38154 447253 -83986 -451732 -364324 -16293 133958 -125329 -616609 -990428 -951976 -433506
38144 -433506 277743 695907 610603 339087 332966 598545 719090 435105 -43373 -379343
38134 -379343 -533519 -663898 -749758 -582895 -145980 231388 227244 -82784 -338558 -339967
38124 -339967 -216982 -157432 -143833 -56360 88781 158175 118772 90044 159533 262487 293410
38113 293410 246737 173274 50556 -216052 -655219 -1132154 -1405829 -1295560 -830857 -265195
38103b65195L47579l1768l10588l30539j54823k435l7274j75521j37938K14028
38093h84474O17354O33464J82291l01651l51488J3443L71353L90732R7905k48738
38083E20191l82797k00808J15909K11331l7543l05267k32147L5836L9086k84445
38073e20654m74757k51241O0691O8386n3983J31302N67803P06992K84828k89527
38063B29840m62046j81385J63499K69874J70261L3390p0665j62257k35066k42386
38053d86941j75269q4217n225Q4929K00085K78912K59421J83396J22743K2708
38043D00542k28649n39429n99637k52023K49122N07531M34785K65166J73858Q5595
38033D96861r7502k52828j52533K23304N84411N82840J77873k69851l30853L6060
$$ plain form
38103 -265195 82384 50616 -259972 -590511 -745334 -747769 -785043 -960564 -1098502 -884474
38093 -884474 -267120 366344 548635 246984 -104504 -91061 280292 671024 768929 520191
38083 520191 137394 -63414 52495 263826 226283 -78984 -311131 -275295 -236209 -520654
38073 -520654 -995411 -1246652 -1185961 -1117575 -1171558 -1040256 -472453 234539 519367 229840
38063 229840 -232206 -413591 -250092 19782 190043 223433 152768 -9489 -244555 -486941
38053 -486941 -662210 -746427 -751652 -666723 -466638 -187726 71695 255091 377834 400542
38043 400542 171893 -367536 -967173 -1219196 -970074 -462543 -27758 237408 411266 496861
38033 496861 399359 146531 -6002 217302 801713 1384553 1562426 1292575 961722 997782
38023I97782M16801L76842r3629o15126q23226o64166l59134j74518j91593k29656
38013a359623l9888L72400P03722P02418M47901J73027m5190k30067k72692m0181
38003D11827L09763M17809J92683o3805j11217j07181k99428n56347m67105J07324
37993a65677P75416R71830N03798k76021p86434o96083j54611L71983M79297J22184
37983A145682l48341m53876l2180N46937P46990M84141J75008Q5320m8132m81092
37973A820457q60268o29219J06476O44777O11516L00021K9906k54265n50165n52942
37963F66294k00335M2428j24993l21524j66365j7362l50896p67899m79260L56526
37953a363386P18226K54324j92622N6901M90318L32359j68573j85976L32025O10321
$$ plain form
38023 997782 1414583 1791425 1697796 1082670 259444 -404722 -763856 -938374 -1129967 -1359623
38013 -1359623 -1399511 -1027111 -323389 379029 826930 999957 954767 724700 452008 411827
38003 411827 721590 1139399 1332082 1268277 1157060 1049879 750451 194104 -273001 -165677
37993 -165677 609739 1581569 2085367 1809346 1022912 326829 172218 544201 1023498 1145682
37983 1145682 797341 343465 311285 858222 1605212 2089353 2264361 2349681 2301549 1820457
37973 1820457 960189 330970 437446 1082223 1693739 1993760 2023666 1769401 1219236 666294
37963 666294 465959 508387 383394 61870 -104495 -121857 -472753 -1240652 -1719912 -1363386
37953 -1363386 -645160 -390836 -583458 -526557 -36239 296120 127547 -58429 273596 883917
37943H83917K62753k10658k73021p2145n1503k96638n74236p04262o00857j93201
37933a829851L82879O92125M38634p3496k39113Q1639M02319K99649l9791j72529
37923e7535n3179J0866m1962Q9061M72817O52091K67686l01795l69942R6380M29250
37912A193738K12728k06226l48097k79405l11349l81707k12003J12233K16034
37903d054L7750j02187n7316k9734q7913L3775M15168O16049K29764m48773p00449
37892i7920k73755L22984M67863J33355j63081p447M32512O14987K83551k03401
37882A509648l31237j12038l2033l06441n45589l49863Q5395K77171J37675l7084
37872B95604j22103k55973l88929k12974K91065O23103L64303k23694m92031j84246
$$ plain form
37943 883917 1146670 936012 662991 590846 539343 242705 -331531 -1035793 -1636650 -1829851
37933 -1829851 -1446972 -754847 -316213 -389709 -628822 -547183 -144864 154785 114994 -57535
37923 -57535 -110714 -99848 -141810 -52749 420068 1072159 1339845 1038050 668108 764488 1193738
37912 1193738 1406466 1200240 852143 572738 261389 -120318 -332321 -220088 -4054
37903 -4054 33696 -68491 -125807 -155541 -243454 -209679 205489 821538 1051302 602529 -97920
37892 -97920 -371675 -48691 419172 552527 389446 381999 814511 1429498 1713049 1509648
37882 1509648 1178411 1066373 1034340 727899 182310 -167553 -82158 195013 332688 295604
37872 295604 173501 -82472 -471401 -684375 -393310 229793 594096 370402 -121629 -305875
37862c05875L29815N55746L89240R7549n4388n4342m3900n6317L1585K36782L02639
37851A428534p316n00569o93280m03047L1992K20728J77744J66568K77264L46202
37841A044820J80181k67938q15153j053456o62031J30024O36498M89289Q0179
37832b37587l4520J07134R2616j31567k62981k56503l57814n16885l56320J47437
37822a806990N14238M98380M23158M93395L56420j98623o29975l62985K38325
37813d74657L35939j24978l69516j1555L99543K55089k73054n78429l93736P7903
37803a157451M96416N99086L46756O2041J57186N49931O68654K52206k17100j93223
37793A564502J57148K71349K8392k10865k55657k70762l32191k77066q0270L1545
$$ plain form
37862 -305875 23940 579686 968926 1066475 1012087 957745 913845 857528 889113 1125895 1428534
37851 1428534 1421218 920649 227369 -175678 -143686 77042 254786 421354 698618 1044820
37841 1044820 1225001 957063 141910 -911546 -1573577 -1443553 -807055 -317766 -237587
37832 -237587 -272107 -164973 -72357 -203924 -466905 -723408 -1081222 -1598107 -1954427 -1806990
37822 -1806990 -1292752 -794372 -371214 122181 478601 279978 -349997 -712982 -474657
37813 -474657 -138718 -263696 -633212 -644767 -245224 9865 -263189 -841618 -1235354 -1157451
37803 -1157451 -661035 -61949 284807 346848 504034 1053965 1722619 1974825 1757725 1564502
37793 1564502 1721650 1992999 2021391 1810526 1554869 1284107 951916 674850 594580 626125
37783F26125j7375J2493K54670M45553K86783r6258k88978r1334K69860L85980
37773A787519N5906m98976p90445n48419n2037J80819L2573j04418R5551M52225
37763F10298N46685K40389k09650m22154k05132K41609M09929J2744n33165n01864
37753A89689J47145O05408L15966k23805k27738J92699K63312k14419n94042m09178
37743D5037N036J32902l9907k54422m11529m42066j57593L86431P16044N25698
37733E05631J56252Q6848K26202J69681p6928j71307q7092j11946k34887j30989
37723C31465J80197K55608k3244j94459K4366K60317J40629p1345J3781J77485
37713A094800k1151l97873l65671R4387L78060K29663R2937K80442M22816J28823
$$ plain form
37783 626125 608750 621243 875913 1321466 1608249 1511991 1223013 1131679 1401539 1787519
37773 1787519 1843425 1344449 554004 5585 -46452 134367 166940 62522 158073 610298
37763 610298 1156983 1397372 1187722 765568 560436 802045 1211974 1224718 691553 189689
37753 189689 336834 942242 1258208 1034403 806665 999364 1262676 1048257 454215 45037
37743 45037 50073 182975 143068 -111354 -522883 -964949 -1122542 -736111 -20067 505631
37733 505631 661883 748731 974933 1144614 1067686 896379 809287 697341 462454 331465
37723 331465 511662 767270 744026 549567 573933 834250 974879 903534 917315 1094800
37713 1094800 1073649 675776 310105 404492 782552 1012215 1105152 1385594 1808410 1937233
37703A937233l08182l57778p0766O7531r8824k82112k94693k22246q4295K05375
37693D91243M93621M55764J26376n5957R4816K13622j3111l20988k89234j077
37683A195075J30084K2178k3000J24390K31983J33100p348J644O6365j1120j97409
37672A665942k57895p6417J77943K29170J6253k03660j55989N3666K8980l29135
37662A148858n62828k47072L41401N23639J24258l43536m40046k94519j68068
37653H2087K5571M08173O76926M33817j46681m35693j69290K26195K49284m2132
37643A308257k19844j09706M1417k2167k29926l46701l05847k21936j49457l5375
37633b91285P8917M5565r5439n7427K47442M35347J46941l58627n24373l08319
$$ plain form
37703 1937233 1629051 1271273 1200507 1268038 1169214 887102 592409 370163 285868 491243
37693 491243 984864 1440628 1567004 1511047 1605863 1819485 1806374 1485386 1196152 1195075
37683 1195075 1325159 1347337 1324337 1448727 1680710 1813810 1806462 1808106 1874471 1863351 1665942
37672 1665942 1408047 1331630 1509573 1738743 1754996 1551336 1395347 1449013 1477993 1148858
37662 1148858 586030 338958 680359 1203998 1328256 984720 544674 250155 82087
37653 82087 107658 515831 1192757 1626574 1479893 1044200 874910 1101105 1350389 1308257
37643 1308257 1088413 978707 1020124 997957 768031 421330 115483 -106453 -255910 -291285
37633 -291285 -212368 -166803 -262242 -319669 -72227 363120 510061 151434 -372939 -681258
37623f81258j61224j88200M3744O44286R71574N24575k05969l63132Q6171M05209
37613A075776K06169r8906j8788L52587N52992K97674l12204q75101r33884l87208
37603a40893L10730N88654L78185N6858j38224k86148m12448l70029j69104m7037
37593b29456q6568r6532Q176M0091j00629k13236j19470O6781J59072J54689J36259
37582b80823J38013J99423L11216K74231o1944l90916k24343L13289M88408N388
37572G71942m83729l06630K76601N54130L91772J82197O5831j16714k46034r516
37562A079850M11879M00656j93122p57951p57164l90275j42808p4754Q2501L68076
37552B6888N01599K93777q3155k49824P972M61833N72507Q2655n49183n99639
$$ plain form
37623 -681258 -842482 -1030682 -986938 -342652 628922 1153497 947528 584396 670567 1075776
37613 1075776 1281945 1183039 1164251 1516838 2069830 2367504 2055300 1180199 246315 -140893
37603 -140893 169837 758491 1136676 1193534 1055310 769162 356714 -13315 -182419 -229456
37593 -229456 -316024 -412556 -404380 -364289 -464918 -678154 -797624 -730843 -571771 -417082 -280823
37582 -280823 -142810 56613 367829 642060 580116 189200 -35143 278146 766554 771942
37572 771942 288213 -18417 258184 812314 1204086 1386283 1452114 1335400 1089366 1079850
37562 1079850 1491729 1892385 1699263 941312 184148 -206127 -348935 -423689 -341188 26888
37552 26888 528487 822264 739109 489285 497257 959090 1531597 1614252 1065069 465430
37542D65430k0623M27150J66436m22083n53499j06539L17800L08241J10292Q2444
37532G75049J49610Q8022J9768K03856M86748M20225n3199m66009n14877m61712
37522F47481n70398n43545j061P22502Q66288L17243j94643j31323J63143J04664
37512A380351k55979m25067k30052O3480K33395K77950J92782m6116k92473l45233
37502E53038k59255k59712l41158k36600J53145N40687N75507K49277j10157j91301
37492F73471j0730J26094R693j82021j35763J03126J90564P4980J19617M47813
37482A416844O08412K47426k70593l72653j04630O7585L3803L1098L7949j68519
37472A526722m15539k77966J28813J76438k87531o20640l37141J88386L39161
$$ plain form
37542 465430 444807 871957 1038393 616310 62811 -43728 274072 582313 692605 775049
37532 775049 924659 1012681 1032449 1236305 1723053 2143278 2090079 1624070 1109193 647481
37522 647481 77083 -466462 -467523 254979 1121267 1438510 1243867 1112544 1275687 1380351
37512 1380351 1124372 699305 469253 532733 766128 1044078 1236860 1190744 898271 553038
37502 553038 293783 34071 -307087 -543687 -390542 150145 725652 974929 864772 673471
37492 673471 662741 788835 798528 616507 480744 583870 774434 849414 969031 1416844
37482 1416844 2025256 2272682 2002089 1629436 1524806 1592391 1626194 1657292 1695241 1526722
37472 1526722 1111183 833217 962030 1138468 850937 230297 -106844 81542 420703
37463D20703J16023m7661pL8909p4102k23952k40674p4791J70112K92476J93637
37452E70673L4168J0800L5034p5826j67499N7457M31682M50035R5298o7785J61569
37441A535606K30224k19958o29865l40240L27041N02618L1895l94792l00820L0746
37431G72455J56362Q9635J04749K55556L32495J80120q1330j66569J7740J72208
37421A833421n7416n33601p01160l04533K85173O09476O23912M36458l0229p18919
37411A442582j124699q11861o9131M12939M01092K27380J47027O3051j01575j83354
37401D03451m3168K21001M13808M30140K95789J45601J06534J15672o768k31492
37391A850568l13752k18209k04991l15494k04277K24204M88887K69908m293J25493
$$ plain form
37463 420703 536726 489065 489058 527967 453865 229913 -10761 -85552 84560 377036 570673
37452 570673 604841 615641 650675 574849 407350 464807 896489 1346524 1441822 1374037 1535606
37441 1535606 1765830 1545872 916007 575767 902808 1405426 1437321 1042529 741709 772455
37431 772455 928817 1018452 1123201 1378757 1711252 1891372 1810042 1643473 1661213 1833421
37421 1833421 1776005 1242404 541244 236711 521884 1131360 1755272 2191730 2161501 1442582
37411 1442582 317883 -493978 -563109 -150170 250922 478302 625329 688380 586805 403451
37401 403451 360283 581284 995092 1425232 1721021 1866622 1973156 2088828 2082060 1850568
37391 1850568 1536816 1318607 1113616 798122 593845 818049 1306936 1576844 1572551 1698044
37381A698044K87145j41792r08943j161437o89290q6745K52799M73865N83670
37372C07316L17205j52528j95543K92294O17747L39448q9921j27120M5075j1237
37362A342736k20706k31106n2668L0283o0793j92104k74377k37665L201L16382
37352D23183L73814J24221q8168q9592j47562m00819m84309j23637L16633L63223
37342B66987J68540J84794L71261L00815q6832l87137l42914q9162J89367M12226
37332I87945M19315O5681m28606n96129l07360N2072J03334p6001j58939k9112
37322C2200J37846J68705J21856J86925L91035M82535K03108l36343o83049m96726
37312B08092J03205O53869P32914K86481k79488m14467k8471L30898J82811j67785
$$ plain form
37381 1698044 1985189 1843397 934454 -226983 -916273 -1003018 -750219 -276354 307316
37372 307316 624521 471993 276450 568744 1186491 1525939 1436018 1308898 1353973 1342736
37362 1342736 1122030 890924 838256 868539 807746 615642 341265 103600 106801 423183
37352 423183 796997 921218 833050 743458 595896 195077 -289232 -412869 -96236 266987
37342 266987 435527 620321 991582 1292397 1205565 818428 475514 386352 575719 987945
37332 987945 1407260 1472941 1044335 448206 140846 192918 296252 220251 61312 32200
37322 32200 170046 338751 460607 647532 1038567 1521102 1724210 1387867 704818 208092
37312 208092 311297 965166 1698080 1984561 1705073 1290606 1262135 1593033 1775844 1608059
37302A608059o9868M12002N09699o6262o34400n51356r8579J05713N3926J15958
37292A384892K51419J32165j53990j83335P2571J81889l6421k41436j33004J15881
37282A390631J64464k4707j90338j19319J11534K16456L7148k28191k71175j13111
37272I73392k8128l1389J41460M41560M11702m7922l51496q8783K74911J12365
37262A807672l60302m44984m3692L08283L18931J69150l8707l76870o30523l92857
37252C16101K55662O87861M89433j11366o13707o75762k21361M68604Q24625N61961
37242A982051R0069o0092K686j17765k72011m7868K91433P4215n66440p22769
37232F53509j42132L48266J94216n9987J73623N12255L42403j12351k34502j9266
$$ plain form
37302 1608059 1538191 1950193 2459892 2393630 1759230 1207874 1109295 1215008 1268934 1384892
37292 1384892 1636311 1768476 1614486 1431151 1503722 1685611 1649190 1407754 1274750 1390631
37282 1390631 1555095 1530388 1340050 1220731 1332265 1548721 1585869 1357678 1086503 973392
37272 973392 945264 913875 1055335 1496895 1908597 1860675 1509179 1420396 1695307 1807672
37262 1807672 1447370 1002386 958694 1266977 1585908 1755058 1716351 1339481 708958 316101
37252 316101 571763 1259624 1749057 1637691 1023984 348222 126861 595465 1420090 1982051
37242 1982051 2072120 2012028 2014714 1896949 1624938 1577070 1868503 1942718 1376278 653509
37232 653509 511377 859643 1053859 993872 1167495 1679750 2022153 1909802 1675300 1656034
37222A656034J16395J39575K69874L35408J1831m54837m69346Q830L89572K98237
37212B301573k4676k20090k44761k05444j23239J261J10077J49750Q7560q5727
37202A746284k41477j39610K37286N27131M12369P9090k2145J95741L47344J14212
37192C256225l13230m22932L5521O94192Q80324L80676k39680l00967J54124N30733
37182D654986N48921M35673L10316L0522k41785l4009N89091Q50430L42625l43291
37172G143479n46145m63324n65309o86445m37367m2671L8875l4468J66089M47488
37162E020202L13264n4264m7499K54397J81394l10924m75469J8456N94532P34003
37152F228092O22040N30334L19968n8672k47960q2712P8889J7038O5208M36249
$$ plain form
37222 1656034 1772429 1912004 2181878 2517286 2529117 2074280 1604934 1613764 2003336 2301573
37212 2301573 2276897 2056807 1812046 1606602 1483363 1484624 1594701 1744451 1832011 1746284
37202 1746284 1504807 1365197 1602483 2129614 2541983 2621073 2598928 2794669 3142013 3256225
37192 3256225 2942995 2520063 2555584 3249776 4130100 4510776 4271096 3970129 4124253 4654986
37182 4654986 5203907 5639580 5949896 5980418 5738633 5704624 6293715 7144145 7486770 7143479
37172 7143479 6597334 6134010 5568701 4882256 4444889 4402218 4441093 4406625 4572714 5020202
37162 5020202 5333466 5279202 5231703 5486100 5667494 5356570 4881101 4899557 5494089 6228092
37152 6228092 6850132 7380466 7700434 7641762 7393802 7311090 7389979 7407017 7472225 7908474
37142G908474O95399M17427r1488k53396k6141K44009M35709O17857P00404O27403
37132A1275657O68322J006953J250121Q83816R6860l70402j60511L81083Q14652
37123A5846551J085168J309974J464099J444721J249100R97717Q99369J162002
37115B5458701J768646K391897K731506K896674L240017L845189M430345M796301
37107E1559276N134937N774288O768124P892503R011406J0312590J2109907J4471719
37099A23034750J7196455K0203703K3752945K8081998L2967573L7834167M1954280
37092C25025871M3922148M1090091L0710011J2657713r091652k8408232m0790358
37085C75115592m5443811m4349835m0127362l4748065k9357136k4489215k0336742
$$ plain form
37142 7908474 8603873 9021300 8929812 8676416 8650275 8894284 9329993 9947850 10648254 11275657
37132 11275657 11943979 12950932 14201053 15084869 15181729 14811327 14650816 15031899 15846551
37123 15846551 16931719 18241693 19705792 21150513 22399613 23397330 24296699 25458701
37115 25458701 27227347 29619244 32350750 35247424 38487441 42332630 46762975 51559276
37107 51559276 56694213 62468501 69236625 77129128 86140534 96453124 108563031 123034750
37099 123034750 140231205 160434908 184187853 212269851 245237424 283071591 325025871
37092 325025871 368948019 410038110 440748121 453405834 444314182 415905950 375115592
37085 375115592 329671781 285321946 245194584 210446519 181089383 156600168 136263426
37078A36263426j7002295j4533997j2747034j1216942r616595q001483o656913
37071E6488167n717022n050761m502944m088587l840739l568343k994982k194111
37063B4530678j641969j630139j811992j646105j176640r57310j182959j366855
37055A3116709j080999o07997n17308q57909j142390j003442n45721j02961R7268
37046G355250M4661r5709j43919j03966j27043k53744l74055m75151o50429p82827
37036D393068n82157j06622J59699J0450j37889L5605J65120j46109n10031l06895
37026B974239K27479K88192k22138n54939l30502m9192j38138k69856m6979K89038
37016B167204L45479K58713L38463M36336K48872l6270J2463L36692M56814K16902
$$ plain form
37078 136263426 119261131 104727134 91980100 80763158 71146563 63145080 56488167
37071 56488167 50771145 45720384 41217440 37128853 33288114 29719771 26724789 24530678
37063 24530678 22888709 21258570 19446578 17800473 16623833 15666523 14483564 13116709
37055 13116709 12035710 11427713 10910405 10052496 8910106 7906664 7360943 7257982 7355250
37046 7355250 7399911 7304202 7160283 7056317 6929274 6675530 6301475 5826324 5175895 4393068
37036 4393068 3810911 3704289 3863988 3874438 3736549 3772154 3937274 3791165 3281134 2974239
37026 2974239 3201718 3489910 3267772 2712833 2382331 2333139 2195001 1925145 1878166 2167204
37016 2167204 2512683 2771396 3109859 3546195 3795067 3758797 3771260 4107952 4564766 4781668
37006D781668l9569n5218K7839K4923p584L95q1207l63725o77902p28304m57575
36995B423741j20812K0860j548L8976J82175J66681j56073m67500l56752K3455
36985A753203J01377k48166m68251j87807J51659l4026n33182o22060j10561M56803
36975B58989O11959M53029K53557N7602j56078k68841k03602q3987m8816p9135
36965G94677j06182j14959p0703P7760K71592L99358M93046O50462P68540O31871
36955C795462K87395J3803j31890l72662p14674q05087m95802j56335j31953k40865
36945A047392j59397J6766K3641k6061J45000L82840K60033k08355n23081m23365
36935E35413j78146o2434m719Q4972P3658p6372j27614K7432J19153l9962j58104
$$ plain form
37006 4781668 4742099 4686881 4714720 4739643 4732059 4732454 4651247 4287522 3609620 2881316 2423741
36995 2423741 2302929 2323789 2322241 2361217 2543392 2710073 2554000 2086500 1729748 1753203
36985 1753203 1854580 1606414 1138163 950356 1102015 1067989 534807 -87253 -197814 258989
36975 258989 870948 1323977 1577534 1635136 1479058 1210217 1006615 922628 873812 794677
36965 794677 688495 573536 502833 580593 852185 1251543 1744589 2395051 3163591 3795462
36955 3795462 4082857 4096660 3964770 3592108 2877434 2072347 1576545 1420210 1288257 1047392
36945 1047392 887995 904761 928402 902341 1047341 1430181 1690214 1481859 958778 535413
36935 535413 357267 294833 290114 375086 448744 372372 244758 272190 391343 351381 193277
36924A93277J06119N46346O43718K76340j74183l55552k53802k4720J57631J12728
36914A227902j67356l61881j66639K03386K14027k29244o01667m79307p6580J61739
36904b75620J85707K38516L47481K89503M556k66015k85627p0130J85862K81589
36894F35822J21391j98792m17955l47284p9794J23939J16982n4014k60832l53112
36884g13649k04872J15467L02081J57389q2177l3451K45464K87606q4459m39330
36874d49931l24290J07241L51199K53095J06717J19863J42573O384j56777j16466
36864C9608R7318K30612J45808l2440j24194j31865j93192l25418l18462J6484
36854e95741N05391O73575K67108l86285p12595n46432k42978j30158j16421K8729
$$ plain form
36924 193277 299396 845742 1489460 1765800 1591617 1236065 982263 957543 1115174 1227902
36914 1227902 1060546 698665 532026 735412 949439 720195 118528 -360779 -437359 -275620
36904 -275620 -89913 148603 496084 785587 790143 524128 238501 168371 354233 635822
36894 635822 757213 558421 140466 -206818 -286612 -162673 -45691 -99705 -360537 -713649
36884 -713649 -918521 -803054 -500973 -343584 -425761 -459212 -213748 73858 -10601 -449931
36874 -449931 -774221 -666980 -315781 -62686 44031 163894 306467 312851 156074 39608
36864 39608 136926 367538 513346 480906 356712 224847 31655 -293763 -612225 -595741
36854 -595741 -90350 583225 850333 464048 -248547 -794979 -1037957 -1168115 -1284536 -1255807
36844a255807K56142L48587K93485K49683K19209P0231j20600r2530J51492K60978
36834C80870O5367j34875m5908J42266P8792j86410l48865l67731l83560k55939
36824a055993K50368Q19502P62032L4033n23029l12416J84527J91509k02228l06553
36814a58248L3022L00294K39891J92848L68008M26686R0720l31166l87977j13708
36804F60370J31635J83435J10387n2483k78179m01708l04683j48282j55875k48298
36794e03681j55480J61369M40422M55538K32195m7131j91375j02421J10417J75547
36784E75400j9598k30793j70701O0934J04760j26566l06123j41820K38550M54689
36774D38732L08014l1907k19853q9392J59327J73006j19162l99065l68056r9136
$$ plain form
36844 -1255807 -999665 -651078 -357593 -107910 111299 181530 60930 -31600 119892 380870
36834 380870 446237 311362 265454 407720 486512 300102 -48763 -416494 -800054 -1055993
36824 -1055993 -805625 13877 775909 809942 286913 -25503 159024 350533 148305 -158248
36814 -158248 -125226 175068 414959 607807 975815 1402501 1493221 1162055 774078 660370
36804 660370 792005 975440 1085827 1033344 755165 353457 48774 -99508 -255383 -503681
36794 -503681 -659161 -497792 -57370 398168 630363 583232 391857 289436 399853 575400
36784 575400 555802 325009 154308 215242 320002 193436 -112687 -254507 -15957 438732
36774 438732 746746 714839 494986 405594 564921 737927 618765 219700 -148356 -247492
36764b47492J58731L27310M14278K83014j27860m60359k45907M05890Q21047N75374
36754A904026l5379m53673m60721j77644J97269M37825L51299K3495k03480j73830
36744A409187j07717j88448k53834j26910M0988M6074j6870K099k5212k24438
36734E54919l43719r2168L27302M82964L74210L39279M02882K51219j60499n09745
36724A626644o45908o98577o12831j80516L55006M00073l8312j95383K69355O29086
36714I08637K12977m49626m05655K26848M68002R926m07806k38249J37362K10448
36704F72864J36248K60890M07019J83666l05377n75515m40262j69756l9786n1028
36694G8963p9295m6505P9835K81219M50774M55915K52136p9850l60515m00559
$$ plain form
36764 -247492 -88761 238549 652827 935841 807981 347622 101715 507605 1328652 1904026
36754 1904026 1868647 1414974 954253 776609 973878 1411703 1763002 1786497 1583017 1409187
36744 1409187 1301470 1113022 859188 732278 773266 819340 802470 804569 779357 554919
36734 554919 211200 119032 446334 929298 1303508 1642787 2045669 2296888 2136389 1626644
36724 1626644 980736 282159 -330672 -511188 -156182 243891 205579 10196 279551 908637
36714 908637 1121614 671988 266333 493181 961183 971109 563303 325054 462416 672864
36704 672864 809112 1070002 1477021 1660687 1355310 779795 339533 169777 129991 78963
36694 78963 -332 -46837 32998 314217 764991 1220906 1473042 1393192 1032677 632118
36684F32118j94394j2298j18576l91691m47486j68896J53428K72291K64445K37723
36674B26664J03742j37743k13297K2942K67990J87815o4147j12227M3260J02342
36664D27341J7661L3582K06527K99476J89337K1865q9655j97476l01456l03533
36654C03669k28142j95896j50878O5816L41685L60626J22559N521J68630K84016
36644A077606P7344k26953k84063j53198j16330j89523j59415O971R6575k6689
36634A02325k35401k77150j9469L82838N55496K94655j18360k34125n5805J4339
36624D09343j19302q6994K26337L63620N3679k50102r4207J94271R3644j50942
36614F39347N1167N01311M03077l31361q60188o69260k35250j35207k35918j86484
$$ plain form
36684 632118 437724 425426 306850 -84841 -532327 -701223 -547795 -275504 -11059 226664
36674 226664 330406 192663 -20634 2308 270298 458113 393966 281739 324999 427341
36664 427341 445002 478584 685111 984587 1173924 1195789 1106134 908658 607202 303669
36654 303669 75527 -120369 -271247 -205431 136254 496880 619439 624960 793590 1077606
36644 1077606 1154950 927997 643934 490736 374406 184883 25468 32439 129014 102325
36634 102325 -133076 -410226 -429695 -46857 508639 803294 684934 450809 395004 409343
36624 409343 290041 203047 429384 793004 846683 596581 502374 696645 790289 639347
36614 639347 690514 1191825 1594902 1263541 403353 -265907 -501157 -636364 -872282 -1058766
36604a058766p8380j06412p6022K12969M68335L10699j00900l08894j88545N9699
36594h66217K98298M43801L37727L0591q2272J68076L29343Q45m22784l01473
36584f4065K12870M12635J65701J5720J47613Q1907m03343q08041o99548l20141
36574a258692k9917K59438O46700P88081M42874M6735J25658M35155L21448k31531
36564A545949n62120l14006J34044L22312K85632K74206K96332K21953J13215
36555B317517J69971M03285N49138L55778q8545l79502k20411K08462M47447L17189
36545D080329N7149j29418l36642n96476o24113k50857J74873K13793n9063k89540
36535B240035m50031o86706p52656k69344M63236O43001J22944k99517o6661L18051
$$ plain form
36604 -1058766 -1137146 -1243558 -1319580 -1106611 -638276 -327577 -428477 -737371 -925916 -866217
36594 -866217 -567919 -124118 213609 244200 161928 330004 659347 660192 237408 -64065
36584 -64065 148805 561440 727141 742861 890474 972381 569038 -239003 -938551 -1258692
36574 -1258692 -1288609 -1029171 -382471 405610 848484 895219 1020877 1456032 1777480 1545949
36564 1545949 983829 669823 803867 1126179 1411811 1686017 1982349 2204302 2317517
36555 2317517 2487488 2890773 3439911 3795689 3707144 3327642 3107231 3315693 3763140 4080329
36545 4080329 4137478 4008060 3671418 3074942 2450829 2199972 2374845 2588638 2529575 2240035
36535 2240035 1790004 1103298 350642 81298 544534 1187535 1310479 1010962 944301 1262352
36525A262352J41559l91696n42173k10201J321j84707l13889K9092N64719P11768
36515A068145L34485j68378l67532j86416J51920L90254M13940K39462p0435m03474
36505A401971n58185l71741N3091L84399M14624K73206K16098L23937M80717N17018
36495C135135L07778j02397l93079k08072L55788P18029M66175j47396n58668
36486C573293n54372l57262k32300k69754m21727n09235l29887J6997J04714k47499
36476G72968n96196m34872N0314K24916r7189m61170m47829j03066L19094O12601
36466a60429N77771J48870l54267m86977k59667p4980o1279N0871K97442K84019
36456c8626j30112m52804k26163L03070N49071L31952q0087m11088n25239l61233
$$ plain form
36525 1262352 1403911 1012215 470042 259841 261162 76455 -237434 -208342 356377 1068145
36515 1068145 1402630 1234252 866720 680304 832224 1222478 1636418 1875880 1805445 1401971
36505 1401971 843786 472045 525136 909535 1324159 1597365 1813463 2137400 2618117 3135135
36495 3135135 3442913 3340516 2947437 2739365 3095153 3813182 4279357 4131961 3573293
36486 3573293 3018921 2661659 2429359 2159605 1737878 1228643 898756 915753 1020467 772968
36476 772968 176772 -258100 -207786 17130 -80059 -541229 -989058 -1092124 -773030 -160429
36466 -160429 417342 566212 211945 -275032 -534699 -609679 -670958 -620087 -322645 -38626
36456 -38626 -168738 -621542 -847705 -544635 4436 336388 256301 -154787 -680026 -1041259
36446a041259m8197R0831o6663k23415q5939K07405L47193L11186K58573J81134
36436f9151j029j59105j04413R7255K40943K88727L14520L02131K40992K32288
36426A383158K56364Q1901l09369n09575k69446J4726j25267m45566l56206J22451
36416a56829M12356L00804J42627J22662l705k87716l43408O390L60902L19504
36406H73587J4326k05673k48722j85002l2812J07265L3947k02052k55241k3990
36396a24367J20931r1313l88069l95036j92448q0661q1812m9511k5961j01581
36386a409828j26953M5806K16318J28842m5728N7432L91308N52826L88310J27095
36376C25428o5613k44820l63976k20578J59010M35426M03792K32567J20894N273
$$ plain form
36446 -1041259 -1089456 -998625 -1065288 -1288703 -1374642 -1167237 -820044 -508858 -250285 -69151
36436 -69151 -70180 -229285 -333698 -236443 4500 293227 607747 909878 1150870 1383158
36426 1383158 1639522 1721423 1412054 902479 633033 647759 522492 76926 -279280 -156829
36416 -156829 255527 556331 698958 821620 817915 530199 186791 193181 554083 873587
36406 873587 887913 682240 433518 248516 215704 322969 356916 154864 -100377 -124367
36396 -124367 -3436 -94749 -482818 -877854 -1070302 -1150963 -1232775 -1282286 -1308247 -1409828
36386 -1409828 -1536781 -1490975 -1274657 -1145815 -1191543 -1134111 -742803 -189977 198333 325428
36376 325428 259815 14995 -348981 -569559 -410549 24877 428669 661236 782130 787403
36366G87403k18385m28345m40953k73034o6181J11014K36557K48459J35860M643
36356I7038p3140j52061k40508k01915j206J14371p5035l82337m29462j91050
36346a535305J554K3549J52260N27889P58520M02329l35671p69754n65884o9939
36336a410452K34304K68767K39755K58405K82542K50658R5622k13826m90065l88405
36326h72695J28549N74428M70579k8189l35358j78411J64547L28373K34114j6028
36316D69909l00299m57714l68378j42224k1722n1691n8017L2478J09758J42799
36306f45101K26091L00948J53546j82848l34672q1393L11594M41022K29917j20300
36296B98804m14583n19907l55489l6535J41834M7047j14164j02406M2363J24845
$$ plain form
36366 787403 569018 140673 -300280 -573314 -639495 -528481 -291924 -43465 92395 97038
36356 97038 23898 -128163 -368671 -570586 -571792 -457421 -532456 -914793 -1344255 -1535305
36346 -1535305 -1533751 -1510202 -1357942 -830053 -71533 330796 -4875 -774629 -1340513 -1410452
36336 -1410452 -1176148 -907381 -667626 -409221 -126679 123979 219601 5775 -484290 -872695
36326 -872695 -744146 -169718 300861 272672 -62686 -241097 -76550 251823 485937 469909
36316 469909 169610 -288104 -656482 -798706 -820428 -872119 -930136 -897658 -787900 -645101
36306 -645101 -419010 -118062 35484 -147364 -482036 -563429 -251835 189187 419104 298804
36296 298804 -115779 -635686 -991175 -1027710 -885876 -838829 -952993 -1055399 -1013036 -888191
36286h88191M7844j65452l91392l68982O8501O15528P00385K45518j58405p6414
36276c71060J85176J50891p7281j01258P5186J48654P9195K3797j06070m63397
36266d56167p63476n49300N6779M21340K80900N5620J75398N34247P58232O56476
36256A170049K80287j66344l99714l16163j92540l36463n85200n16603j07084
36247a169775K50998L62142L76977L26840N8337k86012l00425N421J37470m9871
36237b87898o1449L63511O95750M31037n5217q3592K66581L41193m6049m24479
36227A139388m71970l89528l80032k84338M5106L78097L74178K8958l27379l76742
36217b64262p2231L44938N22860K86148j83056m87821l78160K2818L36944K86570
$$ plain form
36286 -888191 -840347 -1005799 -1397191 -1766173 -1697672 -1082144 -381759 -136241 -294646 -371060
36276 -371060 -185884 -34993 -112274 -213532 -138346 10308 89503 113300 7230 -456167
36266 -456167 -1219643 -1768943 -1712164 -1290824 -1009924 -954304 -778906 -244659 513573 1170049
36256 1170049 1450336 1283992 884278 568115 375575 39112 -546088 -1062691 -1169775
36247 -1169775 -918777 -556635 -179658 147182 205519 -80493 -380918 -375497 -238027 -287898
36237 -287898 -349347 14164 709914 1140951 1085734 1002142 1268723 1609916 1563867 1139388
36227 1139388 667418 277890 -102142 -386480 -341374 36723 410901 439859 112480 -264262
36217 -264262 -336493 8445 531305 817453 634397 146576 -231584 -208766 128178 414748
36207D14748k7961k42054j75858o1949j71469l57202k77839J240O6022j31675
36197i63997j13944L43398P44452N67615M7223k14484j44450j64233l99339m97327
36187g95086k60980N1106J97259L01477N11696O31869L78652j51920n18952m14313
36177f9192J7020L37340K61366n9672k29905r0687J05149P0461j29022k34626
36167b1768k01612j99057k69588k59628j07335L4110L0206m7676m3298Q4091K24124
36156g77431K17205J4463j98849j29617K53740N90630N46015K51688R7013J66238
36146A031095J85039J1028j56175j36567m1354l8383r5221j30895k07388l53477
36136F7702l66775n7300L86721N41868K77405p9507j83980r8455j30440l51318
$$ plain form
36207 414748 386787 144733 -31125 -93074 -264543 -621745 -899584 -898344 -832322 -963997
36197 -963997 -1077941 -734543 9909 577524 624747 410263 265813 101580 -297759 -795086
36187 -795086 -1056066 -1004960 -807701 -506224 5472 637341 1015993 864073 345121 -69192
36177 -69192 -52172 285168 546534 486862 256957 166270 271419 341880 212858 -21768
36167 -21768 -223380 -422437 -692025 -951653 -1058988 -1024878 -994672 -1042348 -1085646 -1001555 -777431
36156 -777431 -560226 -545763 -744612 -874229 -620489 -29859 516156 767844 864857 1031095
36146 1031095 1216134 1227162 1070987 934420 893066 854683 759462 628567 421179 67702
36136 67702 -299073 -356373 30348 572216 849621 770114 586134 487679 357239 5921
36126E921m82865k90685Q5845L25299L42479L26912L76658L14672p578l76802
36116F19856m01032j7734L64664L31406k7792k25644j2251K65683J11341m06854
36106F01643o86641m14858j6791j1573k09910j7241N83650R04268N03591k14887
36096A021251n80040m36928q9943K00946L45487K85993O0270j33232j64779j35115
36086C73910j53679j56431r5367n4969j3923J99168N07563N09825Q8641k79072
36076I25666j84537J00319R7247j33707k13056j03209k1787L9981J65943J53837
36066H26697r8111j35900M00097R15322N10245o09978j288646j026455n14318
36057a021047l88237l96123j64555P2387K8793m6187J17208K77984J82293P4987
$$ plain form
36126 5921 -476944 -767629 -681784 -356485 -14006 312906 689564 1004236 996658 619856
36116 619856 218824 201090 565754 897160 869368 643724 631473 897156 1008497 601643
36106 601643 -84998 -499856 -516647 -528220 -738130 -755371 -171721 732547 1236138 1021251
36096 1021251 441211 4283 -85660 115286 460773 746766 807036 673804 509025 373910
36086 373910 220231 63800 -31567 -86536 -100459 98709 606272 1116097 1204738 925666
36076 925666 741129 841448 938695 804988 591932 488723 466936 506917 672860 826697
36066 826697 728586 592686 992783 1908105 2418350 1808372 519726 -506729 -1021047
36057 -1021047 -1409284 -1805407 -1969962 -1897575 -1868782 -1914969 -1797761 -1519777 -1337484 -1262497
36047a262497K08717L28341J58000n4815o296Q9525n5367j95147J8760L48183
36037d22596L26364K9453j09923k8368J0021k5912J2882L2840j02837j38256K13554
36026b02778O32306N48028L7683k76944j78577n1026j18033j50834m3735n4922
36016A41168k74450l85693j83967J11424K62216L17345L32280J88582r6134k36893
36006A75878p3276K00923L52391L56367K23056p5221l72674l71352r4776P6638
35996C97954j5771q3972N6718J42687l4087j82650J6932L08222J99411k59733
35986E45711n16176k92294Q8597K12400O9556r0603j50477j73640j79931p7637
35976e64494J46012L03923K10859l5946j54988q8585q3408k44643k96705o1241
$$ plain form
36047 -1262497 -1053780 -725439 -567439 -622254 -628550 -539025 -594392 -789539 -770779 -422596
36037 -422596 -96232 -66779 -176702 -205070 -195049 -220961 -208079 -175239 -278076 -416332 -202778
36026 -202778 429528 977556 1015239 738295 559718 508692 390659 239825 196090 141168
36016 141168 -133282 -518975 -702942 -591518 -329302 -11957 320323 508905 412771 175878
36006 175878 102602 303525 655916 1012283 1235339 1160118 787444 416092 321316 397954
35996 397954 382183 298211 354929 497616 463529 280879 297811 606033 805444 545711
35986 545711 29535 -262759 -174162 38238 107794 17191 -133286 -306926 -486857 -564494
35976 -564494 -418482 -114559 96300 60354 -94634 -183219 -266627 -511270 -807975 -869216
35966h69216J04020k04426o69799n54606K10885Q27897P01428J73383j19367j36206
35956e36007k43898m79596n13451k13853J70852L68810L38275K02040J34107K36347
35946e36374L70237K52978j18226l44489j41926K47220M27394L91581L43929K11612
35936A103936j97892o62675o83135j99151K69117L07039N5140j56242k53359k96345
35926g13567k23685K549J89609J24908j01006k01990p4875J12687J88991J65938
35916e30441J33742R7398n73j40556j95083p1086J58124L18585L08401J32653
35906B11164j85597n67995p57106m79242J37128N34465L43765j37644l40658j40125
35896a381845J48657L60571O20342Q74367P70494K16998l25440m16203k22801
$$ plain form
35966 -869216 -765196 -969622 -1639421 -2194027 -1983142 -1155245 -453817 -280434 -399801 -536007
35956 -536007 -779905 -1259501 -1772952 -1986805 -1815953 -1447143 -1108868 -906828 -772721 -536374
35946 -536374 -166137 86841 -31385 -375874 -517800 -270580 156814 548395 892324 1103936
35936 1103936 906044 243369 -439766 -638917 -369800 -62761 -7621 -163863 -417222 -713567
35926 -713567 -937252 -934703 -745094 -620186 -721192 -923182 -998057 -885370 -696379 -530441
35916 -530441 -396699 -299301 -299874 -440430 -635513 -706599 -548475 -229890 78511 211164
35906 211164 25567 -542428 -1299534 -1778776 -1641648 -1107183 -763418 -901062 -1241720 -1381845
35896 -1381845 -1233188 -872617 -252275 622092 1392586 1609584 1284144 867941 645140
35887F45140j99007l78572l82864n4503L05590L80034K00106k7073j93166k50711
35877D4974j18275J80678M12415L66776J47241N8103K05491L51681K07938k10858
35867A646164n69362n26535p7936L89017M35398L7354l47740k95628O4096K25312
35857I80140j1953k92428k35956M8463K01834J60988J43965J95882J25695q5614
35847A231016j88060j00464j03859l76322o17477m40873M1924L57874K97311P9707
35837A80777o5398j44865j79049n1463K62106N34105N37566L29375J32092L5982
35827A571228l3355j21798j73357j35182k5965J03279K05596K42610K10462J48275
35817A991793P3087o2162k73867m31735l39939K2179M05273N06283K68673q1873
$$ plain form
35887 645140 446133 67561 -315303 -369806 -64216 315818 515924 488851 295685 44974
35877 44974 -73301 107377 519792 886568 1033809 1091912 1297403 1649084 1857022 1646164
35867 1646164 1076802 550267 472331 861348 1296746 1334100 986360 690732 754828 980140
35857 980140 968187 675759 439803 488266 690100 851088 995053 1190935 1316630 1231016
35847 1231016 1042956 942492 838633 462311 -155166 -596039 -554115 -196241 101070 180777
35837 180777 115379 -29486 -208535 -259998 2108 536213 1073779 1403154 1535246 1571228
35827 1571228 1537873 1416075 1242718 1107536 1081571 1184850 1390446 1633056 1843518 1991793
35817 1991793 2064880 2002718 1728851 1297116 957177 979356 1384629 1890912 2159585 2077712
35807B077712k97811l48044l73025m62493n49251n09178k95850L1583L45769M96822
35797A16234L98730J27613j10271j61032n0358Q9381J59013J25139l849j53791
35787E36809j95568p4913J01873J95245K00874J88678J24646q6167l71238m82257
35777A37982l01288j9585J12161J06514J44553K19359J09204k28573m62542k86025
35767d68240J18803K88202J25424K1256K14950L71400R3375l84227m48946J705
35757f6298L90814K76529r3414k55909j83365j38196j62110j01605K1796N4784
35747b56974M0424J39471K69529J83507r3499k58644j97948j16349j41451j48549
35737e80483q3304j00956k20074j81465J19079L62878K53823k0355q7793M4141
$$ plain form
35807 2077712 1779901 1431857 1058832 596339 47088 -462090 -757940 -726357 -380588 116234
35797 116234 514964 642577 532306 371274 320916 410297 569310 694449 690600 536809
35787 536809 341241 266328 368201 563446 764320 952998 1077644 991477 620239 137982
35777 137982 -163306 -182891 -70730 35784 180337 399696 508900 280327 -182215 -468240
35767 -468240 -349437 -61235 64189 85445 300395 671795 765170 380943 -68003 -66298
35757 -66298 324516 601045 507631 251722 68357 -69839 -231949 -333554 -311758 -256974
35747 -256974 -216550 -77079 192450 375957 282458 23814 -174134 -290483 -431934 -580483
35737 -580483 -663787 -764743 -984817 -1166282 -1047203 -684325 -430502 -450857 -538650 -494509
35727d94509P3735o9964j45976j4041J85445K83955K62862J55479k048r6597k7042
35716A11299J02050P6982j02281j98134q0442J04683J74713J23878J7455j27530
35706B02673k42206j76896O7450K29587R7038j79919k83372j72461j08118k24416
35696g90640l02057q7956L05836N03211L37180N6824o276J36185J73462o5028
35686B60741l72374m22420j43451K54844N24046N35776L04913J6435n1155J69524
35676A076879L55157J54095k88210m61517k06858L9621j00524l81176l36681q399
35666a57613J58199L3870m6588R8081J85279k4267k76051j87907J64060L63980
35656C11043K48935N7536L876K879r7599k32836k10303K3125L13423M58323L78575
$$ plain form
35727 -494509 -420774 -490738 -636714 -650755 -465310 -181355 81507 236986 234938 138341 111299
35716 111299 213349 290331 188050 -10084 -90526 14157 188870 312748 330203 202673
35706 202673 -39533 -216429 -148979 80608 177646 -2273 -285645 -458106 -566224 -790640
35696 -790640 -1092697 -1180653 -874817 -371606 -34426 22398 16122 152307 325769 260741
35686 260741 -111633 -534053 -677504 -422660 101386 637162 942075 958510 907355 1076879
35676 1076879 1432036 1586131 1297921 836404 629546 669167 568643 187467 -149214 -157613
35666 -157613 586 34456 -12132 85949 271228 246961 -29090 -216997 -52937 311043
35656 311043 559978 617514 621390 624269 526670 293834 83531 106656 420079 878402 1256977
35645A256977J60404m3242j61559k35553k83439k19712J640K37372K92099J69827
35635A174814K8340r7595l19942o01986o66069l39225J63697M63652M25543K08401
35625D39630J7471l5346P3808K28476J80938j70539n43026n34601j37180K44016
35615b36353L15258J88115P3852l2351j86023k61285j41563K6987M7860Q531R6337
35604a00635J86058k789l48748l67266N8614L98191J86503l14932n13343k88895
35594a107242R94J58279L19946N23445N52141L15686J4976j97325l81043m98984
35584b99127l16816J64086N22687M70270K87577L54670N12562L41575j08367l84916
35574A544201l63799l61237m61364l09091J91391M95534J57854m00707l83208
$$ plain form
35645 1256977 1417381 1374139 1212580 977027 693588 473876 475516 712888 1004987 1174814
35635 1174814 1203154 1105559 785617 183631 -482438 -821663 -657966 -194314 231229 439630
35625 439630 457101 421755 495563 724039 904977 734438 191412 -343189 -480369 -236353
35615 -236353 78905 267020 340872 308521 122498 -138787 -280350 -253363 -205503 -196972 -100635
35604 -100635 85423 82634 -266114 -633380 -574766 -176575 9928 -305004 -818347 -1107242
35594 -1107242 -1106248 -947969 -628023 -104578 447563 763249 778225 580900 199857 -299127
35584 -299127 -615943 -451857 70830 541100 828677 1183347 1695909 2037484 1929117 1544201
35574 1544201 1180402 819165 357801 48710 240101 735635 893489 492782 109574
35565A09574K64244P34259M20832l13369o44021l04863J86699K58269m3984k44547
35555D23093j38759k6696j92090m21510l05287J15148L48101J30673k16216k54258
35545e37801R177K29054K11082N8770o9631j29157j31197q2368p308M6916M9568
35534c52895K2067M7217J85701L15010J74676k46503n06976k19673L12854M06508
35524A37986k8213l28891p0378L29641L22504L7556q8676o2699j43889k36193
35514a31252j05374L2064j80700m87718l07818K59944M78321J17069j95115L515
35504e17064L31819K74265l5506j77370j17452p0855o0143j8888k3704p6088J9997
35493d70989K43970K14075j73379l95064o6256L66142K88819q0420p3036K88664
$$ plain form
35565 109574 373818 1108077 1528909 1215540 571519 266656 453355 711624 667640 423093
35555 423093 284334 257638 65548 -355962 -661249 -546101 -198000 -67327 -283543 -537801
35545 -537801 -528624 -299570 -88488 -29718 -99349 -228506 -359703 -442071 -449379 -402463 -352895
35534 -352895 -330828 -283611 -97910 217100 391776 145273 -361703 -581376 -268522 137986
35524 137986 109773 -219118 -289496 40145 362649 400205 311529 248830 104941 -131252
35514 -131252 -236626 -204562 -385262 -872980 -1180798 -920854 -442533 -325464 -520579 -517064
35504 -517064 -185245 89020 53514 -123856 -241308 -312163 -372306 -391194 -414898 -490986 -470989
35493 -470989 -227019 -12944 -186323 -581387 -647643 -281501 7318 -73102 -146138 142526
35483A42526L32177j27149m82894l10572N5653J61223M4340q7320k61569m65030
35473i98615m11946J615L64171K90756K2630M9294L35024L90906L7456l47076
35463b65785l76897j05042J65948K48137J42581l6864j06794N6331L32125M33430
35453D87170K56356L0801J9016J72485K26761P7340j00331j23702n4606q0988
35443I10302k16505k56431o7478J89426K41831P4480l6520Q7712K50480J40878
35433A318175k05868m25086l20916j18012r2888j68265j07435L5707j3271k59515
35423c57374l71222j84880N5334J23017J51525L06093M11671K48493o502k7858
35413C48297J25398J49590O0408J38521L37288K57795j95903o13455o80373n45223
$$ plain form
35483 142526 474703 347554 -135340 -445912 -390259 -229036 -184696 -272016 -533585 -998615
35473 -998615 -1410561 -1408946 -1044775 -754019 -731389 -682095 -347071 43835 81291 -265785
35463 -265785 -642682 -747724 -581776 -333639 -191058 -227922 -334716 -278385 53740 487170
35453 487170 743526 774327 793343 965828 1192589 1269929 1169598 1045896 991290 910302
35443 910302 693797 437366 369888 559314 801145 875625 839105 926817 1177297 1318175
35433 1318175 1112307 687221 366305 248293 155405 -12860 -120295 -84588 -97859 -357374
35423 -357374 -728596 -913476 -858142 -735125 -583600 -277507 134164 382657 376155 348297
35413 348297 473695 623285 683693 822214 1159502 1417297 1221394 607939 -72434 -617657
35403f17657m14092k24913M5203J80543J19379J51726M21765O16354M74504K15824
35393I68636J01090j8543k83898l92680j21286J21751q6054l57100n9761N35880
35383D08035N69541j9796l62175n2769K49240l8741n19321n62403k68224p6824
35373f73437M3087L42115O10935M53800K9126j42766j9523o4672m19527o28157
35363d69019l48379J29332L23311J98316Q5343J62470L00986L62912L89825M21963
35353A557060L11613q8882n86397p27933l48265J45136K48468j3815k23673k20417
35343E2895k16153k56387m9718M61721P93117N29359n0155l51392k69693j92238
35333D51356l03010l44075j26600J21116J17034j9310N8221L72134M99379J06138
$$ plain form
35403 -617657 -1031749 -1256662 -1211459 -1030916 -911537 -759811 -338046 278308 752812 968636
35393 968636 1069726 1051183 767285 374605 253319 375070 289016 -68084 -127845 408035
35383 408035 977576 957780 595605 542836 792076 753335 234014 -328389 -596613 -673437
35373 -673437 -630350 -288235 322700 776500 805626 662860 643337 578665 159138 -469019
35363 -469019 -817398 -688066 -364755 -166439 -81096 81374 382360 745272 1135097 1557060
35353 1557060 1868673 1779791 1193394 465461 117196 262332 510800 496985 273312 52895
35343 52895 -163258 -419645 -469363 -7642 785475 1314834 1264679 913287 643594 451356
35333 451356 148346 -195729 -322329 -201213 -84179 -103489 -45268 326866 826245 932383
35323I32383n20595o93144j44769N63571O73659J51198l32838l22942r6311j20907
35313H9305l67386m66531l16354j62462j44597q8276J95566O00615Q01583N84819
35303G26282R2215k68965k37650j1120R72k67097m58077l32622j10242j03585
35293i69889k61703l12181j75631R222J49912K65703L74425M81996N86445N73553
35283G21852K77745k07647m89130l38233p37J64206J33661O9072m0187k54753
35273C5849l98124k59608K7082J46042N4610l3494k9279k0555k5364J288n245
35262e06798r3988j07993P3030K35108J34764k9344J26682N19324O53677L29618
35252A334080j29315l77227l81393k32456j3671R5889m4729k68364l06237k30618
$$ plain form
35323 932383 411788 -281356 -426125 137446 811105 962303 629465 306523 210212 89305
35313 89305 -278081 -744612 -1060966 -1223428 -1368025 -1456301 -1260735 -660120 141463 726282
35303 726282 818497 549532 311882 300762 301734 34637 -423440 -756062 -866304 -969889
35293 -969889 -1231592 -1543773 -1719404 -1710182 -1560270 -1294567 -920142 -438146 148299 721852
35283 721852 999597 791950 302820 -35413 -36150 128056 261717 330789 290602 35849
35273 35849 -362275 -621883 -594801 -448759 -394149 -427643 -456922 -477477 -502841 -501553 -506798
35262 -506798 -600786 -708779 -635749 -400641 -265877 -295221 -168539 350785 1004462 1334080
35252 1334080 1204765 827538 446145 213689 200018 295907 251178 -17186 -323423 -554041
35242e54041k93148l92037k13058J18048J25750j89465k50058J80565O04532O01116
35232b61796M28378M28922L92723J0793m70898n88154l53186j34823q5733j13210
35222g46984j86553k68529j72047J20895K45640k5284l08312j26176L29250M77463
35212f60637K31922M4243J31762K06190J0104l36136n89533o13606l33260J74084
35202a734867N42747M52296J01078l1424J21182J88542M5952J5634K55322M35216
35192C91678K74643M809r622J76555K22058k025l09086m70415l93043j25194J62757
35181g6885K81236J94703J1013k05245m44340n87090m80244k17079o1726k1296
35171a606953J77458N46235O42630J95655l83165m81113q4098K82592K98710J45297
$$ plain form
35242 -554041 -847189 -1239226 -1452284 -1334236 -1208486 -1397951 -1648009 -1467444 -862912 -261796
35232 -261796 166582 595504 988227 999020 528122 -60032 -413218 -548041 -633774 -746984
35222 -746984 -933537 -1202066 -1374113 -1253218 -1007578 -1032862 -1341174 -1467350 -1138100 -660637
35212 -660637 -428715 -384472 -252710 -46520 -36416 -372552 -962085 -1575691 -1908951 -1734867
35202 -1734867 -1192120 -739824 -638746 -670170 -548988 -360446 -314494 -298860 -43538 391678
35192 391678 666321 671130 661508 838063 1060121 1058096 749010 278595 -114448 -239642 -76885
35181 -76885 204351 399054 410067 204822 -239518 -826608 -1306852 -1523931 -1585657 -1606953
35171 -1606953 -1429495 -883260 -240630 -44975 -428140 -909253 -993351 -710759 -412049 -266752
35161b66752Q2654J11309J33364J41978J13699n1478l19788m30902k06457J48729
35151e43644K48269L790k72559k86511j25272p3356j60569j09677K25266N87381
35141e06882O52766M81418L76976L72237J82581k72031o29622n58994k17702R694
35131a09559M3873Q9925K04147K17767Q6303k90N6165P4313j32118m59668o29881
35120e59023m92937j21733K94478N57718N50802L16638J2320k34555l50282k38680
35110b65254J13650M23823K87808k56921o02726k94507L06765M55185K1671l71510
35100a82016k58203Q3519J53686m6249j49126l6384O5509J3192n9533J5562K26446
35089a73597M14015L81266M9046l45340l60738R4753M85938K66549l44753o27623
$$ plain form
35161 -266752 -184098 -72789 60575 202553 316252 264774 -55014 -485916 -692373 -543644
35151 -543644 -295375 -291585 -564144 -850655 -975927 -1049283 -1209852 -1319529 -1094263 -506882
35141 -506882 145884 627302 1004278 1376515 1559096 1287065 657443 98449 -119253 -109559
35131 -109559 -65686 24239 228386 446153 532456 532166 588331 662644 530526 70858 -559023
35120 -559023 -1051960 -1173693 -879215 -321497 229305 545943 558263 323708 -26574 -265254
35110 -265254 -151604 272219 560027 303106 -299620 -594127 -287362 167823 189494 -182016
35100 -182016 -440219 -356700 -203014 -249263 -398389 -434773 -369264 -356072 -415605 -400043 -173597
35089 -173597 240418 621684 670730 325390 -35348 59405 545343 811892 467139 -160484
35079a60484l54174k0640j4218r7834K9232J70993M8651j13994O6922M34617M71612
35068D60683J06188j63884l781L28414M12898J95652p9620k22533k11783j23007
35058F99227p5622j41734k27834j53695R8006L25092L50356K21003J20657J65461
35048A380917L07745L71283K02252j30026l42016k71584j22916j81716l51850
35039H62089k53471J88949N48620M22217o9730m84770n97870n35807m66710l78577
35029g65060j94069M0334J72835J29828J7768l904O6754P5264n2755j87557j82584
35018h83146p1295K9768Q9902R9219j3769j99652j83835J66830M99981L72863
35008i3134o2797k03258J38923M74928M02552J59184J22758J78719R215k76393
$$ plain form
35079 -160484 -514658 -535298 -549516 -647350 -618118 -447125 -398474 -512468 -445546 -10929 460683
35068 460683 566871 402987 399206 727620 1140518 1336170 1256550 1034017 822234 699227
35058 699227 623605 481871 254037 100342 198348 523440 873796 1094799 1215456 1380917
35048 1380917 1688662 2059945 2262197 2132171 1790155 1518571 1395655 1213939 862089
35039 862089 608618 797567 1346187 1768404 1698674 1213904 616034 80227 -386483 -765060
35029 -765060 -959129 -918795 -745960 -616132 -598364 -602268 -535514 -460250 -513005 -700562 -883146
35018 -883146 -954441 -924673 -834771 -735552 -749321 -948973 -1132808 -965978 -465997 -93134
35008 -93134 -155931 -359189 -220266 254662 657214 816398 939156 1117875 1127090 850697
34998H50697k92401k2831J61294J12344R1044K56364L55965J17056l13341n41514
34988G74677m16147j72774j35144l71712o37737o34802l43080m6363L9274O4840
34978a878968L10533P12381Q81290O43528L02742K02647K36698N3464l43404n12490
34968F08421j71059L63166N18817J57817k88052l66418j05129J19783P5844j27030
34958G86160k82793l48466l82072l45044j26195K25727M32466K76834p5248k12978
34948e1609r092J62966p3170n08642n67565j17044K98769J95113k02800l23625
34938a196699k2908L58900N57796O06282N36689K69584j19832l43398k38870L9337
34928D46881K37205K24716j258l03947l95079j09110K86276L39486P588l05041
$$ plain form
34998 850697 558296 535465 696759 809103 900147 1156511 1512476 1629532 1316191 774677
34988 774677 358530 185756 50612 -321100 -958837 -1593639 -1936719 -1983082 -1943808 -1878968
34978 -1878968 -1568435 -856054 25236 668764 971506 1174153 1410851 1464315 1120911 608421
34968 608421 437362 800528 1319345 1477162 1189110 822692 717563 837346 913190 786160
34958 786160 503367 154901 -227171 -572215 -698410 -472683 -40217 236617 161369 -51609
34948 -51609 -60701 102265 29095 -479547 -1047112 -1164156 -865387 -670274 -873074 -1196699
34938 -1196699 -1219607 -860707 -302911 303371 840060 1109644 989812 646414 407544 446881
34928 446881 684086 908802 907544 603597 208518 99408 385684 725170 732758 427717
34918D27717l35977k44169k30928k59556k70150k95911k34831Q5557M63438M14684
34908d80126o2428l22219M133M36535M22070J58427P9100R223m17284q45119n81950
34897a599638K15609O12300K39364k15634q1601M20542O89270N64172K71581j8788
34887A097177k24556k49925j42841j07858j84423j91943j08399j29913k18463
34878d61144n0872L50836M29132j05360p06797o77055q5187M54941O38056N95645
34868C82195M05658N1765k25534j07804K46364L30716N5235r9858J53188M48683
34858A640608L34994o2151k92176k52715k14982k78773k14262P6665K84169R9343
34848A120720l04193m85443l53018k41595l32606l60006r7664J92653J66399R725
$$ plain form
34918 427717 91740 -152429 -383357 -642913 -913063 -1208974 -1443805 -1358248 -894810 -480126
34908 -480126 -542554 -864773 -860640 -424105 -2035 156392 235492 244715 -172569 -1017688 -1599638
34897 -1599638 -1384029 -771729 -532365 -747999 -829600 -409058 280212 844384 1115965 1097177
34887 1097177 872621 622696 479855 371997 187574 -4369 -112768 -242681 -461144
34878 -461144 -512016 -161180 267952 162592 -544205 -1221260 -1306447 -851506 -213450 382195
34868 382195 787853 839618 614084 506280 752644 1083360 1138595 1038737 1191925 1640608
34858 1640608 1975602 1913451 1621275 1368560 1153578 874805 660543 737208 1021377 1120720
34848 1120720 816527 331084 -21934 -263529 -596135 -956141 -1053805 -861152 -694753 -685028
34838f85028J57001N06319N01712N4972k37388l5766J87079n4075m31326l55447
34828c91947L7023J32333j44648k83528r2634P1152N2673J73062N27118O48172
34818G28776K38015k90216m25463k94607l19769m77547m17018j03501J60557K36624
34808i64149K12241O3883k61043m76147j92021M17969O86337L40789j21045j56971
34798d50157J31761L15471K71081J46020l0113k90827m57880l17101O229J84018
34788d91498J44981R2583J15691R3442k9352j55822k07490j31011J73304O13233
34778B18061P24504J83817n51865o65528j03067L09131M7162m20695m46521j11684
34768h16685J46738L00764N24639O12861K74793k24188l62477j50598r851j0365
$$ plain form
34838 -685028 -528027 -21708 480004 534976 297588 261822 448901 394826 -36500 -391947
34828 -391947 -354924 -222591 -367239 -650767 -743401 -672249 -619576 -446514 80604 728776
34818 728776 966791 676575 251112 -43495 -363264 -840811 -1257829 -1361330 -1200773 -964149
34808 -964149 -751908 -688025 -949068 -1425215 -1617236 -1199267 -512930 -172141 -293186 -450157
34798 -450157 -318396 -2925 268156 414176 384063 93236 -364644 -681745 -675516 -491498
34788 -491498 -346517 -253934 -138243 -44801 -74153 -229975 -437465 -568476 -395172 218061
34778 218061 942565 1126382 574517 -91011 -194078 115053 162215 -258480 -705001 -816685
34768 -816685 -669947 -369183 155456 768317 1043110 818922 456445 305847 295996 285631
34758B85631J08089K47319J3914m89681o52053k75462J43168K32935K05558K59595
34748G9013J78836j37552l26196j37928J21870J09155n3822j39959k11131k85707
34738h03421j17196K77219L89227R663k82396k505L85959K10879k67771k91597
34728d91939J37675L36837J15327m8402J9456m9884l16135l14253N9449K45186
34718c06683l7217k53667P6218N63448N37806L6293l29154k38475O1734K05620
34708C15923P0788k23303m30754l58238o3865K21001M01063N44063N87435L38760
34698A402873j35133m50343l88285j43471M3380J83485L19409L36234J88479K9570
34688A386198n4084j52581k50222j84982l1845j08692l93615l94914R3767N54525
$$ plain form
34758 285631 393720 641039 654953 165272 -486781 -762243 -619075 -386140 -180582 79013
34748 79013 257849 120297 -205899 -343827 -221957 -112802 -166624 -306583 -517714 -803421
34738 -803421 -920617 -643398 -254171 -244508 -526904 -529409 -143450 67429 -200342 -491939
34728 -491939 -354264 -17427 97900 49498 68954 19070 -297065 -611318 -551869 -306683
34718 -306683 -343900 -597567 -521349 42099 579905 616198 287044 48569 110303 315923
34708 315923 386711 163408 -267346 -625584 -689449 -468448 -67385 476678 1064113 1402873
34698 1402873 1267740 817397 429112 285641 329021 512506 831915 1168149 1356628 1386198
34688 1386198 1332114 1179533 929311 744329 712484 603792 210177 -184737 -90970 463555
34678D63555M55751J3263k06253j14648m5401j13285j30101j6424J28861K54040
34668F89358L07361J39562k16077m04437k54836j37338l74303o16419l66580J55676
34658a078033L43993K00023K41121M97470M26101q7576m50362l15481p7851r5902
34648c96497j12355J25038K94122Q4401j63291j1554K66833R7596m13678n83888
34638h13273j84440K38161J77017j78697k99871j6925L51478M22045J56010j17844
34628b66339o8974K31010L65655J02811k89485m02818k03231L1662J56742K51762
34618i1205L20793K18298m9637k04094l2918K78975L19347o7516n65182p05679
34608e78818l89901l696N6304j25644j54770O5623K03476N5602j12221j8294J46944
$$ plain form
34678 463555 919306 932569 726316 611668 566267 452982 322881 306457 435318 689358
34668 689358 996719 1136281 920204 515767 260931 123593 -250710 -867129 -1233709 -1078033
34658 -1078033 -734040 -534017 -292896 204574 630675 543099 92737 -222744 -300595 -396497
34648 -396497 -508852 -383814 -89692 -5291 -168582 -180136 86697 184293 -229385 -813273
34638 -813273 -997713 -759552 -582535 -761232 -1061103 -1078028 -726550 -304505 -148495 -266339
34628 -266339 -335313 -104303 261352 364163 74678 -328140 -531371 -499709 -342967 -91205
34618 -91205 229588 447886 398249 194155 161237 440212 759559 692043 126861 -578818
34608 -578818 -968719 -972415 -916111 -1041755 -1196525 -1130902 -927426 -871824 -984045 -1002339 -855395
34597h55395M5691k07035k08075O2945K06564N9181p4718L0901J76198J47636
34587f16107R4563K02239L03632J66156o9329j08527J3481O3125Q5380K95020
34577D29633N41964L94730j49870n28995l95734r8068p2689j62584K4373L70174
34567C52934M04335R3091q1172J17913L30260J82508j71653l29738j77933P8960
34557G99505K20317J56788m4418j41336P0357M08923M36579Q5165j72745K892
34547A822027L38874M62482N13332P64240R49777O09351m2169k63849J71993P31618
34537F057676J014352J240923J621335J879000J792557J661801J736345J615961
34529A8619950Q00659m44862j361002j659749j663608j595103j343264r79462
$$ plain form
34597 -855395 -809704 -1016739 -1224814 -1161869 -955305 -896124 -970842 -939941 -763743 -616107
34587 -616107 -521544 -319305 -15673 150483 81154 -27373 -13892 49233 134613 429633
34577 429633 971597 1366327 1216457 687462 291728 193660 120971 -41613 -17240 352934
34567 352934 757269 850360 769188 887101 1217361 1399869 1228216 898478 720545 799505
34557 799505 1019822 1176610 1132192 990856 1061213 1470136 1906715 1991880 1819135 1822027
34547 1822027 2160901 2623383 3136715 3900955 4850732 5460083 5417914 5154065 5326058 6057676
34537 6057676 7072028 8312951 9934286 11813286 13605843 15267644 17003989 18619950
34529 18619950 19420609 18975747 17614745 15954996 14291388 12696285 11353021 10373559
34521A0373559r09790j283192j675888j634220j229343q23613n41424k58435M4034
34512B061688K07981J47574l5706j89975k34476j58275k0342M2604q2645l35437
34502A402991n01569m35545k23164o7115l9742l5073L2695J07110J30286J69575
34492E40449K64995K73726Q0516j24175n9824J76422J94562q2884k71947j33364
34482H58476M8314n2406k74463k64750m0293J16383J24843R0178j1863k33703
34472C60716l78973k46627m1204r9309k99652k29939J12687L16810K49743J84437
34462g1311J72680p6431n04515n35968M6732O12447N07550o5692m48985m20155
34452g83648k05596N5537L24723L97053J61276n8079O5361K63501O9352l37942
$$ plain form
34521 10373559 9463769 8180577 6504689 4870469 3641126 2817513 2276089 2017654 2061688
34512 2061688 2269669 2417243 2381537 2191562 1957086 1798811 1778469 1821073 1738428 1402991
34502 1402991 901422 465877 242713 175598 135856 100783 133478 240588 370874 540449
34492 540449 805444 1079170 1159686 1035511 975687 1152109 1346671 1263787 991840 858476
34482 858476 906790 854384 579921 315171 274878 391261 516104 606282 594419 360716
34472 360716 -18257 -264884 -306088 -405397 -705049 -934988 -822301 -505491 -255748 -71311
34462 -71311 101369 24938 -479577 -1015545 -968813 -356366 151184 85492 -363493 -783648
34452 -783648 -989244 -933707 -608984 -211931 -50655 -108734 -43373 220128 289480 -48462
34442d8462l24920J82839N36128L23817j05560k86568k50173k09992j17669J05806
34432a94754K61061J65145j7002o9749j02768k87782m55035l42525p6151J3837
34422a105723n0510L7012K63822K34330j65208m56746j91957L99718P07237N28333
34412B00308K25619J28710J25018l3850k87438l69668k30564r1236q9805j15223
34402e38129n4023K0591K5809L4719R4994O6302j25938k24555N5996N19293O29271
34391E04330K13159k94706m21994j83523J13513L07231L92010L15117N5802k06479
34381G94460k70188j98356j97152k64151k03501K3466K08365J92607M3426j14607
34371A4369k37162k55267m8383L30292N65725M11921K4572k25424k21817j74135
$$ plain form
34442 -48462 -373382 -190543 345585 669402 563842 277274 27101 -182891 -300560 -194754
34432 -194754 66307 231452 214450 144701 41933 -245849 -700884 -1043409 -1119560 -1105723
34422 -1105723 -1156233 -1119221 -855399 -621069 -786277 -1243023 -1434980 -1035262 -328025 200308
34412 200308 425927 554637 679655 645805 358367 -11301 -241865 -333101 -422906 -538129
34402 -538129 -592152 -571561 -545752 -511033 -416039 -349737 -475675 -700230 -644234 -124941 504330
34391 504330 717489 422783 789 -182734 -69221 238010 630020 945137 1000939 794460
34381 794460 524272 325916 128764 -135387 -338888 -315422 -107057 85550 128976 14369
34371 14369 -222793 -478060 -526443 -196151 369574 781495 806067 580643 358826 184691
34361A84691k10483j54943J34578M06528K86345j30902k84134J24400O70202P30121
34351A756403K91184r6796j14274k9035j68403m02342m01285j62585K9419M4851
34341G47137O789j4249j19885l47613n33641n09242l05803r1553R013p501m5383
34330a211931K1078K30420M65382N57122M58037K60979P9963j0357M2466K28234
34320A121393M16727M46522K94112Q6388n7064j31695k08277l38491m73728m47951
34310G07936j36588K91183M15073K7373n38678p49975m94154j44629l3807j07709
34300g63975j36054k5431J67132L46012M07897L05647J45189P9807P7816l0939
34290E73101k46293l45524k04386L8912K14114K91900K46587P818l14577m16001
$$ plain form
34361 184691 -25792 -180735 -46157 360371 646716 515814 231680 356080 1026282 1756403
34351 1756403 2047587 1950791 1836517 1807482 1639079 1236737 835452 672867 702286 747137
34341 747137 753926 739677 619792 272179 -261462 -770704 -1076507 -1168060 -1159047 -1166548 -1211931
34330 -1211931 -1190853 -960433 -495051 62071 520108 781087 861050 850693 893159 1121393
34320 1121393 1538120 1984642 2278754 2365142 2308078 2176383 1968106 1629615 1155887 707936
34310 707936 571348 862531 1277604 1304977 766299 16324 -477830 -622459 -656266 -763975
34300 -763975 -900029 -925460 -758328 -412316 -4419 301228 446417 526224 604040 573101
34290 573101 326808 -18716 -223102 -184190 29924 321824 568411 576229 261652 -154349
34280a54349j90340Q9249J64288J21971J23580P5067j37854l21767k35469j1254
34270d76878M1366p4606j07567r88R5308J58955K48117K12060j07983m44904l68606
34259h25726J6024J72224n721l4046K83903M70637K04929q1484N1990K49779k9028
34248D73481m79180l31128L81341P52784L01077l85137n49165k33000J4165m4983
34238i9745k20453l25621l32906k30020j5885K25404M17658N49762N31168K07512
34228G06874l05161n53907k86636J54848K95395J86442K06921L45729J99267k83493
34218F66279n82860l50735O3789J50758l7639r9794J2899j8835k65048l88117
34208h49303j88842Q6836J69423J74108L31603N39981M96136J69070j54731k77060
$$ plain form
34280 -154349 -344689 -255440 -91152 30819 154399 229466 91612 -230155 -465624 -476878
34270 -476878 -435512 -510118 -617685 -618673 -523365 -364410 -116293 95767 -12216 -457120 -825726
34259 -825726 -809702 -637478 -643199 -677245 -393342 77295 282224 200740 252730 502509 473481
34248 473481 -5699 -336827 44514 797298 1098375 713238 164073 -68927 -54762 -99745
34238 -99745 -320198 -645819 -978725 -1208745 -1224630 -999226 -581568 -31806 499362 706874
34228 706874 401713 -152194 -438830 -283982 11413 197855 404776 750505 949772 666279
34218 666279 83419 -267316 -203527 -52769 -90408 -190202 -177303 -196138 -461186 -849303
34208 -849303 -1038145 -951309 -781886 -607778 -276175 263806 759942 929012 774281 497221
34198D97221k68937k12171l0155K85281M83427L15245q7724l08004j42985J48081
34188F79279J75418j14177m16118m54496k46871K2651K38688L67904L51663J50410
34178G54351j21985k52601j50166Q0032K79816L44103K03983j12440l67767k82151
34168C75175P3596K57463L268l89720m35584q5777K86777M21217L83168K87551
34158A177134J28064p1516k05241k53139k84724k64784r2531J42683K11240Q3282
34148E70468o1042j73061l33932l90104o9212M04674L70506k82255p35716l38089
34138a037763M02436N48498Q7238k05890m1422J00602m0560r6423J37170K72818
34128A26704O3582j00489J11098L36881J35055k13986j34059L02308M82037J74401
$$ plain form
34198 497221 228284 16113 -14042 271239 754666 1069911 982187 674183 531198 679279
34188 679279 854697 740520 324402 -130094 -376965 -354314 -115626 252278 603941 754351
34178 754351 632366 379765 229599 309631 589447 933550 1137533 1025093 657326 375175
34168 375175 448771 706234 709502 319782 -115802 -201579 85198 506415 889583 1177134
34158 1177134 1305198 1233682 1028441 775302 490578 225794 133263 275946 487186 570468
34148 570468 509426 336365 2433 -387671 -456883 -52209 318297 36042 -699674 -1037763
34138 -1037763 -635327 -86829 409 -205481 -246903 -146301 -186861 -283284 -146114 126704
34128 126704 190286 89797 200895 537776 672831 458845 324786 627094 1109131 1283532
$$ [...]
##END NTUPLES=NMR SPECTRUM
##END=
