##TITLE=31Pdec_DE-27k
 D2O, 64 sc
 16.8.2024
##JCAMPDX= 6.0         $$ Bruker NMR JCAMP-DX V2.0
##DATA TYPE= NMR SPECTRUM
##DATA CLASS= NTUPLES
##ORIGIN= UXNMR, Bruker Analytische Messtechnik GmbH
##OWNER= root
$$ XWIN-NMR		Version 3.5
$$ Fri Aug 16 16:06:04 2024 Russian Standard Time (UT+4h)  she@DPX200
##.OBSERVE FREQUENCY= 81.013821
##.OBSERVE NUCLEUS= ^31P
##.ACQUISITION MODE= SIMULTANEOUS
##.ACQUISITION SCHEME= undefined
##.AVERAGES= 64
##.DIGITISER RES= 17
##SPECTROMETER/DATA SYSTEM= spect
##.PULSE SEQUENCE= zgpg30
##.SOLVENT NAME= CDCl3
##.SHIFT REFERENCE= (INTERNAL, CDCl3, 0, 198.062)
##AUDIT TRAIL= $$ (NUMBER, WHEN, WHO, WHERE, WHAT)
$$ ##TITLE= Audit trail, XWIN-NMR		Version 3.5
$$ ##JCAMPDX= 5.01
$$ ##ORIGIN= Bruker BioSpin GmbH
$$ ##OWNER= she
$$ F:/spectra/data/she/nmr/P31/2/pdata/1/auditp.txt
$$ ##AUDIT TRAIL=  $$ (NUMBER, WHEN, WHO, WHERE, WHAT)
(   1,<2024-08-16 16:04:15.73 +0400>,<she>,<DPX200>,
      <created by zg, POWCHK disabled, PULCHK disabled
       configuration hash MD5:
       00 E9 B6 7A A2 85 ED C7 34 08 36 98 17 FE 4E 26
       data hash MD5: 32K
       FA EE 71 9D A1 6A 8C A7 A0 3A 81 E3 A2 28 20 BB>)
(   2,<2024-08-16 16:04:18.06 +0400>,<she>,<DPX200>,
      <Start of raw data processing
       efp BC_mod = 2 LB = 1.5 FT_mod = 6 PKNL = 1 PHC0 = 2468.988 PHC1 = 663.2878 SI = 64K 
       data hash MD5: 64K
       55 8E 74 0B C3 CF C7 F0 EC 6A 93 48 50 E9 25 E1>)
(   3,<2024-08-16 16:04:42.43 +0400>,<she>,<DPX200>,
      <pk PHC0 = 253.0847 PHC1 = -690.0003 
       data hash MD5: 64K
       39 FF 97 22 55 A0 72 14 70 1E AA 46 1E 23 FB 72>)
(   4,<2024-08-16 16:04:48.31 +0400>,<she>,<DPX200>,
      <abs ABSG = 5 
       data hash MD5: 64K
       71 BD C6 7C 2D F4 FC 18 6E 54 CC 0E 03 3C DD 8E>)
$$ ##END=
$$ 
$$ hash MD5
$$ 0B 29 85 6B 97 82 40 06 32 61 2D C0 FA 56 6D 05
##$RELAX= 
##$RELAX= 
##$RELAX= 
##$RELAX= 
##$RELAX= 
##$RELAX= 
##$RELAX= 
##$RELAX= 
$$ Bruker specific parameters
$$ --------------------------
##$DU= <F:/spectra>
##$EXPNO= 2
##$NAME= <P31>
##$PROCNO= 1
##$TYPE= <nmr>
##$USER= <she>
##$AMP= (0..31)
100 100 100 100 100 100 100 100 100 100 100 100 100 100 100 100 100 100 
100 100 100 100 100 100 100 100 100 100 100 100 100 100 
##$AQSEQ= 0
##$AQ_mod= 1
##$AUNM= <au_zg>
##$AUTOPOS= <>
##$BF1= 81.014009
##$BF2= 200.13
##$BF3= 200.13
##$BF4= 200.13
##$BF5= 200.13
##$BF6= 200.13
##$BF7= 200.13
##$BF8= 200.13
##$BYTORDA= 1
##$CFDGTYP= 0
##$CFRGTYP= 5
##$CHEMSTR= <none>
##$CNST= (0..31)
1 1 145 1 1 1 1 1 1 1 1 1 1 1 1 1 1 1 1 1 1 1 1 1 1 1 1 1 1 1 1 1 
##$CPDPRG= <waltz16>
##$CPDPRG1= <>
##$CPDPRG2= <waltz16>
##$CPDPRG3= <>
##$CPDPRG4= <mlev>
##$CPDPRG5= <mlev>
##$CPDPRG6= <mlev>
##$CPDPRG7= <mlev>
##$CPDPRG8= <mlev>
##$CPDPRGB= <>
##$CPDPRGT= <>
##$D= (0..31)
0 1 0 0 0 0 0 0 0 0.06 0 0.03 2e-05 3e-06 0 0 0.0002 0 0 0 0 0 0 0 0 0 
0 0 0 0 0 0 
##$DATE= 1723809855
##$DBL= (0..7)
120 120 120 11 120 120 24 19 
##$DBP= (0..7)
150 150 150 150 150 150 150 150 
##$DBP07= 0
##$DBPNAM0= <>
##$DBPNAM1= <>
$$ [...]
##$SUBNAM3= <"">
##$SUBNAM4= <"">
##$SUBNAM5= <"">
##$SUBNAM6= <"">
##$SUBNAM7= <"">
##$SUBNAM8= <"">
##$SUBNAM9= <"">
##$SW= 400.765351723535
##$SWIBOX= (0..15)
0 1 3 0 0 0 0 0 0 0 0 0 0 0 0 0 
##$SW_h= 32467.5324675325
##$TD= 32768
##$TD0= 1
##$TE= 0
##$TE2= 300
##$TE3= 300
##$TEG= 300
##$TL= (0..7)
0 120 53 12 22 120 120 120 
##$TP= (0..7)
150 150 150 150 150 150 150 150 
##$TP07= 0
##$TPNAME0= <>
##$TPNAME1= <>
##$TPNAME2= <>
##$TPNAME3= <>
##$TPNAME4= <>
##$TPNAME5= <>
##$TPNAME6= <>
##$TPNAME7= <>
##$TPOAL= (0..7)
0.5 0.5 0.5 0.5 0.5 0.5 0.5 0.5 
##$TPOFFS= (0..7)
0 0 0 0 0 0 0 0 
##$TUNHIN= 0
##$TUNHOUT= 0
##$TUNXOUT= 0
##$USERA1= <user>
##$USERA2= <user>
##$USERA3= <user>
##$USERA4= <user>
##$USERA5= <user>
##$V9= 5
##$VALIST= <valist>
##$VCLIST= <CCCCCCCCCCCCCCC>
##$VD= 0
##$VDLIST= <DDDDDDDDDDDDDDD>
##$VPLIST= <PPPPPPPPPPPPPPP>
##$VTLIST= <TTTTTTTTTTTTTTT>
##$WBST= 1024
##$WBSW= 4
##$XGAIN= (0..3)
0 0 0 0 
##$XL= 0
##$YL= 0
##$YMAX_a= 27600
##$YMIN_a= -25250
##$ZGOPTNS= <>
##$ZL1= 120
##$ZL2= 120
##$ZL3= 120
##$ZL4= 120
##$ABSF1= 198.0616
##$ABSF2= -202.7028
##$ABSG= 5
##$ABSL= 3
##$ALPHA= 0
##$AQORDER= 0
##$ASSFAC= 0
##$ASSFACI= 0
##$ASSFACX= 0
##$ASSWID= 0
##$AUNMP= <proc_1d>
##$AZFE= 0.1
##$AZFW= 0.5
##$BCFW= 0
##$BC_mod= 2
##$BYTORDP= 0
##$COROFFS= 0
##$CY= -3
##$DATMOD= 1
##$DC= 0
##$DFILT= <>
##$DTYPP= 0
##$F1P= 0
##$F2P= 0
##$FCOR= 1
##$FTSIZE= 65536
##$FT_mod= 6
##$GAMMA= 0
##$GB= 0
##$INTBC= 1
##$INTSCL= 9.790993e-09
##$ISEN= 30
##$LB= 1.5
##$LEV0= 0
##$LPBIN= 0
##$MAXI= 10000
##$MC2= 0
##$MEAN= 0
##$ME_mod= 0
##$MI= 50
##$NCOEF= 0
##$NC_proc= -6
##$NLEV= 6
##$NOISF1= 182.463
##$NOISF2= 159.3651
##$NSP= 0
##$NTH_PI= 0
##$NZP= 0
##$OFFSET= 198.0616
##$PC= 4
##$PHC0= 2722.073
##$PHC1= -26.71252
##$PH_mod= 1
##$PKNL= yes
##$PPARMOD= 0
##$PSCAL= 0
##$PSIGN= 0
##$REVERSE= no
##$SF= 81.0140089999434
##$SI= 65536
##$SIGF1= 159.3651
##$SIGF2= -187.1042
##$SINO= 113.3802
##$SIOLD= 16384
##$SREGLST= <1H.CDCl3>
##$SSB= 0
##$STSI= 65536
##$STSR= 0
##$SW_p= 32467.5324675325
##$SYMM= 0
##$S_DEV= 0
##$TDeff= 32768
##$TDoff= 0
##$TI= <>
##$TILT= no
##$TM1= 0
##$TM2= 0
##$TOPLEV= 0
##$USERP1= <user>
##$USERP2= <user>
##$USERP3= <user>
##$USERP4= <user>
##$USERP5= <user>
##$WDW= 1
##$XDIM= 65536
##$YMAX_p= 459388792
##$YMIN_p= -18756619
$$ End of Bruker specific parameters
$$ ---------------------------------
##NTUPLES= NMR SPECTRUM
##VAR_NAME=  FREQUENCY,     SPECTRUM/REAL,   SPECTRUM/IMAG
##SYMBOL=    X,             R,               I
##VAR_TYPE=  INDEPENDENT,   DEPENDENT,       DEPENDENT
##VAR_FORM=  AFFN,          ASDF,            ASDF
##VAR_DIM=   65536,         65536,           65536
##UNITS=     HZ,            ARBITRARY UNITS, ARBITRARY UNITS
##FACTOR=    0.49542278885378, 1,            1
##FIRST=     16045.7642231865, 0,            0
##LAST=      -16421.768244346, 0,            0
##MIN=       -16421.768244346, -18756619,    0
##MAX=       16045.7642231865, 459388792,    0
$$ Real data points
##PAGE= N=1
##DATA TABLE= (X++(R..R)), XYDATA
$$ [...]
$$ plain form
39952 -313553 -1142148 -1459595 -1182596 -1074411 -1556630 -2024181 -1723684 -892760 -445340 -740499
39942 -740499 -1291866 -1634291 -1834783 -2048963 -2152835 -2026228 -1754982 -1364763 -771811 -187255
39932 -187255 -144325 -843675 -1772997 -2215864 -1908593 -1064794 -70471 648387 750917 248935
39922 248935 -453429 -881067 -759307 -103647 630326 620340 -541778 -2073966 -2580801 -1619461
39912 -1619461 -195757 515459 397743 43147 -210493 -339523 -168427 468046 1225230
39903 1225230 1471625 1043381 418648 122275 213205 363503 260320 -81806 -357269 -379167
39893 -379167 -373914 -614809 -843040 -498244 429933 1294995 1667625 1736688 1627756 1028788
39883 1028788 -58515 -869235 -830375 -433707 -419615 -547859 -70477 846301 1166136 474295
$$ packed form
39952c13553q28595l17447K76999J08185m82219m67551L00497Q30924M47420k95159
39942g40499n51367l42425k00492k14180j03872J26607K71246L90219N92952N84556
39932a87255M2930o99350r29322m42867L07271Q43799R94323P18858J02530n01982
39922B48935p02364m27638J21760O55660P33973r986j162118j532188n06835R61340
39912a619461J423704P11216j17716l54596k53640j29030J71096O36473P57184
39903A225230K46395m28244o24733k96373R0930J50298j03183l42126k75463k1898
39893c79167N253k40895k28231L44796R28177Q65062L72630O9063j08932n98968
39883A028788j087303q10720L8860L96668J4092j28244M77382R16778L19835o91841
$$ plain form
39873 474295 -449261 -758039 -549928 -477777 -873390 -1531956 -2008349 -1954809 -1453248 -1063204
39863 -1063204 -1226710 -1645067 -1612813 -921407 -3145 772719 1434836 2006847 2280381 2116757
39853 2116757 1586590 766281 -205377 -889797 -861620 -300745 194262 393357 543049 729604
39843 729604 753214 676758 842045 1228149 1439445 1432941 1540388 1643103 1176008 227544
39833 227544 -263370 141565 684574 620717 286246 281488 413769 337616 538151 1592712
39823 1592712 2898430 3253440 2504599 1590431 1039101 441840 -494897 -1309738 -1485275
39814 -1485275 -1129176 -717085 -629727 -1009801 -1569475 -1535904 -378819 1333221 2353863
39805 2353863 2123929 1231421 512404 260156 350648 520609 381917 -283996 -1096535 -1418843
$$ packed form
39873D74295r23556l08778K08111P2151l95613o58566m76393N3540N01561L90044
39863a063204j63506m18357L2254O91406R18262P75864O62117N72011K73534j63624
39853B116757n30167q20309r71658o84420K8177N60875M95007J99095J49692J86555
39843G29604K3610p6456J65287L86104K11296o504J07447J02715m67095r48464
39833B27544m90914M04935N43009o3857l34471m758J32281p6153K00535J054561
39823A592712J305718L55010p48841r14168n51330n97261r36737q14841j75537
39814a485275L56099M12091Q7358l80074n59674L3571J157085J712040J020642
39805B353863k29934q92508p19017k52248R0492J69961j38692o65913q12539l22308
$$ plain form
39795 -1418843 -1189783 -900930 -751639 -471635 -43924 109288 -170264 -565079 -936078
39786 -936078 -1456466 -1895139 -1615592 -669429 -57395 -356909 -830404 -543090 276944 714634
39776 714634 479457 -178 -375239 -537757 -337136 128628 218427 -528552 -1591883 -2084013
39766 -2084013 -1945018 -1785883 -1724940 -1234797 -170678 849055 1285845 1291146 1274929 1363362
39756 1363362 1459418 1424629 1074555 361149 -385273 -758639 -804088 -841598 -854936 -590132
39746 -590132 -201491 -128929 -257793 65947 928485 1461024 991096 7505 -539964 -447653
39736 -447653 -189963 5501 343799 846098 1170178 1121555 893781 701895 553359 497568
39726 497568 725121 1180536 1357037 816894 -184212 -910179 -990769 -764065 -695376 -787367
$$ packed form
39795a418843K29060K88853J49291K80004M27711J53212k79552l94815l70999
39786i36078n20388m38673K79547R46163O12034k99514m73495K87314Q20034M37690
39776G14634k35177m79635l75061j62518K00621M65764Q9799p46979j063331m92130
39766b084013J38995J59135O0943M90143J064119J019733M36790N301j6217Q8433
39756A363362R6056l4789l50074p13406p46422l73366m5449l7510j3338K64804
39746e90132L88641P2562j28864L23740Q62538N32539m69928r83591n47469R2311
39736d47653K57690J95464L38298N02299L24080m8623k27774j91886j48536n5791
39726D97568K27553M55415J76501n40143j001106p25967q0590K26704O8689r1991
$$ plain form
39716 -787367 -822064 -903754 -1300741 -1822267 -1864962 -1218005 -404711 -12962 -41448 -140392
39706 -140392 -147332 -103922 -75388 -255983 -898099 -1779794 -2130816 -1565291 -751159 -599481
39696 -599481 -1069092 -1389377 -1239930 -1011207 -1003038 -1069809 -1066972 -1028750 -906749 -718908 -863624
39685 -863624 -1577596 -2163965 -1628905 -153853 983820 1149611 1054412 1390503 1768464
39676 1768464 1585591 1058552 651883 209120 -533446 -1160829 -1172039 -916481 -1083119 -1591054
39666 -1591054 -1834380 -1766740 -1848575 -2034608 -1720690 -806894 -62707 -190738 -1018792 -1781442
39656 -1781442 -1832930 -1051002 60054 625773 130851 -1048759 -2079968 -2536681 -2556848
39647 -2556848 -2358421 -2024242 -1610040 -1032748 -32264 1269246 1984935 1289769 -420326
$$ packed form
39716g87367l4697q1690l96987n21526m2695O46957Q13294L91749k8486r8944
39706a40392o940M3410K8534j80595o42116q81695l51022N65525Q14132J51678
39696e99481m69611l20285J49447K28723Q169o6771K837L8222J22001J87841j44716
39685h63624p13972n86369N35060J475052J137673J65791r5199L36091L77961
39676A768464j82873n27039m06669m42763p42566o27383j1210K55558j66638n07935
39666a591054k43326O7640q1835j86033L13918R13796P44187j28031q28054p62650
39656a781442n1488P81928J111056N65719m94922j179610j031209m56713k0167
39647b556848J98427L34179M14202N77292J000484J301510P15689o95166j710095
$$ plain form
39638 -420326 -1814026 -2082671 -1541167 -813543 -154225 264220 131609 -508939 -1029477
39629 -1029477 -896261 -301229 160738 178517 -130856 -478720 -557006 -168047 517763 922549
39619 922549 477867 -851877 -2396039 -3138001 -2549914 -1290359 -731391 -1397005 -2220038
39610 -2220038 -1916063 -737472 -15209 -149508 -160497 573738 1256808 939926 -30884
39601 -30884 -609429 -481101 -86628 360449 1009536 1680024 1812876 1208775 324750 -238175
39591 -238175 -251908 41340 60661 -683597 -1920571 -2600004 -2002435 -693177 137367 135975
39581 135975 -5435 266763 694819 894070 1042993 1477292 2036938 2294404 2212355 2160983
39571 2160983 2365132 2629298 2555338 1836793 482124 -987650 -1695386 -1125233 296919
$$ packed form
39638d20326j393700k68645N41504P27624O59318M18445j32611o40548n20538
39629a029477J33216N95032M61967J7779l09373l47864p8286L88959O85810M04786
39619I22549m44682j329744j544162p41962N88087J259555N58968o65614q23033
39610b220038L03975J178591P22263j34299j0989P34235O83070l16882r70810
39601c0884n78545J28328L94473M47077O49087O70488J32852o04101q84025n62925
39591b38175j3733K93248J9321p44258j236974o79433N97569J309258Q30544j392
39581A35975j41410K72198M28056J99251J48923M34299N59646K57466q2049n1372
39571B160983K04149K64166p3960p18545j354669j469774p07736N70153J422152
$$ plain form
39562 296919 1608153 2272009 2434555 2296484 1784261 1047416 716185 1163062 1853122
39553 1853122 1987159 1556297 1150636 916618 483297 -91156 -189189 301199 628253 305881
39543 305881 -168723 -269154 -365587 -981096 -1769881 -2078827 -1989682 -1876440 -1412506 -135453
39533 -135453 1280049 1517794 383824 -975841 -1624345 -1553234 -885186 379612 1598691
39524 1598691 1740045 860598 215247 416437 644180 280955 88211 839011 1845747
39515 1845747 1956759 1213301 402774 -352009 -1370106 -2285796 -2375200 -1788078 -1418019
39506 -1418019 -1690396 -2330489 -3076518 -3733059 -3788527 -2952531 -1912251 -1622384 -1962599
39497 -1962599 -1988830 -1380522 -722240 -466531 -560662 -1000085 -1737854 -2069829 -1186093 519176
$$ packed form
39562B96919J311234O63856J62546j38071n12223p36845l31231M46877O90060
39553A853122J34037m30862m05661k34018m33321n74453r8033M90388L27054l22372
39543C05881m74604j00431r6433o15509p88785l08946Q9145J13242M63934J277053
39533a35453J415502K37745j133970j359665o48504P1111O68048J264798J219079
39524A598691J41354q79447o45351K01190K27743l63225j92744P50800J006736
39515A845747J11012p43458q10527p54783j018097r15690q9404N87122L70059
39506a418019k72377o40093p46029o56541n5468Q35996J040280K89867l40215
39497a962599k6231O08308O58282K55709r4131m39423p37769l31975Q83736J705269
$$ plain form
39487 519176 1651074 1490274 589643 -349133 -1160284 -1643639 -1468023 -1015193 -1253374
39478 -1253374 -2287048 -3000619 -2648895 -1835088 -1334190 -953214 -334287 46517 -313402
39469 -313402 -832595 -637241 -30993 -78543 -899377 -1412152 -876436 158083 733469 726183
39459 726183 796374 1336957 1859308 1577530 505784 -370483 -280627 300454 356256 -164464
39449 -164464 -356797 126923 540022 314562 -82040 -94361 -1292 -155894 -51432 937420
39439 937420 2369512 3199006 3118255 2638947 2105919 1436689 661042 -56345 -838107 -1848139
39429 -1848139 -2697758 -2729592 -1842228 -519922 769512 1645422 1584264 400329 -1164943
39420 -1164943 -2075749 -2150685 -1909551 -1494520 -655182 275664 467149 -122725 -508678 -100053
$$ packed form
39487E19176J131898j60800r00631r38776q11151m83355J75616M52830k38181
39478a253374j033674p13571L51724Q13807N00898L80976O18927L80804l59919
39469c13402n19193J95354O06248m7550q20834n12775N35716J034519N75386p286
39459G26183P0191N40583N22351k81778j071746q76267Q9856N81081N5802n20720
39449a64464j92333M83720M13099k25460l96602j2321R3069j54602J04462R88852
39439I37420J432092Q29494q0751m79308n33028o69230p75647p17387p81762j010032
39429a848139q49619l1834Q87364J322306J289434Q75910o1158j183935j565272
39420a164943r10806p4936K41134M15031Q39338R30846J91485n89874l85953M08625
$$ plain form
39410 -100053 494397 555725 380190 703003 1555856 2315820 2522720 2141195 1330095 410189
39400 410189 -200270 -397756 -493265 -630053 -489449 63627 475357 168800 -590741 -1064235
39390 -1064235 -1085843 -1179413 -1718861 -2512222 -3219843 -3679258 -3738868 -3253417 -2445734 -1895797
39380 -1895797 -1892091 -2016521 -1627882 -628586 460307 1090042 1126403 738886 108546 -624090
39370 -624090 -1260489 -1588113 -1548205 -1282367 -1024952 -1019301 -1451988 -2250423 -2925091 -2877734
39360 -2877734 -2033068 -1000777 -462795 -567277 -1062275 -1747644 -2477553 -2916748 -2730561
39351 -2730561 -2018331 -1240514 -719597 -491158 -580161 -1040795 -1693564 -2185655 -2382424 -2381807
39341 -2381807 -2130000 -1450615 -558211 -68054 -230177 -524891 -324912 344232 1021883
$$ packed form
39410a00053N94450O1328j75535L22813Q52853P59964K06900l81525q11100r19906
39400D10189o10459j97486r5509j36788J40604N53076M11730l06557p59541m73494
39390a064235k1608r3570n39448p93361p07621m59415n9610M85451Q07683N49937
39380a895797L706j24430L88639R99296J088893O29735L6361l87517o30340p32636
39370f24090o36399l27624L9908K65838K57415N651m32687p98435o74668M7357
39360b877734Q44666J032291N37982j04482m94998o85369p29909m39195J86187
39351b730561P12230P77817N20917K28439q9003m60634o52769m92091j96769O17
39341b381807K51807O79385Q92404M90157j62123k94714J99979O69144O77651
$$ plain form
39332 1021883 1496047 1848177 1981865 1586037 637616 -380984 -926503 -929568 -774272 -764859
39322 -764859 -684661 -13766 1314084 2533973 2754365 2048089 1463036 1777830 2584773
39313 2584773 2884040 2304809 1340707 517655 -191435 -989371 -1625071 -1486212 -380124
39304 -380124 964362 1447682 754504 -279685 -706567 -620299 -785226 -1242526 -1059400
39295 -1059400 250707 1771705 2261079 1724777 1188105 1142952 1044906 395362 -449856
39286 -449856 -868020 -822558 -730855 -814229 -949547 -963109 -757427 -282648 346244 795026
39276 795026 807733 508124 238477 188836 356149 722330 1173147 1300909 677200 -538668
39266 -538668 -1572633 -1861055 -1684178 -1670483 -1840331 -1598007 -701900 252033 577298 346711
$$ packed form
39332A021883M74164L52130J33688l95828r48421j018600n45519l065J55296R413
39322g64859Q0198O70895J327850J219889K20392p06276n85053L14794Q06943
39313B584773K99267n79231r64102q23052p09090p97936o35700J38859J106088
39304c80124J344486M83320o93178j034189m26882Q6268j64927m57300J83126
39295a059400J310107J520998M89374n36302n36672m5153r8046o49544q45218
39286d49856m18164M5462R1703q3374j35318j3562K05682M74779O28892M48782
39276G95026J2707k99609k69647m9641J67313L66181M50817J27762o23709j215868
39266e38668j033965k88422J76877J3695j69848K42324Q96107R53933L25265k30587
$$ plain form
39256 346711 119138 108599 118211 132752 375962 744497 785904 457921 382671 989006 1804487
39245 1804487 2021109 1495845 796308 479624 720391 1443091 2363935 2996354 3015867 2560444
39235 2560444 1883843 959541 -116917 -634944 54142 1398382 2016267 1432231 669126
39226 669126 722406 1210223 1197458 737100 659380 1105816 1291844 851414 534940 1141151
39216 1141151 2356041 3200108 3301908 3184479 3387586 3773880 3807216 3253968 2475855
39207 2475855 2122334 2570613 3592805 4553166 4961551 4805244 4343844 3739776 3036852
39198 3036852 2399337 2139184 2447136 3211239 4135492 4937717 5398602 5339491 4687689 3598186
39188 3598186 2470019 1748896 1588900 1679818 1542842 1097196 803773 1080420 1694050
$$ packed form
39256C46711k27573j0539R612J4541K43210L68535M1407l27983p5250O06335Q15481
39245A804487K16622n25264o99537l16684K40767P22700R20844O32419J9513m55423
39235B560444o76601r24302j076458n18027O89086J344240O17885n84036p63105
39226F69126N3280M87817j2765m60358p7720M46436J86028m40430l16474O06211
39216A141151J214890Q44067J01800j17429K03107L86294L3336n53248p78113
39207B475855l53521M48279J022192R60361M08385j56307m61400o04068p02924
39198C036852o37515k60153L07952P64103R24253Q02225M60885n9111o51802j089503
39188C598186j128167p21123j59996R0918j36976m45646k93423K76647O13630
$$ plain form
39179 1694050 2001083 1761276 1385717 1268422 1184013 619224 -457296 -1465855 -1871383
39170 -1871383 -1763938 -1711354 -2139542 -2937340 -3641472 -3924899 -3821937 -3499902 -3005228 -2373175
39160 -2373175 -1794798 -1393478 -972431 -373354 -93 -428361 -1401723 -1869477 -1373782
39151 -1373782 -783084 -1060589 -1798148 -1782798 -788997 88318 -20360 -649970 -739884 50411
39141 50411 1096623 1550281 1088363 152526 -457135 -426996 -288408 -620433 -1127921 -1115670
39131 -1115670 -711250 -736473 -1272630 -1359091 -541526 228980 -57528 -995821 -1498729 -1416108
39121 -1416108 -1435106 -1728047 -1757625 -1358579 -1048259 -1118996 -1200211 -932899 -458188 -49526
39111 -49526 193767 141227 -320597 -855939 -848621 -247077 265016 233680 105482 561754
$$ packed form
39179A694050L07033k39807l75559j17295q4409n64789j076520j008559m05528
39170a871383J07445N2584m28188p97798p04132k83427J02962L22035M94674O32053
39160b373175N78377M01320M21047N99077L73261m28268r73362m67754M95695
39151a373782N90698k77505p37559J5350R93801Q77315j08678o29610q9914P90295
39141E0411J046212M53658m61918r35837o09661L0139J38588l32025n07488J2251
39131a115670M04420k5223n36157q6461Q17565P70506k86508r38293n02908Q2621
39121a416108j8998k92941k9578L99046L10320p0737q1215K67312M74711M08662
39111d9526K43293n2540m61824n35342P318O01544N12093l1336j28198M56272
$$ plain form
39101 561754 1536564 2313635 2413285 2033027 1678603 1594951 1559769 1168370 368111 -346198
39091 -346198 -440056 34939 587823 978236 1364484 1758528 1827340 1436630 969096 787136
39081 787136 684354 237935 -466427 -840900 -529812 143523 599129 748075 1092952 1951440
39071 1951440 2766223 2598080 1352997 -8318 -762193 -1322899 -2280647 -3120762 -2864075
39062 -2864075 -1707505 -901773 -948509 -1046178 -603977 -165488 -273598 -465719 -194044 125103
39052 125103 -76392 -355797 27364 724362 749569 54072 -467050 -459302 -514022 -978026
39042 -978026 -1360651 -1219401 -804101 -455374 -44724 600077 1257034 1652132 1810639 1828476
39032 1828476 1739627 1790141 2309506 3069304 3320179 2762578 1934716 1318310 688861 -170879
$$ packed form
39101E61754R74810P77071R9650l80258l54424q3652l5182l91399q00259p14309
39091c46198r3858M74995N52884L90413L86248L94044O8812l90710m67534j81960
39081G87136j02782m46419p04362l74473L11088O73335M55606J48946L44877Q58488
39071A951440Q14783j68143j245083j361315p53875n60706r57748q40115K56687
39062b864075J156570Q05732m6736r7669M42201M38489j08110j92121K71675L19147
39052A25103k01495k79405L83161O96998K5207o95497n21122P748n4720m64004
39042i78026l82625J41250M15300L48727M10650O44801O56957L95098J58507J7837
39032A828476q8849N0514N19365P59798K50875n57601q27862o16406o29449q59740
$$ plain form
39022 -170879 -755774 -570591 -142256 -446681 -1487820 -2260853 -2156517 -1656243 -1444959
39013 -1444959 -1495309 -1397468 -1121404 -993400 -1154733 -1443376 -1707714 -1903024 -1895946 -1470820
39003 -1470820 -642912 190235 554036 350532 -43239 -148693 144254 493983 515573 264547
38993 264547 249712 887008 1935675 2587442 2255906 1276629 650948 979448 1788910 2119268
38983 2119268 1684511 1124903 1026169 1036105 297207 -1344283 -2928453 -3325073 -2410692 -1135451
38973 -1135451 -488681 -577357 -756151 -481759 159031 732695 1022685 1154014 1273116 1313298
38963 1313298 1111606 645490 101896 -263112 -350794 -320387 -376446 -415563 -59386 795518
38953 795518 1615301 1681202 845975 -399103 -1503445 -2144377 -2017386 -926261 665054
$$ packed form
39022a70879n84895J85183M28335l04425j041139p73033J04336N00274K11284
39013a444959n0350R7841K76064J28004j61333k88643k64338j95310P078M25126
39003a470820Q27908Q33147L63801k03504l93771j05454K92947L49729K1590k51026
38993B64547j4835O37296J048667O51767l31536r79277o25681L28500Q09462L30358
38983B119268m34757n59608r8734R936p38898j641490j584170l96620R14381J275241
38973a135451O46770q8676j78794K74392O40790N73664K89990J31329J19102M0182
38963A313298k01692m66116n43594l65008q7682L0407n6059l9117L56177Q54904
38953G95518Q19783O5901q35227j245078j104342o40932J26991J091125J591315
$$ plain form
38944 665054 1660787 1394257 439403 -66497 237292 712035 744944 473145 377319 611212
38934 611212 985764 1300427 1404962 1164493 682799 419949 751046 1449024 1922319 1981206
38924 1981206 2024520 2337418 2555522 2155765 1284191 665160 671547 888668 768021 357053
38914 357053 65091 -33165 -205835 -457476 -418529 30262 462843 513611 438912 694258
38904 694258 1175056 1350615 1117486 1051970 1654021 2664694 3353629 3287805 2630481 1850499
38894 1850499 1345696 1231191 1269182 1055636 472146 -78955 -86809 423178 859827 726165
38884 726165 119263 -508707 -893340 -1095821 -1224795 -1243749 -1071715 -740791 -404938 -235600
38874 -235600 -298206 -489654 -626397 -620290 -499947 -251707 179341 628621 706760 348241
$$ packed form
38944F65054R95733k66530r54854n05900L03789M74743L2909k71799r5826K33893
38934F11212L74552L14663J04535k40469m81694k62850L31097O97978M73295N8887
38924A981206M3314L12898K18104l99757q71574o19031O387K17121j20647m10968
38914C57053k91962r8256j72670k51641L8947M48791M32581N0768p4699K55346
38904F94258M80798J75559k33129o5516O02051J010673O88935o5824o57324p79982
38894A850499n04803j14505L7991k13546n83490n51101p854N09987M36649j33662
38884G26165o06902o27970l84633k02481j28974j8954J72034L30924L35853J69338
38874b35600o2606j91448j36743O107J20343K48240M31048M49280P8139l58519
$$ plain form
38864 348241 181099 893098 2228464 3109567 2931179 2263746 1941946 1879944 1336888 164749
38854 164749 -809990 -735270 337984 1578273 2121913 1650461 569142 -247032 -148390
38845 -148390 690310 1514482 1843613 1827783 1745087 1522918 931282 -44283 -1213669 -2311243
38835 -2311243 -2949738 -2750052 -1774841 -612447 193696 586660 715764 584827 286189
38826 286189 206422 523068 759219 377821 -351725 -668372 -425597 -250824 -539166 -907638
38816 -907638 -835421 -283826 565573 1623855 2575558 2766396 1944632 791671 191460
38807 191460 196748 218764 25162 -53761 169815 470702 735478 1173119 1782608 2110563
38797 2110563 1851952 1301449 875120 541546 135049 -79543 296330 1064133 1564373
$$ packed form
38864C48241j67142P11999J335366Q81103j78388o67433l21800o2002n43056j172139
38854A64749r74739P4720J073254J240289N43640m71452j081319q16174R8642
38845a48390Q38700Q24172L29131j5830q2696k22169n91636r75565j169386j097574
38835b311243o38495J99686R75211J162394Q06143L92964J29104j30937k98638
38826B86189p9767L16646K36151l81398p29546l16647K42775J74773k88342l68472
38816i07638P2217N51595Q49399J058282R51703J90838q21764j152961o00211
38807A91460N288K2016j93602p8923K23576L00887K64776M37641O09489L27955
38797B110563k58611n50503m26329l33574m06497k14592L75873P67803N00240
$$ plain form
38788 1564373 1586010 1615462 2008471 2386098 2158780 1298653 243516 -677336 -1307662 -1386415
38778 -1386415 -751789 189232 692862 501144 43078 -289879 -618823 -1104974 -1457851
38769 -1457851 -1332225 -932828 -774442 -994589 -1321351 -1606177 -1931620 -2209483 -2127604 -1603740
38759 -1603740 -956424 -526158 -388944 -456358 -545975 -375099 101075 330794 -334073 -1645080
38749 -1645080 -2523066 -2370582 -1746610 -1364943 -1055330 -366061 300258 42567 -1189884
38740 -1189884 -2410985 -2785811 -2309756 -1275942 126497 1422175 1815127 1073282 615
38731 615 -454930 -264106 -99101 -355164 -820570 -1120019 -1071345 -699707 -222510 47010
38721 47010 1706 -177664 -403149 -875040 -1620085 -2125589 -1871292 -1082158 -513774 -525820
$$ packed form
38788A564373K1637K9452L93009L77627k27318q60127j055137r20852o30326p8753
38778a386415O34626R41021N03630j91718m58066l32957l28944m86151l52877
38769a457851J25626L99397J58386k20147l26762k84826l25443k77863Q1879N23864
38759a603740O47316M30266J37214o7414q9617J70876M76174K29719o64867j311007
38749a645080q77986J52484O23972L81667L09613O89269O66319k57691j232451
38740a189884j221101l74826M76055J033814J402439J295678L92952p41845j072667
38731F15m55545J90824J65005k56063m65406k99449M8674L71638M77197K69520
38721D7010m5304j79370k25485m71891p45045n05504K54297P89134N68384j2046
$$ plain form
38711 -525820 -745537 -655126 -186017 309889 445516 157492 -152052 57156 803926 1450874
38701 1450874 1484009 1153674 965442 854472 442683 -113291 -259398 28165 211540 146723
38691 146723 265571 604283 500300 -321647 -1128560 -1214145 -898023 -828052 -876507 -558564
38681 -558564 -120014 -234915 -757541 -723949 264914 1424722 1807054 1359609 693841 252139
38671 252139 20044 -208368 -530352 -801454 -783719 -553938 -583897 -1089505 -1499829 -1089082
38661 -1089082 -60848 575019 242313 -655808 -1497917 -2106519 -2465851 -2462428 -2276556 -2435239
38651 -2435239 -2991952 -3139642 -2190947 -587294 616950 1000898 966327 909105 794486
38642 794486 488589 10751 -543605 -971988 -962087 -511111 -200957 -574997 -1338879 -1709716
$$ packed form
38711e25820k19717R0411M69109M95906J35627k88024l09544K09208P46770O46948
38701A450874L3135l30335j88232j10970m11789n55974j46107K87563J83375o4817
38691A46723J18848L38712j03983q21947q06913q5585L16122O9971m8455L17943
38681e58564M38550j14901n22626L3592R88863J159808L82332m47445o65768m41702
38671B52139k32095k28412l21984k71102J7735K29781k9959n05608m10324M10747
38661a089082J028234O35867l32706q98121q42109o08602l59332L423J85872j58683
38651b435239n56713j47690R48695J603653J204244L83948l4571n7222j14619
38642G94486l05897m77838n54356m28383R901M50976L10154l74040p63882l70837
$$ plain form
38632 -1709716 -1506977 -1284082 -1306229 -1068742 -138199 1063478 1747713 1693502 1285343 871539
38622 871539 530195 371795 643484 1420789 2404883 3134569 3346093 3113330 2668904 2099625
38612 2099625 1286658 231251 -680289 -984022 -698404 -311707 -180807 -237567 -353310
38603 -353310 -613643 -1018426 -1242208 -1011739 -519842 -191365 -224884 -603706 -1286814 -2027929
38593 -2027929 -2248630 -1577620 -429579 390329 598805 533431 458843 340910 293882 574658
38583 574658 957661 789959 8908 -522765 -179576 486933 581257 160221 -60322 51802
38573 51802 4763 -235180 -108245 417288 507070 -319278 -1344964 -1577644 -993404 -320089
38563 -320089 -16063 -51283 -365532 -885590 -1227775 -971972 -235104 425628 616894 296551
$$ packed form
38632a709716K02739K22895k2147K37487R30543J201677O84235n4211m08159m13804
38622H71539l41344j58400K71689P77305R84094P29686K11524k32763m44426n69279
38612B099625q12967j055407r11540l03733K85618L86697J30900n6760j15743
38603c53310k60333m04783k23782K30469M91897L28477l3519l78822o83108p41115
38593b027929k20701O71010J148041Q19908K08476o5374p4588j17933m7028K80776
38583E74658L83003j67702p81051n31673L43189O66509R4324m21036k20543J12124
38573E1802m7039k39943J26935N25533Q9782q26348j025686k32680N84240O73315
38563c20089L04026l5220l14249n20058l42185K55803P36868O60732J91266l20343
$$ plain form
38553 296551 -419409 -1176849 -1337211 -637735 180838 80235 -871843 -1461496 -885658 270748
38543 270748 931131 843065 535693 370135 213859 -53265 -196218 85805 724883 1261185
38533 1261185 1297309 1009763 1065385 1824506 2772971 3085827 2640189 2005493 1493541 850939
38523 850939 26021 -437911 -150883 494157 849877 764680 449663 57207 -169113 228133
38513 228133 1335028 2460553 2831766 2457149 1889041 1476275 1312216 1482242 1735115
38504 1735115 1317986 -83410 -1533689 -1825867 -1087945 -527419 -681943 -904698 -639269
38495 -639269 -171899 159015 544587 1064678 1295685 1069684 909687 1167834 1386603 1113033
38485 1113033 746375 889032 1341718 1483329 1294095 1244521 1386301 1293904 839024 374733
$$ packed form
38553B96551p15960p57440j60362O99476Q18573j00603r52078n89653N75838J156406
38543B70748O60383q8066l07372j65558j56276k67124j42953K82023O39078N36302
38533A261185L6124k87546N5622P59121R48465L12856m45638o34696n11952o42602
38523H50939q24918m63932K87028O45040L55720q5197l15017l92456k26320L97246
38513B28133J106895J125525L71213l74617n68108m12766j64059J70026K52873
38504A735115m17129j401396j450279k92178P37922N60526j54524k22755K65429
38495f39269M67370L30914L85572N20091K31007k26001j59997K58147K18769k73570
38485A113033l66658J42657M52686J41611j89234m9574J41780r2397m54880m64291
$$ plain form
38475 374733 137334 7969 -100536 -102208 -39942 -117797 -366094 -599598 -719641 -751802
38465 -751802 -621964 -235743 245152 547619 683185 858185 1042030 1043688 1018432 1402220
38455 1402220 2172019 2600679 2052442 778581 -350469 -764497 -641589 -561251 -919746
38446 -919746 -1642919 -2298961 -2452263 -1991056 -1190721 -499198 -228434 -335501 -441222 -160093
38436 -160093 500869 1149428 1472782 1557927 1645593 1736902 1637195 1275332 774203 285031
38426 285031 -55223 -88307 219386 634942 855935 813462 624756 348138 13217 -178798
38416 -178798 45384 717419 1597604 2420842 2983352 3080408 2658828 2032330 1651123 1579669
38406 1579669 1421508 828842 -94682 -929809 -1290978 -1031448 -333019 348934 637817
$$ packed form
38475C74733k37399j29365j08505j672O2266p7855k48297k33504j20043l2161
38465g51802J29838L86221M80895L02467J35566J75000J83845J658k5256L83788
38455A402220P69799M28660n48237j273861j129050m14028J22908Q0338l58495
38446i19746p23173o56042j53302M61207Q00335O91523K70764j07067j05721K81129
38436a60093O60962O48559L23354Q5145Q7666R1309r9707l61863n01129m89172
38426B85031l40254l3084L07693M15556K20993m2473j88706k76618l34921j92015
38416a78798K24182O72035Q80185Q23238N62510R7056m21580o26498l81207p1454
38406A579669j58161n92666r23524q35127l61169K59530O98429O81953K88883
$$ plain form
38397 637817 611232 664509 980334 1353354 1586948 1784181 2072239 2252842 2003011 1398517
38387 1398517 1021709 1417675 2455630 3327896 3298319 2455183 1594111 1340177 1593281
38378 1593281 1913984 2138488 2338992 2438048 2286371 2028137 1972329 2099020 2068641 1768052
38368 1768052 1503060 1565052 1891983 2221564 2325673 2092615 1668387 1465732 1645454 1649773
38358 1649773 806220 -531853 -1104372 -305492 969569 1497762 1241281 1074482 1346969
38349 1346969 1472634 934493 69632 -356424 -29622 599852 718618 -109420 -1409650
38340 -1409650 -2098834 -1560410 -300204 722607 1194724 1458038 1634212 1416603 813268
38331 813268 420997 616337 975015 930744 639306 680478 1126615 1450752 1309578 931555
$$ packed form
38397F37817k6585N3277L15825L73020K33594J97233K88058J80603k49831o04494
38387A398517l76808L95966J037955Q72266k9577q43136q61072k53934K53104
38378A593281L20703K24504K00504R9056j51677k58234n5808J26691l0379l00589
38368A768052k64992O1992L26931L29581J04109k33058m24228k02655J79722M319
38358A649773q43553j338073n72519P98880J275061N28193k56481j66799K72487
38349A346969J25665n38141q64861m26056L26802O29474J18766q28038j300230
38340a409650o89184N38424J260206J022811M72117K63314J76174k17609o03335
38331H13268l92271J95340L58678m4271k91438M1172M46137L24137j41174l78023
$$ plain form
38321 931555 669968 587680 604992 690585 725045 484882 -17012 -424113 -488108 -382019
38311 -382019 -314242 -114547 407368 912074 866960 375456 95137 224365 168147 -476011
38301 -476011 -1129297 -937906 65244 1063761 1527802 1586912 1400176 813671 -155686 -1006879
38291 -1006879 -1264476 -1026498 -748490 -699147 -842168 -1039994 -1130835 -967349 -620468 -424736
38281 -424736 -593701 -893618 -947258 -799564 -892883 -1427256 -2006225 -2106822 -1767704 -1547198
38271 -1547198 -1745943 -1906829 -1322321 50708 1483514 2318924 2587323 2616182 2394091
38262 2394091 1716076 754789 12250 -284213 -359650 -467959 -652367 -906614 -1135533 -914891
38252 -914891 179994 1772804 2667669 2009536 223639 -1472698 -2240480 -2029109 -1142183
$$ packed form
38321I31555k61587q2288J7312Q5593L4460k40163n01894m07101o3995J06089
38311c82019O7777J99695N21915N04706m5114m91504k80319J29228n6218o44158
38301d76011o53286J91391J003150R98517M64041N9110j86736n86505r69357q51193
38291a006879k57597K37978K78008M9343j43021j97826r0841J63486L46881J95732
38281d24736j68965k99917n3640J47694r3319n34373n78969j00597L39118K20506
38271a547198j98745j60886N84508J373029J432806Q35410K68399K8859k22091
38262B394091o78015r61287p42539k96463p5437j08309j84408k54247k28919K20642
38252i14891J094885J592810Q94865o58133j785897j696337p67782K11371Q86926
$$ plain form
38243 -1142183 83993 1174836 1540764 915489 -244018 -964438 -578473 553915 1335173
38234 1335173 1161427 644653 709383 1181757 969656 -287442 -1541426 -1724635 -1171607
38225 -1171607 -1012148 -1543690 -1943063 -1505454 -537992 110814 32309 -380258 -393973 263028
38215 263028 1017304 1017818 146303 -825244 -1208811 -1127255 -1000746 -761178 -74173 937117
38205 937117 1723474 1945814 1674320 1118227 576512 480197 996681 1667206 1856292 1491727
38195 1491727 1008452 724276 692421 998105 1689601 2481760 2975723 3107079 3001444 2584476
38185 2584476 1816544 1089447 785253 613176 65424 -595115 -594844 99335 628993 516732
38175 516732 291345 537900 1045522 1320230 1356435 1419556 1473844 1258721 682655 -107521
$$ packed form
38243a142183J226176J090843L65928o25275j159507p20420L85965J132388P81258
38234A335173j73746n16774O4730M72374k12101j257098j253984j83209N53028
38225a171607J59459n31542l99373M37609R67462O48806p8505m12567j3715O57001
38215B63028P54276N14q71515r71547l83567Q1556J26509K39568O87005J011290
38205I37117P86357K22340k71494n56093n41715r6315N16484O70525J89086l64565
38195A491727m83275k84176l1855L05684O91496P92159M93963J31356j05635m16968
38185B584476p67932p27097l04194j72077n47752o60539K71O94179N29658j12261
38175E16732k25387K46555N07622K74708L6205O3121N4288k15123n76066p90176
$$ plain form
38165 -107521 -797930 -975844 -535804 -69878 -298531 -982595 -1037704 29403 1459017
38156 1459017 2346882 2739586 3146824 3577101 3684690 3452957 3122834 2731746 2247524
38147 2247524 1912119 1973258 2255086 2354607 2069365 1411088 550984 -22687 201006 957124
38137 957124 1241023 575768 -317342 -618118 -551794 -760695 -1127198 -1080064 -623443 -123073
38127 -123073 600002 1937698 3417636 4010030 3568686 3026551 3001411 3063111 2620770 1776647
38117 1776647 1005919 605889 686676 1114909 1284049 574282 -724967 -1549351 -1350339
38108 -1350339 -664625 -177630 116648 493879 894892 1201513 1579523 2060710 2227371
38099 2227371 1787880 1072845 499729 -53850 -812728 -1396606 -1197850 -318958 459250
$$ packed form
38165a07521o90409j77914M40040M65926k28653o84064n5109J067107J429614
38156A459017Q87865L92704M07238M30277J07589k31733l30123l91088m84222
38147B247524l35405O1139K81828R9521k85242o58277q60104n73671K23693P56118
38137I57124K83899o65255q93110l00776O6324k08901l66503M7134M56621N00370
38127a23073P23075J337696J479938N92394m41344n42135k5140O1700m42341q44123
38117A776647p70728m00030Q0787M28233J69140p09767j299249q24384J99012
38108a350339O85714M86995K94278L77231M01013L06621L78010M81187J66661
38099B227371m39491p15035n73116n53579p58878n83878J98756Q78892P78208
$$ plain form
38090 459250 640325 468491 384878 449070 438738 234122 -76847 -346673 -486481 -456760
38080 -456760 -222218 189859 558447 562250 187895 -91847 174139 823380 1322051 1498346
38070 1498346 1600600 1687713 1537641 1251020 1321200 1842338 2213099 1976371 1439112 1064830
38060 1064830 779410 402247 288327 858724 1773721 2259677 2136152 1917200 1973297 2170240
38050 2170240 2307467 2348639 2178824 1650554 951011 464248 195772 -213193 -813839 -1157944
38040 -1157944 -914397 -240742 605958 1548705 2335629 2392626 1485247 274821 -230991
38031 -230991 272091 1156793 1602874 1315576 588583 -56309 -241513 56354 546617 897558
38021 897558 998754 990770 1112402 1498941 1985591 2091392 1416983 201062 -704191 -653374
$$ packed form
38090D59250J81075j71834q3613O4192j0332k04616l10969k69826j39808K9721
38080d56760K34542M12077L68588L803l74355k79742K65986O49241M98671J76295
38070A498346J02254Q7113j50072k86621P0180N21138L70761k36728n37259l74282
38060A064830k85420l77163j13920N70397R14997M85956j23525k18952N6097J96943
38050B170240J37227M1172j69815n28270o99543m86763k68476m08965o00646l44105
38040a157944K43547O73655Q46700R42747P86924N6997r07379j210426n05812
38031b30991N03082Q84702M46081k87298p26993o44892j85204K97867M90263L50941
38021H97558J01196p984J21632L86539M86650J05801o74409j215921r05253N0817
$$ plain form
38011 -653374 71948 601842 508080 211694 282429 637522 715747 289301 -269630 -561506
38001 -561506 -638137 -722694 -752432 -529988 -159291 63717 153481 425475 933801 1334974
37991 1334974 1474374 1699748 2290030 2888171 2881415 2158996 1143114 223713 -476455 -906369
37981 -906369 -1058302 -1066825 -947868 -318598 1135628 2894997 3857230 3566067 2735734 2286162
37971 2286162 2288420 2235945 1958855 1707176 1519906 1135751 590218 370604 750838 1343567
37961 1343567 1582601 1377131 991400 506127 -181331 -867500 -990550 -257805 913876
37952 913876 1784883 1988431 1702136 1295906 1025613 969311 1017516 944950 681907 470010
37942 470010 544918 743865 720719 504331 454087 606091 516419 -24639 -532264 -431981
$$ packed form
38011f53374P25322N29894r3762k96386P0735L55093P8225m26446n58931k91876
38001e61506p6631q4557k9738K22444L70697K23008Q9764K71994N08326M01173
37991A334974J39400K25374N90282N98141o756p22419j015882r19401p00168m29914
37981i06369j51933q523J18957O29270J454226J759369R62233k91163q30333m49572
37971B286162K258n2475k77090k51679j87270l84155n45533k19614L80234N92729
37961A343567K39034k05470l85731m85273o87458o86169j23050P32745J171681
37952I13876Q71007K03548k86295m06230k70293n6302M8205p2566k63043k11897
37942D70010P4908J98947k3146k16388n0244J52004q9672n41058n07625J00283
$$ plain form
37932 -431981 163263 642857 620877 87480 -903190 -2170830 -3143809 -3216593 -2455072 -1545848
37922 -1545848 -1010371 -867339 -1052742 -1605922 -2256910 -2365224 -1636912 -574634 102781
37913 102781 228122 127508 120094 399276 1104247 2082347 2768193 2731262 2253531 1982391
37903 1982391 2079568 2094123 1648593 871161 127072 -316665 -301879 185842 859009 1282175
37893 1282175 1309487 1138215 865591 317390 -521292 -1217015 -1296568 -759111 34828 794147
37883 794147 1386230 1705665 1784369 1922307 2365831 2883324 2982034 2568389 2078813 1871986
37873 1871986 1781674 1417703 670484 -266528 -1186955 -1964171 -2459022 -2547681 -2241996 -1687594
37863 -1687594 -1070438 -559631 -243480 -59530 125762 355766 638377 1115523 1880980
$$ packed form
37932d31981N95244M79594k1980n33397r90670j267640r72979p2784P61521R09224
37922a545848N35477J43032j85403n53180o50988j08314P28312J062278O77415
37913A02781J25341j00614p414K79182P04971R78100O85846l6931m77731k71140
37903A982391R7177J4555m45530p77432p44089m43737J4786M87721O73167M23166
37893A282175K7312j71272k72624n48201q38682o95723p9553N37457P93939P59319
37883G94147N92083L19435P8704J37938M43524N17493R8710m13645m89576k06827
37873A871986r0312l63971p47219r37012r20427p77216m94851q8659L05685N54402
37863a687594O17156N10807L16151J83950J85292K30004K82611M77146P65457
$$ plain form
37854 1880980 2597433 2719579 2294956 2073117 2438905 2700765 2042830 847290 303106
37845 303106 843453 1791835 2538890 3129710 3482412 3049169 1822521 839212 927007 1568384
37835 1568384 1780730 1556271 1531670 1720641 1676779 1647127 2331770 3455299 3798148 2971983
37825 2971983 2045854 1878365 1861774 1114610 85658 -62565 789439 1612388 1734550
37816 1734550 1538491 1585682 1824808 1929921 1878172 1865141 1939403 1954772 1745154 1285019
37806 1285019 821100 787385 1343338 2042488 2258364 1936658 1609165 1625521 1716230 1458882
37796 1458882 898628 503019 654581 1326327 2124976 2548545 2349132 1771672 1325965
37787 1325965 1220249 1147459 760816 227488 89611 584635 1296750 1570324 1173952 477564
$$ packed form
37854A880980P16453J22146m24623k21839L65788K61860o57935j195540n44184
37845C03106N40347R48382P47055N90820L52702m33243j226648r83309Q7795O41377
37835A568384K12346k24459k4601J88971m3862k9652O84643J123529L42849q26165
37825B971983r26129j67489j6591p47164j028952j48223Q52004Q22949J22162
37816A734550j96059M7191K39126J05113n1749j3031P4262J5369k09618m60135
37806A285019m63919l3715N55953O99150K15876l21706l27493J6356R0709k57348
37796A458882n60254l95609J51562O71746P98649M23569j99413n77460m45707
37787A325965j05716p2790l86643n33328j37877M95024P12115K73574l96372o96388
$$ plain form
37777 477564 54283 229221 979355 2077366 3205539 4018353 4258528 3866384 2988793
37768 2988793 1968012 1309631 1384030 1933482 2102158 1342160 199495 -229796 387111
37759 387111 1334368 1930627 2283918 2679873 2833643 2328376 1422789 789145 642577 718486
37749 718486 954705 1527687 2236710 2551308 2414667 2363653 2617619 2667359 2129100 1425354
37739 1425354 1091135 877538 245278 -508286 -423453 752886 2078086 2584060 2395911
37730 2395911 2272867 2463027 2608234 2594542 2785794 3244081 3325304 2507599 1277283 636817
37720 636817 842043 1175359 1023540 636182 576746 885933 1186904 1321224 1435141 1582100
37710 1582100 1660555 1711290 1926095 2339334 2765121 3028489 3037797 2697890 2027468 1328940
$$ packed form
37777D77564m23281J74938P50134J098011J128173Q12814K40175l92144q77591
37768B988793j020781o58381P4399N49452J68676p59998j142665m29291O16907
37759C87111R47257N96259L53291L95955J53770n05267r05587o33644j46568P5909
37749G18486K36219N72982P09023L14598j36641n1014K53966M9740n38259p03746
37739A425354l34219k13597o32260p53564Q4833J176339J325200N05974j88149
37730B395911j23044J90160J45207j3692J91252M58287Q1223q17705j230316o40466
37720F36817K05226L33316j51819l87358n9436L09187L00971J34320J13917J46959
37710A582100P8455N0735K14805M13239M25787K63368R308l39907o70422o98528
$$ plain form
37700 1328940 973277 1024383 1281421 1593262 1866196 1902280 1611483 1312627 1412235 1807624
37690 1807624 2028831 1962375 1960985 2188592 2364432 2288806 2137178 2066415 2015848 2091081 2611850
37679 2611850 3482412 4016497 3758475 3046474 2404755 1845354 1200272 676006 544052
37670 544052 667459 870048 1371163 2242848 2853440 2620983 2004158 1882288 2181819 2111787
37660 2111787 1674599 1786152 2668589 3266866 2802665 1933706 1639558 1763397 1559297
37651 1559297 1094232 1071639 1552964 1881406 1850980 2014731 2644643 3186003 3105802 2694975
37641 2694975 2616919 3066666 3761977 4452119 5024662 5278912 4977396 4134242 3075246
37632 3075246 2229039 1898547 2066881 2328672 2220815 1766558 1462762 1542323 1547115 985290
$$ packed form
37700A328940l55663N1106K57038L11841K72934L6084k90797k98856R9608L95389
37690A807624K21207o6456j390K27607J75840p5626j51628p0763n0567P5233N20769
37679B611850Q70562N34085k58022p12001o41719n59401o45082n24266j31954
37670E44052J23407K02589N01115Q71685O10592k32457o16825j21870K99531p0032
37660B111787m37188J11553Q82437N98277m64201q68959k94148J23839k04100
37651A559297m65065k2593M81325L28442l0426J63751O29912N41360q0201m10827
37641B694975p8056M49747O95311O90142N72543K54250l01516q43154j058996
37632C075246q46207l30492J68334K61791j07857m54257l03796P9561M792n61825
$$ plain form
37622 985290 175446 -72639 443526 1095138 1392231 1580286 1935545 2009436 1204227 -148237
37612 -148237 -978311 -766798 -26345 630806 1246184 1963253 2305093 1666586 283370
37603 283370 -929628 -1442841 -1444024 -1136388 -388321 706145 1539846 1685078 1456164 1361168
37593 1361168 1356580 1133582 845295 957613 1517732 2146789 2677617 3176395 3343618 2651767
37583 2651767 1316138 395778 449948 687257 83069 -1111411 -1768492 -1553420 -1283381
37574 -1283381 -1531192 -1753089 -1247315 -326707 130573 -9177 36112 817541 1899388
37565 1899388 2478377 2387208 2109339 1924332 1486472 476411 -614066 -835248 12518
37556 12518 1002098 1251713 1091671 1485446 2479346 2992759 2304536 1042423 305007 368715
$$ packed form
37622I85290q09844k48085N16165O51612K97093J88055L55259P3891q05209j352464
37612a48237q30074K11513P40453O57151O15378P17069L41840o38507j383216
37603B83370j212998n13213j183L07636P48067J094466Q33701J45232k28914r4996
37593A361168m588k22998k88287J12318N60119O29057N30828M98778J67223o91851
37583B651767j335629r20360N4170K37309o04188j194480o57081K15072K70039
37574a283381k47811k21897N05774R20608M57280j39750M5289P81429J081847
37565A899388N78989r1169k77869j85007m37860j010061j090477k21182Q47766
37556A2518R89580K49615j60042L93775R93900N13413o88223j262113p37416O3708
$$ plain form
37546 368715 778397 1244291 1776399 2210823 2332554 2388229 2801653 3371698 3430894 2916093
37536 2916093 2587149 2899888 3309777 3163163 2772935 2990192 3958707 4892069 5035683
37527 5035683 4369368 3342172 2366334 1738488 1732435 2464954 3671992 4717321 4906636
37518 4906636 3959742 2320457 913595 386863 556674 708497 424084 -29197 -124344
37509 -124344 304650 985938 1637971 2263920 2945926 3500250 3575664 3145493 2689167 2698434
37499 2698434 3101993 3355127 3020724 2099699 930901 37566 -45153 809371 2026367
37490 2026367 2799794 2936478 2935263 3200232 3567267 3702225 3527344 3072484 2349832 1624110
37480 1624110 1348602 1503794 1465301 960608 692713 1416237 2745537 3581522 3519431 3099263
$$ packed form
37546C68715M09682M65894N32108M34424J21731N5675M13424N70045N9196n14801
37536B916093l28944L12739M09889j46614l90228K17257R68515R33362J43614
37527E035683o66315j027196r75838o27846o053P32519J207038J045329J89315
37518D906636r46894j639285j406862n26732J69811J51823k84413m53281r5147
37509a24344M28994O81288O52033O25949O82006N54324P5414m30171m56326R267
37499B698434M03559K53134l34403r21025j168798q93335q2719Q54524J216996
37490B026367P73427J36684j215K64969L67035J34958j74881m54860p22652p25722
37480A624110k75508J55192l8493n04693k67895P23524J329300Q35985o2091m20168
$$ plain form
37470 3099263 2757943 2358765 1895895 1876151 2600220 3594016 4174944 4239468 4158608 4208607
37460 4208607 4434417 4796810 5091824 4922306 4116049 3073357 2383512 2144549 1947339
37451 1947339 1533765 1192733 1378936 2093608 2816225 3049064 2804658 2469381 2280133
37442 2280133 2144107 1996391 2057189 2523447 3176330 3552181 3435406 2997506 2551968 2349642
37432 2349642 2448266 2546373 2152582 1253872 613748 953338 1953275 2579577 2370613 1863770
37422 1863770 1708229 1949915 2378415 2999959 3797168 4423457 4541182 4255103 3940351
37413 3940351 3815591 3846177 3843271 3532163 2784349 1879559 1235334 836063 367175 -15186
37403 -15186 328090 1470186 2481313 2545012 2021098 1800875 1995640 1981916 1558507 1311819
$$ packed form
37470C099263l41320l99178m62870j9744P24069R93796N80928O4524q0860M9999
37460D208607K25810L62393K95014j69518q06257j042692o89845k38963j97210
37451A947339m13574l41032J86203P14672P22617K32839k44406l35277j89248
37442B280133j36026j47716O0798M66258O52883L75851j16775m37900m45538k02326
37432B349642R8624R8107l93791q98710o40124L39590R99937O26302k08964n06843
37422A863770j55541K41686M28500O21544P97209O26289J17725k86079l14752
37413C940351j24760L0586k906l11108p47814r04790o44225l99271m68888l82361
37403a5186L43276J142096J011127O3699n23914k20223J94765j3724m23409k46688
$$ plain form
37393 1311819 1750005 2625353 3290095 3389334 3090583 2850824 2987148 3328074 3381025 2997372
37383 2997372 2653005 2810333 3251107 3415652 3203670 2994939 2990398 2993829 2835904 2623312
37373 2623312 2539701 2686317 3078526 3541916 3742723 3617977 3571510 3863458 4077242 3758895
37363 3758895 3369154 3825712 5068435 5875268 5379529 4111003 3163618 2913195 3038628
37354 3038628 3320444 3767424 4176928 4221108 4016166 4118791 4770305 5453984 5474893 4888457
37344 4888457 4589335 5334920 6786597 7773641 7588901 6769236 6365405 6651550 6930835
37335 6930835 6548687 5672349 4946915 4700017 4702131 4570818 4246446 4068388 4370582 4994718
37325 4994718 5377004 5250313 5030490 5240561 5770986 6087621 5998842 5743490 5416045 4869637
$$ packed form
37393A311819M38186Q75348O64742R9239k98751k39759J36324L40926N2951l83653
37383B997372l44367J57328M40774J64545k11982k08731m541L431j57925k12592
37373B623312q3611J46616L92209M63390K00807j24746m6467K91948K13784l18347
37363C758895l89741M56558J242723Q06833m95739j268526r47385k50423J25433
37354C038628K81816M46980M09504M4180k04942J02625O51514O83679K0909n86436
37344D888457k99122P45585J451677R87044j84740q19665m03831K86145K79285
37335F930835l82148q76338p25434k46898K114j31313l24372j78058L02194O24136
37325D994718L82286j26691k19823K10071N30425L16635q8779k55352l27445n46408
$$ plain form
37315 4869637 4253325 4103016 4684518 5628691 6394423 6770262 6816208 6689706 6671218 6999343
37305 6999343 7530095 7878171 7957093 7968085 7800871 7008355 5602036 4349161 3967615
37296 3967615 4462432 5511037 6944943 8440645 9287065 9082312 8354633 7946655 8022766
37287 8022766 8158242 8111984 7950172 7654545 7243353 7135964 7740139 8714465 9284701 9336591
37277 9336591 9538622 10211910 10732894 10436839 9609991 9060159 8973717 8769137 8086177 7436137
37267 7436137 7618311 8720464 9995143 10692094 10749816 10590971 10507754 10487975 10461384 10377157
37257 10377157 10111786 9670834 9476938 10040246 11231912 12257738 12498688 12041384 11283579
37248 11283579 10476958 9872214 9823451 10375971 11110769 11726535 12385186 13125766 13411595
$$ packed form
37315D869637o16312j50309N81502R44173P65732L75839M5946j26502j8488L28125
37305F999343N30752L48076P8922J0992j67214p92516j406319j252875l81546
37296C967615M94817J048605J433906J495702Q46420k04753p27679m07978P6111
37287H022766J35476m6258j61812k95627m11192j07389O04175R74326N70236N1890
37277I336591K02031O73288N20984k96055q26848n49832q6442k04580o82960o50040
37267G436137J82174J102153J274679O96951N7722j58845q3217j9779k6591q4227
37257A0377157k65371m40952j93896N63308J191666J025826K40950m57304p57805
37248A1283579q06621o04744m8763N52520P34798O15766O58651P40580K85829
$$ plain form
37239 13411595 12814241 11811125 11304151 11545830 12058855 12390256 12396940 12023324 11440798
37230 11440798 11262404 11956052 13101112 13840622 14003851 14145884 14567125 15060246 15639140
37221 15639140 16643412 17887173 18540892 18293132 17948240 18343206 19192187 19559703 19108303
37212 19108303 18352788 17933842 18098168 18709192 19380103 19734053 19813402 20034187 20489062
37203 20489062 20610004 19924528 18916685 18647737 19556810 21025954 22172669 22776900 23335714
37194 23335714 24387274 25896968 27298740 28128791 28532051 29010437 29786583 30713879 31739340
37185 31739340 32969420 34169987 34764704 34686647 34777281 35858214 37730100 39595911 41172537
37176 41172537 42733085 44217830 45104415 45320378 45606388 46624310 48202130 49865791
$$ packed form
37239A3411595n97354j003116n06974K41679N13025L31401O684l73616n82526
37230A1440798j78394O93648J145060P39510J63229J42033M21241M93121N78894
37221A5639140J004272J243761O53719k47760l44892L94966Q48981L67516m51400
37212A9108303p55515m18946J64326O11024O70911L53950P9349K20785M54875
37203B0489062J20942o85476j007843k68948R09073J469144J146715O04231N58814
37194B3335714J051560J509694J401772Q30051M03260M78386P76146R27296J025461
37185C1739340J230080J200567N94717p8057R0634J080933J871886J865811J576626
37176D1172537J560548J484745Q86585K15963K86010J017922J577820J663661
$$ plain form
37168 49865791 51700506 54139094 57114121 60021948 62564945 65133628 68185343 71640980
37160 71640980 75150698 78640731 82261484 86013854 89818093 93828557 98261131 102980941
37152 102980941 107767643 113018535 119560983 127498884 135861710 143912463 152311112 162269087
37144 162269087 173832638 185820803 197430820 209102625 221638506 235253940 249896290
37137 249896290 265834008 283261773 301602701 319813032 337394063 354750684 372491329
37130 372491329 390532336 407883221 423242726 435867829 445855446 453457529 458258468
37123 458258468 459388792 456523331 450197000 441034803 429209608 414928143 398905121
37116 398905121 381860467 363906230 344963526 325540477 306525102 288312159 270691570
$$ packed form
37168D9865791J834715K438588K975027K907827K542997K568683L051715L455637
37160G1640980L509718L490033L620753L752370L804239M010464M432574M719810
37152A02980941M786702N250892O542448P937901Q362826Q050753Q398649R957975
37144A62269087J1563551J1988165J1610017J1671805J2535881J3615434J4642350
37137B49896290J5937718J7427765J8340928J8210331J7581031J7356621J7740645
37130C72491329J8041007J7350885J5359505J2625103R987617P602083M800939
37123D58258468J130324k865461o326331r162197j1825195j4281465j6023022
37116C98905121j7044654j7954237j8942704j9423049j9015375j8212943j7620589
$$ plain form
37109 270691570 253624261 237606831 223076669 209814426 197199029 184918119 173259457
37102 173259457 162730551 153452926 144965245 136686604 128520984 120795418 113622919 106741225
37094 106741225 100185324 94640144 90590859 87372053 83715354 79259685 74917337 71561744
37086 71561744 68906929 66057860 62741640 59443423 56512771 53767176 51096581 48893526
37078 48893526 47466080 46338464 44677550 42374112 40199635 38790450 37970910 37307027
37070 37307027 36789060 36492923 36011216 34929390 33679635 33154812 33408193 33414234 32324563
37061 32324563 30404595 28495539 27068618 26104900 25455208 24950138 24418595 23822687 23154591
37052 23154591 22198421 20834063 19586988 19241143 19734990 20109427 19813004 19348699 19270767
$$ packed form
37109B70691570j7067309j6017430j4530162j3262243j2615397j2280910j1658662
37102A73259457j0528906r277625q487681q278641q165620p725566p172499o881694
37094A06741225o555901n545180m049285l218806l656699m455669m342348l355593
37086G1561744k654815k849069l316220l298217k930652k745595k670595k203055
37078D8893526j427446j127616j660914k303438k174477j409185q19540o63883
37070C7307027n17967k96137m81707j081826j249755n24823K53381O041j089671
37061C2324563j919968j909056j426921r63718o49692n05070n31543n95908o68096
37052B3154591r56170j364358j247075l45845M93847L74437k96423m64305p7932
$$ plain form
37043 19270767 19317844 19077826 18770608 18680113 18455768 17762873 17088403 17079214 17534140 17861132
37033 17861132 18060272 18361402 18365647 17618147 16689559 16502685 16747353 16215484 14778866
37024 14778866 13804894 14277198 15524787 16224550 15820637 14575966 13021278 11806772 11449802
37015 11449802 11780260 12073035 11943956 11639498 11386659 11095340 10762702 10445939 9791526
37006 9791526 8457943 7099768 6913727 7961810 9017013 9405227 9764455 10403004 10286854
36997 10286854 8747112 7074389 6992706 8214319 8953407 8511718 7904303 7937012 8037069
36988 8037069 7376812 6136417 5109365 4696529 4760877 5046435 5326685 5373093 5088450
36979 5088450 4618005 4231426 4136964 4381445 4862024 5482893 6265641 7120797 7622723 7451504
$$ packed form
37043A9270767M7077k40018l07218r0495k24345o92895o74470r189M54926L26992
37033A7861132J99140L01130M245p47500r28588j86874K44668n31869j436618
37024A4778866r73972M72304J247589O99763m03913j244671j554688j214506l56970
37015A1449802L30458K92775j29079l04458k52839k91319l32638l16763o54413
37006I791526j333583j358175j86041J048083J055203L88214L59228O38549j16150
36997A0286854j539742j672723q1683J221613P39088m41689o07415L2709J00057
36988H037069o60257j240395j027052m12836O4348K85558K80250M6408k84643
36979E088450m70445l86579r4462K44481M80579O20869P82748Q55156N01926j71219
$$ plain form
36969 7451504 7047851 7208788 7878625 8078703 7393934 6725763 6949611 7570243 7570829 7016459
36959 7016459 6793018 7114563 7377419 7364884 7534369 8037880 8412260 8432958 8451531 8667307
36949 8667307 8818487 8833875 9066028 9587549 9933531 9875783 9815627 10020487 10066434 9520152
36939 9520152 8696400 8219140 8178878 8226571 8237223 8353937 8483320 8221267 7343361 6097672
36929 6097672 4964245 4291700 4167607 4469000 4960915 5420895 5772048 6136801 6680785
36920 6680785 7278818 7420206 6733872 5640831 5108157 5566195 6427284 6916604 6946402
36911 6946402 6781762 6314592 5319935 4162210 3524873 3495028 3526013 3272851 2884806 2508694
36901 2508694 2114222 1821958 1801960 1822529 1508987 1067493 1077330 1498847 1624368 1185375
$$ packed form
36969G451504m03653J60937O69837K00078o84769o68171K23848O20632N86n54370
36959G016459k23441L21545K62856j2535J69485N03511L74380K0698J8573K15776
36949H667307J51180J5388K32153N21521L45982n7748o0156K04860M5947n46282
36939I520152q23752m77260m0262M7693J0652J16714J29383k62053q77906j245689
36929F097672j133427o72545j24093L01393M91915M59980L51153L64753N43984
36920F680785N98033J41388o86334j093041n32674M58038Q61089M89320K9798
36911F946402j64640m67170r94657j157725o37337k9845L0985k53162l88045l76112
36901B508694l94472k92264j9998K0569l13542m41494R837M21517J25521m38993
$$ plain form
36891 1185375 778402 944474 1533318 2263481 3167311 4085889 4451765 4094728 3636275
36882 3636275 3539007 3372395 2650285 1826829 1687721 2150595 2471579 2399274 2346232 2542827
36872 2542827 2781987 3020602 3544473 4378283 5064396 5233217 5023217 4774796 4596233
36863 4596233 4366956 3965304 3410041 2908600 2741243 2942113 3169374 3090095 2822999 2779146
36853 2779146 3104734 3491660 3538323 3152327 2613521 2337066 2524190 2970735 3267150 3175350
36843 3175350 2699294 1904735 983176 435291 733051 1706981 2709021 3474038 4269944
36834 4269944 5035416 5088072 4114718 2789832 1836182 1082508 150773 -535544 -384568
36825 -384568 152318 110714 -435983 -517273 46586 354976 113555 326612 1611064 2908475
$$ packed form
36891A185375m06973J66072N88844P30163R03830R18578L65876l57037m58453
36882C636275r7268j66612p22110q23456j39108M62874L20984p2305n3042J96595
36872B542827K39160K38615N23871Q33810O86113J68821k10000k48421j78563
36863D596233k29277m01652n55263n01441j67357K00870K27261p9279k67096m3853
36853B779146L25588L86926M6663l85996n38806k76455J87124M46545K96415r1800
36843C175350m76056p94559r21559n47885K97760R73930J002040P65017P95906
36834D269944P65472N2656r73354j324886r53650p53674r31735o86317J50976
36825c84568N36886m1604n46697q1290N63859L08390k41421K13057J284452J297411
$$ plain form
36815 2908475 2907765 2025509 1781913 2533525 3031987 2328451 1090986 632374 1343951 2574187
36805 2574187 3560917 3950390 3688470 2955505 2172760 1684219 1407821 1062951 687245
36796 687245 590403 798500 953737 900489 962991 1364450 1735031 1630974 1306286 1429049
36786 1429049 2079716 2573119 2397889 1879067 1697415 2095688 2770406 3253905 3198135 2542366
36776 2542366 1589569 692384 -213147 -1385899 -2474292 -2493172 -1016383 1049929 2429204
36767 2429204 2901013 3155968 3439793 3135488 1868361 378482 -193097 334453 962836
36758 962836 738162 -44033 -132492 1139555 2935627 3880494 3709806 3359573 3442220 3431003
36748 3431003 2692191 1570769 811123 443432 10675 -442923 -417197 163769 857865
$$ packed form
36815B908475p10q82256k43596P51612M98462p03536j237465m58612P11577J230236
36805B574187R86730L89473k61920p32965p82745m88541k76398l44870l75706
36796F87245r6842K08097J55237n3248O2502M01459L70581j04057l24688J22763
36786A429049O50667M93403j75230n18822j81652L98273O74718M83499n5770o55769
36776B542366r52797q97185r05531j172752j088393j8880J476789K066312J379275
36767B429204M71809K54955K83825l04305j267127j489879n71579N27550O28383
36758I62836k24674p82195q8459J272047J796072R44867j70688l50233Q2647j1217
36748C431003p38812j121422p59646l67691m32757m53598K5726N80966O94096
$$ plain form
36739 857865 1439451 2057903 2674649 2981107 2927847 2783895 2650009 2436470 2284517 2423431
36729 2423431 2627161 2429516 1881531 1454978 1198140 718592 68339 -162938 164058
36720 164058 454139 378606 389608 850711 1394345 1620717 1741891 1966095 1889123 1205430
36710 1205430 542540 819885 2026787 3279837 3918250 3989533 3800179 3512897 3154454
36701 3154454 2680881 2118211 1809668 2194679 3069424 3501099 2915423 1881723 1317216
36692 1317216 1294642 1245911 1014559 958837 1157767 1269327 1216070 1366716 1894597 2443161
36682 2443161 2570435 2189031 1551032 1116899 1325905 2065116 2495586 1962154 1028748
36673 1028748 980591 2207131 3685604 4252420 3809382 3003249 2279388 1698404 1291159
$$ packed form
36739H57865N81586O18452O16746L06458n3260j43952j33886k13539j51953J38914
36729B423431K03730j97645n47985m26553k56838m79548o50253k31277L26996
36720A64058K90081p5533J1002M61103N43634K26372J21174K24204p6972o83693
36710A205430o62890K77345J206902J253050O38413P1283j89354k87282l58443
36701C154454m73573n62670l08543L85011Q74745M31675n85676j033700n64507
36692A317216k2574m8731k31352n5722J98930J11560n3257J50646N27881N48564
36682B443161J27274l81404o37999m34133K09006P39211M30470n33432r33406
36673A028748m8157J226540J478473N66816m43038q06133p23861n80984m07245
$$ plain form
36664 1291159 1068028 823899 342575 -241592 -555243 -426076 -16239 436973 833953
36655 833953 1177770 1470490 1699049 1900715 2205492 2717090 3280011 3494368 3153294 2593503
36645 2593503 2373671 2619913 2936488 2980076 2845826 2795775 2864362 2903447 2855663 2820579
36635 2820579 2931706 3248875 3669080 3890736 3613388 2863934 1994601 1270912 626556
36626 626556 -18892 -365155 33017 1089208 2022762 2107352 1476376 915434 868057 998984
36616 998984 896776 803926 1217581 2026576 2645968 2934937 3288885 3715584 3610586 2838645
36606 2838645 2288447 2694897 3494909 3674347 3330700 3420133 4140799 4634692 4420695 4136252
36596 4136252 4491574 5300743 6015548 6528081 6892717 6836920 6211031 5536407 5448564 5825902
$$ packed form
36664A291159k23131k44129m81324n84167l13651J29167M09837M53212L96980
36655H33953L43817K92720K28559K01666L04777N11598N62921K14357l41074n59791
36645B593503k19832K46242L16575M3588j34250n0051O8587L9085m7784l5084
36635B820579J11127L17169M20205K21656k77348p49454q69333p23689o44356
36626F26556o45448l46263L98172J056191R33554Q4590o30976n60942m7377J30927
36616I98984j02208r2850M13655Q08995O19392K88969L53948M26699j04998p71941
36606B838645n50198M06450Q00012J79438l43647Q9433P20666M93893k13997k84443
36596D136252L55322Q09169P14805N12533L64636n5797o25889o74624q7843L77338
$$ plain form
36586 5825902 6054576 5968579 5926042 6061222 6100578 5974770 6018003 6344944 6494661 6000371
36576 6000371 5012399 4059923 3407243 2942594 2553540 2270650 2064780 1829849 1654315
36567 1654315 1827270 2402106 2996560 3290980 3531428 4151371 4971350 5251934 4641773
36558 4641773 3608767 2714410 1932022 1053810 343624 238895 658569 1161674 1612637
36549 1612637 2114303 2437463 2209483 1662655 1483007 1784651 1911880 1477028 926813
36540 926813 746172 721663 446761 50565 -78872 86853 341169 641082 923855 857949
36530 857949 282546 -353902 -478827 -120320 281053 547373 789993 1003395 1150212 1440829
36520 1440829 1952660 2136050 1375897 46895 -657970 -133560 923405 1433888 1152871
$$ packed form
36586E825902K28674q5997m2537J35180L9356j25808M3233L26941J49717m94290
36576F000371r87972r52476o52680m64649l89054k82890k05870k34931j75534
36567A654315J72955N74836N94454K94420K40448O19943Q19979K80584o10161
36558D641773j033006q94357p82388q78212p10186j04729M19674N03105M50963
36549A612637N01666L23160k27980n46828j79648L01644J27229m34852n50215
36540I26813j80641k4509k74902l96196j29437J65725K54316K99913K82773o5906
36530H57949n75403o36448j24925L58507M01373K66320K42620K13402J46817K90617
36520A440829N11831J83390p60153j329002p04865N24410J056965N10483k81017
$$ plain form
36511 1152871 694749 628503 846920 799011 255931 -214478 237334 1616207 2812382
36502 2812382 2834807 2031011 1565872 1908422 2480229 2686735 2523094 2078493 1249685 261017
36492 261017 -225230 43764 495776 590655 566641 842123 1193675 1182334 1018255 1251740
36482 1251740 1790552 1973511 1591558 1118118 835617 454532 -127849 -364867 133945
36473 133945 809786 826143 325052 310103 1204400 2178592 2261079 1619836 1183299 1276737
36463 1276737 1377001 1243331 1442908 2263065 2761693 1770822 -359887 -1916985 -1861903
36454 -1861903 -947605 -468959 -600688 -575982 -47779 497537 587884 369478 231119 273022
36444 273022 351725 391010 469770 713499 1154495 1613606 1772251 1514933 1138051 1026040
$$ packed form
36511A152871m58122o6246K18417m7909n43080m70409M51812J378873J196175
36502B812382K2425q03796m65139L42550N71807K06506j63641m44601q28808r88668
36492B61017m86247K68994M52012R4879k4014K75482L51552j1341j64079K33485
36482A251740N38812J82959l81953m73440k82501l81085n82381k37018M98812
36473A33945O75841J6357n01091j4949Q94297R74192Q2487o41243m36537R3438
36463A276737J00264j33670J99577Q20157M98628r90871k130709j557098N5082
36454a861903R14298M78646j31729K4706N28203N45316R0347k18406j38359M1903
36444B73022P8703L9285P8760K43729M40996M59111J58645k57318l76882j12011
$$ plain form
36434 1026040 1170162 1220031 974429 598565 388646 555836 1179505 2032078 2428792 1677004
36424 1677004 -74522 -1693483 -2067446 -1175207 -10848 422514 -115227 -1137133 -1917084
36415 -1917084 -1966054 -1319470 -478384 56379 237010 330601 337396 -161475 -1349586 -2576869
36405 -2576869 -2840099 -1932255 -736814 -148381 -34798 318645 973343 1186430 565393
36396 565393 -282378 -627133 -634314 -936430 -1488197 -1525239 -641466 681256 1727389 2230776
36386 2230776 2244602 1823197 1140197 563435 258109 -60933 -672119 -1323531 -1479787 -990945
36376 -990945 -244925 294334 491577 532285 677116 976039 1129716 768314 -9194 -569161
36366 -569161 -440354 59119 139013 -581363 -1687205 -2373738 -2088492 -938157 316743
$$ packed form
36434A026040J44122M9869k45602l75864k09919J67190O23669Q52573L96714p51788
36424A677004j751526j618961l73963Q92239J164359M33362n37741j021906p79951
36415a917084m8970O46584Q41086N34763J80631R3591O795m98871j188111j227283
36405b576869k63230R07844J195441N88433J13583L53443O54698K13087o21037
36396E65393q47771l44755p181l02116n51767l7042Q83773J322722J046133N03387
36386B230776J3826m21405o83000n76762l05326l19042o11186o51412j56256M88842
36376i90945P46020N39259J97243M0708J44831K98923J53677l61402p77508n59967
36366e69161J28807M99473P9894p20376j105842o86533K85246J150335J254900
$$ plain form
36357 316743 820764 439776 -86806 -25409 510711 897172 948355 1066828 1524073 2067207
36347 2067207 2279109 1948943 1088880 -16218 -800493 -924095 -782397 -982855 -1328078
36338 -1328078 -1029004 -72854 471057 -38060 -773692 -605065 317910 996487 1161036
36329 1161036 1409146 1924974 2111421 1673344 1161665 1050313 969001 344568 -675736
36320 -675736 -1423287 -1507515 -1008030 -142150 838993 1590597 1901339 1934797 1989587 2083495
36310 2083495 1980765 1547271 878935 143752 -529060 -1051381 -1405548 -1642055 -1793767
36301 -1793767 -1873842 -1954764 -2054389 -1923504 -1259263 -277648 267413 -55394 -714105 -800661
36291 -800661 -112452 749190 1295885 1711560 2364434 3126864 3484963 3217426 2713989 2541373
$$ packed form
36357C16743N04021l80988n26582O1397N36120L86461N1183J18473M57245N43134
36347B067207K11902l30166q60063j105098p84275j23602J41698k00458l45223
36338a328078K99074R56150N43911n09117p35632J68627R22975O78577J64549
36329A161036K48110N15828J86447m38077n11679j11352q1312o24433j020304
36320f75736p47551q4228M99485Q65880R81143P51604L10742L3458N4790R3908
36310B083495j02730m33494o68336p35183o72812n22321l54167k36507j51712
36301a793767q0075q0922r9625J30885O64241R81615N45061l22807o58711q6556
36291h00661O88209Q61642N46695M15675O52874P62430L58099k67537n03437j72616
$$ plain form
36281 2541373 2775478 2889746 2389057 1475358 875828 976145 1386735 1534124 1419631
36272 1419631 1469972 1793928 2010958 1840189 1456782 1089902 585693 -325836 -1462708
36263 -1462708 -2194978 -2064227 -1235251 -272116 412213 783823 958169 954000 776840 604022
36253 604022 666928 946479 1180505 1228724 1247301 1418242 1702230 1988165 2276254 2505234
36243 2505234 2383397 1686553 646261 -233782 -714813 -931347 -1021108 -964124 -811014 -736735
36233 -736735 -748739 -630370 -343552 -227267 -543109 -983986 -909291 -26343 1353763 2676798
36223 2676798 3539172 3755350 3336494 2556401 1845681 1391923 919907 106861 -797300
36214 -797300 -1080926 -476303 311001 326965 -466055 -1122293 -842910 187335 1198399
$$ packed form
36281B541373K34105J14268n00689r13699n99530J00317M10590J47389j14493
36272A419631N0341L23956K17030j70769l83407l66880n04209r11529j136872
36263a462708p32270J30751Q28976R63135O84329L71610J74346m169j77160j72818
36253F04022O2906K79551K34026M8219J8577J70941K83988K85935K88089K28980
36243B505234j21837o96844j040292q80043m81031k16534q9761N6984J53110P4279
36233g36735j2004J18369K86818J16285l15842m40877P4695Q82948J380106J323035
36223B676798Q62374K16178m18856p80093p10720m53758m72016q13046r04161
36214g97300k83626O04623P87304J5964p93020o56238K79383J030245J011064
$$ plain form
36205 1198399 1686816 1647097 1310899 1008226 1047462 1360591 1439738 983984 419130 343001
36195 343001 623695 600523 125915 -220198 -65912 228044 255028 209256 408834 597776
36185 597776 278046 -452920 -902009 -605359 175849 762378 620433 -289786 -1451691
36176 -1451691 -2123984 -1967148 -1303886 -627169 -56809 464469 711654 401338 -226508
36167 -226508 -593375 -605733 -756352 -1211098 -1332602 -539841 703976 1291814 776019 -157852
36157 -157852 -545408 -131462 568993 896974 571827 -222415 -1062078 -1602438 -1752992 -1586583
36147 -1586583 -1189356 -709335 -423615 -492337 -655084 -464916 94921 511607 383705 -148023
36137 -148023 -793678 -1551990 -2380424 -2765290 -2203219 -999533 -13543 375320 467184 411412
$$ packed form
36205A198399M88417l9719l36198l02673L9236L13129P9147m55754n64854p6129
36195C43001K80694k3172m74608l46113J54286K93956K6984m5772J99578J88942
36185E97776l19730p30966m49089K96650P81208N86529j41945r10219j161905
36176a451691o72293J56836O63262O76717N70360N21278K47185l10316o27846
36167b26508l66867j2358j50619m54746j21504P92761J243817N87838n15795r33871
36157a57852l87556M13946P00455L27981l25147p94242q39663n40360j50554J66409
36147a586583L97227M80021K85720o8722j62747J90168N59837M16686j27902n31728
36137a48023o45655p58312q28434l84866N62071J203686R85990L88863R1864n5772
$$ plain form
36127 411412 -55967 -789237 -942966 -85859 974502 1174269 595886 156043 200037 251377
36117 251377 57817 15465 404141 912805 1152031 1071271 693733 11596 -659702 -804169
36107 -804169 -422988 -77771 -1648 193408 639319 800434 442445 273159 871901 1574324
36097 1574324 1359367 494873 276034 1184902 2270526 2522235 2024200 1432613 1010390
36088 1010390 639766 307531 80452 -158149 -575508 -1139578 -1746271 -2437104 -3259879
36079 -3259879 -4013847 -4310348 -3858888 -2691199 -1258021 -282133 -212019 -695900 -860954
36070 -860954 -298934 438105 528284 -125775 -862648 -1119090 -1011025 -1009766 -1299666 -1661974
36060 -1661974 -1896043 -2083319 -2327826 -2462924 -2303965 -2098795 -2320513 -2903572 -3091140
$$ packed form
36127D11412m67379p33270j53729Q57107J060361J99767n78383m39843M3994N1340
36117B51377j93560m2352L88676N08664K39226q0760l77538o82137o71298j44467
36107h04169L81181L45217P6123J95056M45911J61115l57989j69286N98742P02423
36097A574324k14957q64494k18839R08868J085624K51709m98035n91587m22223
36088A010390l70624l32235k27079k38601m17359n64070o06693o90833q22775
36079c259879p53968k96501M51460J167689J433178R75888P0114m83881j65054
36070h60954N62020P37039R0179o54059p36873k56442J08065J259k89900l62308
36060a661974k34069j87276k44507j35098J58959K05170k21718n83059j87568
$$ plain form
36051 -3091140 -2334587 -1050778 -130574 86159 -37621 -118199 -130455 -200706 -474643 -1146886
36041 -1146886 -2163329 -2911946 -2718566 -1729882 -828914 -565999 -647494 -597675 -360344 19086
36031 19086 750704 1883757 2892299 3135301 2548420 1586476 721465 267472 388467
36022 388467 912309 1371610 1550217 1723622 2046946 2090015 1470565 616517 261340 359778
36012 359778 179709 -572112 -1386604 -1780471 -1839496 -1763450 -1484900 -1033584 -754488 -803957
36002 -803957 -861912 -718299 -734876 -1264912 -1944027 -2094864 -1645543 -1114598 -791199 -483023
35992 -483023 -73899 242435 425727 742934 1173589 1141241 291099 -789405 -1185180 -858922
35982 -858922 -652079 -1018302 -1351205 -893667 144292 895854 1051221 1173760 1738220
$$ packed form
36051c091140P56553J283809R20204K16733j23780q0578j2256p0251k73937o72243
36041a146886j016443p48617J93380R88684R00968K62915q1495M9819K37331L79430
36031A9086P31618J133053J008542K43002n86881r61944q65011m53993J20995
36022C88467N23842M59301J78607J73405L23324M3069o19450q54048l55177R8438
36012C59778j80069p51821q14492l93867n9025P6046K78550M51316K79096m9469
36002h03957n7955J43613j6577n30036o79115j50837M49321N30945L23399L08176
35992d83023M09124L16334J83292L17207M30655l2348q50142j080504l95775L26258
35982h58922K06843l66223l32903M57538J037959P51562J55367J22539N64460
$$ plain form
35973 1738220 2360985 2294164 1425267 452895 128381 553089 1229773 1638527 1698996 1739807
35963 1739807 2083062 2687460 3199863 3296462 2917191 2250406 1623182 1343570 1449365 1609241
35953 1609241 1462696 1058576 745216 654489 608368 550979 642931 783145 536665 -125567
35943 -125567 -490333 -37929 638458 529726 -335000 -877007 -466291 282507 461094 15648
35933 15648 -432185 -480474 -259106 -112882 -283065 -696862 -895384 -481862 184955 183848
35923 183848 -776579 -1814780 -1962756 -1372918 -878971 -712070 -366318 433635 1370504
35914 1370504 2122170 2627157 2715006 2162236 1281129 822902 1068425 1566493 1947831 2348398
35904 2348398 2758006 2674302 1891783 1037584 771968 965818 1216300 1612283 2284723 2719789
$$ packed form
35973A738220O22765o6821q68897r72372l24514M24708O76684M08754O0469M0811
35963A739807L43255O04398N12403R6599l79271o66785o27224k79612J05795J59876
35953A609241j46545m04120l13360r0727m6121n7389R1952J40214k46480o62232
35943a25567l64766M52404O76387j08732q64726n42007M10716P48798J78587m45446
35933A5648m47833m8289K21368J46224j70183m13797j98522M13522O66817j107
35923A83848r60427j038201j47976N89838M93947J66901L45752P99953R36869
35914A370504P51666N04987Q7849n52770q81107m58227K45523M98068L81338M00567
35904B348398M09608q3704p82519q54199k65616J93850K50482L95983O72440M35066
$$ plain form
35894 2719789 2417781 1909165 2170158 3203284 4139716 4625077 5032172 5251144 4467339
35885 4467339 2559529 697193 -55118 58334 227371 230761 194106 -44420 -492444 -523053
35875 -523053 254295 1075715 903690 -76522 -756503 -661660 -241027 244749 1023977 1887390
35865 1887390 2028074 1212525 305633 185926 767880 1472040 2030920 2398852 2450083 2264723
35855 2264723 2228006 2371014 2118683 1261591 689989 1380860 2894708 3705657 3070046
35846 3070046 1854720 1266352 1321029 1027243 -152869 -1506348 -1867104 -986021 186679
35837 186679 652519 502662 559571 1032471 1111997 129233 -1357332 -2088470 -1512885 -264601
35827 -264601 666080 860790 579763 282809 183113 141384 -93406 -554403 -1027072 -1323261
$$ packed form
35894B719789l02008n08616K60993J033126R36432M85361M07095K18972p83805
35885D467339j907810j862336p52311J13452J69037L390l6655k38526m48024l0609
35875e23053P77348Q21420j72025r80212o79981R4843M20633M85776P79228Q63413
35865A887390J40684q15549r06892j19707N81954P04160N58880L67932N1231j85360
35855B264723l6717J43008k52331q57092n71602O90871J513848Q10949o35611
35846C070046j215326n88368N4677k93786j180112j353479l60756Q81083J172700
35837A86679M65840j49857N6909M72900P9526r82764j486565p31138N75585J248284
35827b64601R30681J94710k81027k96954r9696m1729k34790m60997m72669k96189
$$ plain form
35817 -1323261 -1405432 -1221937 -709780 -106322 52675 -454597 -1115006 -1196715 -609076 18786
35807 18786 78314 -408512 -878492 -753889 72601 1133158 1802172 1890632 1737106 1705431
35797 1705431 1819413 1943648 1997994 1842249 1305715 567101 143427 206604 303440 136585
35787 136585 171293 862078 1631847 1439483 299864 -565257 -258710 779517 1545403
35778 1545403 1656137 1375535 917310 233689 -665326 -1552857 -2124065 -2154649 -1649615 -959444
35768 -959444 -579874 -664463 -835515 -608291 61908 727869 898432 539725 178395 402528
35758 402528 1139582 1604304 1206086 328375 -160443 -30868 173478 95323 30374 215124
35748 215124 244846 -298405 -977582 -857560 278030 1508123 1738582 872675 -148902
$$ packed form
35817a323261q2171J83495N12157O03458J58997n07272o60409q1709N87639O27862
35807A8786N9528m86826m69980J24603Q26490J060557O69014Q8460j53526l1675
35797A705431J13982J24235N4346j55745n36534p38614m23674O3177R6836j66855
35787A36585L4708O90785P69769j92364j139619q65121L06547J038227P65886
35778A545403J10734k80602m58225o83621q99015q87531n71208l0584N05034O90171
35768i59444L79570q4589j71052K27224O70199O65961J70563l58707l61330K24133
35758D02528P37054M64722l98218q77711m88818J29575K04346p8155o4949J84750
35748B15124K9722n43251o79177J20022J135590J230093K30459q65907j021577
$$ plain form
35739 -148902 -400904 100573 591920 542290 179482 -89 93510 211923 231577 158047
35729 158047 -146434 -764020 -1325932 -1328346 -877984 -629234 -880018 -1207195 -1138137 -699513
35719 -699513 -108061 586025 1266987 1624433 1604871 1611318 1908217 2196802 2158202 2054140
35709 2054140 2324139 2848194 3069340 2663415 1700098 385239 -894902 -1496042 -1048050
35700 -1048050 -4560 821695 1219347 1589196 2048545 2135271 1580522 865274 674319
35691 674319 1079397 1559824 1686350 1561714 1634794 2186554 2983434 3476411 3437816 3283344
35681 3283344 3519287 3938639 3730366 2504479 915712 47647 314162 1136319 1613234
35672 1613234 1371447 805769 608716 1094980 1977982 2774084 3276360 3498994 3324974
$$ packed form
35739a48902k52002N01477M91347m9630l62808j79571R3599J18413J9654p3530
35729A58047l04481o17586n61912k414M50362K48750k50784l27177O9058M38624
35719f99513N91452O94086O80962L57446j9562O447K96899K88585l8600j04062
35709B054140K69999N24055K21146m05925r63317j314859j280141o01140M47992
35700a048050J043490Q26255L97652L69849M59349Q6726n54749p15248j90955
35691F74319M05078M80427J26526j24636P3080N51760P96880M92977l8595j54472
35681C283344K35943M19352k08273j225887j588767q68065K66515Q22157M76915
35672A613234k41787n65678j97053M86264Q83002P96102N02276K22634j74020
$$ plain form
35663 3324974 2568947 1449668 651495 662358 1227022 1703246 1829861 1849822 1937695 1883731
35653 1883731 1473629 876653 418997 178142 78357 219842 740614 1422491 1876119 2168895
35643 2168895 2778589 3719176 4223647 3710375 2655256 1946821 1659465 1144542 230989
35634 230989 -421413 -319548 162402 385830 259745 103584 73693 96277 145772 297784
35624 297784 626455 1146022 1635091 1528176 426478 -1157359 -2070784 -1800651 -1016788
35615 -1016788 -549876 -367606 -25683 373829 344209 -148706 -678923 -1061758 -1442989 -1719451
35605 -1719451 -1480284 -680762 61533 75085 -647293 -1438766 -1585220 -1014613 -443759 -685010
35595 -685010 -1700894 -2572180 -2526428 -1690338 -677238 123154 553259 485913 85287 -137381
$$ packed form
35663C324974p56027j119279p98173J0863N64664M76224J26615J9961Q7873n3964
35653A883731m10102n96976m57656k40855r9785J41485N20772O81877M53628K92776
35643B168895O09694R40587N04471n13272j055119p08435k87356n14923r13553
35634B30989o52402J01865M81950K23428j26085j56161k9891K2584M9495J52012
35624B97784L28671N19567M89069j06915j101698j583837r13425K70133P83863
35615a016788M66912J82270L41923L99512k9620m92915n30217l82835l81231k76462
35605a719451K39167P99522P42295J3552p22378p91473j46454N70607N70854k41251
35595f85010j015884q71286M5752Q36090J013100Q00392M30105o7346m00626k22668
$$ plain form
35585 -137381 -37823 -208429 -1058354 -1943041 -1947336 -1219731 -695947 -692722 -678971 -400889 -297987
35574 -297987 -624320 -968125 -943594 -742891 -738174 -1029466 -1541828 -2102076 -2382034 -2298900
35564 -2298900 -2416983 -3256392 -4242882 -4234955 -3221973 -2516180 -2911909 -3617538 -3554564 -2829201
35554 -2829201 -2193038 -1783310 -1268598 -751473 -641912 -877019 -1010940 -950747 -1003222 -1292661
35544 -1292661 -1626391 -1834734 -1842720 -1556887 -1050997 -685954 -704940 -910582 -1027286 -1074588
35534 -1074588 -1050226 -637043 287487 1152915 1239718 554580 -249613 -628464 -474130 -1310
35524 -1310 288137 -110564 -965661 -1230653 -298795 1002611 1344647 540121 -477708 -1069898
35514 -1069898 -1415728 -1702396 -1711199 -1381851 -1038200 -833807 -603327 -429556 -696294 -1357089
$$ packed form
35585a37381R9558j70606q49925q84687m295P27605N23784L225J3751K78082J02902
35574b97987l26333l43805K4531K00703M717k91292n12362n60248k79958Q3134
35564b298900j18083q39409r86490P927J012982P05793l95729p05629O2974P25363
35554b829201O36163M09728N14712N17125J09561k35107j33921O0193n2475k89439
35544a292661l33730k08343p986K85833N05890L65043j8986k05642j16704m7302
35534a074588K4362M13183R24530Q65428Q6803o85138q04193l78851J54334M72820
35524a310K89447l98701q55097k64992R31858J301406L42036q04526j017829n92190
35514a069898l45830k86668q803L29348L43651K04393K30480J73771k66738o60795
$$ plain form
35504 -1357089 -1806762 -1770803 -1699767 -1930590 -2062857 -1630927 -888157 -399981 -252107 -196253
35494 -196253 -255185 -593477 -986146 -1019018 -768241 -726984 -993705 -1041966 -500802 236362
35484 236362 502013 226111 -41234 75003 312413 254587 31893 224426 1069009 2034163
35474 2034163 2322177 1639820 346443 -994466 -2004916 -2542865 -2634477 -2412898 -1989681
35465 -1989681 -1349491 -449101 579784 1395282 1636120 1194405 400399 -110780 56475
35456 56475 590547 780017 375730 -114071 -104273 410431 1066121 1634779 2011280 2026690
35446 2026690 1679522 1309969 1136676 856939 162051 -583288 -737131 -322343 20596
35437 20596 -17151 -104521 55841 341425 611459 911732 1076258 681178 -272006 -1046183
$$ packed form
35504a357089m49673L5959P1036k30823j32267M31930P42770M88176J47874N5854
35494a96253n8932l38292l92669l2872K50777M1257k66721m8261N41164P37164
35484B36362K65651k75902k67345J16237K37410n7826k22694J92533Q44583R65154
35474B034163K88014o82357j293377j340909j010450n37949r1612K21579M23217
35465a989681O40190R00390J028885Q15498K40838m41715p94006n11179J67255
35456E6475N34072J89470m04287m89801R798N14704O55690N68658L76501J5410
35446B026690l47168l69553j73293k79737o94888p45339j53843M14788L42939
35437B0596l7747q7370J60362K85584K70034L00273J64526l95080r53184p74177
$$ plain form
35427 -1046183 -909154 60892 1151928 1755802 1738622 1348018 975673 815085 618598
35418 618598 24060 -798825 -1178166 -792278 -141696 94622 -119763 -322186 -303474 -343868
35408 -343868 -720185 -1238832 -1362252 -776665 185250 791859 685627 255893 43816 5920
35398 5920 -240913 -634325 -709867 -413412 -233815 -375147 -407356 -12647 465839 555119
35388 555119 257228 -201740 -730925 -1097885 -795446 315187 1627322 2538128 3167072
35379 3167072 3799928 4080182 3502582 2428265 1784138 1827680 1980000 1904907 1957229 2334244
35369 2334244 2476951 1731534 189751 -1470344 -2670547 -3191302 -3054052 -2480240 -1825907
35360 -1825907 -1327731 -984323 -747025 -628189 -536909 -265868 189157 512957 475465 284873
$$ packed form
35427a046183J37029R70046J091036O03874j7180l90604l72345j60588j96487
35418F18598n94538q22885l79341L85888O50582K36318k14385k02423J8712m0394
35408c43868l76317n18647j23420N85587R61915O06609j06232m29734k12077l7896
35398E920k46833l93412p5542K96455J79597j41332l2209L94709M78486Q9280
35388E55119k97891m58968n29185l66960L02439J110633J312135R10806O28944
35379C167072O32856K80254n77600j074317o44127M3542J52320p5093N2322L77015
35369B334244J42707p45417j541783j660095j200203n20755J37250N73812O54333
35360a825907M98176L43408K37298J18836R1280K71041M55025L23800l7492j90592
$$ plain form
35350 284873 320265 631323 938045 1080167 1227812 1572270 1961900 2010799 1594157 1121966
35340 1121966 1166932 1792972 2405622 2387828 1771681 1118610 825793 783039 714480 615587
35330 615587 727097 1192960 1848029 2307213 2255889 1737920 1170154 978127 1199978 1533984
35320 1533984 1743406 1827191 1744764 1230157 155719 -984999 -1298295 -408174 976091
35311 976091 1661686 1169311 144593 -465356 -398257 -77329 117090 218709 402183 727495
35301 727495 1204917 1757203 2018698 1576908 653820 157858 630710 1381591 1210312 -15950
35291 -15950 -1027475 -606931 975198 2274778 2206501 939076 -599700 -1653591 -1944622
35282 -1944622 -1473621 -472733 508017 896126 653539 312708 332377 646925 976936
$$ packed form
35350B84873L5392L11058L06722J42122J47645L44458L89630M8899m16642m72191
35340A121966M4966O26040O12650j7794o16147o53071k92817m2754o8559r8893
35330F15587J11510M65863O55069M59184n1324n17969n67766j92027K21851L34006
35320A533984K09422Q3785q2427n14607j074438j140718l13296Q90121J384265
35311I76091O85595m92375j024718o09949O7099L20928J94419J01619J83474L25312
35301G27495M77422N52286K61495m41790r23088m95962M72852P50881j71279j226262
35291a5950j011525M20544J582129J299580o8277j267425j538776j053891k91031
35282a944622M71001J000888R80750L88109k42587l40831J9669L14548L30011
$$ plain form
35273 976936 1271274 1588723 1834460 1962639 2194292 2623430 2827852 2373454 1554159 1072330
35263 1072330 1072177 1094799 942587 880537 914324 642451 48090 -320262 -280690 -369718 -832826
35252 -832826 -1043114 -537183 82734 55521 -309948 -188565 411310 796564 823708 1023433
35242 1023433 1577873 2069612 2278447 2412941 2462462 2075527 1219131 291182 -506346 -1210568
35232 -1210568 -1472398 -767028 508418 1025052 118648 -1283350 -1883261 -1571879 -1129689
35223 -1129689 -871534 -421512 321934 795281 537243 -144325 -549804 -405088 -80659
35214 -80659 -79621 -495310 -1034646 -1447120 -1710885 -1769428 -1389727 -537587 304753 542911
35204 542911 134724 -430600 -755831 -861637 -948851 -1106404 -1221822 -1023413 -406689 99977
$$ packed form
35273I76936K94338L17449K45737J28179K31653M29138K04422m54398q19295m81829
35263A072330j53K2622j52212o2050L3787k71873n94361l68352L9572q9028m63108
35252h32826k10288N05931O19917k7213l65469J21383N99875L85254K7144J99725
35242A023433N54440M91739K08835J34494M9521l86935q56396r27949p97528p04222
35232a210568k61830P05370J275446N16634r06404j401998n99911L11382M42190
35223a129689K58155M50022P43446M73347k58038o81568m05479J44716L24429
35214h0659J038m15689n39336m12474k63765n8543L79701Q52140Q42340K38158
35204E42911m08187n65324l25231j05806q7214j57553j15418J98409O16724N06666
$$ plain form
35194 99977 -384245 -1898092 -3140416 -2850661 -1413464 -318161 -237886 -573272 -811557
35185 -811557 -1205718 -1845497 -2128996 -1703492 -1103355 -869557 -723275 -185291 614937 1334862
35175 1334862 2033773 2773480 3135873 2792732 2125164 1677483 1417795 1097958 840536
35166 840536 719464 287250 -682440 -1427198 -1081986 -44086 481167 155722 -163823
35157 -163823 281685 1391548 2725854 3903831 4371494 3651823 2134482 924910 587466
35148 587466 606349 345527 -65087 -143630 189659 695598 1243447 1729131 1859514 1427204
35138 1427204 650646 -42150 -437329 -538934 -317235 293852 1184849 1999461 2301402
35129 2301402 1866567 925989 70634 -241109 -44483 371981 891920 1502072 1964800
$$ packed form
35194I9977m84222j513847j242324K89755J437197J095303Q0275l35386k38285
35185h11557l94161o39779k83499M25504O00137K33798J46282N37984Q00228P19925
35175A334862O98911P39707L62393l43141o67568m47681k59688l19837k57422
35166H40536j21072m32214r69690p44758L45212J037900N25253l25445l19545
35157a63823M45508J109863J334306J177977M67663p19671j517341j209572l37444
35148E87466J8883k60822m10614p8543L33289N05939N47849M85684J30383m32310
35138A427204p76558o92796l95179j01605K21699O11087Q90997Q14612L01941
35129B301402m34835r40578q55355l11743J96626M16464N19939O10152M62728
$$ plain form
35120 1964800 1954463 1523279 1124726 1151492 1652543 2395127 2939187 2836743 2160525 1688991
35110 1688991 2084170 2964529 3299712 2673750 1614431 723744 155063 17973 533137
35101 533137 1473117 2088670 1990340 1600051 1378659 1151029 640749 151236 132807 436551
35091 436551 573757 440162 231966 -93891 -654336 -1102221 -911057 -177037 459034 725429
35081 725429 963150 1347727 1500357 1185019 850020 974278 1209761 778450 -334260
35072 -334260 -1147203 -846067 201297 911382 755507 174561 -230228 -454415 -787635
35063 -787635 -1089246 -854281 -8595 780400 811835 156026 -483300 -605496 -373009 -229970
35053 -229970 -277212 -185374 320383 1060930 1582050 1636242 1340475 924765 566141 486058
$$ packed form
35120A964800j0337m31184l98553K6766N01051P42584N44060j02444o76218m71534
35110A688991L95179Q80359L35183o25962j059319q90687n68681j37090N15164
35101E33137R39980O15553r8330l90289k21392k27630n10280m89513j8429L03744
35091D36551J37206j33595k08196l25857n60445m47885J91164P34020O36071K66395
35081G25429K37721L84577J52630l15338l34999J24258K35483m31311j112710
35072c34260q12943L01136J047364P10085j55875n80946m04789k24187l33220
35063g87635l01611K34965Q45686P88995L1435o55809o39326j22196K32487J43039
35053b29970m7242R1838N05757P40547N21120N4192k95767m15710l58624q0083
$$ plain form
35043 486058 887628 1611640 2118316 2066840 1709615 1456022 1300556 1066395 996074 1557491
35033 1557491 2687701 3752897 4350740 4664894 4848728 4546089 3404930 1806925 688622
35024 688622 632723 1294250 1724756 1245449 69488 -963983 -1330480 -1316810 -1394365 -1390315
35014 -1390315 -764561 405963 1308009 1357257 790866 164269 -253366 -391914 -189391
35005 -189391 197770 376037 222407 105987 331913 667393 704494 429139 154985 107514
34995 107514 290871 556774 645902 396110 21042 -91421 87392 240340 246716 226610
34985 226610 57658 -462374 -864985 -291307 1118399 2003860 1543572 623585 506465
34976 506465 1079602 1345438 1035285 668398 421031 46739 -296468 -188409 206879 402874
$$ packed form
35043D86058M01570P24012N06676n1476l57225k53593j55466k34161p0321N61417
35033A557491J130210J065196N97843L14154J83834l02639j141159j598005j118303
35024F88622n5899O61527M30506m79307j175961j033471l66497J3670p7555M050
35014a390315O25754J170524R02046M9248n66391o26597m17635j38548K02523
35005a89391L87161J78267j53630j16420K25926L35480L7101k75355k74154m7471
34995A07514J83357K65903Q9128k49792l75068j12463J78813J52948O376k0106
34985B26610j68952n20032m02611N73678J409706Q85461m60288r19987j17120
34976E06465N73137K65836l10153l66887k47367l74292l43207J08059L95288J95995
$$ plain form
34966 402874 537539 1025246 1426548 898347 -188997 -414095 595645 1499254 1219374
34957 1219374 403780 153239 323854 87426 -551550 -874757 -693169 -501869 -545760 -523485
34947 -523485 -213238 189411 394633 319449 112964 87954 415223 714507 342788 -640317
34937 -640317 -1285227 -953627 -230901 -95563 -600170 -1023009 -996236 -749347 -421300 106934
34927 106934 698713 945522 771299 556095 580578 753320 888639 842482 403441 -512566
34917 -512566 -1573688 -2350568 -2863194 -3370910 -3738775 -3595511 -3085958 -2804491 -2878867 -2773929
34907 -2773929 -2209431 -1637271 -1492211 -1551860 -1462953 -1414355 -1773367 -2375578 -2672659 -2399895
34897 -2399895 -1707261 -813213 100821 821046 1296838 1777124 2420721 2920174 2881119 2457583
$$ packed form
34966D02874J34665M87707M01302n28201j087344k25098J009740R03609k79880
34957A219374q15594k50541J70615k36428o38976l23207J81588J91300m3891K2275
34947e23485L10247M02649K05222p5184k06485k5010L27269K99284l71719r83105
34937f40317o44910L31600P22726J35338n04607m22839K6773K46889L28047N28234
34927A06934N91779K46809j74223k15204K4483J72742J35319m6157m39041r16007
34917e12566j061122p76880n12626n07716l67865J43264N09553K81467p4376J04938
34907b773929N64498N72160J45060n9649Q8907M8598l59012o02211k97081K72764
34897b399895O92634Q94048R14034P20225M75792M80286O43597M99453l9055m23536
$$ plain form
34887 2457583 2204364 2333829 2503832 2364787 1959111 1493418 1010573 413341 -369848
34878 -369848 -1292155 -2094245 -2345466 -1860853 -1101414 -839557 -1293547 -1842207 -1744194 -930390
34868 -930390 44916 594707 452912 -307489 -1283639 -1869720 -1701654 -1031421 -475502 -363921
34858 -363921 -491871 -522632 -437437 -472803 -721507 -954126 -889961 -604232 -557983 -1097865
34848 -1097865 -1933459 -2291568 -1705706 -532618 443680 798759 699771 507701 444181 619328
34838 619328 1058346 1575974 1840555 1700923 1318501 910687 539150 229660 84265 119025
34828 119025 163736 97171 29042 44728 -102577 -777868 -1942122 -3036314 -3440534 -2979206
34818 -2979206 -2002950 -1058730 -449864 -55394 391873 877845 1122755 1043116 924217 967701
$$ packed form
34887B457583k53219J29465J70003j39045m05676m65693m82845n97232p83189
34878c69848r22307q02090k51221M84613P59439K61857m53990n48660R8013Q13804
34868i30390R75306N49791j41795p60401r76150n86081J68066O70233N55919J11581
34858c63921j27950l0761Q5195l5366k48704k32619O4165K85729M6249n39882
34848a097865q35594l58109N85862J173088R76298L55079r8988j92070o3520J75147
34838F19328M39018N17628K64581j39632l82422m07814l71537l09490j45395L4760
34828A19025M4711o6565o8129J5686j47305o75291j164254j094192m04220M61328
34818b979206R76256R44220O08866L94470M47267M85972K44910p9639j18899M3484
$$ plain form
34808 967701 929352 486288 -223447 -760247 -972358 -1082329 -1232982 -1301259 -1203430 -1077789
34798 -1077789 -1061072 -1084051 -957118 -533432 168124 841958 1023910 605057 101642 83977
34788 83977 443621 628661 509402 481878 699539 803699 580797 291962 71700 -395025
34778 -395025 -1137978 -1368800 -334782 1555037 3071850 3526417 3256814 2835555 2371920
34769 2371920 1729085 981452 399686 181665 347266 782191 1317319 1834543 2283617
34760 2283617 2558457 2494815 2105900 1655115 1331790 1034403 674958 488700 752276 1339917
34750 1339917 1847838 2039425 1913025 1512021 987460 657278 611685 427621 -273998 -1129565
34740 -1129565 -1416890 -1050051 -581165 -195546 598513 2046028 3530190 4263113 4154771
$$ packed form
34808I67701l8349m43064p09735n36800k12111j09971j50653o8277R7829J25641
34798a077789J6717k2979J26933M23686P01556O73834J81952m18853n03415j7665
34788H3977L59644J85040j19259k7524K17661J04160k22902k88835k20262m66725
34778c95025p42953k30822J034018J889819J516813M54567k69603m21259m63635
34769B371920o42835p47633n81766k18021J65601M34925N35128N17224M49074
34760B283617K74840o3642l88915m50785l23325k97387l59445j86258K63576N87641
34750A339917N07921J91587j26400m01004n24561l30182m5593j84064p01619q55567
34740a129565k87325L66839M68886L85619P94059J447515J484162P32923j08342
$$ plain form
34731 4154771 3653958 3142943 2854489 2956233 3224447 2966742 1838376 542225 135570
34722 135570 706196 1293446 1152576 544933 115825 15043 -16655 -53518 60875 294290
34712 294290 377864 209881 -13991 -172750 -434717 -900002 -1256781 -1113565 -573500 -97042
34702 -97042 226684 811830 1754364 2339310 1874457 766300 140782 419281 915201 996955
34692 996955 975445 1409548 2082166 2331663 2127958 2098262 2497992 2821347 2606649 2052662
34682 2052662 1528179 971805 250757 -248046 -18134 676352 945525 431875 -229045
34673 -229045 -353687 -88110 78918 199622 596661 990517 747440 30282 -172159 514142
34663 514142 1179018 951525 289040 146150 383976 57174 -888248 -1322092 -545486 764512
$$ packed form
34731D154771n00813n11015k88454J01744K68214k57705j128366j296151m06655
34722A35570N70626N87250j40870o07643m29108j00782l1698l6863J14393K33415
34712B94290Q3574j67983k23872j58759k61967m65285l56779J43216N40065M76458
34702i7042L23726N85146R42534N84946m64853j108157o25518K78499M95920Q1754
34692I96955k1510M34103O72618K49497k03705k9696L99730L23355k14698n53987
34682B052662n24483n56374p21048m98803K29912O94486K69173n13650o60920
34673b29045j24642K65577J67028J20704L97039L93856k43077p17158k02441O86301
34663E14142O64876k27493o62485j42890K37826l26802r45422m33844P76606J309998
$$ plain form
34653 764512 1661005 2179185 2880245 3751590 4297423 4400017 4392572 4401292 4217271 3817024
34643 3817024 3508552 3484222 3609489 3733312 3880184 4036477 4041068 3852188 3723390 3920338
34633 3920338 4343450 4606839 4518096 4343862 4456978 4775680 4818223 4423141 4090182 4280750
34623 4280750 4664101 4595189 4193355 4236907 4889591 5279799 4699422 3588405 2846776 2692816
34613 2692816 2757993 2868902 3087651 3271639 3225607 3099590 3098330 3045326 2808957 2857706
34603 2857706 3666250 4796877 5414572 5624700 6381245 7971779 9507315 10195422 10291740
34594 10291740 10393529 10539999 10528766 10500480 10612823 10583282 10123960 9499123 9161190 9140414
34584 9140414 9242984 9516229 10019574 10449633 10563206 10753205 11624620 13132727 14700534
$$ packed form
34653G64512Q96493N18180P01060Q71345N45833J02594p445Q720j84021m00247
34643C817024l08472k4330J25267J23823J46872J56293M591j88880j28798J96948
34633C920338M23112K63389q8743j74234J13116L18702M2543l95082l32959J90568
34623D280750L83351o8912m01834M3552O52684L90208n80377j111017p41629j53960
34613B692816O5177J10909K18749J83988m6032j26017j260n3004k36369M8749
34603B857706Q08544J130627O17695K10128P56545J590534J535536O88107R6318
34594A0291740J01789J46470j1233k8286J12343k9541m59322o24837l37933k0776
34584I140414J02570K73245N03345M30059J13573J89999Q71415J508107J567807
$$ plain form
34575 14700534 16097722 17611860 19333891 20853979 21824787 22382949 22852611 23426847 24316760
34566 24316760 25819141 27939172 30197082 32116962 33801075 35795625 38440490 41505780
34558 41505780 44433171 46832931 48792012 50776601 53168968 55806831 58039396 59355569
34550 59355569 59915724 60303583 60743089 60786077 59940765 58414538 56878939 55513148 53716541
34541 53716541 50983332 47675605 44543880 41772408 39016240 36212025 33710035 31569779
34533 31569779 29381868 27015018 24954839 23551921 22442158 21160842 19897878 19069981
34525 19069981 18416485 17164827 15079917 12851220 11348515 10815299 10844001 10875076 10649517
34516 10649517 10321143 10136548 9976899 9412505 8329311 7212164 6555147 6256823 5909941
$$ packed form
34575A4700534J397188J514138J722031J520088R70808N58162M69662N74236Q89913
34566B4316760J502381K120031K257910J919880J684113J994550K644865L065290
34558D1505780K927391K399760J959081J984589K392367K637863K232565J316173
34550E9355569N60155L87859M39506M2988q45312j526227j535599j365791j796607
34541E3716541k733209l307727l131725k771472k756168k804215k501990k140256
34533C1569779k187911k366850k060179j402918j109763j281316j262964q27897
34525A9069981o53496j251658k084910k228697j502705n33216K8702L1075k25559
34516A0649517l28374j84595j59649n64394j083194j117147o57017k98324l46882
$$ plain form
34507 5909941 5437692 5081004 4978784 5133799 5548028 5968349 5786376 4767728 3689500
34498 3689500 3597130 4478897 5298915 5327013 4782182 4121406 3429938 2757790 2420730 2597124
34488 2597124 3040115 3429645 3612938 3367088 2459814 1169228 211378 -101848 -97573 78878
34478 78878 798993 2035029 2859069 2580994 1850650 1805526 2472710 2873976 2523571 1939978
34468 1939978 1686710 1761884 2089528 2793508 3609831 3697536 2602040 1044392 214991
34459 214991 436926 977266 1124602 989256 1060866 1315330 1186288 442333 -308115 -314267
34449 -314267 302487 677074 364757 -77995 137799 1077245 2163816 2873328 3008811
34440 3008811 2569697 1749136 915858 309303 -82580 -172804 297739 1145469 1536009 969482
$$ packed form
34507E909941m72249l56688j02220J55015M14229M20321j81973j018648j078228
34498C689500r2370Q81767Q20018K8098n44831o60776o91468o72148l37060J76394
34488B597124M42991L89530J83293k45850r07274j290586r57850l13226M275J76451
34478G8878P20115J236036Q24040k78075p30344m5124O67184M01266l50405n83593
34468A939978k53268P5174L27644P03980Q16323Q7705j095496j557648q29401
34459B14991K21935N40340J47336j35346P1610K54464j29042p43955p50448o152
34449c14267O16754L74587l12317m42752K15794R39446J086571P09512J35483
34440C008811m39114q20561q33278o06555l91883r0224M70543Q47730L90540n66527
$$ plain form
34430 969482 102612 -102735 239655 219637 -389249 -872305 -842459 -810208 -1206670 -1680049
34420 -1680049 -1782158 -1661594 -1623297 -1585217 -1402559 -1186616 -902914 -238422 697037 1181406
34410 1181406 942068 761781 1338902 2146645 2254389 1748956 1345072 993270 70085
34401 70085 -1175224 -1631743 -1000063 -325585 -453684 -957227 -1147141 -1208700 -1547739 -1738256
34391 -1738256 -1085818 145881 975772 996120 624152 167710 -527956 -1408411 -1966521
34382 -1966521 -1971788 -1836565 -1882036 -1752252 -1048264 -160683 163937 -42067 76113 955529
34372 955529 1888228 1916009 1085866 274166 -111363 -612798 -1701243 -2835666 -3060470
34363 -3060470 -2276508 -1325395 -842120 -615656 -261657 19978 -228762 -965679 -1672393
$$ packed form
34430I69482q66870k05347L42390k0018o08886m83056K9846L2251l96462m73379
34420a680049j02109J20564L8297L8080J82658K15943K83702O64492R35459M84369
34410A181406k39338j80287N77121Q07743J07744n05433m03884l51802r23185
34401G0085j245309m56519O31680O74478j28099n03543j89914o1559l39039j90517
34391a738256O52438J231699Q29891K0348l71968m56442o95666q80455n58110
34382a966521n267J35223m5471J29784P03988Q87581L24620k06004J18180Q79416
34372I55529R32699K7781q30143q11700l85529n01435j088445j134423k24804
34363c060470P83962R51113M83275K26464L53999K81635k48740p36917p06714
$$ plain form
34354 -1672393 -1998767 -1993209 -1771628 -1361782 -912409 -693221 -727971 -648941 -82695 914779
34344 914779 1889177 2384743 2290751 1873004 1465006 1085363 453920 -512341 -1371005 -1538450
34334 -1538450 -913729 94416 1033051 1605703 1570982 928803 215376 82664 425836
34325 425836 434817 -241521 -915237 -843470 -299902 -85939 -332139 -488573 -335114 -246826
34315 -246826 -415030 -505087 -288699 -34494 -8530 -70848 -23406 102676 355241 932558
34305 932558 1604134 1619274 714510 -270635 -440612 -121953 -295825 -985956 -1176770 -427811
$$ packed form
34354a672393l26374N558K21581M09846M49373K19188l4750P9030N66246R97474
34344I14779R74398M95566r3992m17747m07998l79643o31443r66261q58664j67445
34334a538450O24721J008145R38635N72652l4721o42179p13427j32712L43172
34325D25836Q981o76338o73716P1767N43568K13963k46200j56434J53459Q8288
34315b46826j68204r0057K16388K54205K5964o2318M7442J26082K52565N77317
34305I32558O71576J5140r04764r85145j69977L18659j73872o90131j90814P48959
$$ [...]
##END NTUPLES=NMR SPECTRUM
##END=
