##TITLE=31Pdec_DE-27_oil2
 D2O, 64 sc
 9.10.2024
##JCAMPDX= 6.0         $$ Bruker NMR JCAMP-DX V2.0
##DATA TYPE= NMR SPECTRUM
##DATA CLASS= NTUPLES
##ORIGIN= UXNMR, Bruker Analytische Messtechnik GmbH
##OWNER= root
$$ XWIN-NMR		Version 3.5
$$ Wed Oct  9 14:34:24 2024 Russian Standard Time (UT+4h)  she@DPX200
##.OBSERVE FREQUENCY= 81.013821
##.OBSERVE NUCLEUS= ^31P
##.ACQUISITION MODE= SIMULTANEOUS
##.ACQUISITION SCHEME= undefined
##.AVERAGES= 64
##.DIGITISER RES= 17
##SPECTROMETER/DATA SYSTEM= spect
##.PULSE SEQUENCE= zgpg30
##.SOLVENT NAME= CDCl3
##.SHIFT REFERENCE= (INTERNAL, CDCl3, 0, 198.062)
##AUDIT TRAIL= $$ (NUMBER, WHEN, WHO, WHERE, WHAT)
$$ ##TITLE= Audit trail, XWIN-NMR		Version 3.5
$$ ##JCAMPDX= 5.01
$$ ##ORIGIN= Bruker BioSpin GmbH
$$ ##OWNER= she
$$ F:/spectra/data/she/nmr/P31/2/pdata/1/auditp.txt
$$ ##AUDIT TRAIL=  $$ (NUMBER, WHEN, WHO, WHERE, WHAT)
(   1,<2024-10-09 14:31:49.04 +0400>,<she>,<DPX200>,
      <created by zg, POWCHK disabled, PULCHK disabled
       configuration hash MD5:
       00 E9 B6 7A A2 85 ED C7 34 08 36 98 17 FE 4E 26
       data hash MD5: 32K
       63 2A 95 EA 8C 9D C5 BF 5E A8 07 4E 61 F0 AD 8E>)
(   2,<2024-10-09 14:33:13.68 +0400>,<she>,<DPX200>,
      <Start of raw data processing
       efp BC_mod = 2 LB = 1.5 FT_mod = 6 PKNL = 1 PHC0 = 2654.881 PHC1 = 63.8875 SI = 64K 
       data hash MD5: 64K
       81 31 4E EE C4 9E 22 1C 60 29 40 B9 C2 FF DF 18>)
(   3,<2024-10-09 14:33:34.43 +0400>,<she>,<DPX200>,
      <pk PHC0 = -23.68426 PHC1 = 0 
       data hash MD5: 64K
       A5 C7 77 61 63 67 F2 56 26 97 C8 55 FE E9 69 9F>)
(   4,<2024-10-09 14:33:39.34 +0400>,<she>,<DPX200>,
      <abs ABSG = 5 
       data hash MD5: 64K
       96 89 4A FF 42 31 E7 16 F7 96 FF 9B A3 53 61 2F>)
$$ ##END=
$$ 
$$ hash MD5
$$ 95 E0 65 C6 18 75 5B 65 80 C8 17 34 46 3A 1A 98
##$RELAX= 
##$RELAX= 
##$RELAX= 
##$RELAX= 
##$RELAX= 
##$RELAX= 
##$RELAX= 
##$RELAX= 
$$ Bruker specific parameters
$$ --------------------------
##$DU= <F:/spectra>
##$EXPNO= 2
##$NAME= <P31>
##$PROCNO= 1
##$TYPE= <nmr>
##$USER= <she>
##$AMP= (0..31)
100 100 100 100 100 100 100 100 100 100 100 100 100 100 100 100 100 100 
100 100 100 100 100 100 100 100 100 100 100 100 100 100 
##$AQSEQ= 0
##$AQ_mod= 1
##$AUNM= <au_zg>
##$AUTOPOS= <>
##$BF1= 81.014009
##$BF2= 200.13
##$BF3= 200.13
##$BF4= 200.13
##$BF5= 200.13
##$BF6= 200.13
##$BF7= 200.13
##$BF8= 200.13
##$BYTORDA= 1
##$CFDGTYP= 0
##$CFRGTYP= 5
##$CHEMSTR= <none>
##$CNST= (0..31)
1 1 145 1 1 1 1 1 1 1 1 1 1 1 1 1 1 1 1 1 1 1 1 1 1 1 1 1 1 1 1 1 
##$CPDPRG= <waltz16>
##$CPDPRG1= <>
##$CPDPRG2= <waltz16>
##$CPDPRG3= <>
##$CPDPRG4= <mlev>
##$CPDPRG5= <mlev>
##$CPDPRG6= <mlev>
##$CPDPRG7= <mlev>
##$CPDPRG8= <mlev>
##$CPDPRGB= <>
##$CPDPRGT= <>
##$D= (0..31)
0 1 0 0 0 0 0 0 0 0.06 0 0.03 2e-05 3e-06 0 0 0.0002 0 0 0 0 0 0 0 0 0 
0 0 0 0 0 0 
##$DATE= 1728469908
##$DBL= (0..7)
120 120 120 11 120 120 24 19 
##$DBP= (0..7)
150 150 150 150 150 150 150 150 
##$DBP07= 0
##$DBPNAM0= <>
##$DBPNAM1= <>
$$ [...]
##$SUBNAM3= <"">
##$SUBNAM4= <"">
##$SUBNAM5= <"">
##$SUBNAM6= <"">
##$SUBNAM7= <"">
##$SUBNAM8= <"">
##$SUBNAM9= <"">
##$SW= 400.765351723535
##$SWIBOX= (0..15)
0 1 3 0 0 0 0 0 0 0 0 0 0 0 0 0 
##$SW_h= 32467.5324675325
##$TD= 32768
##$TD0= 1
##$TE= 0
##$TE2= 300
##$TE3= 300
##$TEG= 300
##$TL= (0..7)
0 120 53 12 22 120 120 120 
##$TP= (0..7)
150 150 150 150 150 150 150 150 
##$TP07= 0
##$TPNAME0= <>
##$TPNAME1= <>
##$TPNAME2= <>
##$TPNAME3= <>
##$TPNAME4= <>
##$TPNAME5= <>
##$TPNAME6= <>
##$TPNAME7= <>
##$TPOAL= (0..7)
0.5 0.5 0.5 0.5 0.5 0.5 0.5 0.5 
##$TPOFFS= (0..7)
0 0 0 0 0 0 0 0 
##$TUNHIN= 0
##$TUNHOUT= 0
##$TUNXOUT= 0
##$USERA1= <user>
##$USERA2= <user>
##$USERA3= <user>
##$USERA4= <user>
##$USERA5= <user>
##$V9= 5
##$VALIST= <valist>
##$VCLIST= <CCCCCCCCCCCCCCC>
##$VD= 0
##$VDLIST= <DDDDDDDDDDDDDDD>
##$VPLIST= <PPPPPPPPPPPPPPP>
##$VTLIST= <TTTTTTTTTTTTTTT>
##$WBST= 1024
##$WBSW= 4
##$XGAIN= (0..3)
0 0 0 0 
##$XL= 0
##$YL= 0
##$YMAX_a= 37883
##$YMIN_a= -67018
##$ZGOPTNS= <>
##$ZL1= 120
##$ZL2= 120
##$ZL3= 120
##$ZL4= 120
##$ABSF1= 198.0616
##$ABSF2= -202.7028
##$ABSG= 5
##$ABSL= 3
##$ALPHA= 0
##$AQORDER= 0
##$ASSFAC= 0
##$ASSFACI= 0
##$ASSFACX= 0
##$ASSWID= 0
##$AUNMP= <proc_1d>
##$AZFE= 0.1
##$AZFW= 0.5
##$BCFW= 0
##$BC_mod= 2
##$BYTORDP= 0
##$COROFFS= 0
##$CY= -3
##$DATMOD= 1
##$DC= 0
##$DFILT= <>
##$DTYPP= 0
##$F1P= 0
##$F2P= 0
##$FCOR= 1
##$FTSIZE= 65536
##$FT_mod= 6
##$GAMMA= 0
##$GB= 0
##$INTBC= 1
##$INTSCL= 9.790993e-09
##$ISEN= 30
##$LB= 1.5
##$LEV0= 0
##$LPBIN= 0
##$MAXI= 10000
##$MC2= 0
##$MEAN= 0
##$ME_mod= 0
##$MI= 50
##$NCOEF= 0
##$NC_proc= -6
##$NLEV= 6
##$NOISF1= 182.463
##$NOISF2= 159.3651
##$NSP= 0
##$NTH_PI= 0
##$NZP= 0
##$OFFSET= 198.0616
##$PC= 4
##$PHC0= 2631.197
##$PHC1= 63.8875
##$PH_mod= 1
##$PKNL= yes
##$PPARMOD= 0
##$PSCAL= 0
##$PSIGN= 0
##$REVERSE= no
##$SF= 81.0140089999434
##$SI= 65536
##$SIGF1= 159.3651
##$SIGF2= -187.1042
##$SINO= 113.3802
##$SIOLD= 16384
##$SREGLST= <1H.CDCl3>
##$SSB= 0
##$STSI= 65536
##$STSR= 0
##$SW_p= 32467.5324675325
##$SYMM= 0
##$S_DEV= 0
##$TDeff= 32768
##$TDoff= 0
##$TI= <>
##$TILT= no
##$TM1= 0
##$TM2= 0
##$TOPLEV= 0
##$USERP1= <user>
##$USERP2= <user>
##$USERP3= <user>
##$USERP4= <user>
##$USERP5= <user>
##$WDW= 1
##$XDIM= 65536
##$YMAX_p= 414749160
##$YMIN_p= -76652354
$$ End of Bruker specific parameters
$$ ---------------------------------
##NTUPLES= NMR SPECTRUM
##VAR_NAME=  FREQUENCY,     SPECTRUM/REAL,   SPECTRUM/IMAG
##SYMBOL=    X,             R,               I
##VAR_TYPE=  INDEPENDENT,   DEPENDENT,       DEPENDENT
##VAR_FORM=  AFFN,          ASDF,            ASDF
##VAR_DIM=   65536,         65536,           65536
##UNITS=     HZ,            ARBITRARY UNITS, ARBITRARY UNITS
##FACTOR=    0.49542278885378, 1,            1
##FIRST=     16045.7642231865, 0,            0
##LAST=      -16421.768244346, 0,            0
##MIN=       -16421.768244346, -76652354,    0
##MAX=       16045.7642231865, 414749160,    0
$$ Real data points
##PAGE= N=1
##DATA TABLE= (X++(R..R)), XYDATA
$$ [...]
37409I508179j013029l04165O43847M73743o42801j168334k65709J135931J613921
$$ 9508179 8495150 8190985 8834832 9308575 8665774 7497440 7231731 8367662 9981583
37400I981583R88981L36307N15897J145130J169953K67524o78587p14620r6634
$$ 9981583 10970564 11306871 11822768 12967898 14137851 14405375 13726788 13012168 12915534
37391A2915534J45102k05675k67639L89147Q84374M08959l56877k23024O58595
$$ 12915534 13060636 12854961 12587322 12976469 13860843 14269802 13912925 13689901 14348496
37382A4348496J099083P55479M54490O45342Q03453O37288O71168J113772J230372
$$ 14348496 15447579 16203058 16657548 17302890 18106343 18743631 19414799 20528571 21758943
37373B1758943N52355j75812o8597N82242R12030Q64694J084536J762017K395089
$$ 21758943 22311298 22135486 22066889 22649131 23561161 24425855 25510391 27272408 29667497
37364B9667497K521539K074178J247258N62849P17842J718190K517963K240396
$$ 29667497 32189036 34263214 35510472 36073321 36791163 38509353 41027316 43267712
37356D3267712J413471J178031J612356J857439J709072J895298K666170L283249
$$ 43267712 44681183 45859214 47471570 49329009 51038081 52933379 55599549 58882798
37348E8882798L273434L122143L202656L043409K423686K299612L558564N352024
$$ 58882798 62156232 65278375 68481031 71524440 73948126 76247738 79806302 85158326
37340H5158326N826369M454453K680876K087064K685078L330112L205147K426797
$$ 85158326 90984695 95439148 98120024 100207088 102892166 106222278 109427425 111854222
37332A11854222J528040Q66200N25814M35785M01763J57267m19920j123587j608790
$$ 111854222 113382262 114248462 114774276 115210061 115611824 115769091 115349171 114225584 112616794
37323A12616794j840293k161245k738848l168233k990798k459302k266240k505986
$$ 112616794 110776501 108615256 105876408 102708175 99717377 97258075 94991835 92485849
37315I2485849k540627k122745j973905k715567l752897l977309l323487k811230
$$ 92485849 89945222 87822477 85848572 83133005 79380108 75402799 72079312 69268082
37307F9268082l037732l418320l177240k438582j891055j788921j779800j550098
$$ 69268082 66230350 62812030 59634790 57196208 55305153 53516232 51736432 50186334
37299E0186334j244763j259089j796210k569762k899621k345614j350660q90828
$$ 50186334 48941571 47682482 45886272 43316510 40416889 38071275 36720615 35829787
37291C5829787j238098j494492q28982J96503K92399o68762j335275p59238K16125
$$ 35829787 34591689 33097197 32268215 32464718 32757117 32088355 30753080 29993842 30209967
37282C0209967J30698j041265j885846j475006m54675q327m17262j065173j403881
$$ 30209967 30340665 29299400 27413554 25938548 25483873 25475546 25058284 23993111 22589230
37273B2589230j381530j127274p35033l75097k41069k89823k88233j99535k79631
$$ 22589230 21207700 20080426 19345393 18970296 18729227 18439404 18151171 17951636 17672005
37264A7672005o44457r45850p26122l2084N82266P16302N26164K92224j34899
$$ 17672005 17027548 16081698 15355576 15323492 15905758 16622060 17148224 17440448 17305549
37255A7305549j006222j874738j776423n32767O70315N93571m96713j268651j115370
$$ 17305549 16299327 14424589 12648166 12115399 12785714 13379285 12882572 11613921 10498551
37246A0498551o61363m78826k79076K46674O48360M09686j92877n69136o56847
$$ 10498551 9837188 9358362 9079286 9325960 9974320 10384006 10191129 9621993 8965146
37237H965146o57931m44643M3004K88417n2749l07114L00370J174149R78751l02664
$$ 8965146 8307215 7862572 7905576 8193993 8141244 7834130 8134500 9308649 10287400 9984736
37227I984736j205729r20875l42796m56138q25974n47047J73453M12951K8736
$$ 9984736 8779007 7858132 7515336 7059198 6233224 5686177 5859630 6272581 6301317
37218F301317k16687J56740P96198J089671P40450j32552j013367j245275o79456
$$ 6301317 6084630 6241370 7037568 8127239 8867689 8735137 7721770 6476495 5797039
37209E797039P9717L99782L27563K31883J27603j39595l82432l56990l01524n44067
$$ 5797039 5876756 6276538 6604101 6835984 6963587 6823992 6441560 6084570 5783046 5238979
37199E238979p68834l83733M59927R38416P01813K84099K19352L47303K47969
$$ 5238979 4470145 4086412 4546339 5484755 6186568 6470667 6690019 7037322 7285291
37190G285291r7954l69515l40415o9543J46495k2735n54222r39266p32914j47585
$$ 7285291 7187337 6817822 6477407 6407864 6554359 6531624 5977402 5038136 4305222 4157637
37180D157637K50740L09785L05940L11333J12741k47109m35122m10139m78433
$$ 4157637 4408377 4718162 5024102 5335435 5448176 5201067 4765945 4355806 3877373
37171C877373o69055o31737l00044o8475j20434j63906l7367M6686Q7019L93238
$$ 3877373 3208318 2576581 2276537 2208062 2087628 1923722 1886355 1933041 2020060 2413298
37161B413298P67527M28292o70332j277070m75285P83615Q65800k39359j023408
$$ 2413298 3180825 3609117 2938785 1661715 1186430 1970045 2835845 2596486 1573078
37152A573078p33725k16095k36629k67216L46824J029432Q06138j00191n98270
$$ 1573078 839353 623258 386629 119413 466237 1495669 2301807 2201616 1603346
37143A603346m13918l63259q57731j167009o24230K40951M80142J36593N8906
$$ 1603346 1189428 826169 -31562 -1198571 -1822801 -1581850 -1101708 -965115 -906209
37134i06209N07904Q01671M57632p3422j63126R0973J92069O1796J1907J66080
$$ -906209 -398305 403366 860998 787576 624450 715423 907492 969288 981195 1147275
37124A147275M06486O87445R06302O72457j95080j058122j027274j80241M49624
$$ 1147275 1553761 2241206 3147508 3819965 3624885 2566763 1539489 1359248 1808872
37115A808872K51546k35458k23732K94433P69329Q35177M56177k02569o65057
$$ 1808872 2060418 1824960 1601228 1895661 2664990 3500167 3956344 3753775 3088718
37106C088718l79302M82758R11378K80161p16317r43385l01088L46423M33772
$$ 3088718 2709416 3192174 4103552 4383713 3667396 2724011 2422923 2769346 3203118
37097C203118J31909l05088p94364j007941n17161M50418J075129R79768N74261
$$ 3203118 3335027 3029939 2235575 1227634 710473 1160891 2236020 3215788 3790049
37088C790049J86516l94973j144032j340964n51250M90929P34429K13187j47635
$$ 3790049 3976565 3581592 2437560 1096596 545346 1036275 1770704 1983891 1836256
37079A836256Q6585M50567M88705K80652n7729o36593j251916j249996m03132
$$ 1836256 1922841 2373408 2862113 3142765 3085036 2448443 1196527 -53469 -456601
37070d56601N64908Q38665N19327K40692J31529j42384m90377l78354K01289N21674
$$ -456601 108307 946972 1466299 1706991 1838520 1696136 1205759 827405 1028694 1550368
37060A550368K12211j15109J63656O30815M32345l72139q34364m66700J35787
$$ 1550368 1762579 1647470 1811126 2441941 2874286 2502147 1667783 1201083 1336870
37051A336870K21852j09475j78171K93857Q17358P28767K3039m65045J12017J478014
$$ 1336870 1558722 1449247 1271076 1564933 2382291 3111058 3134097 2669052 2781069 4259083
37041D259083K225295J337474n02048j668784j527563r05504o33086n05183p2552
$$ 4259083 6484378 7821852 7319804 5651020 4123457 3217953 2584867 2079684 2007132
37032B007132L49790J83168l90534o66261m49817j71900n9951J69444P06627J205201
$$ 2007132 2356922 2540090 2149556 1483295 1033478 861578 801627 971071 1677698 2882899
37022B882899J118566K91036p94161j270964o31681N70474J078423L52015o74201
$$ 2882899 4001465 4292501 3498340 2227376 1595695 2166169 3244592 3596607 2922406
37013B922406p19130K34952J041709R18090K06944l63155n21355m19396k84991
$$ 2922406 2203276 2438228 3479937 4398027 4604971 4241816 3720461 3301065 3016074
37004C016074k97926m27769l07087L42154J118714J244418N57803k43202m80978
$$ 3016074 2718148 2290379 1983292 2325446 3444160 4688578 5246381 5003179 4522201
36995D522201j98884J41267K31421L2365k87542l88595j03686J94020K0423l88286
$$ 4522201 4323317 4464584 4696005 4728370 4440828 4052233 3948547 4142567 4162990 3774704
36985C774704k86526L86008P35602K10825n07797m81472J52655N02729K35698
$$ 3774704 3488178 3874186 4609788 4820613 4312816 3831344 3983999 4486728 4722426
36976D722426j44892j86224J7632K35743M42594O02141N11305P0654m81205p47099
$$ 4722426 4577534 4391310 4408942 4644685 5087279 5689420 6200725 6271379 5790174 5043075
36966E043075n32630j4588M30084O16342P34570R90117J158629Q59164K70875
$$ 5043075 4510445 4495857 4925941 5542283 6276853 7266970 8425599 9284763 9555638
36957I555638P8156M99386Q52629M45099m77896j068674q75493j32098O79968
$$ 9555638 9633794 10133180 10985809 11430908 10953012 9884338 9008845 8876747 9556715
36948I556715J160760J098641O35127J92394k988q7987p5116L47296J153415J599335
$$ 9556715 10717475 11816116 12451243 12643637 12640649 12552662 12477546 12824842 13978257 15577592
36938A5577592J077913K9967n67520l55969K86246R32068J281702J002998J86228
$$ 15577592 16655505 16685472 16117952 15761983 16048229 16980297 18261999 19264997 19451225
36929A9451225k65295M52387J826647K534734K117521J323353Q20947N17860K91802
$$ 19451225 19185930 19638317 21464964 23999698 26117219 27440572 28261519 28779379 29071181
36920B9071181M33931J009532J549664J725778J668683J392762O77395k01903
$$ 29071181 29505112 30514644 32064308 33790086 35458769 36851531 37528926 37327023
36912C7327023m72777l973L61948O6491l88782m43604m09941p36849j121635j108620
$$ 37327023 36854246 36850273 37212221 37278712 36889930 36446326 36036385 35299536 34177901 33069281
36902C3069281q96327q09857o71368m68707q40456j917993k501250j635880l36650
$$ 33069281 32172954 31363097 30691729 30223022 29382566 27464573 24963323 23327443 22990793
36893B2990793k77294j236827j495309n72159K02659j399m06413l21463k91320
$$ 22990793 22713499 21476672 19981363 19409204 19611863 19610464 19204051 18882588 18591268
36884A8591268p61675j055730o72076l53903p57496j153119o98996p1918m01877
$$ 18591268 17829593 16773863 16101787 15747884 14990388 13837269 13138273 13066355 12664478
36875A2664478j250012j179742j7118R33408Q69310L38638L46k20381m55968m60219
$$ 12664478 11414466 10234724 10217606 11151014 12020324 12358962 12359308 12138927 11682959 11222740
36865A1222740k47422k93720p19971j016661q85628o25255m14725r240N27274
$$ 11222740 10975318 10681598 9961627 8944966 8059338 7434083 7019358 7010118 7537392
36856G537392O17693J45436j54839J91565O37601N57616K28421J52656O4531n18017
$$ 7537392 8155085 8300521 8145682 8337247 8974848 9532464 9760885 9913541 9978072 9460055
36846I460055j234617j305439p25414j73873O3149K50986M44061M06236K23358
$$ 9460055 8225438 6919999 6194585 6020712 6083861 6334847 6778908 7185144 7408502
36837G408502J90457J34049l24404q46789o48246J82684N94564J20142l96532
$$ 7408502 7598959 7733008 7408604 6561815 5913569 6096253 6690817 6810959 6414427
36828F414427j03248O37162R52090P37874N21194M93170L85305M9126m04500q21940
$$ 6414427 6311179 6948341 7900431 8638305 9159499 9652669 10037974 10087100 9682600 8860660
36818H860660r23808l39896P70080J481795J085662J8289p71118j043485j130426
$$ 8860660 7936852 7596956 8367036 9848831 10934493 10952782 10181664 9138179 8007753
36809H007753r17241K80J169922J418196M95547l76708j94914L98236J83836p23216
$$ 8007753 7090512 7090792 8260714 9678910 10174457 9797749 9602835 10001071 10184907 9461691
36799I461691j074672m15625K62447M9906n94486o79131k04444k8257m10920n94376
$$ 9461691 8387019 7971394 8233841 8283747 7689261 7010130 6805686 6777429 6366509 5772133
36789E772133o8036N19278L06463m22203o28708p5791M04084K93287J15945L58839
$$ 5772133 5704097 6223375 6529838 6107635 5478927 5403136 5807220 6100507 6216452 6575291
36779F575291N20382j7421p99116r20298m67142k92157m91429k30565P39299J475992
$$ 6575291 7095673 7078252 6279136 5358838 4891696 4599539 4108110 3877545 4616844 6092836
36769F092836J220709M71638O3434o8404m46377r61649j090715q39811o21646
$$ 6092836 7313545 7785183 7848617 7780213 7333836 6372187 5281472 4441661 3820015
36760C820015m17017P9081N86475M32164k99918o98158l59196M4058n2357j61639
$$ 3820015 3402998 3482079 4068554 4500718 4200800 3502642 3143446 3187504 3135147 2973508
36750B973508L31719R51985P58636j15024n41726n5308M93023K54805m07571n87153
$$ 2973508 3305227 4257212 5015848 4900824 4359098 4303790 4796813 5051618 4644047 4056894
36740D056894j68485K00815K12075K36311N40527P94521N92506L6417m77316p61625
$$ 4056894 3888409 4089224 4301299 4537610 5078137 5872658 6465164 6501581 6024265 5262640
36730E262640q68901q38459o77029m56314k20463R1922M67079O88196N61296J58645
$$ 5262640 4393739 3555280 2878251 2421937 2201474 2293396 2760475 3448671 4009967 4168612
36720D168612k97631o48475p69910n53952j27733J13933m0524k91063k03338K36523
$$ 4168612 3870981 3222506 2452596 1898644 1770911 1884844 1844320 1553257 1349919 1586442
36710A586442O87343Q76931O77976J4877q79048j298347o98612N07023J245666
$$ 1586442 2273785 3150716 3828692 3843569 2964521 1666174 967562 1474585 2720251
36701B720251R49347P4368n46413n06579R790M75972M02708j94566p21196o88824
$$ 2720251 3669598 3743966 3197553 2690974 2700764 3176736 3579444 3384878 2663682 1974858
36691A974858l17089o6313J30514N25293P20676J19470q26707r03725O2224P61762
$$ 1974858 1657769 1591456 1721970 2247263 2967939 3087409 2260702 1356977 1419201 2180963
36681B180963K85199n46835m95708K78461O52366K30966l57003n20658j97063
$$ 2180963 2466162 1919327 1423619 1702080 2354446 2585412 2228409 1707751 1510688
36672A510688M82183J200213J295134L81091r09070j463259r60849q0988M40992
$$ 1510688 1992871 3193084 4488218 4869309 3960239 2496980 1536131 1455143 1896135
36663A896135M16879O775m78082o18492k46073K77424N09650M63884L36876P9238
$$ 1896135 2313014 2319789 1841707 1223215 977142 1254566 1764216 2228100 2564976 2644214
36653B644214k67154k68421K02625M44728q1364p07706m87857K40243L87633p2520
$$ 2644214 2377060 2108639 2311264 2755992 2674628 1966922 1479065 1719308 2106941 2034421
36643B034421j53216L64413O03007J82667k46626l47787n75788r01147m99132
$$ 2034421 1881205 2245618 2848625 3031292 2784666 2436879 1861091 959944 460812
36634D60812O54850J282002P05578p0273j19202p2366o52829j045207k83536P68249
$$ 460812 1115662 2397664 3103242 3032969 2913767 2841401 2188572 1143365 859829 1628078
36624A628078O06475m31136p49307j72988p0437q00149j013156J8845J124832
$$ 1628078 2234553 1803417 1054110 881122 810685 10536 -1002620 -983775 141057
36615A41057J096863M13891J16466R5036l40833r58994r02551j55468L65708J57709
$$ 141057 1237920 1651811 1768277 1863313 1522480 563486 -339065 -494533 -128825 28884
36605B8884k62217k21340K47605O28622O11081L09681j4559k38242l81934m36873
$$ 28884 -233333 -454673 -207068 421554 1032635 1342316 1327757 1089515 707581 270708
36595B70708l04889K5285L46568M31824L06994J62665O1807m6443o4616K17460
$$ 270708 -34181 -8896 337672 769496 1076490 1239155 1300962 1254519 1189903 1407363
36585A407363P38773J030359O47905k55988q86113n11860O23673J291389N89689
$$ 1407363 2146136 3176495 3824400 3568412 2682299 2170439 2794112 4085501 4675190
36576D675190p86418j201213j64757R60767P82283l19637r43122o29358q8928
$$ 4675190 3888772 2687559 2522802 3483569 4265852 3946215 3003093 2373735 2284807
36567B284807J94375M57721P55874O27746m7437o70856p29102l72549J7577K56102
$$ 2284807 2479182 2936903 3692777 4320523 4273086 3602230 2873128 2500579 2518156 2774258
36557B774258K20420q1728k18602K04403P39803N80931p4791j67294M86623P67921
$$ 2774258 2994678 2912950 2694348 2898751 3638554 4219485 4144694 3977400 4464023 5231944
36547E231944O6934o93075o23844k92340n09293p65802k63730L21143k29328j413216
$$ 5231944 5298878 4605803 3981959 3689619 3180326 2414524 2150794 2471937 2242609 829393
36537H29393j456082l5278J133555P93391k85830q15733o93206m01655Q3044P80716
$$ 829393 -626689 -661967 471588 1264979 979149 163416 -529790 -931445 -848401 -67685
36527f7685J059020O04837K96221R31674J684906J144777m48380j418555j070026
$$ -67685 991335 1596172 1892393 2824067 4508973 5653750 5205370 3786815 2716789
36518B716789m74024n72275q66445o18934j69884j52487k97107m3691L22227K39508
$$ 2716789 2242765 1670490 804045 185111 15227 -137260 -434367 -478058 -155831 83677
36508H3677P3839N42411J227577R84607j62560q60657m43850J55669L4238l37398
$$ 83677 157516 699927 1927504 2912111 2749551 1888894 1445044 1600713 1634951 1297553
36498A297553j71301K62475K90579N6291K9108n2372o17212j162800r37744l49110
$$ 1297553 1126252 1388727 1679306 1735597 1764705 1712333 1095121 -67679 -1005423 -1354533
36488a354533l82248q37188n68818M94807J066150N57125n794K64576P34448M84413
$$ -1354533 -1736781 -2573969 -3142787 -2647980 -1581830 -1024705 -1030499 -765923 -31475 452938
36478D52938j14149q3501N99985J109633R87458M51734j54375n61869n91144n08666
$$ 452938 338789 255288 855273 1964906 2952364 3404098 3249723 2687854 2096710 1588044
36468A588044q85593j568164j450439k6058J481999J535812L84262l28651J72038
$$ 1588044 702451 -865713 -2316152 -2342210 -860211 675601 1059863 731212 903250
36459I03250J010685J140460N88972L327k51503k19778j05524j37460l59227n11652
$$ 903250 1913935 3054395 3643367 3646694 3395191 3175413 3069889 2932429 2573202 2061550
36449B061550m07208k81086m09694o08992n55668l37143j78318M7702M25496M81901
$$ 2061550 1654342 1373256 963562 354570 -201098 -538241 -716559 -668857 -243361 238540
36439B38540j54147q52827o22787M81768J421873J517937R15776p5644j112980
$$ 238540 84393 -768434 -1391221 -909453 512420 2030357 2946133 2870489 1757509
36430A757509j430696n00934Q41575J104083J72748n13116j10874N33376M33657
$$ 1757509 326813 -174121 667454 1771537 1944285 1431169 1320295 1853671 2287328
36421B287328j02673l13810k18830j83104r9792J64540K36890o4665j92746K09994
$$ 2287328 2184655 1870845 1652015 1468911 1369119 1533659 1770549 1705884 1513138 1723132
36411A723132N62881L08389j23293j91607l08726r47323j388105o72078O36245
$$ 1723132 2286013 2594402 2471109 2279502 1970776 1023453 -364652 -1036730 -400485
36402d00485J032165K64343l92241j16015M61934N00365R4267k30172l03695j82786
$$ -400485 631680 896023 503782 387767 849701 1350066 1444333 1214161 910466 727680
36392G27680R2916K83522P4626l59797n05184l43405l51573n26351k44511N83405
$$ 727680 820596 1104118 1178744 818947 313763 -29642 -381215 -907566 -1152077 -568672
36382e68672J066644N76559k62334m54271M1550N25821O54005N93353L81898j01237
$$ -568672 497972 1074531 812197 357926 399476 925297 1579302 2172655 2554553 2453316
36372B453316n99330o05533j30306K03063J0757l37940l07847L7987K13025P8568
$$ 2453316 1853986 1248453 1118147 1321210 1331967 994027 686180 724167 937192 1015760
36362A015760J6252K42440L29421k20828j073332j236457k96804R59162J488398
$$ 1015760 1032012 1274452 1603873 1383045 309713 -926744 -1223548 -264386 1224012
36353A224012J201628P73457N31736J88347l73400p40973o33499m00617n26593
$$ 1224012 2425640 3199097 3730833 3919180 3545780 2804807 2171308 1770691 1244098
36344A244098r51840j168883p98989P1231R16208J098024N00556j26418Q4527
$$ 1244098 292258 -876625 -1675614 -1604383 -688175 409849 910405 783987 868514
36335H68514R14941J176880L07797p68322q77082j52800L43949J99651k5537N4061
$$ 868514 1783455 2960335 3268132 2499810 1622728 1469928 1813877 2013528 1987991 2042052
36325B042052Q2558k35972n39492m42272j94091j77635j66149K83752R10813R13000
$$ 2042052 2124610 1888638 1349146 906874 712783 535148 368999 652751 1563564 2476564
36315B476564R3020p55528q48431l37905R2798J84144J82576J97959N6127k00240
$$ 2476564 2569584 1814056 965625 627720 720518 904662 1087238 1285197 1341324 1141084
36305A141084k16252P2003J95867j68342o38164o46894k77916r6632k48304k35797
$$ 1141084 924832 996835 1192702 1024360 386196 -260698 -538614 -635246 -883550 -1119347
36295a119347K93860R37974R54032J24515r42070j318044n83546P14172J470677
$$ -1119347 -825487 112487 1066519 1191034 248964 -1069080 -1652626 -938454 532223
36286E32223J083333P3609n30540l41904J37649L34161K45553J79926K47765L38289
$$ 532223 1615556 1689165 1158625 816721 954370 1288531 1534084 1714010 1961775 2300064
36276B300064L33315J31000l21515q08110q61037k64508N47672Q18761K12732
$$ 2300064 2633379 2764379 2442864 1634754 773717 509209 1056881 1875642 2088374
36267B088374q18612j371399q53808L88218J231580Q42567l76139j207804j027673
$$ 2088374 1269762 -101637 -955445 -567227 664353 1506920 1130781 -77023 -1104696
36258a104696l65646N5411K61552N90325Q25798M79417k71769o71432m56287j85118
$$ -1104696 -1470342 -1414931 -1153379 -563054 262744 742161 470392 -201040 -657327 -842445
36248h42445l04208m73683j73128M78686R46949J011097Q13100M08054j91423
$$ -842445 -1146653 -1620336 -1793464 -1314778 -367829 643268 1456368 1864422 1672999
36239A672999o04338l22215M69387Q19495J19734j028672j459572q00534J90989
$$ 1672999 1068661 746446 1215833 2035328 2155062 1126390 -333182 -1133716 -942727
36230i42727N84016K01786m15569o24540j63338O76129J220951R87784K04500
$$ -942727 -358711 -156925 -572494 -1197034 -1360372 -684243 536708 1524492 1728992
36221A728992m16623m64866j39932K26999N48345P40164N73815P2048l37089m09408
$$ 1728992 1312369 847503 707571 934570 1482915 2223079 2796894 2868942 2531853 2122445
36211B122445m46072o74311p08930j99382L73739K87175k75117m77149j45602
$$ 2122445 1676373 1002062 293132 93750 467489 754664 479547 2398 -143204
36202a43204M1766k46978n06188l56838j59914k46725k81888O5776M41901M10422
$$ -143204 -101438 -348416 -854604 -1211442 -1371356 -1618081 -1899969 -1834193 -1392292 -981870
36192i81870K32490L75956O30805M24861j94960n75991l89737K0318K27445J97484
$$ -981870 -749380 -373424 257381 682242 487282 -88709 -478446 -458128 -230683 -33199
36182c3199J41189K44291N57885Q90310Q69019L67966k31970m73677l77643k85250
$$ -33199 107990 352281 910166 1800476 2669495 3037461 2805491 2331814 1954171 1668921
36172A668921l21742l58114l57328l64185k36771K00859P28843Q15543K32632
$$ 1668921 1347179 989065 631737 267552 30781 231640 960483 1776026 2008658
36163B008658o24280j102653q94575k99109Q5058L1588k6337L17820N94844m1152
$$ 2008658 1384378 281725 -612850 -911959 -826901 -795313 -821650 -503830 91014 49862
36153D9862j322998j740337m77130J250357J643163N98831m27391m98859l5086
$$ 49862 -1273136 -3013473 -3490603 -2240246 -597083 1748 -425643 -924502 -959588
36144i59588L26218N38514N91630J83410n89945r89767n80521J43546M72918L05489
$$ -959588 -633370 -94856 496774 680184 90239 -899528 -1480049 -1336503 -863585 -558096
36134e58096p9768n10087p82832n73325N6159M91755L67003J26784L19352O93380
$$ -558096 -637864 -1147951 -1930783 -2504108 -2447949 -1956194 -1589191 -1462407 -1143055 -449675
36124d49675N59432j55685p39839n36914L81466J330604J582503R50589j1507
$$ -449675 109757 -45928 -785767 -1322681 -941215 389389 1971892 2922481 2910974
36115B910974n48030n35618n11683p86238r65976o14314M7704M60325L87071r1825
$$ 2910974 2362944 1827326 1315643 529405 -436571 -1050885 -1003181 -542856 -155785 -247610
36105b47610q44982j503453j407926l48787Q69022J205225O16205k9191j45063
$$ -247610 -1092592 -2596045 -4003971 -4352758 -3483736 -2278511 -1662306 -1691497 -1836560
36096a836560N9684K24635L27161L72290J83647j82786k48158K82082R82223J165040
$$ -1836560 -1776876 -1552241 -1225080 -852790 -669143 -851929 -1100087 -818005 164218 1329258
36086A329258P58022L38985K57295R8385o53293j590441j578584k47646J182494
$$ 1329258 2087280 2426265 2683560 2781945 2128652 538211 -1040373 -1288019 -105525
36077a05525J206860k1171q66334m29833L49746K98916k10693m1956P46752R65492
$$ -105525 1101335 1080164 213830 -216003 133743 432659 221966 180010 926762 1892254
36067A892254K08655n23275m09349M4053R512l38652k76716K14795M67960J78487
$$ 1892254 2100909 1577634 1168285 1212338 1221850 883198 606482 821277 1289237 1467724
36057A467724k78383n42998o79323q09074q18417n89460k07935J78165M73773
$$ 1467724 1189341 646343 -32980 -842054 -1660471 -2249931 -2457866 -2279701 -1805928
36048a805928N82670N11538N36721R16316J369725J262858N04942j68462j49433
$$ -1805928 -1223258 -711720 -174999 741317 2111042 3373900 3878842 3710380 3560947
36039C560947J92198J12030l45827m59219j9380L36665J46505k41780m02676n27363
$$ 3560947 3753145 3865175 3519348 3060129 3040749 3377414 3523919 3282139 2879463 2352100
36029B352100q36235q78952j84508P50486R72569M27520k9074L0004J04247k33024
$$ 2352100 1515865 636913 452405 1202891 2175460 2602980 2573906 2603910 2708157 2475133
36019B475133o41908o58869l73176r4006R9026J42430j08689m24342k46849L99818
$$ 2475133 1833225 1174356 801180 707174 806200 948630 839941 415599 168750 568568
36009E68568O70862Q3988o49097n86852J62880P88051R29813P80886M40027n5890
$$ 568568 1239430 1323418 674321 87469 250349 1038400 1968213 2749099 3189126 3133236
35999C133236l69930k94879k53468o13961q54009l01740N88644P49894J46789
$$ 3133236 2763306 2468427 2214959 1600998 746989 445249 1033893 1783787 1930576
35990A930576k05669J16173M32506K77461Q6364J84291J42030l27866p45495p14674
$$ 1930576 1724907 1841080 2273586 2551047 2637411 2821702 2963732 2635866 1890371 1175697
35980A175697n80102o30658m38580K97900R43489P51296o255m63707l07184J36623
$$ 1175697 595595 -35063 -473643 -175743 767746 1519042 1512787 1049080 741896 878519
35970H78519N11289N19083j03549j033367j304385n48197K48339Q8123m83637
$$ 878519 1389808 1908891 1805342 771975 -532410 -1080607 -832268 -744145 -1227782
35961a227782k61448O08155Q22856L3176o26711l63092J91585K22160k5119P7938
$$ -1227782 -1489230 -881075 -58219 -25043 -651754 -1014846 -823261 -601101 -626220 -548282
35951e48282M76960P94516J076969J414951J362837N59195m32612p08315k50536
$$ -548282 -71322 723194 1800163 3215114 4577951 5137146 4704534 3996219 3745683
35942C745683J53429R5775p0660k7563L0280j30025l81360n22950n29046l31802
$$ 3745683 3899112 3994887 3924227 3896664 3926944 3796919 3415559 2892609 2363563 2031761
35932B031761K10615Q93943J129865O66196K9834j34406O7050J0877m70257q61894
$$ 2031761 2242376 3136319 4266184 4932380 4962214 4827808 4894858 4905735 4435478 3573584
35922C573584p74642m87027m21288m39559p5606O67559J169656R19783J21705
$$ 3573584 2798942 2311915 1890627 1451068 1375462 2043021 3212677 4132460 4254165
35913D254165n45498o02206j17701M44984O14707K79478j98730l34853r0420M7289
$$ 4254165 3708667 3106461 2988760 3433744 4048451 4327929 4129199 3794346 3703926 3751215
35903C751215k88709p75528p53566j04210N40784N62526O7400l45481l44855j51812
$$ 3751215 3462506 2686978 1933412 1829202 2369986 2932512 2999912 2654431 2309576 2157764
35893B157764j33795l45493m96646k31561N39115J410192J627136P67063o17561
$$ 2157764 2023969 1678476 1181830 950269 1489384 2899576 4526712 5293775 4676214
35884D676214j349110q67096J31271O16721N29421O05729J007116Q96237k78102
$$ 4676214 3327104 2460008 2591279 3208000 3737421 4343150 5350266 6246503 5968401
35875E968401j697734k022194j049272J12416M78609J99534k66J17732J63500
$$ 5968401 4270667 2248473 1199201 1311617 1790226 1989760 1989494 2107226 2270726
35866B270726j67814n75680m45912L79859J239960J265675M06579m44595n34035
$$ 2270726 2102912 1527232 1081320 1461179 2701139 3966814 4373393 3928798 3394763
35857C394763j25804K8238k27969m07731k27725O8470J91271J09793j02224k79869
$$ 3394763 3268959 3297197 3069228 2661497 2433772 2502242 2693513 2803306 2701082 2421213
35847B421213j28601L33475M85906q7167p07814m06928M78715O14817k77753r01619
$$ 2421213 2292612 2626087 3111993 3024826 2317012 1910084 2388799 3003616 2725863 1824244
35837A824244l68552N01349N95444J09379k16481m52519q90256r30629L2806J146826
$$ 1824244 1455692 1957041 2552485 2661864 2445383 1992864 1102608 171979 204785 1351611
35827A351611R97509k37013r46493l92068M81910O76655L10136j30923n39436
$$ 1351611 2349120 2112107 1165614 773546 1255456 1932111 2242247 2111324 1571888
35818A571888p65326m63798J61216L37661j19599m64413k24826J19719J22595
$$ 1571888 806562 342764 503980 841641 722042 257629 32803 152522 275117
35809B75117J36056M99774P72307M60588j34762m48872m40058k66784J89084Q40591
$$ 275117 411173 910947 1683254 2143842 2009080 1560208 1120150 853366 1042450 1883041
35799A883041J057814N10825j97205m07473l31282l95547l31383J91410O25324
$$ 1883041 2940855 3451680 3254475 2847002 2515720 2120173 1788790 1980200 2605524
35790B605524K99367l42872l95705m3415k14437q50260q75519k2266O37001L69628
$$ 2605524 2904891 2562019 2166314 2122899 1908462 1058202 182683 160417 797418 1167046
35780A167046j92559k73127j13269j47282N0927R71189J904883J609922R0322
$$ 1167046 974487 701360 588091 440809 491736 1462925 3367808 4977730 5068052
35771E068052j246229j319196n32569Q911j49456n79212o89535k90683L71551
$$ 5068052 3821823 2502627 1970058 1978969 1829513 1250301 560766 270083 641634
35762F41634P92501M92777n25431j528850j553770l80066J124439J821406J362546
$$ 641634 1434135 1926912 1401481 -127369 -1681139 -2061205 -936766 884640 2247186
35753B247186K92157o61118j046907o79223K29732Q96445N67643m80026j100726
$$ 2247186 2539343 1878225 831318 152095 381827 1278272 1845915 1365889 265163
35744B65163o98816J07529N52944P13464Q73903O80238j77767j000338q79197
$$ 265163 -433653 -326124 226820 940284 1814187 2494425 2316658 1316320 437123
35735D37123j62988J704n34920p67773k33627L55276M75873O01218J088542J330551
$$ 437123 274135 275839 -259081 -1026854 -1260481 -905205 -429332 171886 1260428 2590979
35725B590979P93904N3867q8705J22460o6692n90540p35345l90667j99639m82757
$$ 2590979 3384883 3438750 3350045 3472505 3405813 2815273 2079928 1689261 1489622 1006865
35715A006865p88903o25000m8283N80095R80958J025800P93141N83978N69338
$$ 1006865 217962 -407038 -455321 124774 1105732 2131532 2924673 3508651 4077989
35706D077989M85121K5914n60292p16848m02607k08650n41165j065035j147832
$$ 4077989 4563110 4589024 4028732 3311884 2909277 2700627 2159462 1094427 -53405
35697e3405o18278R8651M87943M50172K88121K22191P0874l67362p34440l94691
$$ -53405 -671683 -573032 -85089 365083 653204 875395 946269 578907 -155533 -550224
35687e50224N82550J248328R11036K891n84108n86547l10342N7318M14502L77953
$$ -550224 32326 1280654 2191690 2194581 1610473 1023926 713584 770902 1185404 1563357
35677A563357k62179r04263p48299K8391M99949L71841K66382N18822O06572J26341
$$ 1563357 1301178 396915 -351384 -322993 176956 548797 815179 1334001 1940573 2066914
35667B066914m64294n77829l45683k22600k45844j95858q4540l74J90565N48006
$$ 2066914 1602620 1024791 679108 456508 210664 14806 -69734 -70108 120457 668463
35657F68463P74073O34272L66362K96057L55298L41324L06520L06100J35575k48167
$$ 668463 1442536 2076808 2443170 2739227 3094525 3435849 3742369 4048469 4184044 3935877
35647C935877m43477k46915j74100p11318j376340j253423l03459N46013N57287
$$ 3935877 3492400 3245485 3071385 2360067 983727 -269696 -573155 -27142 530145
35638E30145j41516r22776j147954m80260O67989J230741P41553J80690O30144
$$ 530145 388629 -534147 -1682101 -2162361 -1494372 -263631 477922 658612 1288756
35629A288756J401049Q56223q88992j723727n77220Q81977O78499o48022j144455
$$ 1288756 2689805 3546028 2657036 933309 356089 1238066 1916565 1268543 124088
35620A24088m51728N6261k47081m43248R1320O62670O09388L68805M79156N58360
$$ 124088 -327640 -271379 -518460 -961708 -870388 -207718 401670 770475 1249631 1807991
35610A807991J03857m78466n07993j27812N8622L2276K25725O12323P08588L82763
$$ 1807991 1911848 1433382 925389 797577 856199 888475 1114200 1726523 2435111 2817874
35600B817874k964k24952m05905n90983o09661l99670r7525J79532L48473K91018
$$ 2817874 2814910 2589958 2184053 1593070 983409 583739 486214 665746 1014219 1305237
35590A305237Q2932N5802K36350O1031p65728j463379j055942R6062O23335R9750
$$ 1305237 1388169 1443971 1680321 1741352 975624 -487755 -1543697 -1447635 -824300 -724550
35580g24550l59561J69266J035034J015119J2667r86956j204698o32355L47687
$$ -724550 -1084111 -914845 120189 1135308 1147975 161019 -1043679 -1676034 -1328347
35571a328347J242931J557377J175413M96419j71615r89204j908068k146048j121320
$$ -1328347 -85416 1471961 2647374 3143793 2972178 1982974 74906 -2071142 -3192462
35562c192462M26964J158415Q46094M74764O45805Q56711N77353J02273j24860
$$ -3192462 -2765498 -1607083 -760989 -286225 359580 1216291 1793644 1895917 1771057
35553A771057k80628o84467j102032j107880p64498m21386j36800K26873N82547
$$ 1771057 1490429 805962 -296070 -1403950 -2168448 -2589834 -2726634 -2499761 -1917214
35544a917214P37836P23806O01791J78154o20693j264805j052351l4887R27596
$$ -1917214 -1179378 -455572 146219 324373 -296320 -1561125 -2613476 -2648363 -1720767
35535a720767J127675O95550K13718o1831l56016q25013j095980o02930N45055
$$ -1720767 -593092 102458 316176 254345 -101671 -926684 -2022664 -2625594 -2080539
35526b080539J327874Q58658m21655j132674o60525R9417L7825o70213r32661
$$ -2080539 -752665 105993 -315662 -1448336 -2108861 -2009444 -1971619 -2641832 -3574493
35517c574493k81386O11385R04897N46702J65201L18573R05223J193199N93323
$$ -3574493 -3855879 -3244494 -2339597 -1792895 -1627694 -1309121 -403898 789301 1382624
35508A382624m60849p86314N1433R65773O93610m29741q82321n5273R72782R67797
$$ 1382624 921775 135461 186894 1152667 1846277 1416536 534215 478942 1451724 2419521
35498B419521L3434q36357j050878p41423k36899K05480L54878J51974j69958
$$ 2419521 2452955 1616598 565720 -175703 -412602 -207122 147756 299730 129772
35489A29772l64752m42679m79642l87453j14865J38843J82844J37553K19262L64418
$$ 129772 -234980 -677659 -1157301 -1544754 -1659619 -1520776 -1337932 -1200379 -981117 -616699
35479f16699L20934K2508l24692m52981k21085K61460O05149M60976N258j61316
$$ -616699 -295765 -273257 -597949 -1050930 -1272015 -1010555 -405406 55570 60828 -100488
35469a00488K08231O13508M62539j31323n43466m48390q9925J36748M0833l36664
$$ -100488 107743 721251 1183790 1052467 509001 60611 -29314 107434 148267 -188397
35459a88397p24552p07671j34207N75845Q20916N18437J33919n622j05993m69851
$$ -188397 -912949 -1620620 -1754827 -1178982 -358066 160371 294290 288668 182675 -287176
35449b87176r04466q32958j7006R85649J271184N81709l09528m51993J25297M89514
$$ -287176 -1191642 -2024600 -2041606 -1055957 215227 796936 487408 35415 160712 650226
35439F50226P5140o05367p64523l82584j9709M5393n3306k46840n12924m89353
$$ 650226 725366 119999 -644524 -1027108 -1046817 -1001424 -1054730 -1301570 -1814494 -2303847
35429b303847K10195J203525J502582P40425k63093n15964o1990K37024j07170
$$ -2303847 -2093652 -890127 612455 1352880 1089787 573823 511833 748857 641687
35420F41687o93354q81214n65556j37451J02147K19374L50936M12402L08710K43475
$$ 641687 -51667 -932881 -1498437 -1635888 -1533741 -1314367 -963431 -551029 -242319 1156
35410A156M47532O54577L36981m16092q07648m30220J06125J43936K2305L88631
$$ 1156 448688 1103265 1440246 1024154 216506 -213714 -107589 36347 58652 447283
35400D47283Q95300O16312l46505p96762k10838M77277L45275j87118k09859K19401
$$ 447283 1342583 1958895 1612390 815628 604790 1082067 1427342 1240224 1030365 1249766
35390A249766L49408K4758k14291j53256j86362n25485q01544o39064j63807K42410
$$ 1249766 1599174 1623932 1409641 1256385 1070023 544538 -257006 -896070 -1059877 -817467
35380h17467L81167L18849K60345L79558N87984N33721N7195m70510n69560l00225
$$ -817467 -436300 -117451 142894 522452 1110436 1644157 1701352 1230842 661282 361057
35370C61057j15299j37251m1604K87627M59932J54512l55808n46246l06495l620
$$ 361057 245758 108507 66903 354530 814462 968974 613166 66920 -239575 -243195
35360b43195K1168j93448l52650k49771K4765J91617J34325J03249M12777R08795
$$ -243195 -222027 -415475 -768125 -1017896 -993131 -801514 -667189 -563940 -151163 757632
35350G57632R62704J91672r32937j470333j049664k82266L0638j05037p302O10288
$$ 757632 1720336 1912008 979071 -491262 -1540926 -1823192 -1792554 -1897591 -1904893 -1294605
35340a294605J157248R75023K50910k65831k25863Q8629L42552M47594L33033
$$ -1294605 -137357 837666 1088576 822745 596882 685511 1028063 1475657 1808690
35331A808690m3391m06549l98618j59701j24373k03509J06992O46519N24223m16523
$$ 1808690 1765299 1358750 960132 800431 676058 472549 579541 1226060 1750283 1333760
35321A333760r86161k72615Q83273J019555J02757o68212p43327o66126p39507
$$ 1333760 347599 74984 958257 1977812 2080569 1412357 669030 2904 -736603
35312g36603n43511j0715K02617j18944k21695L94587J081976J053359N68875
$$ -736603 -1280114 -1290829 -1088212 -1207156 -1428851 -1034264 47712 1101071 1669946
35303A669946L39799L08452r2157p61947r14703k64772M60756M32392k37689o14371
$$ 1669946 2009745 2318197 2226040 1464093 549390 284618 745374 1177766 940077 325706
35293C25706k6781J066661J434495M67077r35110j294146l49950O55823O35225
$$ 325706 298925 1365586 2800081 3267158 2332048 1037902 687952 1343775 1979000
35284A979000p5583m79880l21769j11487j77967l80041n54299o49922n22569q9960
$$ 1979000 1903417 1423537 1101768 990281 812314 432273 -122026 -771948 -1294517 -1384477
35274a384477L91921O16430O61357P56292P96704N03879r5138p21331j152076
$$ -1384477 -992556 -376126 285231 1041523 1838227 2342106 2246968 1525637 373561
35265C73561j126226l44857Q95669J516486Q76869j50780k46636M44764N78853
$$ 373561 -752665 -1097522 -201853 1314633 2191502 2040722 1794086 2238850 2817703
35256B817703k26461p71623k00738O67765O78669L9379k68373q6827l9703k95121
$$ 2817703 2591242 1819619 1618881 2286646 2965315 3004694 2736321 2649494 2609791 2314670
35246B314670m35846m28819p13950j212619j132935j07573J102315J451652P84547
$$ 2314670 1878824 1450005 736055 -476564 -1609499 -1717072 -614757 836895 1621442
35237A621442j58022o19237m22765J11497N47291O45141M46045J16219j96397
$$ 1621442 1463420 844183 421418 532915 1080206 1725347 2171392 2287611 2091214
35228B091214l02813N369O16451R54515N63205k29419o48611m66447j84258j70939
$$ 2091214 1788401 1793770 2410221 3364736 3927941 3698522 3049911 2583464 2399206 2228267
35218B228267k00970q4353j53679o56015j127349r65075l13676K33154N57448
$$ 2228267 2027297 1942944 1789265 1133250 5901 -959174 -1272850 -1039696 -482248
35209d82248R31511J176733P82526n8071m38674q4694J50918l36600q39503m45603
$$ -482248 449263 1625996 2408522 2350451 1911777 1827083 1978001 1641401 801898 356295
35199C56295M07310N02013l27871r87014p27396m167M48611N29507M48670K45344
$$ 356295 763605 1265618 937747 -49267 -776663 -780830 -332219 197288 645958 891302
35189H91302J6100Q258J19559j03931o12490o50293J11871Q73938P48835j7839
$$ 891302 907402 915660 1035219 931288 318798 -331495 -219624 654314 1403149 1385310
35179A385310n27358m72419k10812l282P5611j92604q06251j132408o60520R8628
$$ 1385310 857952 385533 174721 171439 247050 54446 -751805 -1884213 -2544733 -2446105
35169b446105L13735J42036L35913P86344O93701J58914J97180Q67356Q40066
$$ -2446105 -2132370 -1990334 -1654421 -868077 -174376 -15462 181718 1049074 1889140
35160A889140m80289j720011j439368k23620L40379J1816j31634L56994P59591
$$ 1889140 1408851 -311160 -1750528 -1974148 -1633769 -1621953 -1753587 -1396593 -637002
35151f37002N70017J85151Q165j37321l57053k66602L22867Q67561P09129p4355
$$ -637002 -66985 118166 126331 -10990 -368043 -634645 -311778 555783 1264912 1190557
35141A190557p67343q10474l39707l6229m13111j119629j166492j43801J053253
$$ 1190557 423214 -387260 -726967 -763196 -1176307 -2295936 -3462428 -3606229 -2552976
35132b552976J208538L03149n54926o18108k09497J08162L18177O11630Q70110
$$ -2552976 -1344438 -1041289 -1596215 -2214323 -2423820 -2315658 -1997481 -1385851 -515741
35123e15741Q77472O39393K02424m33416r53593p62630K14228J146044J171623
$$ -515741 361731 1001124 1203548 770132 -183461 -946091 -731863 414181 1585804
35114A585804M01299l62787o48928n90928l70579N0928N93433Q99368P26571K81225
$$ 1585804 1987103 1624316 975388 384460 13881 64809 658242 1557610 2284181 2565406
35104B565406k6074p6236j54824n33086j002544r83456k04628Q53606J397088
$$ 2565406 2539332 2463096 2308272 1775186 772642 -210814 -415442 438164 1835252
35095A835252J126032M03474k54075n40949l46736J55121M07879k0860p32022
$$ 1835252 2961284 3364758 3110683 2569734 2222998 2378119 2785998 2765138 2033116
35086B033116q28692j27210N40009N05590J39660J12732L72310M56830L61412
$$ 2033116 1204424 1077214 1617223 2122813 2262473 2375205 2747515 3204345 3565757
35077C565757L72061L45995q4297p40760j051390r01351o56316m07985M0019M12292
$$ 3565757 3937818 4283813 4199516 3458756 2407366 1506015 849699 441714 481733 894025
35067H94025P4956p96807r94502J98570J826153K294189J300362O0361l27751
$$ 894025 968981 172174 -822328 -623758 1202395 3496584 4796946 4857307 4529556
35058D529556j04190j93305p63071r59741j41681J051286J334373M17124n89998
$$ 4529556 4425366 4232061 3468990 2509249 2367568 3418854 4753227 5170351 4580353
35049D580353o78288k52769l28724q66725q40769J04986J046790J099614N20069
$$ 4580353 3902065 3649296 3320572 2453847 1613078 1718064 2764854 3864468 4384537
35040D384537N9488r2371j74553k19053j52711j36228k25675l0757O98774J400241
$$ 4384537 4444025 4351654 4177101 3958048 3805337 3669109 3443434 3412677 4111451 5511692
35030E511692J211065L7692j343028k085975j792912n54128R52468J667148J128926
$$ 5511692 6722757 6760449 5417421 3331446 1538534 984406 1936874 3604022 4732948
35021D732948J26471k49769l2740j17544p09557r85708m65087K16707L24960M9169
$$ 4732948 4859419 4609650 4576910 4459366 3749809 2764101 2299014 2515721 2840681 2889850
35011B889850l6087Q1244O5536n8198o0790o5499l07212n27033k47902L91547
$$ 2889850 2853763 2935007 3000543 2942345 2881555 2816056 2508844 1981811 1733909 2125456
35001B125456O71457K58561l33217m29932k070M32253M85341K45803J7228r2592
$$ 2125456 2796913 3055474 2722257 2292325 2290255 2722508 3207849 3453652 3470880 3378288
34991C378288k25732m60322o06507m60727j54565N221M965J01582L02035K72213
$$ 3378288 3152556 2692234 2085727 1625000 1470435 1475656 1480621 1582203 1884238 2156451
34981B156451r1781m33780n15755n61374o66625l79740N35648J323114J030026
$$ 2156451 2064670 1630890 1115135 553761 -112864 -492604 43044 1366158 2396184
34972B396184o2737o64545k22939L73413J43174o67939j115342q53505l01019
$$ 2396184 2333447 1668902 1445963 1819376 1962550 1294611 179269 -674236 -975255
34963i75255J48344M57260O35975O52127O25607O73889N73771M788q17487j161278
$$ -975255 -826911 -369651 266324 918451 1544058 2217947 2791718 2796506 1979019 817741
34953H17741o03346M32260J117158J029245M44334k30J23419O15119P78089J97857
$$ 817741 214395 646655 1763813 2793058 3237392 3237162 3360581 3975700 4753789 4951646
34943D951646o11960o91922J39386R59759Q92296J73964l35264l68241l77991
$$ 4951646 4339686 3647764 3787150 4746909 5639205 5813169 5477905 5109664 4731673
34934D731673n99952o78191l44447J31804M31064O22697P93720O94709J85987
$$ 4731673 4131721 3453530 3109083 3240887 3671951 4294648 5088368 5783077 5969064
34925E969064l21916l70144j41854j35241l31697k59185J83402N43051N14494
$$ 5969064 5647148 5277004 5135150 4999909 4668212 4409027 4592429 5135480 5649974
34916E649974L22241K87463M41114O64106P98290N57665j83927r18366q87877
$$ 5649974 5972215 6259678 6700792 7364898 8163188 8720853 8536926 7618560 6730683
34907F730683j67377K25054l28273j122622j063041j24362O98015O78393O5254
$$ 6730683 6563306 6788360 6460087 5337465 4274424 4150062 4848077 5526470 5591724
34898E591724m18216l43711J41932N25491M46056J19474N3621K85978L28789L3916
$$ 5591724 5173508 4829797 4971729 5497220 5943276 6062750 6116371 6402349 6731138 6765054
34888F765054q9601K01296L09654k20534p57662m73973K73392M55674j6106k87840
$$ 6765054 6675453 6876749 7186403 6965869 6208207 5734234 6007626 6463300 6447194 6159354
34878F159354o5866L9404k14007k43044K18233N91223N20147M55563O13561L64161
$$ 6159354 6093488 6132892 5918885 5675841 5894074 6485297 7005444 7461007 8074568 8438729
34868H438729n71415j231630p23864K67595M11310k73254n52149K8748M88017
$$ 8438729 7867314 6635684 5911820 6179415 6590725 6317471 5765322 5794070 6282087
34859F282087j9877r61019j238936o19958J91822N71103N90912O92536J024462
$$ 6282087 6262210 5301191 4062255 3442297 3634119 4205222 4796134 5488670 6513132
34850F513132J214421Q09158q8427p87433p32242j07206M35755N03350K38415
$$ 6513132 7727553 8536711 8448284 7660851 6928609 6821403 7257158 7760508 7998923
34841G998923J4300M4187K10028J83141j59556m45431k16789L57957O18905L67356
$$ 7998923 8013223 8057410 8267438 8450579 8291023 7845592 7628803 7986760 8605665 8973021
34831H973021J51029L61912O30673M94005Q4024l24964q45995j419134j328520
$$ 8973021 9124050 9485962 10116635 10610640 10694664 10369700 9523705 8104571 6776051
34822F776051j58983J182902J398252N54270n8738K25045P00784N00663l10143
$$ 6776051 6617068 7799970 9198222 9752492 9693754 9918799 10619583 11120246 10810103
34813A0810103j042477j093122k39274J081451J748112J011080l60567q60208
$$ 10810103 9767626 8674504 8435230 9516681 11264793 12275873 11915306 11055098
34805A1055098k63276J79087j91775m14099M12634J551060J713154R02121R0373
$$ 11055098 10791822 10970909 10779134 10365035 10777669 12328729 14041883 14944004 15034377
34796A5034377l44644p10186q97350m17958M86843Q75546M60907N3281L38723
$$ 15034377 14689733 13979547 13082197 12664239 13151082 14026628 14487535 14540816 14879539
34787A4879539R40181J091689O87039K08967j0407j5748Q6872K93300N82697Q55023
$$ 14879539 15819720 16911409 17598448 17807415 17797008 17781260 17868132 18161432 18744129 19599152
34777A9599152R94643R12941N76920P4033l71767n00117j80463M39511R42056
$$ 19599152 20593795 21506736 22083656 22157689 21785922 21285805 21105342 21544853 22486909
34768B2486909R41023M85979O9161J08250M86746P15950N09277J11699O0713N92697
$$ 22486909 23427932 23913911 23983072 24091322 24578068 25294018 25803295 25914994 25975707 26568404
34758B6568404J231324J115156m248j183961j137494K41695J637593J829064J054294
$$ 26568404 27799728 28914884 28910636 27726675 26589181 26830876 28468469 30297533 31351827
34749C1351827M93015O92814J022846O61040k96223r06895m72480N77452J074064
$$ 31351827 31844842 32537656 33560502 34221542 33925319 33018424 32545944 33123396 34197460
34740C4197460N25453j31849L05858J542677J986342R29247l69860l98428N79520
$$ 34197460 34722913 34591064 34896922 36439599 38425941 39355188 38985328 38586900 39166420
34731C9166420J132596P92474M24991O02905Q08942N61336L28764P32012J504548
$$ 39166420 40299016 41091490 41516481 42119386 42928328 43489664 43818428 44550440 46054988
34722D6054988J897448J714546J348299J039592O80854K78520J11541L47462Q22922
$$ 46054988 47952436 49666982 51015281 52054873 52735727 53014247 53125788 53473250 54296172
34713E4296172J289840J636062J787777J656513J378522J417831K094886K997421
$$ 54296172 55586012 57222074 59009851 60666364 62044886 63462717 65557603 68555024
34705F8555024L222305K443034J473448J394595K271197L184240L444229L184256
$$ 68555024 71777329 74220363 75693811 77088406 79359603 82543843 85988072 89172328
34697H9172328K730085K154910J765169K221159L538545M612777M555379M029333
$$ 89172328 91902413 94057323 95822492 98043651 101582196 106194973 110750352 114779685
34689A14779685M314591N374437N952012N517394M953566N081901N614733O062129
$$ 114779685 119094276 124468713 130420725 135938119 140891685 145973586 151588319 157650448
34681A57650448O696211P862501R035734R424843R145121R019338R400335R858461
$$ 157650448 164346659 172209160 181244894 190669737 199814858 208834196 218234531 228092992
34673B28092992R988932R976133J0267575J1008656J1861596J2260464J1952470
$$ 228092992 238081924 248058057 258325632 269334288 281195884 293456348 305408818
34666C05408818J1370014J1207662J1502606J1515043J0766749R754996R201889
$$ 305408818 316778832 327986494 339489100 351004143 361770892 371525888 380727777
34659C80727777Q959329Q227109O671558M769056L094486J755817N44028p69602
$$ 380727777 389687106 397914215 404585773 409354829 412449315 414205132 414749160 413979558
34651D13979558k329609m065972n643434o779219p540890q102474q414101q477652
$$ 413979558 411649949 407583977 401940543 395161324 387620434 379517960 371103859 362626207
34643C62626207q710273r476984j0364698j0558007j0001277r559924r821959
$$ 362626207 353915934 344438950 334074252 323516245 313514968 303955044 294133085
34636B94133085j0322948j0309353r799207r426261r505000r683116r419952q538657
$$ 294133085 283810137 273500784 263701577 254275316 244770316 235087200 225667248 217128591
34628B17128591p403486o697919o816761p322752p301469o472976n592036n419377
$$ 217128591 209725105 203027186 196210425 188887673 181586204 175113228 169521192 164101815
34620A64101815n701744n694791n350404n230904n361638n045897m035332l091414
$$ 164101815 158400071 152705280 147354876 142123972 136762334 131716437 127681105 124589691
34612A24589691k926290l214566l246735l057523l153516l432469l259645k608036
$$ 124589691 121663401 118448835 115202100 112144577 108991061 105558592 102298947 99690911
34604I9690911k257605k597824k966397k634134j892188j589821j942599k388131
$$ 99690911 97433306 94835482 91869085 89234951 87342763 85752942 83810343 81422212
34596H1422212k435888k099096j568596j018124p79742j186990k033058k547865
$$ 81422212 78986324 76887228 75318632 74300508 73520766 72333776 70300718 67752853
34588F7752853k168790j158833l27889k91249j036990j995930k471570k221820
$$ 67752853 65584063 64425230 64097341 63806092 62769102 60773172 58301602 56079782
34580E6079782j672614j351737j169182o52132R7000K77403m64352j323210j352345
$$ 56079782 54407168 53055431 51886249 51234117 51331117 51608520 51144168 49820958 48468613
34571D8468613q26657q36456j613338k097112j449854l08618M2407o33003j316347
$$ 48468613 47641956 46805500 45192162 43095050 41645196 41336578 41378985 40745982 39429635
34562C9429635j143978m05061N0116q4202m38092o82466q91619j151076j213020
$$ 39429635 38285657 37880596 37930712 37846510 37408418 36725952 35834333 34683257 33470237
34553C3470237q34082k93686k18700p91166j382153j245381n07428j17336o36906
$$ 33470237 32636155 32342469 32123769 31332603 29950450 28705069 28197641 28080305 27443399
34544B7443399j378621j166909J06395J189679R43136l00626j209541j007362
$$ 27443399 26064778 24897869 25004264 26193943 27137079 26836453 25626912 24619550
34536B4619550j20004N51138M92326k35322j142085j553217j160620m57366k26648
$$ 24619550 24499546 25050684 25543010 25307688 24165603 22612386 21451766 20994400 20767752
34527B0767752n28951o66744k34140L83499P29321Q28760P29075K21167n04652
$$ 20767752 20238801 19572057 19337917 19721416 20450737 21279497 22008572 22229739 21725087
34518B1725087o82876j36773J03998p39637j749599j491378k38837L54789k53858
$$ 21725087 21042211 20905438 21009436 20269799 18520200 17028822 16789985 17144774 16890916
34509A6890916p87640k54963O01747O71225J80166P1654M14124M67736k2943n38545
$$ 16890916 16103276 15848313 16450060 17121285 17301451 17373105 17787229 18254965 18232022 17693477
34499A7693477p00906p30824q95816j022335p60626j06570M92676N70217J91991
$$ 17693477 16992571 16261747 15365931 14343596 13582970 13476400 13969076 14539293 14731284
34490A4731284o6037J24340L46374Q9749l76738m34079k10915l49964o98310l42960
$$ 14731284 14665247 14789587 15135961 15225710 14848972 14414893 14203978 13854014 13155704 12812744
34480A2812744P59200J364399P72155k3651J06502O81501N41527k21445n66024
$$ 12812744 13571944 14936343 15708498 15684847 15791349 16472850 17014377 16792932 16226908
34471A6226908k90445j76497n00850o86808n18597n22281q62025q83757j86678
$$ 16226908 15936463 15759966 15259116 14572308 14053711 13531430 12669405 11785648 11598970
34462A1598970O55522R06366N90902J96835m7501k00140k81960k73466k16090
$$ 11598970 12254492 13160858 13751760 13948595 13901094 13700954 13418994 13145528 12929438
34453A2929438j36987o1855j10921k96653k85038K31622R34132J103209N11977
$$ 12929438 12792451 12730596 12619675 12323022 12037984 12269606 13203738 14306947 14818924
34444A4818924l14554p89809q21995o32553m17368k63057o3170M84646J425494
$$ 14818924 14504370 13714561 12892566 12260013 11842645 11579588 11516418 12001064 13426558
34435A3426558K123833J768179M02261r28581j197124l41923P81026J163635M87918
$$ 13426558 15550391 17318570 17720831 16792250 15595126 15253203 16034229 17197864 17685782
34426A7685782n18845p49848j9786O14711K20886p47400j137382o47251M9796
$$ 17685782 17166937 16417089 16397303 17012014 17232900 16485500 15348118 14700867 14750663
34417A4750663M04196L80163L814n83985q25395m22214q3202n52228j167748p25331
$$ 14750663 15154859 15535022 15538836 14954851 14129456 13707242 13624040 13071812 11904064 11178733
34407A1178733L56763L70452r42951j736184q42227M11576K76948q53857j299735
$$ 11178733 11535496 11905948 10962997 9226813 8384586 8796162 9073110 8219253 6919518
34398F919518n70350L74434P59328O47286L11492j7654m0118J89795R0077n20299
$$ 6919518 6349168 6723602 7482930 8130216 8441708 8424054 8383936 8573731 8663808 8143509
34388H143509q66872l52191L95445N04013K45593M01221Q25651Q15873M32707
$$ 8143509 7276637 6924446 7319891 7823904 8069497 8470718 9296369 10112242 10544949
34379A0544949K12805k9895p57643j361464p71933O25935J221140N18985k18551
$$ 10544949 10757754 10727859 9970216 8608752 7836819 8462754 9683894 10202879 9984328
34370I984328n2917L53365J57648k93952l80766l87507p57481j015441n33320
$$ 9984328 9931411 10284776 10442424 10148472 9767706 9380199 8622718 7607277 7073957
34361G073957K05842K22517l84005n36667J76048Q97221P69628R4930j94685J68774
$$ 7073957 7279799 7502316 7118311 6581644 6757692 7654913 8424541 8519471 8324786 8493560
34351H493560N06263J69386n77938r25474o36155l65797o78630j179095j106018
$$ 8493560 8999823 9169209 8591271 7665797 7029642 6663845 5985215 4806120 3700102
34342C700102n04315j27455k30283k11861L33629Q95178P94043J57698l56232
$$ 3700102 3195787 3068332 2838049 2626188 2959817 3854995 4649038 4806736 4450504
34333D450504m90992n19257n80602m10156J61447P78408Q90377M42282p626P251
$$ 4450504 3959512 3440255 2859653 2449497 2610944 3389352 4279729 4722011 4714385 4721636
34323D721636K25468O6303l86167l59996M16510J093026P85869j66976p14362
$$ 4721636 4947104 5013407 4627240 4267244 4683754 5776780 6562649 6395673 5681311
34314E681311n25805j40192R0300K95123L74089j7529n81470m31984N45815J214626
$$ 5681311 5155506 5015314 5105614 5400737 5774826 5757297 5175827 4743843 5289658 6504284
34304F504284O24838o90121j447770j175335m73455q9620k62850p32821r40708
$$ 6504284 7129122 6439001 4991231 3815896 3342441 3252821 2989971 2257150 1316442
34295A316442m16307O61370J461833J351146N73121j03413j81293K53431O90478
$$ 1316442 900135 1561505 3023338 4374484 4947605 4844192 4662899 4916330 5606808
34286E606808N34428l25203j155736j064056j74927M53975K80517r0117o5059
$$ 5606808 6141236 5816033 4660297 3596241 3421314 3875289 4155806 4065689 4000630
34277D000630j936l37447n53482M0292R73466J093741K11415o37857n75011K00753
$$ 4000630 3998694 3661247 3107765 3148057 4121523 5215264 5426679 4788822 4213811 4414564
34267D414564Q93857R16106K22506o33244q64526l53901M5398l14087p70914k94368
$$ 4414564 5308421 6224527 6447033 5813789 4949263 4595362 4640760 4326673 3555759 3261391
34257C261391P67465J042291K50748l14260J77983Q06780M16945n60118q43167
$$ 3261391 4028856 5071147 5321895 5007635 5185618 5992398 6409343 5849225 5006058
34248E006058k40352K68522J25833j87293j53338P4621J93275K56039L43209K88863
$$ 5006058 4765706 5034228 5160061 4972768 4819430 4894051 5087326 5343365 5686574 5975437
34238E975437Q8358J04031M50475N75291q722q17110q63317m4057N83585J93694
$$ 5975437 6063795 6167826 6618301 7193592 7184870 6367760 5504443 5460386 6043971 6237665
34228F237665o47335p23901J80367R95911P84296j04031n92590k54897K92218
$$ 6237665 5590330 4866429 5046796 6042707 6827003 6722972 6130382 5875485 6167703
34219F167703K79697l04115q10671p42618k80393K3814l5881j04058J41108M12990
$$ 6167703 6447400 6143285 5332614 4589996 4309603 4333417 4297536 4193478 4334586 4747576
34209D747576J85363m34246o76824j35289O01312O76578M4585n77435o56456l19413
$$ 4747576 4932939 4498693 3821869 3686580 4287892 4964470 5009055 4431620 3775164 3455751
34199C455751M8213K49316K52419P1578j67543k41904n8067K18595L18971J05103
$$ 3455751 3503964 3753280 4005699 4077277 3909734 3667830 3609763 3828358 4147329 4252432
34189D252432l23849o87815p39275m86662j26125K56572O86555R35385N60786
$$ 4252432 3928583 3240768 2501493 2014831 1888706 2145278 2831833 3767218 4328004
34180D328004l64521r40304m25781O38683R61967J73484p31953q36274m77077
$$ 4328004 3963483 3023179 2597398 3236081 4198048 4371532 3639579 2803305 2326228
34171B326228m82960p95565o39289J29403O74341L73720k78034l67207K47782
$$ 2326228 1843268 1047703 408414 537817 1212158 1585878 1307844 940637 1188419
34162A188419R28517J217390J254749J236771R99194L87727l26029p26989p44224
$$ 1188419 2116936 3334326 4589075 5825846 6825040 7212767 6886738 6159749 5415525
34153E415525n78337l49539j29895j19620l93352o14970m39819q2343J0289o4891
$$ 5415525 4837188 4487649 4357754 4238134 3844782 3229812 2789993 2707650 2717939 2653048
34143B653048J47659N23273L93847k89281o70300k86990J51642q3175n31616l29676
$$ 2653048 2800707 3323980 3717827 3428546 2758246 2471256 2622898 2539723 2008107 1678431
34133A678431L42856N79162J92166j59954j51770r8195r3960J59516N41174M99954
$$ 1678431 2021287 2600449 2792615 2632661 2480891 2382696 2288736 2448252 2989426 3489380
34123C489380R6987Q1159N53292N66535l27140j077172n79594N84217R33428K17079
$$ 3489380 3586367 3667526 4220818 4787353 4460213 3383041 2803447 3387664 4321092 4538171
34113D538171l91938j73818J90975j24266p97786r36912m17572N8281Q5386J04683
$$ 4538171 4146233 3972415 4163390 4039124 3241338 2304426 1886854 1945135 2030521 2135204
34103B135204O63140J521010J843788J198959O1746p58690r68707q73375p75388
$$ 2135204 2798344 4319354 6163142 7362101 7423847 6665157 5696450 4823075 4047687
34094D047687o08756k02638L34236O20932L41692l89317r34077o03020N21460
$$ 4047687 3438931 3236293 3570529 4191461 4533153 4143836 3209759 2606739 3128199
34085C128199J421823J204223J99561m81612m11451k12750l95698o01972l59269
$$ 3128199 4550022 5754245 5953806 5472194 5060743 4847993 4452295 3850323 3491054
34076C491054J17598M16706O22774Q73261P54749l1879p77678n07632N03902R45247
$$ 3491054 3608652 4025358 4648132 5521393 6276142 6244263 5466585 4958953 5462855 6408102
34066F408102K92912n27045n87607j46263J41211L66546R12851J378011R26284
$$ 6408102 6701014 6173969 5586362 5440099 5581310 5947856 6860707 8238718 9165002
34057I165002l78446j419987j373165o03273n112O6893r7822j67889q0153J00574
$$ 9165002 8786556 7366569 5993404 5390131 5385019 5451912 5354090 5186201 5106048 5206622
34047E206622K89684L61333K49984R2764R2089J98162R4459l96676j000450j230217
$$ 5206622 5496306 5857639 6107623 6200387 6292476 6490638 6585097 6188421 5187971 3957754
34037C957754r26151m11134n8526J48216M58801Q39115Q99320M72476L2960K26239
$$ 3957754 3031603 2620469 2561943 2710159 3168960 4008075 4907395 5379871 5412831 5639070
34027E639070J008316J556548J169605P5013q06367p89787j5630P54766Q01545
$$ 5639070 6647386 8203934 9373539 9448552 8642185 7852398 7836768 8591534 9393079
34018I393079M9015q15261r41445k30031M81702L77892l37632p38990l75113K76581
$$ 9393079 9442094 8626833 7685388 7455357 7937059 8314951 7977319 7238329 6863216 7139797
34008G139797N74422M31311J02931k42119m17101j22059N78835R88880N21689
$$ 7139797 7714219 8145530 8248461 8006342 7589241 7467182 8046017 9034897 9556586
33999I556586m42830r62554p15276k48871n1813L9634L07359N36065L32222j91628
$$ 9556586 9113756 8151202 7435926 7187055 7135242 7174876 7482235 8018300 8350522 8158894
33989H158894m46661p2666O04045Q86278M47559k73479n21831j28106K36794p0523
$$ 8158894 7712233 7639567 8243612 9129890 9577449 9303970 8782139 8654033 8890827 8820304
33979H820304p40892q59671j34348O89080P83438K37411j60757Q2959O42485P81845
$$ 8820304 8079412 7219741 7085393 7774473 8557911 8795322 8634565 8717524 9360009 10141854
33969A0141854J78943o61110r05549m03848M3479k55312q19290n90805M89389
$$ 10141854 10320797 9659687 8754138 8350290 8393769 8138457 7319167 6728362 7217751
33960G217751J277090R99899K62891J3738J85807Q6014l31491m48646q6280K08196
$$ 7217751 8494841 9494740 9757631 9771369 9957176 10043190 9711699 9263053 9176773 9384969
33950I384969O4224k18751k94906k99122m30384m72793j38109M08175P60035Q26818
$$ 9384969 9449193 9230442 8935536 8636414 8206030 7733237 7595128 8003303 8763338 9590156
33940I590156Q01201P00304L70428l7683n1615M37455Q11654M34125m32565q66281
$$ 9590156 10391357 11091661 11462089 11424406 11372791 11810246 12621900 13056025 12623460 11757179
33930A1757179m85423L8754r3555p32745j006467m27201O19214J384866J380092
$$ 11757179 11271756 11310510 11216955 10484210 9477743 9050542 9669756 11054622 12434714
33921A2434714N81028n20270j068421n42332N55891J120968P08326k4758k95304
$$ 12434714 13015742 12495472 11427051 10884719 11440610 12561578 13269904 13245146 12949842
33912A2949842j12090R3503K56144N60514Q31940O57973Q0746l39820k51705O7991
$$ 12949842 12837752 12931255 13187399 13747913 14579853 15237826 15318572 14978752 14727047 14795038
33902A4795038J56562l2202j36789J44730P38171J283511J434376J074869L52443
$$ 14795038 14951600 14919398 14782609 14927339 15665510 16949021 18383397 19458266 19810709
33893A9810709l88627p50765n82506k14628j31951k40961J60307J298732K224788
$$ 19810709 19422082 18671317 18088811 17874183 17742232 17501271 17661578 18960310 21185098
33884B1185098J901794P70754L05951R61617J590894J270231O54973P80133J379229
$$ 21185098 23086892 23857646 24163597 25125214 26716108 27986339 28641312 29421445 30800674
33875C0800674J439380R03846O65757J032055J299828J004038O58491R19346J700020
$$ 30800674 32240054 33143900 33809657 34841712 36141540 37145578 37804069 38723415 40423435
33866D0423435K485183K983893L088970K643077J731988R78538J073650K000914
$$ 40423435 42908618 45892511 48981481 51624558 53356546 54335084 55408734 57409648
33858E7409648L004069L381390L129700K723378K461338K318951K381772K913056
$$ 57409648 60413717 63795107 66924807 69648185 72109523 74428474 76810246 79723302
33850G9723302L684724L758355K637304J347012J410550K730714L553908K844048
$$ 79723302 83408026 87166381 89803685 91150697 92561247 95291961 98845869 101689917
33842A01689917J581114J097228J224268J050948N92614M76884N96462L84569
$$ 101689917 103271031 104368259 105592527 106643475 107236089 107712973 108309435 108694004
33834A08694004K8750Q5643J56241o47734j994777k549979k049207j712461k222059
$$ 108694004 108722754 108808397 108964638 108316904 106322127 103772148 101722941 100010480 97788421
33825I7788421k704178k353026j785036j906895k463766k680423k564322k596910
$$ 97788421 95084243 92731217 90946181 89039286 86575520 83895097 81330775 78733865
33817G8733865k709629k512405k153462k114500k419638k738250k993731l226159
$$ 78733865 76024236 73511831 71358369 69243869 66824231 64085981 61092250 57866091
33809E7866091l146246k507026j702006j336306j357305j232287q67107p08832
$$ 57866091 54719845 52212819 50510813 49174507 47817202 46584915 45717808 45008976
33801D5008976r48852j224703j228653j129978j200112j359881j340007j131968
$$ 45008976 44060124 42835421 41606768 40476790 39276678 37916797 36576790 35444822
33793C5444822j053101j315750j634814j466906p41385j11025j82775p03003r39909
$$ 35444822 34391721 33075971 31441157 29974251 29232866 29121841 28939066 28236063 27296154
33784B7296154p24498n43743o49991p48610o71567o77335q60180r14964p76322
$$ 27296154 26571656 26027913 25377922 24629312 23957745 23280410 22420230 21505266 20728944
33775B0728944q45968j219973j316124p35063L6116K66920r7810n84589q42106
$$ 20728944 19882976 18663003 17346879 16611816 16647932 16914852 16817042 16232453 15390347
33766A5390347p59054l47281J31041L14258K74009M07906O21037L22469m73481
$$ 15390347 14631293 14284012 14415053 14729311 15003320 15411226 16032263 16354732 15881251
33757A5881251q92837n19946q7626k29842m55832j82116Q8542l51749j068885
$$ 15881251 14988414 14468468 14380842 14151000 13695168 13513052 13601594 13249845 12180960
33748A2180960j145684o45062l00304k22458o1878k1736m73777q90496m45578
$$ 12180960 11035276 10390214 10089910 9867452 9805574 9783838 9310061 8419565 7973987
33739G973987N29061R62496P43448O44230O59369m6741j371695j993942j303787
$$ 7973987 8503048 9465544 10208992 10853222 11512591 11465850 10094155 8100213 6796426
33730F796426k48520K80791N85225J009404R45249n8339j181702j356465p03919
$$ 6796426 6547906 6828697 7413922 8423326 9368575 9310236 8128534 6772069 6068150
33721F068150n7979L12706O07317O67630K10964m35661o75940m96442k72164J2043
$$ 6068150 6010171 6322877 6930194 7597824 7808788 7373127 6697187 6200745 5928581 5940624
33711E940624N80884J083472Q10739k26813j106050j091498m68471l1745n6053
$$ 5940624 6521508 7604980 8415719 8188906 7082856 5991358 5522887 5491142 5435089
33702E435089r1394K89081Q33514R28188M87952J31911K59982L79706j42739r69796
$$ 5435089 5343695 5632776 6466290 7394478 7882430 8014341 8274323 8654029 8511290 7541494
33692G541494j148997m89865J98626L39413K66764M09407N31969K37296l07647
$$ 7541494 6392497 5902632 6101258 6440671 6707435 7116842 7648811 7886107 7578460
33683G578460n90497l47068L20872J030108J169070L94353p37426j210548q14437
$$ 7578460 6987963 6640895 6961767 7991875 9160945 9555298 8817872 7607324 6792887
33674F792887l12050j59534Q0695O55950R00793L00538n13116o73614l61065k83704
$$ 6792887 6480837 6321303 6401998 7057948 7958741 8259279 7746163 7072549 6711484 6427780
33664F427780m18723k68199Q038k08786q00905r26276k79867N07054Q31472P27817
$$ 6427780 6009057 5740858 5748896 5540110 4739205 3812929 3533062 4040116 4871588 5599405
33654E599405L97376j27088o25248o59522k15758J38901M4645j44024L1773L94936
$$ 5599405 5996781 5869693 5244445 4584923 4369165 4508066 4552711 4408687 4440460 4835396
33644D835396M17332L7555k44779j04762J36829q399m46788o02837k99394p6167
$$ 4835396 5252728 5290283 5045504 4940742 5077571 5069172 4622384 4019547 3720153 3643986
33634C643986l12555m82906P8103R54082J076219L68526l1066N02597J104061
$$ 3643986 3331431 2848525 2926628 3880710 4956929 5325455 5294389 5796986 6901047
33625F901047P41508l05833j024627j061524p56609l35134J03892K27463q2953
$$ 6901047 7642555 7336722 6312095 5250571 4493962 4158828 4262720 4490183 4407230
33616D407230k89015K7700L61464Q8997l71904k06936L73281N09081K51283M55242
$$ 4407230 4118215 4145915 4507379 4596376 4224472 4017536 4390817 4899898 5151181 5606423
33606E606423J115852J151196J58342q29444q52149k64548J16605J90181J99086
$$ 5606423 6722275 7873471 8031813 7202369 6350220 6085672 6202277 6392458 6591544
33597F591544m1037p07032j265216j022368j47152M98084M16159j14791n61999
$$ 6591544 6550507 5843475 4578259 3555891 3408739 3906823 4322982 4208191 3646192
33588C646192o37915l37372J73642O59088R44350R43286N84113r7642p79939j028032
$$ 3646192 3008277 2670905 2844547 3503635 4447985 5391271 5975384 5877742 5097803 4069771
33578D069771p42018k58675J2951r4572m54423o72053l25535M91217J041857P71632
$$ 4069771 3327753 3069078 3082029 2987457 2533034 1860981 1535446 2026663 3068520 3840152
33568C840152P6029k32813l0127J36551m032k03381l04794l63145k05173L39507
$$ 3840152 3916181 3683368 3653241 3789792 3785760 3582379 3277585 2914440 2709267 3048774
33558C048774P91229M87838k60863m71498o7147l2200o65490r03956l4157J043989
$$ 3048774 3840003 4327841 4066978 3595480 3528333 3496133 2830643 1926687 1892530 2936519
33548B936519J149754N00183P1292M2286m6133j63002M6226L22924J05299m26479
$$ 2936519 4086273 4586456 4657748 4700034 4653901 4490899 4537125 4860049 4965348 4538869
33538D538869n88805l27419j82704k40548p4209K69052J73067m80577r59030o64815
$$ 4538869 3950064 3622645 3439941 3199393 3125184 3394236 3567303 3086726 2127696 1462881
33528A462881J18697O77099N91789n4650p20841o67914K69776J200766J088475
$$ 1462881 1581578 2258677 2850466 2795816 2074975 1407061 1676837 2877603 3966078
33519C966078J45976l92281K8703O15159N20355R027j81569j7897m3918m24901
$$ 3966078 4112054 3719773 3748476 4363635 4883990 4893017 4711448 4693551 4649633 4224732
33509D224732p59424p34471m56600j26083K07542M54745L56602k04954q43488
$$ 4224732 3465308 2730837 2274237 2148154 2355696 2810441 3167043 2962089 2118601
33500B118601q83882j21506P68509Q96960K44445l15006k04786J41860J06223
$$ 2118601 1234719 1113213 1881722 2778682 3023127 2708121 2503335 2645195 2751418
33491B751418j16982J2451L08347J30910l84447l31564N33299J241718R37524
$$ 2751418 2634436 2646887 2955234 3086144 2701697 2370133 2903432 4145150 5082674
33482E082674L5933n29082o54598r11256j334010j227885l12396N95379M70017
$$ 5082674 5118607 4589525 3934927 3023671 1689661 461776 149380 744759 1214776
33473A214776o05885j430850j020372L27778J457251J624474J047333L20951k11834
$$ 1214776 608891 -821959 -1842331 -1514553 -57302 1567172 2614505 2935456 2723622
33464B723622m00890j61167K32136J93401l41410n72921M1404P44371M21079o72784
$$ 2723622 2322732 2161565 2393701 2587102 2245692 1672771 1714175 2458546 2879625 2206841
33454B206841j168508n60126K00025L24462K53061N42707P66164L74920j60916
$$ 2206841 1038333 478207 678232 1002694 1255755 1798462 2564626 2939546 2778630
33445B778630p2667M20902N64565L75735M31153O31208L47381k56436k71789L59718
$$ 2778630 2705963 3126865 3691430 4067165 4498318 5129526 5476907 5220471 4948682 5308400
33435E308400M82976m94033j468095j107400K40756J048513O52453j32002l67812
$$ 5308400 5791376 5297343 3829248 2721848 2962604 4011117 4663570 4531568 4163756
33426D163756j02090J12986J43923K64588N24249N75653J60103m51764o37985
$$ 4163756 4061666 4174652 4318575 4583163 5107412 5683065 5843168 5391404 4753419
33417D753419q8113P44848J020369M51717l06422m45795j7584K33239j0091k28384
$$ 4753419 4665306 5410154 6430523 6882240 6575818 6130023 6112439 6345678 6335587 6107203
33407F107203J3804K92736k5891p22643r83337o13205k65943l33011l30079K13857
$$ 6107203 6121007 6413743 6387852 5665209 4681872 4068667 3802724 3469713 3139634 3353491
33397C353491Q63853Q98955M52489L07746O63200Q09512J80087q25963j336087
$$ 3353491 4217344 5116299 5568788 5876534 6539734 7349246 7529333 6703370 5367283
33388E367283r76792j31842N22861N69372J30151k70554k61840l1885L0040j7208
$$ 5367283 4390491 4258649 4781510 5350882 5481033 5210479 4948639 4916754 4946794 4929586
33378D929586K01038O08612O15596L9230m47216j92321M88789P22140K06800n11003
$$ 4929586 5130624 5739236 6354832 6394062 5946846 5754525 6243314 6965454 7172254 6661251
33368F661251p93325n58268j92743q5514k52733l32989p9075J50165k14581r31081
$$ 6661251 5867926 5309658 5116915 5031401 4778668 4445679 4366604 4516769 4302188 3371107
33358C371107r14965L03910J634772J668134N20616m22456m36807j33140j08988
$$ 3371107 2456142 2760052 4394824 6062958 6583574 6161118 5724311 5591171 5482183
33349E482183m295N89045J144351R11812J15210l43629j33849K33317K68042K8894
$$ 5482183 5477888 6066933 7211284 8123096 8238306 7894677 7760828 7994145 8262187 8291081
33339H291081j98497k33085K2015M91806P86054N38602r0207o24109r31283j187858
$$ 8291081 8092584 7859499 7881514 8373320 9159374 9697976 9607769 8983660 8052377 6864519
33329F864519j221844n88008M92262R90034L61524n91658p94113l69597k33959
$$ 6864519 5642675 5054667 5546929 6536963 6898487 6306829 5512716 5143119 4909160
33320D909160n15557m09578L28859Q06602L69378l13088k57098L57686N74152
$$ 4909160 4393603 3984025 4312884 5119486 5488864 5175776 4918678 5276364 5850516
33311E850516J53104k24031j15219J99636M28716O11121N93820K6696q01416r78670
$$ 5850516 6003620 5779589 5664370 5864006 6292722 6903843 7497663 7524359 6722943 5744273
33301E744273l35461K5975o81937j527516j075811M17365J233284N79609m25365
$$ 5744273 5408812 5434787 4752850 3225334 2149523 2566888 3800172 4379781 3954416
33292C954416m77207K16529N49350R5502o15045r59041p33877q9617N38165O57298
$$ 3954416 3477209 3693738 4243088 4338590 3723545 2764504 2030627 1941010 2479175 3136473
33282C136473L05294J34010M97802Q30601M81007k21110m88447l78269n95785
$$ 3136473 3441767 3575777 4073579 4904180 5385187 5164077 4675630 4297361 3701576
33273C701576j045239p31325N12904J296259M80786j061495j544578o77281J76862
$$ 3701576 2656337 1925012 2437916 3734175 4214961 3153466 1608888 931607 1108469
33264A108469J38230j27070J64252N34497J20279p62317r62188k07908M90584
$$ 1108469 1246699 1119629 1283881 1818378 1938657 1176340 214152 6244 496828
33255D96828L20451k63735l83756n0390L0111l26950n26448k27527P0430j18004
$$ 496828 817279 553544 169788 119398 149509 -177441 -703889 -931416 -860986 -978990
33245i78990l43229J70230J189376J547781P50159k25722k57336L30183K95021
$$ -978990 -1322219 -1151989 37387 1585168 2335327 2109605 1852269 2182452 2477473
33236B477473o18261j247100o88788M23670Q62257M44327K2828J19394L23541
$$ 2477473 1859212 612112 -76676 346994 1209251 1653578 1676406 1795800 2119341
33227B119341R7329m26404o90005m15501J45567M96062L45399r3624l04670j32255
$$ 2119341 2216670 1790266 1100261 684760 830327 1326389 1671788 1578164 1273494 1141239
33217A141239p6767n83700j199830r95943J15075J071787R47808P3375m90594
$$ 1141239 1064472 480772 -719058 -1715001 -1599926 -528139 419669 493044 2450
33208B450k42039M13207Q54918Q49229N53024K83584K75261M38015M09126O726
$$ 2450 -239589 173618 1028536 1877765 2430789 2714373 2989634 3427649 3836775 3843501
33198C843501n04426p78747q21737q06634o76536k87976J86947M08199L77797
$$ 3843501 3339075 2560328 1738591 931957 255421 -32555 154392 562591 940388
33189I40388M01620N01625K73555m65199j159674r68392K46632J545517J709880
$$ 940388 1342008 1843633 2117188 1651989 492315 -476077 -229445 1316072 3025952
33180C025952N15219r31728j375020q24141l46666m51806l94488N15950J612062
$$ 3025952 3541171 2609443 1234423 410282 63616 -388190 -782678 -266728 1345334
33171A345334J666101O06114m60882p96141o90345n62333l58558j11368k01535
$$ 1345334 3011435 3617549 3156667 2360526 1670181 1107848 749290 637922 436387
33162D36387o03570o18515Q4321P91057P23494J50088j59422j10542j32856k18061
$$ 436387 -167183 -785698 -701377 89680 813174 963262 803840 693298 560442 342381
33152C42381r203L08996J44729m13690n36780O1457N83972L31561k61944l75211
$$ 342381 333178 642174 786903 373213 -163567 -102110 481862 813423 551479 176268
33142A76268n6553K4434j98340q1727N45486R27651N11533j21269j15747K74375
$$ 176268 119715 144149 -54191 -135918 409568 1337219 1848752 1727483 1611736 1886111
33132A886111O1129p78653j019764m9361R22989M37444j014315j556429n48947
$$ 1886111 1947240 1168587 148823 99462 1022451 1459895 445580 -1110849 -1659796
33123a659796O48313P97494L93986M54985P92955N94583J1242r9380K83737L05186
$$ -1659796 -1011483 -213989 179997 634982 1427937 2022520 2033762 1934382 2218119 2523305
33113B523305k65324o40956l46669Q9508J54611J47145M35486O95145N13487J38915
$$ 2523305 2257981 1617025 1270356 1359864 1514475 1661620 2097106 2792251 3305738 3444653
33103C444653m2467k60183q36798j304821r26879K5522L89817l22780j194968
$$ 3444653 3402186 3142003 2305205 1000384 73505 99027 488844 166064 -1028904
33094a028904j093849r0728P68297Q22904M13030J70130J95216K05615J83441
$$ -1028904 -2122753 -2213481 -1445184 -622280 -209250 -39120 156096 361711 545152
33085E45152M02179Q13214Q91383L42353m09317p98583q58529r03114p85559j79130
$$ 545152 947331 1760545 2651928 2994281 2584964 1786381 927852 24738 -760821 -939951
33075i39951N45132N84516l9717l76641j3763K39022l11302j042691r64948k33529
$$ -939951 -394819 189697 149980 -226661 -240424 -1402 -312704 -1355395 -2320343 -2553872
33065b553872K26327J82148J72164L58196L42698J05667J40697N34242P90942
$$ -2553872 -2327545 -2145397 -1973233 -1615037 -1272339 -1166672 -1025975 -491733 299209
33056B99209P30444O84193O09845k3900j096839j550310q42763J37417L41570
$$ 299209 1029653 1713846 2323691 2299791 1202952 -347358 -1190121 -1052704 -711134
33047g11134L1211J26376O51243Q25194M12928J1853N1037L27117N56572O67363
$$ -711134 -679923 -553547 97696 922890 1335818 1347671 1398708 1725825 2282397 2949760
33037B949760N06098n3957o53368p76481o08783q13265j293286j039969L43918
$$ 2949760 3455858 3401901 2748533 1972052 1363269 550004 -743282 -1783251 -1439333
33028a439333J721618J708065M11290q13103j073998p10480m30202l59504j48784
$$ -1439333 282285 1990350 2401640 1588537 514539 -195941 -626143 -985647 -1134431
33019a134431L81378R49979J058220M86757l55418o89839j75934O47020R65376
$$ -1134431 -753053 196926 1255146 1741903 1386485 696646 520712 1167732 2133108
33010B133108O25165J54840n0042j39334l40800n05606l76786n4948R7924p4648
$$ 2133108 2758273 2913113 2863071 2723737 2382937 1877331 1500545 1445597 1543521 1468873
33000A468873l70734n10222m17097k36073j69605k85809m24453l25461Q7951N77967
$$ 1468873 1098139 587917 170820 -65253 -234858 -520667 -945120 -1270581 -1182630 -604663
32990f04663P86439N41350l0878o18909r06415p26155j63404M58788P65881O09145
$$ -604663 181776 723126 692248 73339 -833076 -1559231 -1722635 -1263847 -497966 111179
32980A11179K17681J2895J55914L25994J48616j85447j10734L50440L33116o45463
$$ 111179 328860 341755 497669 823663 972279 786832 676098 1026538 1359654 714191
32970G14191j614575j164256N29836J674845J156088p7003n18606j30092Q5804
$$ 714191 -900384 -2064640 -1534804 140041 1296129 1219126 700520 570428 656232
32961F56232j09334m4107M29981O27702K76621o7090j34109l72146q25602p13001
$$ 656232 546898 502791 932772 1560474 1837095 1770005 1635896 1263750 438148 -274853
32951b74853J75167P14022O3688q23905n26611O52837J185084O51958J09052J57716
$$ -274853 -99686 614336 678024 -145881 -672492 -19655 1165429 1817387 1926439 2084155
32941B084155J80423j81894k46349L38099O68282k3659r86855j002354j69556
$$ 2084155 2264578 2082684 1836335 2174434 2842716 2819057 1832202 829848 660292
32932F60292M10883L04277M2724o315n1812j77248j28135O3287k2185m62575p40289
$$ 660292 1071175 1375452 1418176 1411861 1360049 1182801 1054666 1117953 1095768 633193 -107096
32921a07096m21314L23552R69719J050783L73778p06346j288340p70369K88030
$$ -107096 -528410 -204858 764861 1815644 2189422 1483076 194736 -575633 -287603
32912b87603P27727K51952l04962k51278J54956M13493N34758O22444L51708m94048
$$ -287603 440124 692076 387114 135836 290792 704285 1239043 1861487 2213195 1719147
32902A719147j365897j468678p51566J08104N52592N59150L74127K53065L68723
$$ 1719147 353250 -1115428 -1866994 -1758890 -1206298 -647148 -273021 -19956 348767
32893C48767O24974O42202K07746l73901o23928m26479r391L73135M87637J55549
$$ 348767 973741 1615943 1823689 1449788 825860 399381 389990 763125 1250762 1406311
32883A406311m19672o61516l49323j7772j56903l62029P0238R34122J267272O77827
$$ 1406311 986639 325123 -24200 -41972 -198875 -560904 -490666 443456 1710728 2388555
32873B388555j95892o16856m86001o4854L71973M71276N3696l98505j95004M28394
$$ 2388555 2192663 1575807 1089806 1024952 1396925 1868201 1921897 1523392 1328388 1756782
32863A756782M19419n33343j424944j419718j001261q78852o36080L98298J559851
$$ 1756782 2176201 1642858 217914 -1201804 -2203065 -3081917 -3717997 -3319699 -1759848
32854a759848J523562L69544m16343j22146L42715J47476k07013k9305K89824
$$ -1759848 -236286 133258 -283085 -405231 -62516 84960 -122053 -151358 138466
32845A38466J14073j70139J59974P59164O65165j29455o88723o04174l36056p3270
$$ 138466 252539 82400 242374 1001538 1666703 1537248 848525 244351 -91705 -164975
32835a64975N39988J272635J137048l3945r20500m98947L88175L25034m74860
$$ -164975 375013 1647648 2784696 2750751 1830251 1331304 1719479 2044513 1569653
32826A569653n70178L86764J126297P21722j81255n80096n25143n99358p48900
$$ 1569653 999475 1386239 2512536 3234258 3053003 2472907 1947764 1348406 599506
32817E99506m87463J41088N92528O50494O03539O61382O73468M02030k36412j068699
$$ 599506 112043 253131 845659 1496153 2099692 2761074 3434542 3836572 3600160 2531461
32807B531461j555280j107855P4661Q38600L27067q44124j304850o44776L05834
$$ 2531461 976181 -131674 -57013 781587 1108654 264530 -1040320 -1685096 -1379262
32798a379262P82803Q14590N88748M1416n83189o16676N9900O12361M07161m9199
$$ -1379262 -596459 218131 806879 848295 265106 -351570 -291670 320691 727852 678653
32788F78653k42K98303O9915n96096q17514k88640L31965M95389L97182L14946
$$ 678653 678411 976714 1046629 450533 -366981 -655621 -323656 171733 568915 883861
32778H83861Q0958l78702n85523j09713P32965J238258J125188O32041M3314m89970
$$ 883861 964819 586117 594 -109119 623846 1862104 2987292 3619333 3662647 3172677
32768C172677q07719p87586n07112j44938K08918N01113O26752N53566L63557
$$ 3172677 2364958 1577372 1070260 925322 1134240 1635353 2262105 2815671 3179228
32759C179228M8960m54776q69100o32512K60481Q91454M75898m92623q67960m63521
$$ 3179228 3228188 2773412 1904312 1271800 1532281 2423735 2899633 2407010 1539050 1075529
32749A075529j74398m31106n32003M3744N93108K82522l75474k14278O97072J027294
$$ 1075529 901131 470025 -61978 -18234 574874 857396 481922 267644 964716 1992010
32739A992010J87542p31058n48492L44038P19680L49265R8988L51840L80042l75338
$$ 1992010 2179552 1448494 900002 1244040 1963720 2312985 2411973 2763813 3143855 2768517
32729B768517j215188j049218M5968Q65643O13124k48994q28266q92363p47692
$$ 2768517 1553329 504111 550079 1415722 2028846 1779852 951586 59223 -688469
32720f88469m76008R4937P87185J055837P11583J96901n4803j23784k19331k16111
$$ -688469 -1164477 -1069540 -282355 773482 1485065 1681966 1627163 1503379 1284048 1067937
32710A067937K3794J97992n7313n16072o02383j99951K55488M29405L41191K8472
$$ 1067937 1091731 1289723 1232410 716338 113955 -85996 169492 598897 940088 968560
32700I68560m57406p14858l18268L94628N68578R7485j26178L69698P90185L25976
$$ 968560 511154 -203704 -521972 -127344 441234 538719 412541 782239 1572424 1898400
32690A898400m65610m69498K67856O81942L45384q4535r4649J9544p0612j93342
$$ 1898400 1432790 963292 1231148 1913090 2258474 2173939 2079290 2098834 2028222 1834880
32680A834880k50085n18131r69271j013960m24093J16504n6871o22724q07174
$$ 1834880 1584795 1066664 97393 -916567 -1340660 -1224156 -1281027 -1903751 -2710925
32671b710925m43050Q7867N70239R59755R74354L94146l51345n41829j04230L35802
$$ -2710925 -3153975 -3066108 -2495869 -1536114 -561760 -167614 -518959 -1060788 -1165018 -829216
32661h29216L31444N0593j71547k27301j15289J45272L80738L97130L08588L91660
$$ -829216 -497772 -447179 -618726 -846027 -961316 -816044 -435306 -38176 270412 662072
32651F62072N86004N30386J61746j38720j39087r4106k61821m27329k27160K55132
$$ 662072 1248076 1778462 1940208 1801488 1662401 1568295 1306474 879145 651985 907117
32641I07117N39319L40177j14957l73895k52762k3445j22360o38739j123653j011752
$$ 907117 1446436 1786613 1671656 1297761 1044999 1021554 899194 260455 -863198 -1874950
32631a874950k41076O31860R41257M97204k69493o80692m30085R4920K58760J2347
$$ -1874950 -2116026 -1484166 -542909 -45705 -315198 -995890 -1425975 -1331055 -1072295 -1059948
32621a059948j0509N66711J204927J170286O13563L04068M20288L50791k02220
$$ -1059948 -1070457 -503746 701181 1871467 2485030 2789098 3209386 3560177 3357957
32612C357957o72406n06835L6421L94067M51392K98315k15454r94581j223735
$$ 3357957 2685551 2178716 2215137 2609204 3060596 3358911 3143457 2148876 925141
32603I25141l07161Q97959Q46224n14055j369580m32705J167233J335913j42791
$$ 925141 617980 1515939 2362163 1848108 478528 45823 1213056 2548969 2406178
32594B406178j389730j039394J22187N99759K60470N6712K97097L50884l1295
$$ 2406178 1016448 -22946 99241 699000 959470 1016182 1313279 1664163 1632868
32585A632868k17045J99090O90006O80122M14512L70862M14774K18543J4994J50720
$$ 1632868 1415823 1614913 2304919 2985041 3399553 3770415 4185189 4403732 4418726 4569446
32575D569446K76351j34806p11149o02238R8411L80688j04986n45141l82253k10322
$$ 4569446 4845797 4710991 3999842 3397604 3496015 3876703 3771717 3226576 2844323 2634001
32565B634001o41378j158863r38676j93459K17094J37428J65589N23622P41817
$$ 2634001 1992623 833760 -104916 -298375 -81281 56147 221736 745358 1487175
32556A487175N03152Q6672j61682k33311j90656K1679L31414M73262L09616m8262
$$ 1487175 1990327 2076999 1915317 1682006 1491350 1513029 1844443 2317705 2627321 2579059
32546B579059m58946p92874p95496l01149L86219P07235N01412J05870j99154
$$ 2579059 2120113 1327239 531743 230594 616813 1324048 1825460 1931330 1732176
32537A732176m09531m18209M1090Q25495J218947P20754k71031r11799q64181
$$ 1732176 1322645 904436 945526 1771021 2989968 3710722 3439691 2527892 1663711
32528A663711m91815k44865j90216j49359m8796k3232k19907n39563o43332l23400
$$ 1663711 1171896 927031 736815 587456 538660 515428 295521 -244042 -887374 -1210774
32518a210774J94229N05772N51940O21019Q10554Q16509M11057j46747m01120
$$ -1210774 -1016545 -510773 41167 662186 1472740 2289249 2700306 2553559 2152439
32509B152439k32088P6309J58554j57244p13444j053889q14500j97709K16674
$$ 2152439 1920351 1996660 2155214 1997970 1284526 230637 -583863 -781572 -564898
32500e64898K58079L75058Q15099J059564N60432l12324o91604m05483q5806j40770
$$ -564898 -306819 68239 883338 1942902 2503334 2191010 1499406 1093923 1008117 867347
32490H67347l22233m03434n63012q28582q02756l47614K3294q9126l10948j38807
$$ 867347 545114 141680 -421332 -1249914 -2052670 -2400284 -2376990 -2466116 -2777064 -2915871
32480b915871K22826L10870K86227N85762R59718P39101j7655n38822n42134m99760
$$ -2915871 -2693045 -2382175 -2095948 -1510186 -550468 188633 170978 -367844 -909978 -1409738
32470a409738n43367j27614P97522J277207O98014j88694l96619j24178j01364
$$ -1409738 -1953105 -2080719 -1283197 -5990 692024 503330 106711 -17467 -118831
32461a18831j77458K53578Q39460O24647k76605o96869k62980O3903l26201p05211
$$ -118831 -296289 -42711 796749 1421396 1144791 447922 184942 248845 -77356 -782567
32451g82567l34276L10622M49865K33897J63581N4020l92599n95852J41962J218755
$$ -782567 -1116843 -806221 -356356 -122459 41122 95142 -297457 -893309 -751347 467408
32441D67408J273298R8943j046308j149320n06679J25292N33611P96915P63068
$$ 467408 1740706 1839649 793341 -355979 -862658 -737366 -203755 593160 1356228
32432A356228L27081j89912l94960l14711k34370k52375k26230k4405K93740M65758
$$ 1356228 1683309 1493397 1098437 783726 549356 296981 70751 46346 340086 805844
32422H05844K49083j86067k74885K24781P64296P02918K33975K47O62k78502o97275
$$ 805844 1054927 868860 593975 818756 1583052 2285970 2519945 2520192 2520854 2242352 1545077
32411A545077m66564M22827Q40706J64535o67815n74599J3929o730n03519l59797
$$ 1545077 1078513 1501340 2342046 2506581 1838766 1264167 1278096 1271366 767847 408050
32401D08050N26610R02356J29735p50349o28560j4748r9295p49530p05413L17946
$$ 408050 934660 1837016 1966751 1216402 587842 573094 473799 -275731 -981144 -663198
32391f63198J001991L58935p35269p99074J36001P69480O01313M67412Q18843
$$ -663198 338793 697728 -37541 -836615 -700614 68866 670179 1137591 1956434
32382A956434P92240k46148j302741j076456r770L57966j88211k80250O70270
$$ 1956434 2748674 2502526 1199785 123329 113559 471525 283314 3064 673334
32373F73334J342792M86829j096461j584590m96990R58945J539281J067555P0330
$$ 673334 2016126 2502955 1406494 -178096 -675086 283859 1823140 2890695 2961025
32364B961025q63118j300170j125754o16600r8451L63662P21154P29716L74772
$$ 2961025 2097907 797737 -328017 -944617 -1043068 -679406 41748 771464 1146236
32355A146236J52850M06018O82508L60358l52349p22325o08020n09584n73665
$$ 1146236 1299086 1705104 2387612 2747970 2395621 1673296 1065276 555692 -17973
32346a7973l75960J83389N54359L94881R9929J22935L20513L56343K76037K49600
$$ -17973 -393933 -210544 343815 738696 838625 961560 1282073 1638416 1914453 2164053
32336B164053J39495k01892m97890m01669j03729r8403m03896m75959J9660P17408
$$ 2164053 2303548 2101656 1603766 1202097 1098368 999965 596069 120110 139770 857178
32326H57178J020143Q17007M84975K73026j8573o29391j324727j577341j239351
$$ 857178 1877321 2694328 3179303 3452329 3433756 2804365 1479638 -97703 -1337054
32317a337054p24762m13235j81003K27622O25234N79183J06206k27343J6402O32649
$$ -1337054 -2061816 -2475051 -2656054 -2428432 -1803198 -1224015 -1117809 -1345152 -1328750 -696101
32307f96101J035938Q53679J81096o01642j149098j323890j133727o18532P5789
$$ -696101 339837 1193516 1374612 772970 -376128 -1700018 -2833745 -3452277 -3376488
32298c376488O14376P41932O19679N64890M79805M2738m72191k85821O40401J213065
$$ -3376488 -2762112 -2020180 -1400501 -835611 -355806 -313068 -785259 -1071080 -430679 782386
32288G82386O75350k21085l38384J44064J92050l26159n54553j76608K06060K79217
$$ 782386 1457736 1236651 898267 1042331 1234381 908222 353669 177061 383121 662338
32278F62338L84465M93055O5428o84508o48169M32333J240142P16211m01074q00447
$$ 662338 1046803 1539858 1605286 920778 272609 704942 1945084 2661295 2260221 1459774
32268A459774m66767k61548l65921l21361j34210j63504j96800K50973Q65579
$$ 1459774 993007 731459 365538 44177 -90033 -253537 -450337 -199364 666215
32259F66215P92074o7308r06116j130885q16799j63824O12956R32030L59689m79424
$$ 666215 1458289 1390981 484865 -646020 -1462819 -1626643 -1013687 -81657 278032 -201392
32249b01392m77582L33897P22063P2140p19377o34118N6183M00015J47292j63529
$$ -201392 -678974 -345077 376986 449126 -270251 -904369 -848186 -448171 -300879 -464408
32239d64408j19795J50202K93691R1443l58535o44327m55714n6689R374k86598
$$ -464408 -584203 -434001 -140310 -48867 -407402 -1051729 -1507443 -1564132 -1554758 -1841356
32229a841356m34126j98974J13757L12354N58141P57129M70548k13753m81980
$$ -1841356 -2275482 -2474456 -2360699 -2048345 -1490204 -733075 -262527 -476280 -958260
32220i58260L0571N72404L91528j44662k71069o8355j15992l59354k91438L078
$$ -958260 -927689 -355285 36243 -108419 -379488 -447843 -563835 -923189 -1214627 -1211549
32210a211549k5449l20250k42770K80571N68146L37390J80285N36045R38775P57393
$$ -1211549 -1236998 -1557248 -1800018 -1519447 -951301 -613911 -433626 102419 1041194 1798587
32200A798587J11141m33284o25431n32296j78481L12221N19791J92820k84267
$$ 1798587 1909728 1476444 851013 318717 140236 452457 972248 1165068 880801
32191H80801l74021j70012j64675l40879j66226L76600M65949l68088j252483
$$ 880801 506780 336768 172093 -168786 -335012 41588 507537 139449 -1113034
32182a113034r38400M09249J254022P15534k80231m09735K24737N69832M23281
$$ -1113034 -2051434 -1642185 -388163 327371 47140 -362595 -137858 431974 855255
32173H55255N50751J070200J052332J40075o58020n28143j27919l26356o48461
$$ 855255 1406006 2476206 3528538 3668613 3010593 2482450 2354531 2028175 1379714
32164A379714k77875J78126m09493j431311j101038O00928J522715N57664n87471
$$ 1379714 1101839 1279965 870472 -560839 -1661877 -1060949 461766 1019430 431959
32155D31959n4684J286599J316446r051p82664k26126L19043k56119j160328j115114
$$ 431959 377275 1663874 2980320 2971269 2188605 1962479 2281522 2025403 865075 -250039
32145b50039k42140L60736J95907l20938o85441p03335k95545M58127J110869
$$ -250039 -492179 -131443 64464 -256474 -941915 -1645250 -1940795 -1482668 -371799
32136c71799J129644M53721m32225r65002r26830n15048j43422j06769l32950
$$ -371799 757845 1211566 779341 -185661 -1112491 -1627539 -1770961 -1877730 -2210680
32127b210680m92917l51175P1306N97716R75227R42485M87588J291j15228L3131
$$ -2210680 -2703597 -3054772 -2983466 -2385750 -1410523 -468038 19550 20841 -94387 -61256
32117f1256K5304k11904l29084j59954M6750J03612J50551K81435L18491J53857
$$ -61256 -35952 -247856 -576940 -736894 -690144 -586532 -435981 -154546 163945 317802
32107C17802n4325j83889k55224j38066L20859P33187M23500m23566o42553K99601
$$ 317802 263477 79588 -175636 -313702 7157 740344 1163844 740278 97725 397326
32097C97326J289779J001805k12251q67752m40904J91378K99660J32186J9190
$$ 397326 1687105 2688910 2476659 1608907 1168003 1359381 1659041 1791227 1810417
32088A810417k47754o78660o51865J12657P97816M48500o74700j362942r17208
$$ 1810417 1562663 884003 232138 344795 1142611 1591111 916411 -446531 -1363739
32079a363739J82259R91111J061457O59879L10338K38561K44035R4628j22654
$$ -1363739 -1181480 -190369 871088 1530967 1841305 2079866 2323901 2418529 2295875
32070B295875k22432k69535l52392k43460J75212L64994k15497r98611q45601
$$ 2295875 2073443 1803908 1451516 1208056 1383268 1748262 1532765 534154 -311447
32061c11447J49321N34528l30145j139049n39884Q30695J365922Q09272K37281
$$ -311447 -162126 372402 42257 -1096792 -1636676 -805981 559941 1369213 1606494
32052A606494J84434J96304Q7616K40000N41731L31602l37089n85791k11151q8953
$$ 1606494 1790928 1987232 2074848 2314848 2856579 3188181 2851092 2265301 2054150 1965197
32042A965197n84779p83176n4724P20290M91613k87450m73967p7679l6477n00208
$$ 1965197 1380418 597242 542518 1262808 1754421 1466971 993004 915325 878848 378640
32032C78640o14199j1850N97055N64165J55384m9800M3421J50237K3629m38847
$$ 378640 -235559 -247409 349646 913811 1069195 1019395 1062816 1213053 1236682 797835
32022G97835j074292j325095p14284M03471J046758P44851K6644l88408l92609
$$ 797835 -276457 -1601552 -2315836 -1912365 -865607 -120756 -94112 -482520 -875129
32013h75129k47729m9888J88505L12371K80266L43369N84145N75971l2521q14669
$$ -875129 -1122858 -1172746 -984241 -671870 -391604 -48235 535910 1111881 1079360 264691
32003B64691r85505m48378J18781K74777L58240P65570J159247Q88581J1846o25340
$$ 264691 -720814 -1169192 -1050411 -775634 -417394 348176 1507423 2396004 2407850 1782510
31993A782510m11772L20628P88383O42597J12312m52438p91197o66112q4709M21934
$$ 1782510 1370738 1691366 2479749 3122346 3234658 2782220 1991023 1324911 1240202 1662136
31983A662136K56832m01355p28472m04611m8514j71213l37301L2648N64375M57356
$$ 1662136 1918968 1517613 789141 384530 336016 164803 -172498 -139850 424525 881881
31973H81881k09618o00690m14338j26938L8484L76988P59529M90722m43492r71045
$$ 881881 672263 71573 -342765 -469703 -431219 -54231 705298 1196020 752528 -218517
31963b18517m43694K97160J91850m14037m23491K23139N38471R2489m53657n07989
$$ -218517 -662211 -365051 -173201 -587238 -1010729 -787590 -249119 -156630 -610287 -1118276
31953a118276l10390k68487k59714M6171O29563J141120J186052N71709l64454
$$ -1118276 -1428666 -1697153 -1956867 -1910696 -1281133 -140013 1046039 1617748 1253294
31944A253294p86020k35542O32138Q28599M26411L44558P38134O40214m54823
$$ 1253294 467274 231732 863870 1692469 2118880 2463438 3201572 3841786 3386963
31935C386963j651521j897492j333179o84521o0836P34318J254237Q43122j75566
$$ 3386963 1735442 -162050 -1495229 -2179750 -2240586 -1506268 -252031 591091 415525
31926D15525o92228k11627O56265J098761Q55266J22549o22996p21379O4476R81326
$$ 415525 -276703 -488330 167935 1266696 2121962 2244511 1621515 900136 964612 1945938
31916A945938R88124J16194n39178l16061K31534K91567j51979n94744p57909
$$ 1945938 2934062 3050256 2511078 2195017 2426551 2718118 2566139 1971395 1213486
31907A213486o30465k42896J78237K40703m0815j23587K16351L97144q0875p02700
$$ 1213486 583021 340125 518362 759065 718250 594663 811014 1208158 1127283 424583
31897D24583n82567K28141Q08224O43616J33361k07130l60992m37802k89689J40354
$$ 424583 -157984 70157 878381 1521997 1655358 1448228 1087236 649434 359745 500099
31887E00099M74095K90650l03060p57682o55773p1289N39730P25599M23895o486
$$ 500099 974194 1264844 961784 204102 -451671 -522960 16770 742369 1166264 1159778
31877A159778k42058l99905p43299j077964q87525j68225L62589K06012j73549
$$ 1159778 917720 517815 -225484 -1303448 -2190973 -2359198 -1996609 -1790597 -1964146
$$ [...]
##END NTUPLES=NMR SPECTRUM
##END=
