##TITLE=31Pdec_DE-27_oil
 D2O, 64 sc
 16.8.2024
##JCAMPDX= 6.0         $$ Bruker NMR JCAMP-DX V2.0
##DATA TYPE= NMR SPECTRUM
##DATA CLASS= NTUPLES
##ORIGIN= UXNMR, Bruker Analytische Messtechnik GmbH
##OWNER= root
$$ XWIN-NMR		Version 3.5
$$ Fri Aug 16 16:18:29 2024 Russian Standard Time (UT+4h)  she@DPX200
##.OBSERVE FREQUENCY= 81.013821
##.OBSERVE NUCLEUS= ^31P
##.ACQUISITION MODE= SIMULTANEOUS
##.ACQUISITION SCHEME= undefined
##.AVERAGES= 64
##.DIGITISER RES= 17
##SPECTROMETER/DATA SYSTEM= spect
##.PULSE SEQUENCE= zgpg30
##.SOLVENT NAME= CDCl3
##.SHIFT REFERENCE= (INTERNAL, CDCl3, 0, 198.062)
##AUDIT TRAIL= $$ (NUMBER, WHEN, WHO, WHERE, WHAT)
$$ ##TITLE= Audit trail, XWIN-NMR		Version 3.5
$$ ##JCAMPDX= 5.01
$$ ##ORIGIN= Bruker BioSpin GmbH
$$ ##OWNER= she
$$ F:/spectra/data/she/nmr/P31/2/pdata/1/auditp.txt
$$ ##AUDIT TRAIL=  $$ (NUMBER, WHEN, WHO, WHERE, WHAT)
(   1,<2024-08-16 16:17:29.20 +0400>,<she>,<DPX200>,
      <created by zg, POWCHK disabled, PULCHK disabled
       configuration hash MD5:
       00 E9 B6 7A A2 85 ED C7 34 08 36 98 17 FE 4E 26
       data hash MD5: 32K
       59 34 E9 5E 51 C0 D8 D2 AA E7 AA F8 AA 4A 48 E7>)
(   2,<2024-08-16 16:17:31.60 +0400>,<she>,<DPX200>,
      <Start of raw data processing
       efp BC_mod = 2 LB = 1.5 FT_mod = 6 PKNL = 1 PHC0 = 2722.073 PHC1 = -26.71252 SI = 64K 
       data hash MD5: 64K
       A9 1E 42 68 41 01 04 D1 32 F7 89 4D 44 F9 E6 57>)
(   3,<2024-08-16 16:17:46.75 +0400>,<she>,<DPX200>,
      <pk PHC0 = 5.770935 PHC1 = 0 
       data hash MD5: 64K
       C4 7F 48 2B 16 4D 55 CA 76 7F 8E AD C9 8A D4 01>)
(   4,<2024-08-16 16:17:52.21 +0400>,<she>,<DPX200>,
      <abs ABSG = 5 
       data hash MD5: 64K
       EC F8 2B 83 8D 64 BE AA C9 5F 49 72 3A 49 40 05>)
$$ ##END=
$$ 
$$ hash MD5
$$ 8E 83 BB F3 48 7E DE ED 0C B8 5E 08 C6 E4 DA 56
##$RELAX= 
##$RELAX= 
##$RELAX= 
##$RELAX= 
##$RELAX= 
##$RELAX= 
##$RELAX= 
##$RELAX= 
$$ Bruker specific parameters
$$ --------------------------
##$DU= <F:/spectra>
##$EXPNO= 2
##$NAME= <P31>
##$PROCNO= 1
##$TYPE= <nmr>
##$USER= <she>
##$AMP= (0..31)
100 100 100 100 100 100 100 100 100 100 100 100 100 100 100 100 100 100 
100 100 100 100 100 100 100 100 100 100 100 100 100 100 
##$AQSEQ= 0
##$AQ_mod= 1
##$AUNM= <au_zg>
##$AUTOPOS= <>
##$BF1= 81.014009
##$BF2= 200.13
##$BF3= 200.13
##$BF4= 200.13
##$BF5= 200.13
##$BF6= 200.13
##$BF7= 200.13
##$BF8= 200.13
##$BYTORDA= 1
##$CFDGTYP= 0
##$CFRGTYP= 5
##$CHEMSTR= <none>
##$CNST= (0..31)
1 1 145 1 1 1 1 1 1 1 1 1 1 1 1 1 1 1 1 1 1 1 1 1 1 1 1 1 1 1 1 1 
##$CPDPRG= <waltz16>
##$CPDPRG1= <>
##$CPDPRG2= <waltz16>
##$CPDPRG3= <>
##$CPDPRG4= <mlev>
##$CPDPRG5= <mlev>
##$CPDPRG6= <mlev>
##$CPDPRG7= <mlev>
##$CPDPRG8= <mlev>
##$CPDPRGB= <>
##$CPDPRGT= <>
##$D= (0..31)
0 1 0 0 0 0 0 0 0 0.06 0 0.03 2e-05 3e-06 0 0 0.0002 0 0 0 0 0 0 0 0 0 
0 0 0 0 0 0 
##$DATE= 1723810648
##$DBL= (0..7)
120 120 120 11 120 120 24 19 
##$DBP= (0..7)
150 150 150 150 150 150 150 150 
##$DBP07= 0
##$DBPNAM0= <>
##$DBPNAM1= <>
$$ [...]
##$SUBNAM3= <"">
##$SUBNAM4= <"">
##$SUBNAM5= <"">
##$SUBNAM6= <"">
##$SUBNAM7= <"">
##$SUBNAM8= <"">
##$SUBNAM9= <"">
##$SW= 400.765351723535
##$SWIBOX= (0..15)
0 1 3 0 0 0 0 0 0 0 0 0 0 0 0 0 
##$SW_h= 32467.5324675325
##$TD= 32768
##$TD0= 1
##$TE= 0
##$TE2= 300
##$TE3= 300
##$TEG= 300
##$TL= (0..7)
0 120 53 12 22 120 120 120 
##$TP= (0..7)
150 150 150 150 150 150 150 150 
##$TP07= 0
##$TPNAME0= <>
##$TPNAME1= <>
##$TPNAME2= <>
##$TPNAME3= <>
##$TPNAME4= <>
##$TPNAME5= <>
##$TPNAME6= <>
##$TPNAME7= <>
##$TPOAL= (0..7)
0.5 0.5 0.5 0.5 0.5 0.5 0.5 0.5 
##$TPOFFS= (0..7)
0 0 0 0 0 0 0 0 
##$TUNHIN= 0
##$TUNHOUT= 0
##$TUNXOUT= 0
##$USERA1= <user>
##$USERA2= <user>
##$USERA3= <user>
##$USERA4= <user>
##$USERA5= <user>
##$V9= 5
##$VALIST= <valist>
##$VCLIST= <CCCCCCCCCCCCCCC>
##$VD= 0
##$VDLIST= <DDDDDDDDDDDDDDD>
##$VPLIST= <PPPPPPPPPPPPPPP>
##$VTLIST= <TTTTTTTTTTTTTTT>
##$WBST= 1024
##$WBSW= 4
##$XGAIN= (0..3)
0 0 0 0 
##$XL= 0
##$YL= 0
##$YMAX_a= 40148
##$YMIN_a= -29313
##$ZGOPTNS= <>
##$ZL1= 120
##$ZL2= 120
##$ZL3= 120
##$ZL4= 120
##$ABSF1= 198.0616
##$ABSF2= -202.7028
##$ABSG= 5
##$ABSL= 3
##$ALPHA= 0
##$AQORDER= 0
##$ASSFAC= 0
##$ASSFACI= 0
##$ASSFACX= 0
##$ASSWID= 0
##$AUNMP= <proc_1d>
##$AZFE= 0.1
##$AZFW= 0.5
##$BCFW= 0
##$BC_mod= 2
##$BYTORDP= 0
##$COROFFS= 0
##$CY= -3
##$DATMOD= 1
##$DC= 0
##$DFILT= <>
##$DTYPP= 0
##$F1P= 0
##$F2P= 0
##$FCOR= 1
##$FTSIZE= 65536
##$FT_mod= 6
##$GAMMA= 0
##$GB= 0
##$INTBC= 1
##$INTSCL= 9.790993e-09
##$ISEN= 30
##$LB= 1.5
##$LEV0= 0
##$LPBIN= 0
##$MAXI= 10000
##$MC2= 0
##$MEAN= 0
##$ME_mod= 0
##$MI= 50
##$NCOEF= 0
##$NC_proc= -6
##$NLEV= 6
##$NOISF1= 182.463
##$NOISF2= 159.3651
##$NSP= 0
##$NTH_PI= 0
##$NZP= 0
##$OFFSET= 198.0616
##$PC= 4
##$PHC0= 2727.844
##$PHC1= -26.71252
##$PH_mod= 1
##$PKNL= yes
##$PPARMOD= 0
##$PSCAL= 0
##$PSIGN= 0
##$REVERSE= no
##$SF= 81.0140089999434
##$SI= 65536
##$SIGF1= 159.3651
##$SIGF2= -187.1042
##$SINO= 113.3802
##$SIOLD= 16384
##$SREGLST= <1H.CDCl3>
##$SSB= 0
##$STSI= 65536
##$STSR= 0
##$SW_p= 32467.5324675325
##$SYMM= 0
##$S_DEV= 0
##$TDeff= 32768
##$TDoff= 0
##$TI= <>
##$TILT= no
##$TM1= 0
##$TM2= 0
##$TOPLEV= 0
##$USERP1= <user>
##$USERP2= <user>
##$USERP3= <user>
##$USERP4= <user>
##$USERP5= <user>
##$WDW= 1
##$XDIM= 65536
##$YMAX_p= 469523150
##$YMIN_p= -6880276
$$ End of Bruker specific parameters
$$ ---------------------------------
##NTUPLES= NMR SPECTRUM
##VAR_NAME=  FREQUENCY,     SPECTRUM/REAL,   SPECTRUM/IMAG
##SYMBOL=    X,             R,               I
##VAR_TYPE=  INDEPENDENT,   DEPENDENT,       DEPENDENT
##VAR_FORM=  AFFN,          ASDF,            ASDF
##VAR_DIM=   65536,         65536,           65536
##UNITS=     HZ,            ARBITRARY UNITS, ARBITRARY UNITS
##FACTOR=    0.49542278885378, 1,            1
##FIRST=     16045.7642231865, 0,            0
##LAST=      -16421.768244346, 0,            0
##MIN=       -16421.768244346, -6880276,     0
##MAX=       16045.7642231865, 469523150,    0
$$ Real data points
##PAGE= N=1
##DATA TABLE= (X++(R..R)), XYDATA
$$ [...]
37459A751328o25772J60054R98555J070884M19766j66873j50272J31587M2585
$$ 1751328 1125556 1285610 2284165 3355049 3774815 3607942 3457670 3589257 3631842
37450C631842l83638n22010j74929Q0455j59871l77309R7222Q90992R41088M3062
$$ 3631842 3248204 2726194 2551265 2631720 2471849 2094540 2191762 3082754 4023842 4066904
37440D066904p40447n37290J57448L40292L859m8314L51672M57298p8996n41142
$$ 4066904 3326457 2789167 2946615 3286907 3290766 3242452 3594124 4051422 3972426 3431284
37430C431284k66612L11343L83454l3618l58794m76697o39377o13476P4895J054176
$$ 3431284 3164672 3476015 3859469 3825851 3467057 2990360 2350983 1737507 1812402 2866578
37420B866578J267194M51450m24308n44027k28682q6252q333L13975N53869K61612
$$ 2866578 4133772 4585222 4160914 3616887 3388205 3301953 3293620 3607595 4161464 4423076
37410D423076k13592j39050M99551J040829J124188R41981O45957J96248k19117
$$ 4423076 4209484 4070434 4569985 5610814 6735002 7676983 8322940 8519188 8300071
37401H300071k53793M0876K49228K31740K68863N29891Q25808R27405P82025M61935
$$ 8300071 8046278 8087154 8336382 8568122 8836985 9366876 10192684 11120089 11902114 12364049
37391A2364049K18303M00288R08428J010430K93498m68633j84889R57011J676236
$$ 12364049 12582352 12982640 13891068 14901498 15194996 14726363 14541474 15498485 17174721
37382A7174721J422847J031758J273917J718679J604056J084903R02626J284477
$$ 17174721 18597568 19629326 20903243 22621922 24225978 25310881 26213507 27497984
37374B7497984J837176K235640K427427K339912J918668J422825J314101J819896
$$ 27497984 29335160 31570800 33998227 36338139 38256807 39679632 40993733 42813629
37366D2813629K751147L682464M260695M498524M770569N304485N768096N722482
$$ 42813629 45564776 49247240 53507935 58006459 62777028 68081513 73849609 79572091
37358G9572091N366019N296569N596775N820676N906267O289228O916550P014704
$$ 79572091 84938110 90234679 95831454 101652130 107558397 113847625 120764175 127778879
37350A27778879O225595N153173M283837L166640J310134q17488k414673l386477
$$ 127778879 134004474 139157647 143441484 146608124 147918258 147100770 144686097 141299620
37342A41299620m067161m507077m781275n395555o521986p357566p133122o265230
$$ 141299620 137232459 132725382 127944107 122548552 116026566 108669000 101535878 95270648
37334I5270648n612728n173608m578695m261474m774176n359522m755904l288917
$$ 95270648 89657920 84484312 79905617 75644143 70869967 65510445 60754541 57465624
37326E7465624k567246l014066l344344k835905k452730l011828l720063l487149
$$ 57465624 54898378 51884312 48539968 45704063 43251333 40239505 36519442 33032293
37318C3032293k514521j621340j027025p49570j181786k175533k474164j295703
$$ 33032293 30517772 28896432 27869407 27119837 25938051 23762518 21288354 19992651
37310A9992651K40990N36014k47248o81713l40914j14541m81578r20154j079350
$$ 19992651 20233641 20769655 20522407 19840694 19499780 19385239 18903661 17983507 16904157
37301A6904157j197376j168525m81050N53521P09162m46178j723988j829211r22570
$$ 16904157 15706781 14538256 14057206 14610727 15319889 14873711 13149723 11320512 10397942
37292A0397942p2183J49751j08865n36260p54278l55199M82210Q28869J43400
$$ 10397942 10325759 10475510 10366645 9830385 9076107 8720908 9203118 10031987 10175387
37283A0175387p87285q01785n009L97742j27766p14513m00971N53477J153020
$$ 10175387 9388102 8586317 8581308 8979050 8851284 8136771 7735800 8289277 9442297
37274I442297R98390N34692J70878j96972o62711q67533n03425K5869q660o21940
$$ 9442297 10440687 10975379 11146257 10949285 10286574 9419041 8915616 8941485 8932825 8310885
37264H310885r91981n69764J71121M56903K66310J21565J21287j10515n60013
$$ 8310885 7318904 6749140 6920261 7377164 7643474 7765039 7886326 7775811 7215798
37255G215798o47603j25290M50370M61043j6907n13298p96775q53397o31400k40135
$$ 7215798 6568195 6442905 6893275 7354318 7337411 6824113 6027338 5173941 4542541 4302406
37245D302406q5561l30248m60688P7303R42989J165455L88662o36507r72387n33509
$$ 4302406 4216845 3886597 3425909 3503212 4446201 5611656 6000318 5363811 4391424 3857915
37235C857915L3660K47595K29907K74032K84245r4128q12161j216554q00521J6621
$$ 3857915 3891575 4139170 4369077 4643109 4927354 4833226 4021065 2804511 2003990 2020611
37225B020611K97517k17171q01455p79170l45403l1323J41123M26102O39267L73515
$$ 2020611 2318128 2100957 1299502 520332 174929 143606 284729 710831 1350098 1723613
37215A723613j81266l20549J63002O06999L48162m22765r17866o29667K12326
$$ 1723613 1542347 1221798 1384800 1991799 2339961 1917196 999330 369663 581989
37206E81989Q95430Q52741J84045m43132n39508l13150k21374k32609J9634M77762
$$ 581989 1477419 2330160 2514205 2071073 1531565 1218415 997041 764432 784066 1261828
37196A261828O35969L25834m0577j65575k46510m13174l40657J65643O32813M69873
$$ 1261828 1897797 2223631 2183054 2017479 1770969 1357795 1017138 1182781 1815594 2285467
37186B285467j94268o70072n54413n6105L87932M95338K54751o5112j50345r1240
$$ 2285467 2091199 1421127 866714 810609 1198541 1693879 1948630 1883518 1733173 1641933
37176A641933l50137j011391j398162q85576J67042Q47539Q78465P30658O19638
$$ 1641933 1291796 280405 -1117757 -2003333 -1836291 -988752 -110287 620371 1240009
37167A240009J80759o21780j014539m04409O17612R33010L69230j45811N7985
$$ 1240009 1420768 798988 -215551 -619960 -2348 930662 1299892 1154081 1212066
37158A212066N11901L98329k43553o28848l64442J05903K80448K72894L70743
$$ 1212066 1723967 2122296 1878743 1249895 885453 991356 1271804 1544698 1915441
37149A915441L58188j54353r16793j190462p49351j46853J62292L77369P48826
$$ 1915441 2273629 2119276 1202483 12021 -737330 -884183 -721891 -344522 404304
37140D04304R96120P85466L42801P6414m8102k27041k85321n9063L3488m05253
$$ 404304 1400424 2185890 2528691 2605105 2557003 2329962 2044641 1985578 2019066 1613813
37130A613813q21247l36743P33375J056906K05523o62185n32164N4804R9739k01915
$$ 1613813 792566 455823 1189198 2246104 2451627 1789442 1257278 1312082 1411821 1209906
37120A209906K9149P24997R59517N20656K25067M96061O72894J61140n81521q06417
$$ 1209906 1239055 1964052 2923569 3444225 3669292 4165353 4838247 4999387 4417866 3611449
37110C611449n91462n06181n71006l09212K98417O14779K20426n13798r28022
$$ 3611449 3019987 2513806 1942800 1633588 1932005 2546784 2767210 2253412 1325390
37101A325390q12812m46209j35971L7219J17123J08695l1394k53237k95893J33246
$$ 1325390 512578 66369 -69602 -32383 84740 193435 162041 -91196 -387089 -253843
37091b53843R13660J389498R93181j4616p41521o74084j78102J34444J62608J56158
$$ -253843 659817 2049315 3042496 3027880 2286359 1612275 1434173 1568617 1731225 1887383
37081A887383J31494r3201m20374m99664k41312Q2499K83327M32001N28091L87963
$$ 1887383 2018877 1925676 1505302 1005638 764326 846825 1130152 1562153 2090244 2478207
37071B478207J0895k86773k86625j31588k8353l258j00934m22433p16200l80072
$$ 2478207 2489102 2202329 1915704 1784116 1755763 1752505 1651571 1229138 512938 132866
37061A32866O89631J594441J343882J25435q69741q70138k98767o3463m79963
$$ 132866 822497 2416938 3760820 3886255 3016514 2146376 1847609 1784146 1304183
37052A304183j053833j087365l86913N18437Q79023N21331k9947l31859n40804
$$ 1304183 250350 -837015 -1223928 -705491 173532 694863 664916 333057 -207747
37043b07747q28199p63237M3036R83254J037120K89944o6946N18246J129304P83956
$$ -207747 -1035946 -1799183 -1756147 -772893 264227 554171 487225 1005471 2134775 2918731
37033B918731j42353o12291m50027k95490l60984j85347L42074N66075L1471o89912
$$ 2918731 2776378 2164087 1714060 1418570 1057586 872239 1214313 1780388 1811859 1121947
37023A121947o34906K95992J159699J099280L53306j02070J78257N57165K19669
$$ 1121947 487041 783033 1942732 3042012 3395318 3293248 3471505 4028670 4248339
37014D248339o85345j241184r71899l21264J17348K69275K59756J0254m13358
$$ 4248339 3562994 2321810 1349911 1028647 1145995 1415270 1675026 1685280 1271922
37005A271922n03971O3924P69739P86116R1346m77829k95231L78526Q52800P48564
$$ 1271922 767951 831875 1601614 2387730 2479076 2001247 1706016 2084542 2937342 3685906
36995C685906J63658n63946j042485r68376l25450N31262J066651R27533K25516
$$ 3685906 3849564 3285618 2243133 1274757 949307 1480569 2547220 3474753 3700269
36986C700269n14142p93835n80844k26329N01R4312P2293j08835l03987j93678
$$ 3700269 3186127 2392292 1811448 1585119 1585620 1679932 1752225 1643390 1339403 1145725
36976A145725K64524O75276O79530L43369m8627k74850j40894M11946R66151Q70443
$$ 1145725 1410249 2085525 2765055 3108424 3059797 2784947 2644053 3055999 4022150 4892593
36966D892593J16550m93226l88766O3528K95175L92890O61983Q94443P84378N97283
$$ 4892593 5009143 4515917 4127151 4190679 4485854 4878744 5540727 6435170 7219548 7816831
36956G816831O35359M83405k86691j040684q13923Q2156L87295j69019n07399
$$ 7816831 8452190 8935595 8648904 7608220 6794297 6876453 7263748 7094729 6587330
36947F587330n337N93061N67366L64746O27115J035458R95729P47632Q76856J250867
$$ 6587330 6581993 7175054 7742420 8107166 8734281 9769739 10765468 11513100 12389956 13640823
36937A3640823J330901J161314J191903J377629J266939Q29915M68941L29789
$$ 13640823 14971724 16133038 17324941 18702570 19969509 20799424 21268365 21598154
36929B1598154K88331M83979J114580J760846J728314J158143R92148J571479
$$ 21598154 21886485 22370464 23485044 25245890 26974204 28132347 29124495 30695974
36921C0695974K031475J550383N73594J58413M89837P52595L40774m80898j183713
$$ 30695974 32727449 34277832 34851426 35009839 35499676 36252271 36593045 36112147 34928434
36912C4928434j622603j828180j682082j239351j004653j317914j659863j237510
$$ 34928434 33305831 31477651 29795569 28556218 27551565 26233651 24573788 23336278
36904B3336278k63286R7038o76701j628620j624072q90062n27651q86660j308534
$$ 23336278 23072992 23170030 22493329 20864709 19240637 18350575 17822924 16936264 15627730
36895A5627730j343887j303272j463370j533829j225346p38207l68049j15220
$$ 15627730 14283843 12980571 11517201 9983372 8758026 8019819 7651770 7536550
36887G536550N2490K0084j40286j10556J50314K59635J6754k69316k56176M6071
$$ 7536550 7589040 7609124 7468838 7358282 7508596 7768231 7784985 7515669 7259493 7305564
36877G305564M70089P63014M39624o93726j748034j430393J21137J174490O58364
$$ 7305564 7775653 8538667 8978291 8284565 6536531 5106138 5227275 6401765 7060129
36868G060129m14027n80912k4298P9393m54724p83988n49755j48559K58251P80581
$$ 7060129 6646102 6065190 6040892 6120285 5665561 4881573 4331818 4183259 4441510 5222091
36858E222091R93216L23571p60580j116983n39322J11057L93582O54577P98936
$$ 5222091 6215307 6538878 5778298 4661315 4121993 4233050 4626632 5281209 6080145
36849F080145J35876j117388j574604o32171N24466O65259J43989j12363j25913
$$ 6080145 6216021 5098633 3524029 2891858 3416324 4081583 4225572 4113209 3987296
36840C987296k51465l8125Q98786J593006Q65583o40220j128904k46391N50416
$$ 3987296 3735831 3697706 4596492 6189498 7055081 6414861 5285957 5039566 5589982
36831E589982L59860K792L17173P27820M08768k31310l06510N1427P9763j92973
$$ 5589982 5949842 5952634 6269807 6997627 7406395 7175085 6868575 6920002 6999765 6806792
36821F806792m7513N69521Q58300M29026j64717l92434m27313m81863k15149N82126
$$ 6806792 6759279 7328800 8187100 8616126 8451409 8058975 7631662 7149799 6934650 7516776
36811G516776J251547R99200J27803k71815J00698K72986n49018j683429j790620
$$ 7516776 8768323 9767523 9895326 9623511 9724209 9997195 9448177 7764748 5974128
36802E974128p21947K03684r0823j071661j367006n54927M06919N05887j43002
$$ 5974128 5252181 5455865 5365042 4293381 2926375 2371448 2778367 3284254 3141252
36793C141252o88505o80204l61583n5584J83814K91168J04433k25486j96026L36454
$$ 3141252 2452747 1772543 1410960 1355376 1539190 1830358 1934791 1709305 1513279 1849733
36783A849733P70628N10602j74009n29505l57280j04972l6644J9486N3925k62778
$$ 1849733 2620361 3130963 2956954 2427449 2070169 1965197 1928553 1948039 2001964 1739186
36773A739186q35468r39495k34969N37305M71866k21569m94512J16678R42612
$$ 1739186 903718 -35777 -270746 266559 738425 516856 22344 139022 1081634
36764A081634J098341M69925l60003q27745q09778m81469J6312O36485J145814
$$ 1081634 2179975 2649900 2289897 1462152 652374 170905 187217 823702 1969516
36755A969516J055652K12695o41845m90223O21192J459244J159187K96315j13816
$$ 1969516 3025168 3237863 2596018 2105795 2726987 4186231 5345418 5641733 5527917
36746E527917q1133l10526q23789r15700m16491k4734j71553l70707p4000M57133
$$ 5527917 5446784 5136258 4312469 3396769 2980278 2955544 2783991 2413284 2339284 2796417
36736B796417N94459K44352j30753j69977L4106J42394l5543k92612k00102L13020
$$ 2796417 3390876 3635228 3504475 3334498 3368604 3510998 3475455 3182843 2982741 3295761
36726C295761P00737M30498k69021p09601o74300n28719m78996l59464k11800
$$ 3295761 3996498 4426996 4157975 3448374 2774074 2245355 1766359 1406895 1195095
36717A195095l73680p72242q01123k47234K67792K05011q5248n296L19975L76772
$$ 1195095 821415 49173 -751950 -999184 -731392 -526381 -611629 -616925 -296950 79822
36707G9822K45094M80231J062519J200793M28897o19346r33375l79878J88584
$$ 79822 324916 805147 1867666 3068459 3497356 2878010 1944635 1564757 1753341
36698A753341O9061m38470n40492l9451N13303O78839O04116M87350J54183m38511
$$ 1753341 1822402 1383932 843440 803989 1317292 1996131 2600247 3087597 3241780 2803269
36688B803269p81828m61524J41626L84583K46201M8957k70882p68605p78234K55519
$$ 2803269 2021441 1559917 1701543 2086126 2332327 2381284 2110402 1341797 563563 819082
36678H19082J410443J095152o05788j734866j065261L51370R08161N44418K07111
$$ 819082 2229525 3324677 2718889 984023 -81238 270132 1178293 1722711 1929822
36669A929822J83017R0472q3294l0981J17294k2213l72339n50242m60381j70018
$$ 1929822 2112839 2203311 2120017 2089036 2206330 2184117 1811778 1261536 801155 631137
36659F31137L93417J041166J137055M86429j31279o5058J63787j91707p13837
$$ 631137 1024554 2065720 3202775 3689204 3557925 3492867 3656654 3464947 2751110
36650B751110m96132K25712L82017j79634n22696k29533L3796k13347n14446l62421
$$ 2751110 2254978 2480690 2862707 2683073 2160377 1930844 1964640 1751293 1236847 874426
36640H74426M1346L02083L97865M08143K89066J60299K42835L59932J05527l85034
$$ 874426 915772 1217855 1615720 2023863 2312929 2473228 2716063 3075995 3181522 2796488
36630B796488n08487j67453M5570j79867m42420m07409k92697k73992r2433L77641
$$ 2796488 2288001 2120548 2166118 1986251 1543831 1136422 843725 569733 477300 854941
36620H54941P71361Q01576O36443M01223j04638q24776j157097p12302O8106M68181
$$ 854941 1626302 2427878 3064321 3465544 3360906 2536130 1379033 666731 734837 1203018
36610A203018L29549P292j66512r9218P8974P0186k42587m69694j81176L32746
$$ 1203018 1532567 1539859 1373347 1274129 1353103 1423289 1180702 711008 529832 862578
36600H62578L96461N1966K4877M52534N73073J8695n28554m85012k48126k68312
$$ 862578 1259039 1311005 1335882 1788416 2361489 2380184 1851630 1366618 1118492 850180
36590H50180j33944N45690J110349P45202j35319m84701k39830k35932p03201
$$ 850180 716236 1261926 2372275 3117477 2982158 2497457 2257627 2021695 1318494
36581A318494r63115o47300j93451N8365L59459Q43784J092953P95420K50445
$$ 1318494 355379 -291921 -485372 -427007 -67548 776236 1869189 2664609 2915054
36572B915054j54492m66347p86741q16809k70387M95086P39163K27834m53325
$$ 2915054 2760562 2294215 1507474 690665 420278 915364 1654527 1882361 1429036
36563A429036n81191j27175K68127J49392j67129j18415J67205n301p19744j030356
$$ 1429036 847845 720670 988797 1138189 971060 852645 1019850 1014549 294805 -735551
36553g35551k05729J076222J481247P64900O886N5798M76308L68162l22220q23998
$$ -735551 -941280 134942 1616189 2381089 2387975 2443773 2920081 3288243 2966023 2142025
36543B142025o32661p2387K68300K95794L68700O31098P14091K62918m50168p67967
$$ 2142025 1509364 1436977 1705277 2001071 2369771 3000869 3714960 3977878 3527710 2759743
36533B759743m65020L3019L02074L89672M48890L08314k39658r74849j422940
$$ 2759743 2294723 2327742 2629816 3019488 3468378 3776692 3537034 2562185 1139245
36524A139245j333894p44832J68217R77454J051026K21577p37972q38189p1877
$$ 1139245 -194649 -939481 -771264 206190 1257216 1478793 740821 -97368 -169245
36515a69245N83985M35501j09367j88717L81128R18524P13524j70500r82384j100965
$$ -169245 414740 850241 740874 552157 933285 1851809 2565333 2394833 1412449 311484
36505C11484o52210k16793n1859R0745L65509M82594J90137k49874m13118k88708
$$ 311484 -340726 -557519 -609378 -518633 -153124 329470 519607 269733 -143385 -432093
36495d32093j47661m6949J52050M22810O05335O76999O44594L21749l70492r89779
$$ -432093 -579754 -626703 -474653 -51843 553492 1230491 1875085 2196834 1826342 836563
36485H36563r27633j93041N52062P77162N61059K69823J24302J70692L59959N18065
$$ 836563 -91070 -284111 267951 1045113 1606172 1875995 2000297 2170989 2530948 3049013
36475C049013M42753J24209k56008n30558o10385m44631j43167l6801l07898n95011
$$ 3049013 3491766 3615975 3359967 2829409 2219024 1774393 1631226 1594425 1286527 691516
36465F91516l08003N72519J277943J019169j01698j065394q98729K73789J231681
$$ 691516 383513 956032 2233975 3253144 3151446 2086052 1187323 1461112 2692793
36456B692793R22125l26484j175326q59097M8740N63745M30893L2151l17446n07962
$$ 2692793 3614918 3288434 2113108 1254011 1302751 1866496 2297389 2329540 2012094 1504132
36446A504132m51779k36627j63593k61750j64033J51250N4468p29087j384439
$$ 1504132 1052353 815726 652133 390383 226350 377600 432068 -297019 -1681458
36437a681458j045096q2108N02478N24872M77691L42016k62665r38614q12892
$$ -1681458 -2726554 -2808662 -2306184 -1781312 -1303621 -961605 -1224270 -2162884 -2975776
36428b975776j8348L84827J15998J0169L74174M02159k17064m89074K25161R53355
$$ -2975776 -2994124 -2609297 -2493299 -2483130 -2108956 -1706797 -1923861 -2412935 -2187774 -1234419
36418a234419O27785j18996L7634R80159J385465P67294q702j98196k5979P1888
$$ -1234419 -606634 -725630 -687996 292163 1677628 2444922 2436220 2238024 2212045 2283933
36408B283933Q4788M6957k02704n69974o18049k28010J42423J35596L255J38644
$$ 2283933 2368721 2415678 2212974 1643000 1024951 796941 939364 1074960 1078215 1216859
36398A216859M38163M69536Q8996m04993o58089n76352k74970R2526L70619L92913
$$ 1216859 1655022 2124558 2213554 1808561 1150472 574120 299150 391676 762295 1155208
36388A155208J14817k45678l93020l41955l76322m94932k71786L93508P93113
$$ 1155208 1270025 1024347 631327 289372 -86950 -581882 -853668 -460160 332953
36379C32953L02848n02784m54120N14013J171952P31111j25610m02924j56765
$$ 332953 635801 133017 -321103 192910 1364862 2095973 1970363 1567439 1410674
36370A410674j7514j087L44685R44423J169824P34649O711n40797p27931n97477
$$ 1410674 1393160 1392073 1736758 2681181 3851005 4585654 4592365 4051568 3323637 2726160
36360B726160l68335l78495o94015q63120m18098M50299J039878R18938L40939
$$ 2726160 2357825 1979330 1285315 422195 4097 454396 1494274 2413212 2754151
36351B754151n9410J28253O46379P21727m0948r56848r77168j44254M00691Q1120
$$ 2754151 2694741 2822994 3469373 4191100 4150152 3193304 2216136 2071882 2472573 2553693
36341B553693l25697n3852M09094K54017k42543k77417M5946j5567m27294l81020
$$ 2553693 2227996 2174144 2583238 2837255 2594712 2317295 2363241 2347674 1920380 1539360
36331A539360L04024Q16419N50356j40443n63038m38967L7063L58720j1624r86110
$$ 1539360 1843384 2659803 3210159 3069716 2506678 2067711 2104774 2463494 2451870 1465760
36321A465760j651737j318583m78393j6619J18505N05749R12026O23757n9988
$$ 1465760 -185977 -1504560 -1982953 -1999572 -1881067 -1375318 -463292 160465 100477
36312A00477q4263N26974N65046l05145q64362l10161N00430N95263L68890M97511
$$ 100477 16214 543188 1108234 803089 -61273 -371434 128996 724259 1093149 1590660
36302A590660N46724q6746p76976n98648Q637p0352p08295p57302k98N49155L64335
$$ 1590660 2137384 2050638 1273662 675014 683651 613299 -94996 -852298 -852596 -303441 60894
36291F0894Q5561K04740K88797o316k05653N8257K54762j38445n81643j90991
$$ 60894 146455 351195 639992 633676 428023 486280 741042 602597 20954 -170037
36281a70037Q54805J475414J129735L24521l36730q30507j170274r24088Q7825
$$ -170037 684768 2160182 3289917 3614438 3277708 2447201 1276927 352839 440664
36272D40664J037162Q51468k99804j065060o71222J21880K70572p4653j06351
$$ 440664 1477826 2329294 2029490 964430 293208 415088 685660 611007 504656
36263E04656J72314O6736m31450n31730l2956K79459q045k21456J65271N17848
$$ 504656 676970 743706 312256 -219474 -252430 27029 18984 -202472 -37201 480647
36253D80647Q8301o58916p28481j18014L13696K11810J6331K5505N2919M854J1195
$$ 480647 568948 -89968 -818449 -936463 -622767 -410957 -394626 -369121 -316202 -311348 -300153
36242c00153m3821l76702o47405k16751P92161J425907J138866M38148K117k03950
$$ -300153 -343974 -720676 -1368081 -1584832 -792671 633236 1772102 2210250 2212367 2008417
36232B008417n23799q67577q93902o00070k65211k6789J00382o003l75564o49907
$$ 2008417 1484618 617041 -276861 -876931 -1142142 -1168931 -1068549 -1074552 -1450116 -2100023
36222b100023m21169J32442L43715o3710m86941j26772R36535J696864J393835
$$ -2100023 -2521192 -2388750 -2045035 -2108745 -2595686 -2722458 -1785923 -89059 1304776
36213A304776M44292j34387m8373O3221k28755m70361j66736L03770K69820j15086
$$ 1304776 1749068 1614681 1566308 1629529 1400774 930413 763677 1067447 1337267 1222181
36203A222181j07878M13575P51823M48469j58433n72839o91976n38738r5394L21391
$$ 1222181 1114303 1527878 2279701 2728170 2569737 1996898 1304922 766184 670790 992181
36193I92181J61010m93849p53115j19265O56854N52508k83002p99433n59405j77892
$$ 992181 1153191 659342 -93773 -213038 443816 996324 713322 -86111 -645516 -823408
36183h23408j93189k68981J14455P16131Q36835L73807L8845L99584J052484J067321
$$ -823408 -1016597 -1285578 -1171123 -454992 381843 755650 794495 1194079 2246563 3313884
36173C313884J77811q07702r43379k55130L88737L94640J3379k64645m08823o15265
$$ 3313884 3491695 2683993 1740614 1485484 1874221 2268861 2282240 2017595 1608772 993507
36163I93507p09639l07333M54443Q12985K22567r34225j689811j444050m39748
$$ 993507 283868 -23465 430978 1243963 1466530 532305 -1157506 -2601556 -3041304
36154c041304N90928J066441R12780N24052M12042O92315Q51095K67169q94557
$$ -3041304 -2450376 -1383935 -471155 52897 464939 1157254 2008349 2275518 1380961
36145A380961j626173j238836k94768J47688K9769K70443J179395J794111J264781
$$ 1380961 -245212 -1484048 -1778816 -1631128 -1601359 -1330916 -151521 1642590 2907371
36136B907371J12897o11206p94001r79116j109425o73952Q2031K94689p2086p3786
$$ 2907371 3020268 2409062 1615061 635945 -473480 -1147432 -1065401 -770712 -842798 -916584
36126i16584O24011J130284Q08979K96985L09895M07212p1072o15155k93456N55811
$$ -916584 -292573 837711 1646690 1943675 2253570 2660782 2589710 1974555 1681099 2236910
36116B236910O49828k99928j128927q91780l9269M22262K10993k04613l45697
$$ 2236910 2886738 2586810 1457883 566103 526834 949096 1160089 955476 609779
36107F09779j04012K93958M50604J67172k46663l05798r20K38800K11255J08049
$$ 609779 505767 799725 1250329 1417501 1170838 865040 864120 1102920 1314175 1422224
36097A422224J923k64149n34736k96152N06093J124692R25784K65071l2256J96240
$$ 1422224 1424147 1159998 625262 329110 835203 1959895 2885679 3150750 3118494 3314734
36087C314734L55352K3083n21860p74475o20723k90684O1705M44494P25910N56093
$$ 3314734 3670086 3693169 3171309 2396834 1776111 1485427 1547132 1991626 2717536 3273629
36077C273629j64137q78378q42418q6529N09458L55955o1326K9697N13247O51832
$$ 3273629 3109492 2231114 1388696 1302167 1811625 2167580 2106254 2135951 2649198 3301030
36067C301030K81758l9455l2834k9662j85181j71495P4760P2945l28869n10613
$$ 3301030 3582788 3543333 3510499 3480837 3295656 3124161 3198921 3271866 2942997 2432384
36057B432384l4966N50007M55841k52086q62455r31651m94852K13288P36257N41964
$$ 2432384 2397418 2947425 3403266 3151180 2288725 1357074 862222 1075510 1811767 2353731
36047B353731k45721p09942l28746K01934L3219m91478m64770N9478K59907J5992
$$ 2353731 2108010 1398068 1069322 1271256 1304475 812997 348227 407705 667612 683604
36037F83604Q165L82483M86253R9980j68465j4249O4433k22198m09543k04282
$$ 683604 691769 1074252 1560505 1660485 1492020 1477771 1542204 1320006 910463 706181
36027G06181m2957j88428j39799M10942Q23606M64943k14124l31260J72422O28132
$$ 706181 663224 474796 334997 745939 1569545 2034488 1820364 1489104 1661526 2289658
36017B289658N87641Q5083o10423r65471m46630N98987R55698J31392p60001n96497
$$ 2289658 2877299 2962382 2351959 1386488 939858 1538845 2494543 2625935 1865934 1269437
36007A269437L10k74984j147651j074004K93637J481040J330029M34818r1143
$$ 1269437 1269747 994763 -152888 -1226892 -933255 547785 1877814 2312632 2221489
35998B221489j65023l33631o54471p61003n48871j71335L01346P56608Q97697
$$ 2221489 2056466 1722835 1068364 307361 -241510 -412845 -111499 645109 1542806
35989A542806O05388J62422j41961l22801m39683m05795k21916j2694K59849O50084
$$ 1542806 2148194 2310616 2168655 1845854 1406171 1000376 778460 765766 1025615 1675699
35979A675699P83691K33461n65395o23212R5005L98915l63090j191204q80633
$$ 1675699 2459390 2692851 2127456 1504244 1599249 1998164 1635074 443870 -436763
35970d36763J99721P81710N95576M44876O39905N43722j88547q96997q13379l6378
$$ -436763 -237042 544668 1140244 1585120 2225025 2768747 2580200 1683203 869824 833446
35960H33446P31416R97010P69139L52445O4642r662o0180k40011m03504l25299
$$ 833446 1564862 2561872 3331011 3683456 3748098 3738436 3678256 3438245 3034741 2709442
35950B709442l8000K51302M17405M20302L06499L65273Q71455J429010J146364
$$ 2709442 2671442 2922744 3340149 3760451 4066950 4432223 5303678 6732688 7879052
35941G879052p1120j020845p00464K32961L94304l62098r70764r02207o72446
$$ 7879052 7807932 6787087 6086623 6319584 6713888 6351790 5381026 4478819 3806373
35932C806373n86853k21659N06476Q57631L93488k83405m62763k52995m9136J95550
$$ 3806373 3219520 2997861 3504337 4361968 4755456 4472051 4009288 3756293 3707157 3902707
35922C902707N56380O35740J55017m28608n24312k34949l6021k6503l7642r5797
$$ 3902707 4459087 5094827 5249844 4821236 4296924 4061975 4025954 3999451 3961809 3866012
35912C866012k28077j75511J59491L50208P5913k77013k31602k7582j38911l76983
$$ 3866012 3637935 3462424 3621915 3972123 4048036 3771023 3539421 3511839 3372928 2995945
35902B995945k65809l169j50434n24654l58551L91985Q22060L90726l29366n45961
$$ 2995945 2730136 2726967 2576533 2051879 1693328 2085313 2907373 3298099 2968733 2422772
35892B422772k32333J62582M30616N71598M37420j00149p80173j104774q43197
$$ 2422772 2190439 2353021 2783637 3355235 3792655 3692506 2912333 1807559 964362
35883I64362k37976K51993L72060K80718K84355L44886J11468m14236o59730l03569
$$ 964362 726386 978379 1350439 1631157 1915512 2260398 2371866 1957630 1297900 994331
35873I94331J13222k0965l71964k20866K41260J69879m51296o89142k01335K33236
$$ 994331 1107553 1086588 714624 493758 735018 904897 453601 -235541 -436876 -203640
35863b03640J39316J68842P91011J175312L95044r53348j437294p03097L10113
$$ -203640 -64324 104518 895529 2070841 2465885 1512537 75243 -627854 -317741
35854c17741Q13224Q36348N84571R9996l72444n03736m58263o32516p91583k76950
$$ -317741 495483 1331831 1916402 2016398 1643954 1140218 681955 49439 -742144 -1019094
35844a019094P99292J421179J040957L35500J84304N32740P39698N18766K5962
$$ -1019094 -219802 1201377 2242334 2577834 2762138 3294878 4034576 4553342 4579304
35835D579304n62746j047775j105178o78806k35074k00285l64526k50273J45864
$$ 4579304 4016558 2968783 1863605 1184799 949725 749440 384914 134641 280505
35826B80505M18558M00761L06210L12017L92532N09063N99718M35321j29805p62551
$$ 280505 699063 1099824 1406034 1718051 2110583 2619646 3219364 3654685 3524880 2762329
35816B762329q87260m02982J47503K41296n6763l35304m10083m18941m53520l82622
$$ 2762329 1875069 1472087 1619590 1860886 1804123 1468819 1058736 639795 186275 -196347
35806a96347j35493M6529r8230l53541j77581M85949R34426O37077J16114K75472
$$ -196347 -331840 -285311 -383541 -737082 -914663 -428714 505712 1142789 1258903 1534375
35796A534375J007609J269392O44541l2940R960L52979J64045n35805j106589
$$ 1534375 2541984 3811376 4455917 4422977 4432937 4785916 4949961 4414156 3307567
35787C307567j277956j138917n84398L58424R74494N80733l48489o89217k23535
$$ 3307567 2029611 890694 306296 664720 1639214 2219947 1871458 1182241 958706
35778I58706K23270J57154o1952j45685k94167m57554j80547M65309P29878L69308
$$ 958706 1181976 1339130 1277178 1131493 837326 379772 199225 664534 1394412 1763720
35768A763720P2734K63917M23749J46443j07879M880l6578n33577o87833J16611
$$ 1763720 1836454 2100371 2524120 2670563 2562684 2567564 2530986 1997409 1309576 1426187
35758A426187R76601O90205k94302n44494J05918M31610j36605p48349o10694
$$ 1426187 2402788 3092993 2798691 2254197 2360115 2791725 2655120 1906771 1296077
35749A296077j157N12302Q04666P98482K95056m15913o34844l00242j38940m41993
$$ 1296077 1294920 1807222 2611888 3410370 3705426 3289513 2654669 2354427 2215487 1773494
35739A773494n77147j44008K92461K02499J020K54318O61556N93440J20447k52430
$$ 1773494 1196347 1052339 1344800 1547299 1548319 1802637 2464193 3057633 3178080 2925650
35729B925650m57984p25518q85413n61133J07378N68332N91665L96460J88722
$$ 2925650 2467666 1742148 856735 295602 402980 971312 1562977 1959437 2148159
35720B148159N2878J46676N04157P53301N01674p1642m33670m26443l66599m88358
$$ 2148159 2201037 2347713 2851870 3605171 4106845 4035203 3601533 3175090 2808491 2320133
35710B320133p02000q78966r85392r12403n17048R9368N93242P07835M62819O2792
$$ 2320133 1618133 739167 -246225 -1158628 -1675676 -1576308 -983066 -275231 187588 250380
35700B50380k50001l43632l15301l25892k41016K80550J151151J631588J101776
$$ 250380 379 -343253 -658554 -984446 -1225462 -944912 206239 1837827 2939603
35691B939603j17281j040621j032903l26861L37447L94651p0884l74947L8516
$$ 2939603 2822322 1781701 748798 421937 759384 1154035 1083151 708204 746720
35682G46720Q11025R58272J40468p83079q12447k6654O87668P82948M19518m6326
$$ 746720 1557745 2516017 2656485 1873406 1060959 1034305 1721973 2504921 2924439 2878113
35672B878113l86524m50454k89179k54859n67122q89471p28658j24393M46673
$$ 2878113 2491589 2041135 1751956 1497097 929975 40504 -688154 -812547 -365874
35663c65874O97214O54020L39797j94703o34257o54893l57831q1761Q7093K49966
$$ -365874 331340 985360 1325157 1130454 496197 -158696 -516527 -598288 -511195 -261229
35653b61229L36079K36951J17823J66441K39883J92215K62772O17757Q30934M58767
$$ -261229 74850 311801 429624 596065 835948 1028163 1290935 1908692 2739626 3198393
35643C198393j67110m40502m75595p56627j051609p02113Q5375L52516p9784l00649
$$ 3198393 3031283 2590781 2115186 1358559 306950 -395163 -309788 42728 -37056 -337705
35633c37705J66131N98620L33732j66879j50815K86100N60159M93592K34414j81114
$$ -337705 -171574 427046 760778 593899 443084 729184 1289343 1782935 2017349 1836235
35623A836235o08116o31261j69311K40919K68470L31919P37149Q99436K34759
$$ 1836235 1228119 596858 427547 668466 936936 1268855 2006004 2905440 3140199
35614C140199o62290o93772J27152O94803M10040j50190l20145k61751l91563
$$ 3140199 2477909 1784137 1911289 2606092 3016132 2865942 2545797 2284046 1892483
35605A892483n21986j68613N54472R16727N00388k37726n50865l32399j26489
$$ 1892483 1370497 1201884 1756356 2673083 3173471 2935745 2384880 2052481 1925992
35596A925992k60158m17158k72011q1040k01772m04482k68902K2247K8325k5361
$$ 1925992 1665834 1248676 976665 895625 693853 289371 20469 42716 71041 45680
35586D5680M05850R72582O65664n05486j191840n69147M92963P90722L81973J8769
$$ 45680 451530 1424112 2089776 1584290 392450 -176697 316266 1106988 1488961 1507730
35576A507730j57644l73726l61351J80827P37419O32058J58867M6419J60703j46146
$$ 1507730 1350086 976360 615009 795836 1533255 2165313 2324180 2370599 2531302 2385156
35566B385156o73196n91592M2202K40689l04852p44195n00739r6745r5554j86216
$$ 2385156 1711960 1120368 1162570 1403259 1098407 354212 -146527 -243272 -338826 -525042
35556e25042Q6049M51553M24109J11448p2243o6807k2696J22177M21960N71794
$$ -525042 -438993 12560 436669 548117 475874 409067 386371 508548 930508 1502302
35546A502302K50539l54663p31136o36680k67197N5674J81043J86500K03507J37342
$$ 1502302 1752841 1398178 667042 30362 -236835 -181161 -118 186382 389889 527231
35536E27231k74119r04674j036570k16379Q86417J153392M96784r3910n7415M4350
$$ 527231 253112 -651562 -1688132 -1904511 -1018094 135298 632082 538172 480757 525107
35526E25107l67082r19691r57512n23256q7559J96836M00591M27064K93992L92973
$$ 525107 158025 -761666 -1719178 -2242434 -2329993 -2133157 -1732566 -1305502 -1011510 -618537
35516f18537Q55119J041056L73576n88784o93885K44340J137980R77833n8461
$$ -618537 236582 1277638 1651214 1062430 368545 612885 1750865 2728698 2670237
35507B670237r87509j074173l69171M58269O87534J73835n28550p99048n83782
$$ 2670237 1682728 608555 239384 697653 1385187 1559022 1030472 231424 -352358
35498c52358k00360K19316O70847Q70392M88565k25752o18265n02309l18905l07596
$$ -352358 -552718 -333402 337445 1207837 1696402 1470650 852385 350076 31171 -276425
35488b76425j28179M00499P67154M68687j56219l65079o7449J26267j45886n27715
$$ -276425 -404604 -4105 763049 1231736 1075517 710438 642989 769256 623370 95655
35478I5655n25540j63469J15091j8129m38999o35149j54883Q07005J394973R99631
$$ 95655 -429885 -593354 -478263 -496392 -935391 -1570540 -1725423 -918418 476555 1476186
35468A476186P7686l84996j70058K6311j83195k98374L3328K06674l50262r60897
$$ 1476186 1553872 1168876 998818 1025129 841934 543560 576888 783562 433300 -527597
35458e27597m98504Q31833J570612R40714k51493r02002r13829p91871o87239
$$ -527597 -1026101 -194268 1376344 2317058 2065565 1163563 249734 -542137 -1229376
35449a229376m30614m2267K93876M53129K95535k14821o38377m10609K07633K92474
$$ -1229376 -1659990 -1702257 -1408381 -955252 -659717 -874538 -1512915 -1923524 -1715891 -1423417
35439a423417k82822m75534K52036R02317N18981j52060J37197R80867R15818
$$ -1423417 -1706239 -2181773 -1929737 -1027420 -508439 -660499 -523302 457565 1373383
35430A373383j55406p86486l07767K35460j33045r46200j283284j012563m21248
$$ 1373383 1217977 431491 123724 359184 226139 -720061 -2003345 -3015908 -3437156
35421c437156M07984J183903J251415N63438N1643L21962O88340K61478o44748
$$ -3437156 -3029172 -1845269 -593854 -30416 21227 343189 1031529 1293007 648259
35412F48259j040879o99462j94009J61532N48799R65666J069215P18129J46901
$$ 648259 -392620 -1092082 -1286091 -1124559 -575760 389906 1459121 2177250 2324151
35403B324151l91298p63846q29721n43427j25689J32716J42708l5422k70574k86685
$$ 2324151 1932853 1169007 339286 -204141 -329830 -197114 -54406 -89828 -360402 -647087
35393f47087R2800M79642K19726o04448j075931p00778r2596R6163J94316P13920
$$ -647087 -554287 -74645 145081 -459367 -1535298 -2236076 -2328672 -2232509 -2038193 -1324273
35383a324273J187912Q28280k7613k48153L72741P90505L17087l69008k80753
$$ -1324273 -136361 691919 664306 416153 788894 1579399 1896486 1527478 1246725
35374A246725M54793Q24252K96784n64240q87988n51883j93767k48035l76142
$$ 1246725 1701518 2525770 2822554 2258314 1370326 818443 624676 376641 499
35365D99j39399J55092o9087n32301l50188N03264R91338O17340J72086K85360
$$ 499 -138900 16192 -52895 -585196 -935384 -432120 559218 1176558 1348644 1634004
35355A634004L31219k92798q06299k35021P80491Q17826j11906o64233k87940
$$ 1634004 1965223 1672425 866126 631105 1411596 2229422 2117516 1453283 1165343
35346A165343K24010L14181L16806L19829j85481j056157j206915k25612Q02472
$$ 1165343 1389353 1703534 2020340 2340169 2154688 1098531 -108384 -333996 468476
35337D68476P95795R4671l18989j95068J29946N24278R02879Q29751O8507q28781
$$ 468476 1264271 1358942 1039953 844885 974831 1499109 2401988 3231739 3300246 2471465
35327B471465j126269p97712l14442R3098M49886O48114N50174K50172r9481m20442
$$ 2471465 1345196 547484 233042 326140 776026 1424140 1974314 2224486 2125005 1704563
35317A704563m65115L2965O82360N87317l47695r75117m33233N41105O80651K7338
$$ 1704563 1239448 1272413 1954773 2542090 2194395 1219278 786045 1327150 2007801 2035139
35307B035139l20226L0226L74730K35172j3503l2597p6458k94608k90527J28370
$$ 2035139 1714913 1745139 2119869 2355041 2341538 2308941 2232483 1937875 1647348 1775718
35297A775718M08775M2014n75640p00831l53217j98291m36657n05684m4860M35237
$$ 1775718 2184493 2226507 1650867 950036 596819 398528 -38129 -543813 -588673 -153436
35287a53436K58541l87192o45863j48133N17479O35563K86262J38064N14053R89177
$$ -153436 105105 -282087 -927950 -1076083 -558604 76959 363221 501285 1015338 2004515
35277B004515R13792J55365p12738r37924l80423K67204K82016j24108q4667O05985
$$ 2004515 2918307 3073672 2360934 1423010 1042587 1309791 1591807 1467699 1383032 1989017
35267A989017J085226O71370j21572m06054k01206j23178k37387j35745J17233
$$ 1989017 3074243 3745613 3624041 3217987 3016781 2893603 2656216 2520471 2637704
35258B637704R1571j02084n938J74303j83446q77657j058555p28526p66105j197306
$$ 2637704 2729275 2627191 2621253 2795556 2612110 1734453 675898 -52628 -818733 -2016039
35248b016039q93776M38996J435383J119615M30101N49193R37892M84466l66328
$$ -2016039 -2909815 -2470819 -1035436 84179 514280 1063473 2001365 2485831 2119503
35239B119503l46241L45012K77342q05536j502910r16980J45882N99165N24638
$$ 2119503 1773262 2118274 2395616 1590080 87170 -829810 -683928 -84763 439875
35230D39875N79357Q18821P86541L00219l39682o80238m61240J24681N04937L40769
$$ 439875 1019232 1838053 2624594 2924813 2585131 1904893 1443653 1568334 2073271 2414040
35220B414040n3207k22478k24623l17199l69945k11877j72358m90764n66910K21019
$$ 2414040 2360833 2138355 1913732 1596533 1226588 1014711 842353 351589 -215321 5698
35210E698J230290J227199K46496m35435k49582J4163k33254m53629j36711K62339
$$ 5698 1235988 2463187 2709683 2274248 2024666 2038829 1805575 1351946 1215235 1477574
35200A477574K24456O2246K05469L96255K87561J21742J50678P1694l03712n06740
$$ 1477574 1702030 1764276 1969745 2366000 2653561 2775303 2925981 2997675 2693963 2187223
35190B187223k14398R0202k0569r6662L24384O87782K21743p29938j167359q76819
$$ 2187223 1972825 2063027 2042458 1945796 2270180 2957962 3179705 2449767 1282408 405589
35180D05589m71512k75249r1755J24573K57014N12004J069393J440255J050996
$$ 405589 -65923 -341172 -432927 -308354 -51340 460664 1530057 2970312 4021308
35171D021308K82563m857J80695J14058k54214k14803L13164N20434J25656j16776
$$ 4021308 4303871 4299014 4479709 4593767 4339553 4124750 4437914 4958348 5084004 4967228
35161D967228J93296L08713l88052j263768j400873r26083n28398k87851J06484
$$ 4967228 5160524 5469237 5081185 3817417 2416544 1490461 962063 674212 780696
35152G80696M59946L50312M675n832K32133J35457l11437n02606k37328K465p9940
$$ 780696 1240642 1590954 1595629 1589797 1821930 1957387 1645950 1143344 906016 908481 828541
35141H28541j87023p7326M5599M0658J15889L23256L33730M3949j25143Q4889
$$ 828541 641518 564192 609791 650449 766338 1089594 1423324 1467273 1342130 1427019
35131A427019K80935N5007l44610m84208m72495o12163o59348j62523O20088R22865
$$ 1427019 1707954 1762961 1418351 934143 461648 -150515 -809863 -972386 -352298 570567
35121E70567O22360M17454O59301P49409J40337o77089q20320k80061J60546J33369
$$ 570567 1192927 1610381 2269682 3019091 3159428 2482339 1662019 1381958 1542504 1675873
35111A675873J01433M60823Q64284P87991L32571l993j08033k89719n98887o39086
$$ 1675873 1777306 2238129 3102413 3890404 4222975 4218982 4110949 3821230 3222343 2583257
35101B583257k31445J95926K18415O6097J95720M41382K21316m04698n82495J27568
$$ 2583257 2351812 2547738 2766153 2832250 3027970 3469352 3690668 3285970 2703475 2831043
35091B831043R76643R77458K25558l44996k96144r7967k30279n18594n40158k10264
$$ 2831043 3807686 4785144 5010702 4665706 4369562 4271595 4041316 3522722 2982564 2772300
35081B772300K50869N89686N99196K33291k37903m54147l80702k08592O8415N08738
$$ 2772300 3023169 3612855 4212051 4445342 4207439 3753292 3372590 3163998 3232413 3741151
35071C741151P36101K68227n81451q75544l74083P9233j25681m60172k48038J99885
$$ 3741151 4477252 4745479 4164028 3288484 2914401 2993634 2867953 2407781 2159743 2359628
35061B359628K36183M2532K06914N73619N25936J58643J36593M78554N04218N1558
$$ 2359628 2595811 2638343 2845257 3418876 3944812 4103455 4240048 4718602 5222820 5274378
35051E274378k32044m214K67922J94198K9207K6018m498j12680N7591M89365M59260
$$ 5274378 5042334 5038120 5306042 5500240 5529447 5555465 5550967 5438287 5495878 5985243 6444503
35040F444503m16463j383034j466717p71992j82381o7821m568L21303O06942M70844
$$ 6444503 6028040 4645006 3178289 2406297 2223916 2156095 2151527 2472830 3079772 3550616
35030C550616N0318j77487J1979L60897M79700L05134M7300k88317r29564j646518
$$ 3550616 3600934 3423447 3435426 3796323 4276023 4581157 4628457 4340140 3410576 1764058
35020A764058j552524k59983J121423J101758j32388q49554j65810Q39856R13409
$$ 1764058 211534 -48449 1072974 2174732 2042344 1192790 1026980 1866836 2780245
35011B780245L88359K78166N51924M89114J48106J96946N42609L74065m16094
$$ 2780245 3168604 3446770 3998694 4487808 4635914 4832860 5375469 5749534 5333440
35002E333440r72458q17090m55337l58393k54980J39040M70223L57937M7527q2342
$$ 5333440 4360982 3543892 3088555 2730162 2475182 2614222 3084445 3442382 3489909 3407567
34992C407567j57086l97209n16272j58145L86493N77409N25198P36494J021968
$$ 3407567 3250481 2853272 2337000 2178855 2565348 3142757 3667955 4404449 5426417
34983E426417N58751o71752j389065o61038N77666O66121l78103q15078K16625
$$ 5426417 5985168 5313416 3924351 3263313 3840979 4507100 4128997 3313919 3530544
34974C530544J307567Q05751p36166j377410n24691N50453Q06935N84803L89724
$$ 3530544 4838111 5643862 4907696 3530286 3005595 3556048 4362983 4947786 5337510
34965E337510l7858p46652q92595k8443Q36259N77609l08273n06728K9739J01848
$$ 5337510 5299652 4553000 3660405 3631962 4468221 5045830 4737557 4230829 4260568 4362416
34955D362416p33162j438448j046432M7534P68875O60945O4957n32137q92231
$$ 4362416 3629254 2190806 1144374 1191908 1960783 2621728 2686685 2154548 1262317
34946A262317r52309o62569l579P62246R92120K90229o67094o20062N68988J457894
$$ 1262317 310008 -352561 -356140 406106 1398226 1688455 1021361 401299 970287 2428181
34936B428181R44371j27370k75614L61929M13433m23612r66351n06822K30302
$$ 2428181 3372552 3245182 2969568 3331497 3744930 3321318 2354967 1848145 2078447
34927B078447M44816L31846L00388K13788o762L9128M46732O19345K29882j94986
$$ 2078447 2523263 2855109 3155497 3369285 3362523 3401651 3848383 4467728 4697610 4502624
34917D502624j68313N9287J90950M12194O62529L17318o61841j168551m55335
$$ 4502624 4334311 4393598 4584548 4996742 5659271 5976589 5314748 4146197 3690862
34908C690862N98114P25791Q6727k59272p9978N1510P1335L92570P47095L77853
$$ 3690862 4288976 5014767 5101494 4842222 4762244 4813754 4885089 5277659 6024754 6402607
34898F402607n50319r36648l77582K36836J02358m22210n38361j06079L90202
$$ 6402607 5852288 4915640 4538058 4774894 4877252 4455042 3916681 3810602 4200804
34889D200804M66862k6527p48241r44472k28530O96786P74222R2648j85203M26950
$$ 4200804 4667666 4641139 3892898 2948426 2719896 3416682 4190904 4283552 4098349 4525299
34879D525299J022196P66973J35003m0206M9481k92109q64228p73101P6452O72339
$$ 4525299 5547495 6314468 6449471 6409265 6458746 6166637 5302409 4529308 4605760 5278099
34869E278099K65439o80010j194554r27270k40307M16937Q43711R99645R25592
$$ 5278099 5543538 4863528 3668974 2741704 2501397 2918334 3762045 4761690 5687282
34860E687282P38934N42110L50844J75629P7926N4779k0708k10867l63775l31638
$$ 5687282 6426216 6968326 7319170 7494799 7572725 7627504 7606796 7395929 7032154 6700516
34850F700516k62580m09328o34560m51903K46873Q26128O41061n5542m08469r1673
$$ 6700516 6437936 6028608 5394048 4942145 5189018 6015146 6656207 6600665 6192196 6100523
34840F100523L86104N55866N62541O28871N51801J75349j33951m4392R9355j77803
$$ 6100523 6486627 7042493 7605034 8233905 8785706 8961055 8827104 8782712 8882067 8704264
34830H704264o05848n53646p2091K38092K87675N37352R28915P61017n3391n43208
$$ 8704264 8098416 7544770 7472679 7710771 7998446 8535798 9464713 10225730 10172339 9629131
34820I629131n5638P01351O99506M7958m08585m76689o49180r77782r00104k64796
$$ 9629131 9573493 10274844 10974350 11022308 10613723 10137034 9487854 8510072 7609968 7345172
34810G345172L32502M84163N23895Q00060J006042P06965J08181k13809j08221
$$ 7345172 7677674 8161837 8685732 9485792 10491834 11198799 11306980 11093171 10984950
34801A0984950Q1444J07863N0456m183j13971k28111q3126M69697J164693J493283
$$ 10984950 11066394 11174257 11224713 11220530 11106559 10878448 10795322 11265019 12429712 13922995
34791A3922995J157850L21180n50834j051290j056600o69823p3999M83734P14682
$$ 13922995 15080845 15402025 14851191 13799901 12743301 12073478 11999479 12483213 13197895
34782A3197895N51558L62174N74938J003547R34067J45707n52878l04578N34775
$$ 13197895 13749453 14111627 14686565 15690112 16624179 16769886 16217008 15912430 16447205
34773A6447205P90661J07924n52812l18449M00393O56211L82052L20978P79200
$$ 16447205 17237866 17345790 16792978 16474529 16874922 17531133 17913185 18234163 19013363
34764A9013363J231142J201644Q57689N26059J95922j89311l91813k11595J22885
$$ 19013363 20244505 21446149 22303838 22829897 23025819 22836508 22444695 22233100 22355985
34755B2355985K34216O8934j80180m17230o16638o32881l64562j3017J20679N3631
$$ 22355985 22590201 22659135 22478955 22061725 21445087 20812206 20447644 20434627 20555306 20608937
34745B0608937R0318M10053Q99913J351763J602359J508040J021952L42055j88078
$$ 20608937 20699255 21109308 22009221 23360984 24963343 26471383 27493335 27835390 27647312
34736B7647312l79227k99806r0156J97079N48964Q90078J098767J137298J160291
$$ 27647312 27268085 26968279 26878123 27075202 27624166 28514244 29613011 30750309 31910600
34727C1910600J406099J862033K115499J764622R69282L30727K02099M37663Q63771
$$ 31910600 33316699 35178732 37294231 39058853 40028135 40358862 40560961 40998624 41862395
34718D1862395J528396K261562K486720J920247J122138Q54998J137545J442879
$$ 41862395 43390791 45652353 48139073 50059320 51181458 52036456 53174001 54616880
34710E4616880J616049J975856K582794L044694L130345L035220K939326K832319
$$ 54616880 56232929 58208785 60791579 63836273 66966618 70001838 72941164 75773483
34702G5773483K908162L553687M666323N492439N528695N203945N268830N825385
$$ 75773483 78681645 82235332 86901655 92394094 97922789 103126734 108395564 114220949
34694A14220949O410793O819391P317176Q052899Q719794R001126R112094R644584
$$ 114220949 120631742 127451133 134768309 142821208 151541002 160542128 169654222 179298806
34686A79298806J0867622J2335867J3344778J3759837J4167691J5079873J6269302
$$ 179298806 190166428 202502295 215847073 229606910 243774601 258854474 275123776
34679B75123776J7216091J7944341J8846501J9752276J9892677J9010552J7817775
$$ 275123776 292339867 310284208 329130709 348882985 368775662 387786214 405603989
34672D05603989J6879761J5618893J3113656R532568N952288K821995n38942m649380
$$ 405603989 422483750 438102643 451216299 460748867 466701155 469523150 468984208 464334828
34664D64334828q785201j1747443j3343179j4494757j5959737j7500969j8473054
$$ 464334828 455549627 443802184 430459005 415964248 400004511 382503542 364030488
34657C64030488j8764368j8768459j8646400j8114083j7039921j5850650j5072445
$$ 364030488 345266120 326497661 307851261 289737178 272697257 256846607 241774162
34650B41774162j4686850j4231472j3416693j2356864j1272394j0282982r492571
$$ 241774162 227087312 212855840 199439147 187082283 175809889 165526907 156034336
34643A56034336q969114q579312q098970p532331p063381o669295o116518n419583
$$ 156034336 147065222 138485910 130386940 122854609 115791228 109121933 103005415 97585832
34635I7585832m919053m723868m467081l910689l433120l476865l748050l505795
$$ 97585832 92666779 87942911 83475830 79565141 76132021 72655156 68907106 65401311
34627F5401311k619867j823206j755777k169779k366451k136668j881600j900130
$$ 65401311 62781444 60958238 59202461 57032682 54666231 52529563 50647963 48747833
34619D8747833j983627j846329j608607j545340j558244j307220q15320m88888
$$ 48747833 46764206 44917877 43309270 41763930 40205686 38898466 38083146 37594258
34611C7594258m64222m40959l70831p22931j615962k254749j944355j239972j175052
$$ 37594258 37130036 36689077 36318246 35595315 33979353 31724604 29780249 28540277 27365225
34602B7365225j600417j414418m73842l727o54586j360148r73955o9477J3480
$$ 27365225 25764808 24350390 23876548 23872821 23218235 21858087 20884132 20814655 20828135
34593B0828135p34659j124765p06319k75193l69916m51597J0609N70996N14052
$$ 20828135 20093476 18968711 18262392 17987199 17617283 17165686 17176295 17747291 18261343
34584A8261343q8665o13496p72779p30256n88472k84900N8950R6811l17613q40328
$$ 18261343 18172678 17559182 16786403 16056147 15467675 15182775 15241725 15338536 15020923 14180595
34574A4180595r06438l45996K80152J46858q53586j780315j637718o12132J21489
$$ 14180595 13274157 12928161 13208313 13355171 12501585 10721270 9083552 8471420 8592909
34565H592909j28323p66816p96394q3514O33827P55055L95416N960j83149k02860
$$ 8592909 8464586 7697770 6901376 6817862 7451689 8206744 8602160 8608120 8424971 8222111
34555H222111j02974O3482R4114k27027p38036q97468m38656J45598J60774l16549
$$ 8222111 8119137 8182619 8276733 8049706 7311670 6414202 5975546 6121144 6281918 5965369
34545E965369n22884j30904L03072K66143L4861L4607N9898j84529k79621K68962
$$ 5965369 5442485 5311581 5614653 5880796 5915657 5950264 6010162 5825633 5546012 5814974
34535E814974R12393O36940m02140r25297l94042K43105R0730m02692l49534J90800
$$ 5814974 6727367 7364307 6962167 6036870 5642828 5885933 5976663 5573971 5224437 5415237
34525E415237N31814M91680L81841K51870o3606l90587m25774l17481l75045l86503
$$ 5415237 5947051 6438731 6820572 7072442 7008836 6618249 6192475 5874994 5499949 5113446
34515E113446N6853O67574O72555k0668n88504m23122J03138K76237m2668m48766
$$ 5113446 5170299 5837873 6510428 6489760 5901256 5478134 5581272 5857509 5814841 5366075
34505E366075n87125m17636j14737Q0594O2747J0077J59350M29213N22292L82094
$$ 5366075 4778950 4361314 4246577 4327171 4389918 4399995 4559345 4988558 5510850 5892944
34495E892944K12127M7625k60064n66621m54007N7444L10698j15818p39885q17881
$$ 5892944 6105071 6152696 5892632 5326011 4872004 4929448 5240146 5124328 4384443 3566562
34485C566562l48425O7390J70185K76441N71207O95914K53160n78782j150199
$$ 3566562 3218137 3285527 3455712 3732153 4303360 4999274 5252434 4673652 3523453
34476C523453r44693k5952R72135J286437O60203l70927r48561o93763M3362O65296
$$ 3523453 2578760 2552808 3524943 4811380 5471583 5100656 4152095 3458332 3501694 4166990
34466D166990Q37435N36993p9456o79759q46919m21989K85314P69041P78046M37554
$$ 4166990 5004425 5541418 5461962 4782203 3935284 3513295 3798609 4567650 5345696 5783250
34456E783250M3241j44417j1352L29171N87649N37921J92688k72392o37108o45340
$$ 5783250 5826491 5682074 5670722 5999893 6587542 7125463 7318151 7045759 6408651 5763311
34446E763311j56330N35605Q15396M96843J87347M28262P02353M1976j339575
$$ 5763311 5606981 6142586 6957982 7454825 7642172 8070434 8772787 8814763 7475188
34437G475188j924409q67495O54158Q58038l38130j359467j153313l29973L2147
$$ 7475188 5550779 4683284 5337442 6195480 5857350 4497883 3344570 3014597 3046744
34428C046744k05859m90039n20589l40725N5635N74315P75979L92851r3669R270
$$ 3046744 2840885 2350846 1830257 1489532 1545167 2119482 2895461 3288312 3194643 3203913
34418C203913N84622Q22327L66948k40803l92488j36499J44232K92514L09178
$$ 3203913 3788535 4610862 4977810 4737007 4344519 4208020 4352252 4644766 4953944
34409D953944J26215j90885l15098r1820J48409O5359j53067j37620J3631n4891
$$ 4953944 5080159 4889274 4574176 4482356 4630765 4696124 4543057 4405437 4419068 4364177
34399D364177k59555k08029L74j94531q05276j029344m08622L50626L33584k36950
$$ 4364177 4104622 3896593 3896967 3702436 2897160 1867816 1459194 1809820 2143404 1906454
34389A906454l55349K80468R32587R75005O05741K18606k07345p09128r40461
$$ 1906454 1551105 1831573 2764160 3739165 4344906 4563512 4356167 3647039 2706578
34380B706578o96881m04466n14301p21078l99754L60167Q03455N78552J56802
$$ 2706578 2009697 1605231 1090930 369852 -29902 330265 1133720 1712272 1869074
34371A869074O0211J91455J71192m5582j80484l9660L03071N88380N25568L4235
$$ 1869074 1929285 2120740 2291932 2246350 2065866 2026206 2329277 2917657 3443225 3477460
34361C477460n76761q40170o10712j64266J74508K76785J08595k76513n80933
$$ 3477460 2900699 2060529 1449817 1285551 1460059 1736844 1845439 1568926 987993
34352I87993m59075j3950K28647N382l48953m22399k14676J24724O30389J218444
$$ 987993 528918 514968 743615 748997 400044 -22355 -237031 -112307 518082 1736526
34342A736526J411599Q68750j7190n44112n92844o03576p43884o52174r4792N91106
$$ 1736526 3148125 4016875 3999685 3455573 2862729 2259153 1515269 863095 768303 1359409
34332A359409Q94091O57537J05802l60119l30692K84187R67515R95509L02917
$$ 1359409 2253500 2911037 3016839 2656720 2326028 2610215 3577730 4573239 4876156
34323D876156m01236n91142n89773r03253j254157q98668J53446Q83886N10482
$$ 4876156 4474920 3883778 3294005 2390752 1136595 237927 391373 1275259 1785741
34314A785741m44243p73263r9735P09283P09979K3490m88616l92499m5234J42282
$$ 1785741 1341498 568235 468500 1177783 1887762 1911252 1422636 1030137 984903 1127185
34304A127185K42661L95081L48604j05168n31189k77905N30169R98010O16400
$$ 1127185 1369846 1764927 2113531 2008363 1477174 1199269 1729438 2727448 3343848
34295C343848p0802k47977J02591L30907J15426j60944q9362J12268p5114o29693
$$ 3343848 3273046 3025069 3127660 3458567 3573993 3413049 3323687 3435955 3360841 2731148
34285B731148q49486k46735O64764R11059L88421Q3068O30609J227912P10250
$$ 2731148 1881662 1634927 2299691 3210750 3599171 3682239 4312848 5540760 6251010
34276F251010o16020j213597m41097O04534P63476L18184R7672k0752o06335j234288
$$ 6251010 5634990 4421393 3980296 4584830 5348306 5666490 5764162 5743410 5137075 3902787
34266C902787q77845L53197J112656O70609k07167n69095m61215l20809j37026
$$ 3902787 3024942 3378139 4490795 5161404 4954237 4385142 3923927 3603118 3466092
34257C466092J09568k9364p06884j163710p09598J65568M82819J31557l13454
$$ 3466092 3575660 3546296 2839412 1675702 966104 1131672 1614491 1746048 1432594
34248A432594o67598j011449q76059K07957J475476J562515N15366j47195K71438
$$ 1432594 764996 -246453 -1122512 -914555 560921 2123436 2638802 2491607 2763045
34239B763045O29716j10424j173961j210794k98204M45084N93862N83404N60573
$$ 2763045 3392761 3282337 2108376 897582 599378 1044462 1638324 2221728 2782301
34230B782301K54314j74948k33705j8444r2795m39264m54121m2802K09043J02962
$$ 2782301 3036615 2861667 2627962 2609518 2516723 2077459 1623338 1580536 1789579 1892541
34220A892541J28314M19802L38378m29851j137527r57169j49779L60957K13635
$$ 1892541 2020855 2440657 2779035 2349184 1211657 254488 104709 465666 679301
34211F79301j47731k23993J8844K83283K95586Q3653k0521J72312L24199K7189
$$ 679301 531570 307577 326421 609704 905290 988943 968422 1140734 1464933 1492122
34201A492122m12056k70441L95790O01185j53419j009978q66409J70193J071320
$$ 1492122 1080066 809625 1205415 1806600 1653181 643203 -223206 -53013 1018307
34192A018307J217347P85789J33070m93320p71673n12363o7452k3010m48223q47508
$$ 1018307 2235654 3021443 3154513 2661193 1889520 1377157 1309705 1286695 838472 -9036
34182i036q44942n41697k07221L5293J92432L26494N02899O72769P14756O78027
$$ -9036 -853978 -1395675 -1602896 -1567603 -1375171 -1048677 -545778 126991 841747 1519774
34172A519774P24930P26607L32930l45869o68700m51961m22328j079289j676357
$$ 1519774 2244704 2971311 3304241 2958372 2289672 1837711 1415383 336094 -1340263
34163a340263j179686J50102J091311J154579R16586P24813K12731o27615r60106
$$ -1340263 -2519949 -2369847 -1278536 -123957 792629 1517442 1730173 1102558 142452
34154A42452k89644O18579O89403m3708n88753l16316L86432P11877L43612k62709
$$ 142452 -147192 471387 1160790 1117082 528329 212013 598445 1310322 1653934 1391225
34144A391225m22580n0989J94327k17802r22244j147970p45643j76847L14806
$$ 1391225 968645 917656 1111983 894181 -28063 -1176033 -1921676 -2098523 -1783717
34135a783717P83990R39559L50457n60352p01915J12668O91572J47753p55249
$$ -1783717 -999727 -60168 290289 -270063 -971978 -859310 -167738 -19985 -775234
34126g75234p14196K83212J119562J140762P03035L25905J26599Q2055J73892
$$ -775234 -1489430 -1206218 -86656 1054106 1757141 2083046 2209645 2291700 2465592
34117B465592K08628M905k30987j67479P3372Q6293j22034j44529J04318K25429
$$ 2465592 2674220 2679125 2448138 2280659 2354031 2440324 2318290 2173761 2278079 2503508
34107B503508M376k59866k73397j47715n9391Q0401L21472L88483Q8985k11196
$$ 2503508 2507884 2248018 1974621 1826906 1767515 1847916 2169388 2557871 2646856 2435660
34097B435660K7443O83561R46847K96200p71578j259555p94028N4246N43901N26565
$$ 2435660 2463103 3146664 4093511 4389711 3618133 2358578 1564550 1618796 2162697 2689262
34087B689262L19832J41748l9875k76926n61479q65860j003497o18876L33552
$$ 2689262 3009094 3150842 3110967 2834041 2272562 1406702 403205 -215671 117881
34078A17881J241268J385906P72380M651n27368q05820o75357N0561Q84808R09557
$$ 117881 1359149 2745055 3517435 3522086 2994718 2188898 1513541 1564102 2448910 3358467
34068C358467P5830m89228J6515R06209R76744J44401o09478o11208j03943L65786
$$ 3358467 3434297 2945069 2961584 3867793 4844537 4988938 4379460 3768252 3664309 4030095
34058D030095N44229M78338L87489M95830O82911M79328k61387r66330j049619
$$ 4030095 4574324 5052662 5440151 5935981 6618892 7098220 6836833 5870503 4820884
34049D820884p31850o31679p82027o63792r4281N24342Q11370P25624L17681k85122
$$ 4820884 4089034 3457355 2675328 2011536 1917255 2441597 3252967 3978591 4296272 4011150
34039D011150o47249l45443L85130Q11799O13564J86066m8493j63005l79787o07208
$$ 4011150 3363901 3018458 3403588 4215387 4828951 5015017 4966524 4803519 4423732 3816524
34029C816524n74856k07361K95187O13336N37331K23214J53549N83703J094634
$$ 3816524 3241668 3034307 3329494 3942830 4480161 4703375 4856924 5440627 6535261
34020F535261J005486K07629o97696j068295p73889j57403K72081J81790k68779
$$ 6535261 7540747 7748376 7050680 5982385 5208496 5051093 5323174 5504964 5236185
34011E236185n26896k91108R6951J47962j21166l27394k44030J36339O98033R83247
$$ 5236185 4709289 4418181 4515132 4663094 4541928 4214534 3970504 4106843 4804876 5788123
34001E788123L90501q23049j306118k36572J301054J629892P98611K65495M31184
$$ 5788123 6178624 5355575 4049457 3812885 5113939 6743831 7542442 7807937 8239121
33992H239121J02667j241098k255476j662574j33397Q01684P70254M00771l5661
$$ 8239121 8341788 7100690 4845214 3182640 3049243 3850927 4621181 5021952 4986291
33983D986291n71489o78580J82846J329729J434218M16173l69144r1191M50251
$$ 4986291 4414802 3736222 3919068 5248797 6683015 7099188 6730044 6638853 7089104
33974G089104J84672o22932q92211l64224J32531k3560m24917l66588R4453K80835
$$ 7089104 7273776 6650844 5758633 5394409 5526940 5503380 5078463 4711875 4806328 5087163
33964E087163q9677n46009n99954l70156j98903m9033K69485N44265L84521j11441
$$ 5087163 4997486 4451477 3851523 3481367 3282464 3233431 3502916 4047181 4431702 4320261
33954D320261m51355m59785l48652j19919M56077J185800J440657J006354L65039
$$ 4320261 3868906 3409121 3060469 2940550 3396627 4582427 6023084 7029438 7394477
33945G394477n4787k97176l60425M372O25547P72020J86201l79829k24650K79062
$$ 7394477 7339690 7042514 6682089 6686461 7312008 8084028 8270229 7890400 7665750 7944812
33935G944812L35934j11053n26779o37504m62508P8302Q49307J163628N70204
$$ 7944812 8280746 8169693 7642914 7005410 6542902 6621204 7470511 8634139 9204343
33926I204343k88243m19553J13845L84780P7490j48468J52076N37704M76764J09489
$$ 9204343 8916100 8496547 8610392 8995172 9072662 8924194 9076270 9613974 10090738 10200227
33916A0200227j41188j87797j57405n5136J31363K80320L35163M17172N48780
$$ 10200227 10059039 9871242 9713837 9658701 9790064 10070384 10405547 10822719 11371499
33907A1371499M93228Q0250m46080n92054j24934O28027J032143P93537L32581
$$ 11371499 11864727 11944977 11498897 10906843 10781909 11409936 12442079 13235616 13568197
33898A3568197L01526P28780R90064P25488L35440L18160N70719P09475O63330
$$ 13568197 13869723 14598503 15588567 16314055 16649495 16967655 17538374 18247849 18911179
33889A8911179N31148K59614p3447o9327L90112P87854P78072Q40337J422577
$$ 18911179 19442327 19701941 19628494 19559167 19949279 20737133 21515205 22355542 23778119
33880B3778119J957577J659844R01585P36831J306170J833816K053707K397736
$$ 23778119 25735696 27395540 28297125 29033956 30340126 32173942 34227649 36625385
33872C6625385K762611K455935J656995J581278K631128L607319L502377K963926
$$ 36625385 39387996 41843931 43500926 45082204 47713332 51320651 54823028 57786954
33864E7786954L036467L414136L127222K334363K160855K976139L937493M263022
$$ 57786954 60823421 64237557 67364779 69699142 71859997 74836136 78773629 83036651
33856H3036651M059935L760697L485070L212232L043363K974822K687649J817608
$$ 83036651 87096586 90857283 94342353 97554585 100597948 103572770 106260419 108078027
33848A08078027L99900j005029j702130j574928j384517j994802l235353m032699
$$ 108078027 108477927 107472898 105770768 104195840 102811323 100816521 97581168 93548469
33840I3548469l879587l571120m024377m916129n183419m541067l733058l393130
$$ 93548469 89668882 86097762 82073385 77157256 71973837 67432770 63699712 60306582
33832F0306582l395553l392726l325299l181149k777978k105742j557089j519673
$$ 60306582 56911029 53518303 50193004 47011855 44233877 42128135 40571046 39051373
33824C9051373j911632k315871k440866k303160k067664j850376j641882j352333
$$ 39051373 37139741 34823870 32383004 30079844 28012180 26161804 24519922 23167589
33816B3167589r46217n41154l33932m19409o98230r50102j002964q77262p60203
$$ 23167589 22221372 21680218 21346286 20926877 20228647 19278545 18275581 17398319 16638116
33807A6638116p84790q68511q56875p65856p29596p42491o45952l95617j76917
$$ 16638116 15853326 14984815 14127940 13362084 12632488 11889997 11244045 10848428 10671511
33798A0671511k03578m88318q01268q11774m09220L4211j5880m83182n98948K6743
$$ 10671511 10467933 9979615 9178347 8366573 7957353 7991564 7975684 7492502 6893554 6920297
33788F920297O51738L39383o45351j175880q75454m82394n31786o26568l30628
$$ 6920297 7572035 7911418 7266067 6090187 5214733 4732339 4200553 3573985 3243357
33779C243357R4605L17791N40285R18932J042473N88852l4798k99997l27891m87145
$$ 3243357 3337962 3655753 4196038 5114970 6157443 6746295 6711497 6411500 6083609 5596464
33769E596464o84271o41508m70252m01150l30881j55834j17271k90728k50186
$$ 5596464 4912193 4270685 3800433 3399283 3068402 2912568 2795297 2504569 2254383
33760B254383J59197K92473l03982r30023o65496J79051N47873K65461J13519
$$ 2254383 2413580 2706053 2402071 1472048 806552 985603 1533476 1798937 1912456
33751A912456M29416O97686N88793M43329N41670O57440M99902J4656p29282j363382
$$ 1912456 2341872 3039558 3628351 4071680 4613350 5270790 5770692 5785348 5056066 3692684
33741C692684j161997L8074J099988P71424n20379j176596p06200k21992m60322
$$ 3692684 2530687 2568761 3668749 4440173 3919794 2743198 2036998 1815006 1354684
33732A354684o84045j38102O13930O44158O2354l68197l43115j4497N11033R71781
$$ 1354684 670639 532537 1146467 1790625 1852979 1484782 1141667 1127170 1638203 2609984
33722B609984Q11449o3187q69121r24048n46086l60252k54940K14449Q16035Q65161
$$ 2609984 3421433 3358246 2489125 1565077 1018991 658739 403799 618248 1434283 2299444
33712B299444K52302m23603o09474k07228N09356R41392N04506n69734j189419
$$ 2299444 2551746 2128143 1518669 1311441 1820797 2762189 3266695 2696961 1507542
33703A507542p27480O4342J26215m05997n85781j35961M12776P91192J144639
$$ 1507542 780062 844404 970619 564622 -21159 -157120 255656 1046848 2191487
33694B191487J208350M51605p69357j233185m45098N97729P12611l1263o88387
$$ 2191487 3399837 3851442 3082085 1848900 1403802 2001531 2714142 2682879 1994492
33685A994492p56317n61316n70089p68401p02454M283J093407J699236J230323
$$ 1994492 1238175 676859 106770 -661631 -1364085 -1359802 -266395 1432841 2663164
33676B663164J60664m79971l71556j12079j16113j6655N08315R64748O76429j98345
$$ 2663164 2823828 2343857 1972301 1860222 1744109 1727454 2235769 3200517 3876946 3678601
33666C678601q71510r31175o11466k08374K06447M91716M06380N3754o1341L06745
$$ 3678601 2807091 1875916 1264450 1056076 1262523 1754239 2160619 2214373 2153032 2459777
33656B459777P10495N59672o0328m92476l98505j26773l4419J27138P01431J246737
$$ 2459777 3170272 3729944 3669616 3177140 2778635 2651862 2617443 2744581 3446012 4692749
33646D692749Q36719o21715j954613j979017q11173M65968J079291J022653N63400
$$ 4692749 5529468 4907753 2953140 974123 162950 628918 1708209 2730862 3294262
33637C294262k6076l29426o4301L85450K80117m72333j138644j165755q19524
$$ 3294262 3268186 2938760 2874459 3259909 3540026 3067693 1929049 763294 -56230
33628e6230n50239k96285J15152L51004L652n94724o57340l1995N77317N94531
$$ -56230 -606469 -902754 -787602 -436598 -432946 -1027670 -1685010 -1717005 -1139688 -545157
33618e45157K57989P5974M4615j55916m26632k57216M55939J042466Q14872k7806
$$ -545157 -287168 -211194 -166579 -322495 -749127 -1006343 -550404 492062 1306934 1279128
33608A279128o13539m57387O1670L54045L63071M01470N35586N16125K17961j94626
$$ 1279128 665589 208202 269872 623917 986988 1388458 1924044 2440169 2658130 2463504
33598B463504n16528o37447m80898j15234J21291k7946k67506o5160M81071N93761
$$ 2463504 1946976 1309529 828631 713397 834688 806742 539236 474076 955147 1548908
33588A548908r9743q83430p89986J59798J038712J187223P97827L36923p7701
$$ 1548908 1449165 565735 -224251 -64453 974259 2161482 2959309 3296232 3218531
33579C218531m95095p37672o03561l22315l97291r05222j258036r03361j09863
$$ 3218531 2723436 1985764 1382203 1059888 662597 -242625 -1500661 -2404022 -2513885
33570b513885K76396r6494n79024l23848N97076J227692Q75721r2910p32694n61159
$$ -2513885 -2237489 -2333983 -2913007 -3236855 -2639779 -1412087 -536366 -629276 -1361970 -1923129
33560a923129O7408N01847M87697K99266L01062M74951M39046n0339p02758r22620
$$ -1923129 -1855721 -1353874 -866177 -566911 -265849 209102 648148 597809 -104949 -1027569
33550a027569m44375L45517P61640M89658q2625k43974K33611P42225N48423j64183
$$ -1027569 -1471944 -1126427 -364787 124871 42246 -201728 31883 774108 1322531 1158348
33540A158348m13052K23617Q94947O19960k97910p44823m45994k14934m95112
$$ 1158348 745296 968913 1863860 2483820 2185910 1441087 995093 780159 285047
33531B85047o40849q8662N76822M32938l98545r04038m86198M66919J178903J165954
$$ 285047 -355802 -444464 132358 565296 166751 -737287 -1223485 -756566 422337 1588291
33521A588291M51787m39902p87726l53794L09807N25226K74295m812j31385k22071
$$ 1588291 2040078 1600176 812450 458656 768463 1293689 1567984 1563172 1431787 1209716
33511A209716k39688o9767N6912k06967o88166q27550m89983j29950q1945j74765
$$ 1209716 970028 900261 957173 750206 62040 -765510 -1255493 -1385443 -1467388 -1642153
33501a642153j44835L3994L36781P47345J020258Q30475K75887j96350m17288
$$ -1642153 -1786988 -1752994 -1416213 -668868 351390 1181865 1457752 1261402 844114
33492H44114n47653m92658K9390O72518N50173m30681j103373n56476N39564R10983
$$ 844114 296461 -196197 -166807 505711 1055884 625203 -478170 -1034646 -495082 415901
33482D15901M49124M5089J2895j85630o44939n93343L24562J227693J084803P8848
$$ 415901 865025 910114 923009 737379 92440 -500903 -176341 1051352 2136155 2215003
33472B215003p14697o69597q1156M69305O69033M62448k1370m42794m89853k57668
$$ 2215003 1500306 830709 749553 1218858 1887891 2350339 2328969 1886175 1396322 1138654
33462A138654j65688m13792p22083p06684l28764J59329N45034P37509O44989
$$ 1138654 972966 559174 -162909 -869593 -1198357 -1039028 -493994 243515 888504
33453H88504K63070j03303k3414M85795Q28411N40650o7398l42915k18109k09221
$$ 888504 1151574 1048271 1024857 1510652 2339063 2879713 2812315 2469400 2251291 2042070
33443B042070m97312o24820l36841j06288l41764n82554j71450N85914P56178
$$ 2042070 1544758 919938 583097 476809 135045 -447509 -618959 -33045 723133
33434G23133K04097j73161J78019O65420N52523R2620K8789L89894N12869J22677
$$ 723133 927230 754069 932088 1597508 2150031 2242651 2271440 2661334 3174203 3296880
33424C296880k78488j78699K94699O63585O74785L97925J2441k97674m00399l51466
$$ 3296880 3018392 2839693 3134392 3797977 4472762 4870687 4883128 4585454 4185055 3833589
33414C833589l83469o13267q15846o32483j9811O09589P72399M23139l583r3149
$$ 3833589 3450120 2836853 2021007 1388524 1368713 1978302 2750701 3173840 3170257 3077108
33404C077108J04419K37241J63647Q6207J77857L23553L27937J64566j02840m26472
$$ 3077108 3181527 3418768 3582415 3668622 3846479 4170032 4497969 4662535 4559695 4133223
33394D133223o38058m44046J80722P60904P81857L01943j57139k54586j02454
$$ 4133223 3495165 3051119 3231841 3992745 4774602 5076545 4919406 4664820 4562366
33385D562366K3571n5039l90720q10146q68763k79029N71002R05279M75291j64024
$$ 4562366 4585937 4530898 4140178 3330032 2461269 2182240 2753242 3658521 4133812 3969788
33375C969788m14587k81335p4934R4120J93722L2533l91004n72808p6006P09832
$$ 3969788 3555201 3273866 3198932 3293052 3486774 3519307 3128303 2555495 2479489 3189321
33365C189321R33060L90983k58844m64736m02563m40697n32230m95052m40056
$$ 3189321 4122381 4513364 4254520 3789784 3387221 2946524 2414294 1919242 1479186
33356A479186m51971j99263N63428J318511J263426M46473k03788j06577L07348
$$ 1479186 1027215 827952 1391380 2709891 3973317 4419790 4216002 4109425 4416773
33347D416773L99997K21273J94296L70005N07429N63159N52887J98544o40660
$$ 4416773 4816770 5038043 5232339 5602344 6109773 6672932 7225819 7424363 6783703
33338F783703j343580j077021j7200O99531M47442j39124k04299J78379L65617
$$ 6783703 5440123 4363102 4345902 5045433 5492875 5353751 5149452 5327831 5693448
33329E693448J35702k44037n68730p55492o51809l35838l17241q31911j209801
$$ 5693448 5829150 5585113 5016383 4260891 3609082 3273244 2956003 2124092 914291
33320I14291o70162M28335R49119N52839L0414o9965k04650q01184j297913r17107
$$ 914291 244129 672464 1621583 2174422 2204836 2134871 1930221 1129037 -168876 -1085983
33310a085983J01669P45261M73476l08508q46497o78782J27503R78960J166527
$$ -1085983 -984314 -239053 234423 -74085 -920582 -1599364 -1471861 -492901 673626
33301F73626O27364R7037J70799M99271L54261k82547p58168p21760m67554l24071
$$ 673626 1300990 1398027 1568826 2068097 2422358 2139811 1381643 659883 192329 -131742
33291a31742k51023j35045l7216j0712O402L6232N1421J02807K01889J94271P6639
$$ -131742 -382765 -517810 -555026 -565738 -559336 -523104 -471683 -368876 -166987 27284 103923
33280A03923K35395Q72047J369678R18975k37675r52334p17589k65985k81858
$$ 103923 339318 1211365 2581043 3500018 3262343 2310009 1592420 1326435 1044577
33271A044577l44772J86558Q98449Q47411N5785m67177k18161J43940q3434n67217
$$ 1044577 699805 886363 1784812 2632223 2688008 2220831 2002670 2146610 2063176 1495959
33261A495959m98065J69695O52481M59120M5905J13315N64186N88472j94392j074864
$$ 1495959 997894 1167589 1820070 2279190 2325095 2438410 3002596 3591068 3396676 2321812
33251B321812j048634r8381P33131O01008j94729p29212o00912j85777J02049
$$ 2321812 1273178 1174797 1907928 2508936 2314207 1584995 984083 798306 900355
33242I00355L07775N32875M35449l86065j529993j834292o84518R76202J533816
$$ 900355 1208130 1741005 2176454 1790389 260396 -1573896 -2258414 -1282212 251604
33233B51604O42325l50237k02908O33683Q40050J31596n50706n67682l29166l82159
$$ 251604 893929 543692 340784 974467 1814517 1946113 1395407 827725 498559 116400
33223A16400o22888p30635o56112l33755L83603J107020R80739p2190q75678m82478
$$ 116400 -506488 -1237123 -1893235 -2226990 -1843387 -736367 244372 172182 -703496 -1185974
33213a185974M65171O78298M8551l97366q4182N24137Q38131P81885M90707J09492
$$ -1185974 -720803 -42505 6046 -391320 -475502 48635 886766 1668651 2159358 2268850
33203B268850o1267J40864L19347J6340m79422n40118k65840k64624m56162j58692
$$ 2268850 2207583 2348447 2667794 2684134 2204712 1664594 1398754 1134130 677968 519276
33193E19276N29225O04005k11107q30436m01487M51048P03221L79266Q5911j37913
$$ 519276 1048501 1652506 1441399 610963 209476 660524 1363745 1743011 1828922 1691009
33183A691009n48584q57382o61081l04223l44974m84824l2445P59751Q59348j5280
$$ 1691009 1142425 285043 -376038 -680261 -1025235 -1510059 -1542504 -782753 76595 61315
33173F1315r35909r98441l01412M47077O82572K48175n15353q63999l66753M45388
$$ 61315 -874594 -1873035 -2174447 -1727370 -1044798 -796623 -1311976 -2175975 -2542728 -2097340
33163b097340O67361K09117j91274p2535L16157O58544Q89159Q13230K03050n73823
$$ -2097340 -1429979 -1220862 -1412136 -1484671 -1168514 -509970 379189 1192419 1395469 821646
33153H21646p88011l89236n2284l3394J23657M91713M06920k82849o19609P0229
$$ 821646 33635 -355601 -407885 -441279 -317622 174091 581011 298162 -321447 -251218
33143b51218J022678J127900M73739j08707m23116q07637j110596q56190k10475
$$ -251218 771460 1899360 2373099 2264392 1841276 1033639 -76957 -933147 -1143622
33134a143622K04792L11174M61055M96468n7792r03794j130567n88584j05392
$$ -1143622 -938830 -627656 -166601 329867 272075 -631719 -1762286 -2350870 -2456262
33125b456262j17142q3139L75224P08111L61269l01336n97247m36123p3406M59575
$$ -2456262 -2573404 -2656543 -2281319 -1573208 -1211939 -1513275 -2110522 -2546645 -2620051 -2160476
33115b160476J058231J191443N59010k36191l63296J02625L63134P6786k79661
$$ -2160476 -1102245 89198 648208 412017 48721 151346 514480 591266 311605
33106C11605k31814P7978K37401J17842j08064k61731l03484k80126k27834j46826
$$ 311605 79791 157769 395170 513012 404948 143217 -160267 -440393 -668227 -815053
33096h15053q5208j57002l25059k75854J88569P02273P08277K91543J02713L32982
$$ -815053 -900261 -1057263 -1382322 -1658176 -1469607 -767334 -59057 232486 335199 668181
33086F68181M19970Q4599o3567M32903Q47462J78694j190030j717077o95967P66495
$$ 668181 1088151 1172750 1109183 1542086 2389548 2568242 1378212 -338865 -1034832 -268337
33076b68337J095248O1580j123836j277250m67058K36640R8257m05549k85184
$$ -268337 826911 888491 -235345 -1512595 -1979653 -1743013 -1644756 -2050305 -2335489
33067b335489N23816J008272N30081k73409n24287l52103l40319l17398K35954
$$ -2335489 -1811673 -803401 -273320 -546729 -1071016 -1423119 -1763438 -2080836 -1844882
33058a844882R10850P49084j01941l78604L50700R24090L54319o86584r65775
$$ -1844882 -934032 -184948 -286889 -665493 -314793 609297 963616 277032 -688743
33049f88743m70586j38212l19336m93525l06329j9372R0669J18962K01510K38702
$$ -688743 -1159329 -1297541 -1616877 -2110402 -2416731 -2436103 -2345434 -2226472 -2024962 -1786260
33039a786260O0476l65782q67262j059083o01332L27810J058266J164731R01687
$$ -1786260 -1725784 -2091566 -2958828 -4017911 -4619243 -4291433 -3233167 -2068436 -1166749
33030a166749O70194M38154M8247k93383l14586j53036o0613M9809K55841J94678
$$ -1166749 -496555 -58401 -10154 -303537 -618123 -771159 -831772 -781963 -526122 -331444
33020c31444l67109q46092n02570L95166Q87483P05667M50948L93837J06069m69038
$$ -331444 -698553 -1544645 -2047215 -1652049 -764566 -58899 392049 785886 891955 422917
33010D22917o01393M3796O68875M81652j07130k05597J68684K99248L2739j15168
$$ 422917 -178476 -134680 534195 1015847 908717 703120 871804 1171052 1203791 1088623
33000A088623j5578j62556p20873j147731j042402o77112l24588K68915J189998
$$ 1088623 1073045 910489 189616 -958115 -2000517 -2677629 -3002217 -2733302 -1543304
32991a543304J699854J049093l01800j076153p86394j99027n3284r1861K06680
$$ -1543304 156550 1205643 903843 -172310 -958704 -1157731 -1211015 -1302876 -1096196
32982a096196N94124M54044j21236m15330j58178J70724J53803o4213k02163j80201
$$ -1096196 -502072 -48028 -169264 -584594 -742772 -572048 -418245 -482458 -684621 -864822
32972h64822J38945R25782J794700J836498P15671p09155j355657j136465p11764
$$ -864822 -725877 199905 1994605 3831103 4546774 3837619 2481962 1345497 633733
32963F33733m22170j27545J41077J12380j58951k78697j21863N8746J50915K80368
$$ 633733 211563 84018 225095 337475 178524 -100173 -222036 -163290 -12375 267993
32953B67993L56896J07039l08846k98113K89429Q00775O36901O0778k39788q7777
$$ 267993 624889 731928 423082 124969 414398 1215173 1852074 1912852 1673064 1585287
32943A585287J09348M0840j80549l50459m66296n55797m41005O2017O95810P92323
$$ 1585287 1694635 1735475 1554926 1204467 738171 182374 -258631 -196614 499196 1291519
32933A291519M1370q95586j002527k16555M37775L02781L0285M64515J162126
$$ 1291519 1332889 437303 -565224 -781779 -344004 -41223 -10938 453577 1615703
32924A615703R92032m4880o97599k68679M89246O15700J75766k45571n12608p70006
$$ 1615703 2607735 2562855 1865256 1596577 2085823 2701523 2877289 2631718 2119110 1349104
32914A349104q65168n89448j42235J61508L28484M15434K17531k96097o16547
$$ 1349104 483936 -105512 -247747 -86239 242245 657679 875210 579113 -37434
32905c7434l08178K93716N16914K61170p257J9671K19960L47943K37542j59024
$$ -37434 -345612 -51896 465018 726188 718931 738602 958562 1306505 1544047 1385023
32895A385023o46766q79251p66654n19077j91150L12945O53595K52053n72647
$$ 1385023 738257 -140994 -907648 -1426725 -1617875 -1304930 -651335 -399282 -971929
32886i71929n98825M90610J250987M44146r70799j141432l0166P13575L09662
$$ -971929 -1570754 -1080144 170843 614989 -355810 -1497242 -1527408 -813833 -504171
32877e04171l53590n12846m83796m78762l5581P53516Q56456m1793p42025l26926
$$ -504171 -857761 -1370607 -1854403 -2333165 -2368746 -1615230 -758774 -800567 -1542592 -1869518
32867a869518L69155J69600n48521o26054m5737K67402J00650O5563K81495K15020
$$ -1869518 -1500363 -1330763 -1879284 -2505338 -2551075 -2283673 -2183023 -2117460 -1835965 -1620945
32857a620945j90099l50461r0727J33412J43397K26954L31593M5828m39668l46358
$$ -1620945 -1811044 -2161505 -2252232 -2118820 -1975423 -1748469 -1416876 -1371048 -1810716 -2157074
32847b157074M06182Q76260M90383j15493j61298J76181L36398L28538M15320
$$ -2157074 -1750892 -874632 -384249 -499742 -661040 -484859 -148461 180077 595397
32838E95397M40667J95181n3989j08178l88050j124792j509391o80116P53114
$$ 595397 1036064 1231245 1177256 1069078 681028 -443764 -1953155 -2633271 -1880157
32829a880157J316727P21561J10600J29683L3674p62031j413583q62564M55598
$$ -1880157 -563430 158131 268731 398414 432088 -329943 -1743526 -2606090 -2150492
32820b150492J158835P65112K1792l95471n50278n87292k96661L58319Q83780
$$ -2150492 -991657 -226545 -204753 -600224 -1150502 -1737794 -2034455 -1676136 -792356
32811g92356P91882J72466m76099p22702m25022K02237O43673N18510M9706j86159
$$ -792356 -474 171992 -304107 -1026809 -1451831 -1249594 -605921 -87411 -37705 -223864
32801b23864J890K79847L84123L83519K66160j79302q22585j044115m98215L63720
$$ -223864 -221974 57873 441996 825515 1091675 912373 89788 -954327 -1452542 -1088822
32791a088822Q85649R53563P92679M36635j04689m79465l74814p2094p3789l23652
$$ -1088822 -203173 750390 1543069 1979704 1875015 1395550 1020736 948642 874853 551201
32781E51201l70800k21285l83273r73225j357911r37358J00514J035782J352963
$$ 551201 180401 -40884 -424157 -1397382 -2755293 -3692651 -3592137 -2556355 -1203392
32772a203392J056063M97839P4260n8528p2022j94489l89955m49324l10387q3079
$$ -1203392 -147329 350510 424770 366242 294220 99731 -290224 -739548 -1049935 -1133014
32762a133014J40754K77604K09942M4693K07896Q59847J390380J043113k0269
$$ -1133014 -992260 -714656 -504714 -460021 -252125 607722 1998102 3041215 3020946
32753C020946q59273r61896o86635m23573m1041N38180Q74069N97479K629l88749
$$ 3020946 2161673 1199777 513142 89569 48528 586708 1460777 2058256 2060885 1672136
32743A672136m74934m00640j60903J62602J74474k71640o05144k41646M78083
$$ 1672136 1197202 796562 635659 798261 972735 701095 95951 -145695 332388
32734C32388P00934K74988j47694k16336l42447q19408j135048o46791M12614
$$ 332388 1033322 1308310 1160616 944280 601833 -217575 -1352623 -1999414 -1586800
32725a586800J111119R12779K23971j94100r7643J02212k4863l55003m08355n2223
$$ -1586800 -475681 437098 661069 466969 369326 471538 446675 91672 -316683 -368906
32715c68906K53791O2437m18188n76722k22573J79797J85517k2166O1418M94624
$$ -368906 -115115 -52678 -470866 -1047588 -1270161 -1090364 -904847 -927013 -865595 -370971
32705c70971P32962L12063n06897r55731n87399K75443R48851J068401P45161
$$ -370971 361991 674054 167157 -788574 -1375973 -1100530 -151679 916722 1661883
32696A661883K29282k98335o36139n89426k30260P3285N3630j54710k44425j42827
$$ 1661883 1891165 1592830 956691 367265 137005 210290 263920 109210 -135215 -278042
32686b78042k7306k1361o8232j04324j89848l85603n82415n68104k85415O4185
$$ -278042 -305348 -326709 -394941 -499265 -689113 -1074716 -1657131 -2225235 -2510650 -2446465
32676b446465K60986L51305N41567Q31983R75216Q45341N87905L00666j12475
$$ -2446465 -2185479 -1834174 -1292607 -460624 514592 1359933 1947838 2248504 2136029
32667B136029n66635o45745j92089K69604J74497k48305l26261L2465K72080R0779
$$ 2136029 1569394 923649 731560 1001164 1175661 927356 601095 633560 905640 996419
32657I96419k10002l18296k76213j81370o5459j11623m25664n91047j26042N94904
$$ 996419 786417 468121 191908 10538 -54921 -166544 -592208 -1183255 -1309297 -714393
32647g14393O83472J17949j34718L50370P82325M83773o0293j37447O8298N7034
$$ -714393 -30921 87028 -47690 302680 1085005 1568778 1508485 1371038 1439336 1496370
32637A496370m1931N7335O0825k81434m43930K8618N23750K46285m07526m79627
$$ 1496370 1454439 1511774 1572599 1291165 847235 875853 1399603 1645888 1238362 758735
32627G58735l1860J05357j41674r7954K66753K46733k63654n57731l53748r9834
$$ 758735 726875 832232 690558 592604 859357 1106090 842436 284705 -69043 -168877
32617a68877O7913M92369R64182P68322L0006k60487N3093r3614j093768j731167
$$ -168877 -100964 391405 1355587 2123909 2153915 1893428 1946521 1852907 759139 -972028
32607i72028r95764L18770Q50632N57627K92193K74062J46953J5856K89437P82934
$$ -972028 -1967792 -1649022 -798390 -240763 51430 325492 472445 488301 777738 1560672
32597A560672R28819O56460K79668j86955q08084j134536o78750J99298O42136
$$ 1560672 2489491 3145951 3425619 3238664 2430580 1296044 617294 816592 1458728
32588A458728L90878j07601m60151n42624k27536L98735P86423N75684K22057
$$ 1458728 1849606 1742005 1281854 739230 511694 910429 1696852 2272536 2494593
32579B494593K63904L27285k75642j267669j712736j405954r38463n21605J33382
$$ 2494593 2758497 3085782 2810140 1542471 -170265 -1576219 -2514682 -3036287 -2902905
32570b902905Q07223Q77149N64159P93795J493381J371390n231j217601r88949
$$ -2902905 -2095682 -1218533 -654374 139421 1632802 3004192 2998961 1781360 792411
32561G92411n0906J30257m00578m73973J41968N44665L84674L07986N41892L69382
$$ 792411 741505 871762 471184 -2789 139179 683844 1068518 1376504 1918396 2287778
32551B287778m85675j066034n41731M37546O50424P5252k06523K81408P36954
$$ 2287778 1802103 736069 194338 631884 1282308 1357560 1151037 1432445 2169399
32542B169399L27025o09626j059614o42795N8936L41871J33187j38359j30638
$$ 2169399 2496424 1886798 827184 184389 243325 585196 718383 580024 449386
32533D49386R8879K42364Q7475k57083m52888k88092O4238K17087M118l35714
$$ 449386 548265 790629 878104 621021 168133 -119959 -55721 161366 165484 -170230
32523a70230m25734j34697L18922N77648M59100J34974j3075J97383N12861N33054
$$ -170230 -595964 -730661 -411739 165909 625009 759983 746908 944291 1457152 1990206
32513A990206J92593k23405n12084p28656q60656o44660L5999P57234Q88299L26860
$$ 1990206 2182799 1959394 1447310 718654 -142002 -786662 -750663 6571 894870 1221730
32503A221730l36571m78258j37336O3681l15814r37381r68900k3812J284699J871163
$$ 1221730 885159 406901 269565 333246 17432 -919949 -1888849 -1912661 -627962 1243201
32493A243201J231063j44385j323295j711517j344882o94869k60209j60573p7378
$$ 1243201 2474264 2329879 1006584 -704933 -2049815 -2744684 -3004893 -3165466 -3242844
32484c242844K70221O54967N97676N8123m47764m60200j7067N35743Q61031P50946
$$ -3242844 -2972623 -2317656 -1719980 -1661857 -2109621 -2569821 -2586888 -2051145 -1190114 -439168
32474d39168K97394l5264J01889L91768K66803j55144k04093J99830L37177j09404
$$ -439168 -141774 -177038 -75149 316619 583422 428278 224185 424015 761192 651788
32464F51788m93094l12393n1019k52459n26448l07009O7350j933k03914J08219
$$ 651788 158694 -153699 -204718 -457177 -983625 -1290634 -1223284 -1225217 -1429131 -1320912
32454a320912N82881L39856m10647n08762L08290R21683N00432m12130r00915
$$ -1320912 -738031 -398175 -808822 -1317584 -1009294 -87611 412821 691 -900224
32445i00224q40074n67433k01988J80542L32927K75896M02089P69216Q75852M89105
$$ -900224 -1740298 -2307731 -2509719 -2329177 -1996250 -1720354 -1318265 -549049 326803 815908
32435H15908M9869j25880l35445o96521o26208J83938Q94037M73943q11397j660402
$$ 815908 865777 739897 404452 -292069 -918277 -734339 159698 633641 -177756 -1838158
32425a838158j299052j45790R23821J371610J145489N67395Q7359j48580l66819
$$ -1838158 -3137210 -3283000 -2359179 -987569 157920 725315 812674 664094 297275
32416B97275o21416n55751l8855M10909L31483L3111K5710J20939j86012p32090
$$ 297275 -324141 -879892 -918747 -507838 -176355 -143244 -117534 3405 -182607 -914697
32406i14697q77376n27472j69344M9649M51522R74695J028639M51595j04094r0150
$$ -914697 -1792073 -2319545 -2488889 -2439240 -1987718 -1013023 15616 467211 363117 272967
32396B72967K17752K86108J13110M6661J83351L27696K93801j6811n62916r80227
$$ 272967 490719 776827 889937 936598 1119949 1447645 1741446 1724635 1161719 181492
32386A81492q01703j20784L34995J14618l40397l86184j13952n0937j90417j6058
$$ 181492 -620211 -740995 -406000 -291382 -631779 -1017963 -1131915 -1182852 -1373269 -1389327
32376a389327N29980Q04336M07464j99856l79728j72150k0130J8358K06988M38541
$$ -1389327 -859347 -55011 352453 152597 -227131 -399281 -419411 -401053 -194065 244476
32366B44476K68807k54731m19338J53751Q03318O19602l15196j011601q23321
$$ 244476 513283 258552 -160786 -7035 796283 1415885 1100689 89088 -734233
32357g34233j22947L09212J33356m23916r01873q91144l11461L98449O30969L20668
$$ -734233 -857180 -547968 -414612 -838528 -1740401 -2631545 -2943006 -2544557 -1913588 -1592920
32347a592920L4383J70391L88695J46811m43288p01741k67507M50138P86183N69531
$$ -1592920 -1558537 -1388146 -999451 -852640 -1295928 -1997669 -2265176 -1815038 -1028855 -459324
32337d59324K15731J28240J70207q0100n51448n32732L51906J322760J233819
$$ -459324 -243593 -115353 54854 -25246 -576694 -1109426 -757520 565240 1799059
32328A799059J35152o94487m80650M8033j24748p66483q38930q6090O77029P82899
$$ 1799059 1934211 1239724 759074 807107 682359 -84124 -923054 -1009144 -332115 450784
32318D50784M49366J69506m632k66838n40540n14571r8174L58567L72176r9312
$$ 450784 900150 1069656 1065024 798186 257646 -256925 -355099 3468 375644 276332
32308B76332m66056j48924N75294P89736J70959m99839m31557Q0022K33385j3947
$$ 276332 -189724 -338648 236646 1026382 1197341 697502 265945 345967 579352 565405
32298E65405k4196L83495O82688N26922J60446j53450m57686p06762o53446l31412
$$ 565405 541209 924704 1607392 2134314 2294760 2141310 1683624 976862 323416 -7996
32288g996j25932j71767j66141N8838K85465L98397N76946P79634O08342J2415
$$ -7996 -133928 -305695 -471836 -412998 -127533 270864 847810 1627444 2235786 2248201
32278B248201l96093j43012M09939N87534K78420j23297l68693n27330o90884
$$ 2248201 1852108 1709096 2119035 2706569 2984989 2861692 2492999 1965669 1274785
32269A274785q40146q76420n93848J27925R02626R66071P4732r99820j264328
$$ 1274785 434639 -441781 -1035629 -907704 -5078 960993 1035725 35905 -1228423
32260a228423o17187J74176M60396L30427K99530O30421R83329P23891k64973
$$ -1228423 -1845610 -1671434 -1211038 -880611 -581081 49340 1032669 1756560 1491587
32251A491587j155085r90084M306N17237j46490j075338r89521M6924Q73771Q68583
$$ 1491587 336502 -653582 -649276 -132039 -278529 -1353867 -2343388 -2296464 -1422693 -554110
32241e54110N07397L65503L60026J68242k10776n80731q17183p96873m06625J77553
$$ -554110 -46713 318790 678816 847058 636282 55551 -761632 -1558505 -1965130 -1787577
32231a787577N15452M05679J42895J14438L28352M83076L60384K9808k56805l25625
$$ -1787577 -1272125 -866446 -723551 -609113 -280761 202315 562699 592507 335702 10077
32221A0077k72210l18121m12880j99979L94263P92746M22096l86449o81446j26186
$$ 10077 -262133 -580254 -993134 -1193113 -798850 -6104 415992 29543 -651903 -778089
32211g78089N81253P14291M34562L29877M26958K13953m55151j006882q76699
$$ -778089 -196836 517455 952017 1281894 1708852 1922805 1467654 460772 -415927
32202d15927k78038M6482k35645o37082n04833J11680N45664M48730K58608N11210
$$ -415927 -693965 -647483 -883128 -1520210 -2025043 -1913363 -1367699 -918969 -660361 -149151
32192a49151R97772J007698K91914o11331j010302p04987j7496N02646M26327
$$ -149151 848621 1856319 2148233 1536902 526600 -178387 -195883 306763 733090
32183G33090j53907n87815m05235k3951k03023q14960q96125j35545N09939K24158
$$ 733090 579183 -8632 -413867 -437818 -640841 -1455801 -2351926 -2487471 -1977532 -1753374
32173a753374l87205k51266M77137P30845L00102J00421N31368P31662J2107r07295
$$ -1753374 -2140579 -2391845 -1914708 -1183863 -883761 -783340 -251972 479690 491797 -415498
32163d15498q96307l9431O04814N14503J15351j48576k89109k73065J42370Q04619
$$ -415498 -1311805 -1351236 -746422 -231919 -116568 -265144 -554253 -827318 -684948 119671
32153A19671J030097M50122m34434q77451p30201l80650j87843k77878n85636
$$ 119671 1149768 1599890 1165456 288005 -442196 -822846 -1010689 -1288567 -1874203
32144a874203p59637l10421P53667J648627J579323O59786k76936o49255n39597
$$ -1874203 -2633840 -2944261 -2190594 -541967 1037356 1697142 1420206 770951 231354
32135B31354k76716o0292Q055p0265r1226J30559M11453L72109k6387m24628n36122
$$ 231354 -45362 -105654 -97599 -167864 -259090 -128531 282922 655031 628644 204016 -332106
32124c32106l48105J05784P30207J087831O58971l98011j187099j076676m17242
$$ -332106 -680211 -574427 155780 1243611 1902582 1504571 317472 -759204 -1176446
32115a176446M1999J13499J55855L51807M75329L18381m1410m28831p28121p94831
$$ -1176446 -1134447 -1020948 -865093 -513286 -37957 280424 239014 -189817 -917938 -1712769
32105a712769m64819K14828Q88901J150296Q80252K99282k95391p71303j079162
$$ -1712769 -2177588 -1962760 -1073859 76437 956689 1255971 960580 189277 -889885
32096h89885j022486l87483N66558J054850N74052l90998q90786o64341k79893
$$ -889885 -1912371 -2299854 -1733296 -678446 -104394 -495392 -1386178 -2050519 -2330412
32087b330412j29735R4707O89992J270435J251607O57743J7731l19887l92289
$$ -2330412 -2460147 -2365440 -1675448 -405013 846594 1504337 1522068 1202181 809892
32078H09892l23036j84484p1426l5495m270P2146J10113L2926j51271m51233p88773
$$ 809892 486856 302372 230946 195451 191181 263327 373440 406366 255095 -196138 -984911
32067i84911p99723k21148M47611L37350m71953q01113n8413P35174M43075l79846
$$ -984911 -1784634 -2005782 -1558171 -1220821 -1692774 -2493887 -2552300 -1817126 -1374051 -1753897
32057a753897l50724N05744Q03783P8963m40169J73381J045269Q58806j75594
$$ -1753897 -2104621 -1598877 -795094 -716131 -1156300 -982919 62350 921156 745562
32048G45562p44713l43940K56050L16966J2471j43886q7974j13170l45651n86747
$$ 745562 849 -343091 -87041 229925 242396 98510 10536 -102634 -448285 -1035032
32038a035032n41604q7992N66335R49233P06250J3967n02884l95034J14084L77429
$$ -1035032 -1576636 -1664628 -1098293 -149060 557190 571157 68273 -326761 -212677 164752
32028A64752O9985m61490o69097m59169j78873o3682j2442P5170P6379j11293
$$ 164752 234737 -226753 -895850 -1355019 -1533892 -1597574 -1610016 -1534846 -1458467 -1569760
32018a569760l76116n63330n77554k57749M53293J099726R96091J91436l94205
$$ -1569760 -1945876 -2509206 -3086760 -3344509 -2891216 -1791490 -795399 -603963 -998168
32009i98168j83487K80247K81824M3513J51414M25197L06004j6598O0560L12696
$$ -998168 -1181655 -901408 -619584 -576071 -424657 540 306544 289946 350506 663202
31999F63202m6226q68021j058588k84700M63022M05045K204n3355J20886J71427
$$ 663202 616976 -251045 -1309633 -1594333 -1131311 -726266 -724062 -777417 -656531 -485104
31989d85104K08545K61881r8688q54171j087656l06382N71659N47910J39948M53479
$$ -485104 -276559 -14678 -113366 -967537 -2055193 -2361575 -1789916 -1242006 -1102058 -648579
31979f48579J215480J158187J72014m05572J22694P65536M45831l97106o09031
$$ -648579 566901 1725088 1897102 1491530 1614224 2379760 2825591 2428485 1819454
31970A819454n9474K98975j28403q21474r29050l57441J82638Q6443m42501p41550
$$ 1819454 1759980 2058955 1930552 1109078 180028 -177413 5225 91668 -350833 -1092383
31960a092383n91700m13191m93639m75100M6353P53595R36547M39292j83274l99853
$$ -1092383 -1684083 -2097274 -2590913 -3066013 -3019660 -2266065 -1329518 -890226 -1073500 -1473353
31950a473353j89468J75239M48787M98270L71140K80851L06065K21220j09004
$$ -1473353 -1662821 -1487582 -1038795 -540525 -169385 111466 417531 638751 529747
31941E29747l67012k09290J12590O1216l18254l91828J07930O26620N26381p6070
$$ 529747 162735 -46555 66035 127251 -191003 -582831 -474901 151719 678100 602030
31931F02030m98247l40678R9668K47169m5286l02867j7498O63088J089105R34438
$$ 602030 103783 -236895 -137227 109942 64656 -238211 -255709 407379 1496484 2430922
31921B430922M84946L2002m86561r77993r29330j66529O10768O78898K70539K4667
$$ 2430922 2915868 2947870 2461309 1483316 553986 387457 998225 1677123 1947662 1972329
31911A972329j33864o93536j405651j454129p71803k17356k73847m47410k13215
$$ 1972329 1838465 1144929 -260722 -1714851 -2486654 -2704010 -2977857 -3425267 -3638482
31902c638482K46787N67282P29560P26158L75612j68618l71117j41996o1924l88023
$$ -3638482 -3391695 -2824413 -2094853 -1368695 -993083 -1161701 -1532818 -1674814 -1736738 -2124761
31892b124761n26212o719O71543Q06932N52377M97860O32930M99657J15347k4728
$$ -2124761 -2650973 -2657692 -1986149 -1179217 -626840 -128980 503950 1003607 1118954 1094226
31882A094226K09504L80265J48058l36810p21324p62631m04430J31935M20693
$$ 1094226 1303730 1683995 1832053 1495243 773919 11288 -393142 -261207 159486
31873A59486K83974K1274p4436j47723l61241m02962J2909M20999J16743o77462
$$ 159486 443460 464734 390298 242575 -118666 -521628 -508719 -87720 29023 -648439
$$ [...]
##END NTUPLES=NMR SPECTRUM
##END=
