##TITLE=31Pdec_DE-27_Et_sh
 D2O
  24 sc
 30.11.2023
##JCAMPDX= 6.0         $$ Bruker NMR JCAMP-DX V2.0
##DATA TYPE= NMR SPECTRUM
##DATA CLASS= NTUPLES
##ORIGIN= UXNMR, Bruker Analytische Messtechnik GmbH
##OWNER= root
$$ XWIN-NMR		Version 3.5
$$ Thu Nov 30 16:44:30 2023 Russian Standard Time (UT+4h)  she@DPX200
##.OBSERVE FREQUENCY= 81.013821
##.OBSERVE NUCLEUS= ^31P
##.ACQUISITION MODE= SIMULTANEOUS
##.ACQUISITION SCHEME= undefined
##.AVERAGES= 24
##.DIGITISER RES= 16
##SPECTROMETER/DATA SYSTEM= spect
##.PULSE SEQUENCE= zgpg30
##.SOLVENT NAME= D2O
##.SHIFT REFERENCE= (INTERNAL, D2O, 0, 248.564)
##AUDIT TRAIL= $$ (NUMBER, WHEN, WHO, WHERE, WHAT)
$$ ##TITLE= Audit trail, XWIN-NMR		Version 3.5
$$ ##JCAMPDX= 5.01
$$ ##ORIGIN= Bruker BioSpin GmbH
$$ ##OWNER= she
$$ F:/spectra/data/she/nmr/P31/1/pdata/1/auditp.txt
$$ ##AUDIT TRAIL=  $$ (NUMBER, WHEN, WHO, WHERE, WHAT)
(   1,<2023-11-30 16:43:45.15 +0400>,<she>,<DPX200>,
      <created by zg, POWCHK disabled, PULCHK disabled
       configuration hash MD5:
       00 E9 B6 7A A2 85 ED C7 34 08 36 98 17 FE 4E 26
       data hash MD5: 32K
       63 97 0A 83 91 07 21 39 EA F2 84 C1 51 62 AD F8>)
(   2,<2023-11-30 16:43:47.04 +0400>,<she>,<DPX200>,
      <Start of raw data processing
       efp BC_mod = 2 LB = 10 FT_mod = 6 PKNL = 1 PHC0 = -11663.64 PHC1 = -67.90641 SI = 64K 
       data hash MD5: 64K
       35 BD 16 58 0D 72 5F 9E 89 3D FF 4D 48 E1 5E D0>)
(   3,<2023-11-30 16:44:01.95 +0400>,<she>,<DPX200>,
      <pk PHC0 = -5.189088 PHC1 = 0 
       data hash MD5: 64K
       3E 64 CF 3F 4A 82 72 94 FE 3C 2C 6F 8C 26 9D 19>)
(   4,<2023-11-30 16:44:04.39 +0400>,<she>,<DPX200>,
      <abs ABSG = 5 
       data hash MD5: 64K
       C9 AF DB EB 93 90 03 B0 75 BF A6 0B A3 4B F0 10>)
$$ ##END=
$$ 
$$ hash MD5
$$ B7 20 23 8C 9B 25 01 40 85 02 A2 F7 87 CD 9A 6E
##$RELAX= 
##$RELAX= 
##$RELAX= 
##$RELAX= 
##$RELAX= 
##$RELAX= 
##$RELAX= 
##$RELAX= 
##$RELAX= 
$$ Bruker specific parameters
$$ --------------------------
##$DU= <F:/spectra>
##$EXPNO= 1
##$NAME= <P31>
##$PROCNO= 1
##$TYPE= <nmr>
##$USER= <she>
##$AMP= (0..31)
100 100 100 100 100 100 100 100 100 100 100 100 100 100 100 100 100 100 
100 100 100 100 100 100 100 100 100 100 100 100 100 100 
##$AQSEQ= 0
##$AQ_mod= 1
##$AUNM= <au_zg>
##$AUTOPOS= <>
##$BF1= 81.014009
##$BF2= 200.13
##$BF3= 200.13
##$BF4= 200.13
##$BF5= 200.13
##$BF6= 200.13
##$BF7= 200.13
##$BF8= 200.13
##$BYTORDA= 1
##$CFDGTYP= 0
##$CFRGTYP= 5
##$CHEMSTR= <none>
##$CNST= (0..31)
1 1 145 1 1 1 1 1 1 1 1 1 1 1 1 1 1 1 1 1 1 1 1 1 1 1 1 1 1 1 1 1 
##$CPDPRG= <waltz16>
##$CPDPRG1= <>
##$CPDPRG2= <waltz16>
##$CPDPRG3= <>
##$CPDPRG4= <mlev>
##$CPDPRG5= <mlev>
##$CPDPRG6= <mlev>
##$CPDPRG7= <mlev>
##$CPDPRG8= <mlev>
##$CPDPRGB= <>
##$CPDPRGT= <>
##$D= (0..31)
0 1 0 0 0 0 0 0 0 0 0 0.03 2e-05 3e-06 0 0 0 0 0 0 0 0 0 0 0 0 0 0 0 0 
0 0 
##$DATE= 1701348224
##$DBL= (0..7)
120 120 120 11 120 120 24 19 
##$DBP= (0..7)
150 150 150 150 150 150 150 150 
##$DBP07= 0
##$DBPNAM0= <>
##$DBPNAM1= <>
$$ [...]
##$SUBNAM3= <"">
##$SUBNAM4= <"">
##$SUBNAM5= <"">
##$SUBNAM6= <"">
##$SUBNAM7= <"">
##$SUBNAM8= <"">
##$SUBNAM9= <"">
##$SW= 501.771253377433
##$SWIBOX= (0..15)
0 1 3 0 0 0 0 0 0 0 0 0 0 0 0 0 
##$SW_h= 40650.406504065
##$TD= 32768
##$TD0= 1
##$TE= 0
##$TE2= 300
##$TE3= 300
##$TEG= 300
##$TL= (0..7)
0 120 53 12 22 120 120 120 
##$TP= (0..7)
150 150 150 150 150 150 150 150 
##$TP07= 0
##$TPNAME0= <>
##$TPNAME1= <>
##$TPNAME2= <>
##$TPNAME3= <>
##$TPNAME4= <>
##$TPNAME5= <>
##$TPNAME6= <>
##$TPNAME7= <>
##$TPOAL= (0..7)
0.5 0.5 0.5 0.5 0.5 0.5 0.5 0.5 
##$TPOFFS= (0..7)
0 0 0 0 0 0 0 0 
##$TUNHIN= 0
##$TUNHOUT= 0
##$TUNXOUT= 0
##$USERA1= <user>
##$USERA2= <user>
##$USERA3= <user>
##$USERA4= <user>
##$USERA5= <user>
##$V9= 5
##$VALIST= <valist>
##$VCLIST= <CCCCCCCCCCCCCCC>
##$VD= 0
##$VDLIST= <DDDDDDDDDDDDDDD>
##$VPLIST= <PPPPPPPPPPPPPPP>
##$VTLIST= <TTTTTTTTTTTTTTT>
##$WBST= 1024
##$WBSW= 4
##$XGAIN= (0..3)
0 0 0 0 
##$XL= 0
##$YL= 0
##$YMAX_a= 1082
##$YMIN_a= -2458
##$ZGOPTNS= <>
##$ZL1= 120
##$ZL2= 120
##$ZL3= 120
##$ZL4= 120
##$ABSF1= 248.5645
##$ABSF2= -253.2056
##$ABSG= 5
##$ABSL= 3
##$ALPHA= 0
##$AQORDER= 0
##$ASSFAC= 0
##$ASSFACI= 0
##$ASSFACX= 0
##$ASSWID= 0
##$AUNMP= <proc_1d>
##$AZFE= 0.1
##$AZFW= 0.5
##$BCFW= 0
##$BC_mod= 2
##$BYTORDP= 0
##$COROFFS= 0
##$CY= -3
##$DATMOD= 1
##$DC= 0
##$DFILT= <>
##$DTYPP= 0
##$F1P= 0
##$F2P= 0
##$FCOR= 1
##$FTSIZE= 65536
##$FT_mod= 6
##$GAMMA= 0
##$GB= 0
##$INTBC= 1
##$INTSCL= 6.047779e-11
##$ISEN= 30
##$LB= 10
##$LEV0= 0
##$LPBIN= 0
##$MAXI= 10000
##$MC2= 0
##$MEAN= 0
##$ME_mod= 0
##$MI= 50
##$NCOEF= 0
##$NC_proc= -11
##$NLEV= 6
##$NOISF1= 182.463
##$NOISF2= 159.3651
##$NSP= 0
##$NTH_PI= 0
##$NZP= 0
##$OFFSET= 248.5645
##$PC= 4
##$PHC0= -11668.83
##$PHC1= -67.90641
##$PH_mod= 1
##$PKNL= yes
##$PPARMOD= 0
##$PSCAL= 0
##$PSIGN= 0
##$REVERSE= no
##$SF= 81.0140089999694
##$SI= 65536
##$SIGF1= 159.3651
##$SIGF2= -187.1042
##$SINO= 113.3802
##$SIOLD= 16384
##$SREGLST= <1H.CDCl3>
##$SSB= 0
##$STSI= 65536
##$STSR= 0
##$SW_p= 40650.406504065
##$SYMM= 0
##$S_DEV= 0
##$TDeff= 32768
##$TDoff= 0
##$TI= <>
##$TILT= no
##$TM1= 0
##$TM2= 0
##$TOPLEV= 0
##$USERP1= <user>
##$USERP2= <user>
##$USERP3= <user>
##$USERP4= <user>
##$USERP5= <user>
##$WDW= 1
##$XDIM= 65536
##$YMAX_p= 429980683
##$YMIN_p= -117328403
$$ End of Bruker specific parameters
$$ ---------------------------------
##NTUPLES= NMR SPECTRUM
##VAR_NAME=  FREQUENCY,     SPECTRUM/REAL,   SPECTRUM/IMAG
##SYMBOL=    X,             R,               I
##VAR_TYPE=  INDEPENDENT,   DEPENDENT,       DEPENDENT
##VAR_FORM=  AFFN,          ASDF,            ASDF
##VAR_DIM=   65536,         65536,           65536
##UNITS=     HZ,            ARBITRARY UNITS, ARBITRARY UNITS
##FACTOR=    0.620285442955139, 1,           1
##FIRST=     20137.2065510682, 0,            0
##LAST=      -20513.1999529968, 0,           0
##MIN=       -20513.1999529968, -117328403,  0
##MAX=       20137.2065510682, 429980683,    0
$$ Real data points
##PAGE= N=1
##DATA TABLE= (X++(R..R)), XYDATA
$$ [...]
14960 10145910 9033197 7862532 6607526 5272698 3904861 2586166 1412749 472163
14952 472163 -170845 -481949 -462806 -150980 393318 1110019 1953296 2882294 3835781 4715660
14942 4715660 5398455 5770851 5767648 5390938 4703441 3803608 2796961 1775277 807006
14933 807006 -64302 -817306 -1446692 -1953764 -2337059 -2587694 -2690304 -2625224 -2368306 -1891541
14923 -1891541 -1171975 -210783 947235 2208730 3448177 4537989 5377940 5914319 6147236
14914 6147236 6127270 5941672 5692227 5471421 5345464 5349208 5492980 5777659 6210999 6815316
14904 6815316 7617792 8623516 9784355 10984628 12058969 12839150 13206736 13122646 12619490
14895 12619490 11766538 10631470 9258919 7670740 5880192 3908675 1797712 -384495
14887 -384495 -2539454 -4538561 -6233425 -7481312 -8179987 -8295808 -7870200 -7002421 -5819760
14878 -5819760 -4450676 -3010971 -1603336 -322704 741913 1513927 1942705 2019052 1786399
14869 1786399 1341575 821848 380976 161582 270387 759563 1617955 2777976 4139382
14860 4139382 5600087 7078578 8520352 9894262 11189192 12414718 13601311 14795023
14852 14795023 16046731 17400467 18884999 20509302 22259532 24096080 25953744 27750646
14844 27750646 29407409 30869324 32119201 33173314 34064596 34826055 35485380 36070059 36611606
14835 36611606 37138998 37664447 38175266 38640956 39028881 39313329 39471662 39476679 39297393 38908626
14825 38908626 38298858 37468731 36423584 35167815 33703226 32027785 30132816 28001562
14817 28001562 25613625 22957045 20046218 16939717 13748306 10624632 7735751 5231191
14809 5231191 3221461 1772704 912836 641375 938093 1767895 3080306 4804403 6843600
14800 6843600 9075965 11363651 13571489 15591229 17363570 18887007 20204807 21371738
14792 21371738 22415625 23315599 24011004 24435621 24555042 24385053 23984666 23433874 22810193
14783 22810193 22171565 21547385 20938154 20323413 19674233 18964563 18178065 17310713 16370811
14774 16370811 15377982 14362522 13365329 12436060 11627160 10985795 10549357 10347216 10404821
14765 10404821 10744945 11386140 12341949 13620519 15219139 17111025 19231310 21474516
14757 21474516 23709727 25807063 27661119 29199778 30377720 31164310 31538150 31493401 31052031
14748 31052031 30270617 29234124 28037512 26761255 25447747 24086159 22615074 20948931
14740 20948931 19021909 16828485 14438091 11977076 9591859 7414846 5545070 4041705
14732 4041705 2924724 2181947 1783611 1699006 1903595 2370507 3054486 3884402 4773374
14723 4773374 5641023 6434366 7137073 7764498 8347752 8913504 9467852 9989927 10433991
14714 10433991 10734169 10809061 10570112 9937261 8857382 7315501 5333564 2960921 263975
14705 263975 -2681345 -5793744 -8985727 -12156537 -15183774 -17924617 -20234778 -22001923
14697 -22001923 -23179479 -23804497 -23989858 -23892441 -23669877 -23443821 -23283669 -23212804 -23227476 -23314172
14687 -23314172 -23456223 -23629207 -23791135 -23875105 -23789909 -23430745 -22697982 -21518048 -19858762
14678 -19858762 -17734600 -15203348 -12358731 -9320327 -6217747 -3168152 -253746 2489463
14670 2489463 5064717 7491797 9778505 11899246 13792154 15378869 16598349 17436310
14662 17436310 17934458 18177661 18270217 18314170 18395352 18575706 18888328 19333014 19872542 20432608
14652 20432608 20909739 21189236 21169918 20788285 20034808 18957778 17652730 16238478 14826182
14643 14826182 13493489 12275420 11174576 10181763 9293489 8517715 7867900 7351355 6960002
14634 6960002 6670873 6458895 6316017 6264126 6352156 6638809 7170923 7965769 8998499 10194293
14624 10194293 11430253 12554538 13422153 13933654 14058125 13830627 13329592 12649285 11880781
14615 11880781 11104759 10389628 9786915 9324032 9003547 8816843 8766612 8879962 9196448
14606 9196448 9733032 10446506 11217716 11869118 12208170 12076876 11389021 10147114 8440957
14597 8440957 6432736 4331514 2359921 719207 -438496 -1023851 -1008505 -412347 711068
14588 711068 2281261 4186170 6273422 8351237 10207598 11643366 12505808 12710635 12249595
14579 12249595 11187915 9656324 7838031 5947666 4201149 2781861 1813970 1353015
14571 1353015 1396806 1910136 2850363 4181031 5867357 7857661 10063273 12351745 14562232
14562 14562232 16539405 18170312 19406496 20264113 20808178 21131181 21330551 21485619 21639219
14553 21639219 21793410 21922704 21995982 21993503 21912498 21764186 21567272 21339311 21085080 20784169
14543 20784169 20385165 19815025 19004920 17921534 16586411 15073345 13488306 11943865
14535 11943865 10535633 9321835 8308188 7445213 6643950 5806852 4860834 3777606 2573602
14526 2573602 1293797 -7783 -1279238 -2472285 -3542171 -4453670 -5191372 -5764999 -6203050
14517 -6203050 -6537905 -6791820 -6969797 -7057149 -7017253 -6792139 -6315097 -5538907 -4467815 -3171908
14507 -3171908 -1771504 -399554 836274 1873800 2695432 3314964 3763141 4078242 4302201
14498 4302201 4479585 4655758 4871331 5152377 5498938 5876781 6217793 6432792 6435579 6169700
14488 6169700 5624518 4831775 3846313 2723650 1504236 204998 -1184801 -2702669 -4403667
14479 -4403667 -6343196 -8556849 -11043027 -13751862 -16582656 -19391545 -22009925 -24272546
14471 -24272546 -26050902 -27282085 -27979894 -28220940 -28112218 -27756601 -27230661 -26579931 -25828776
14462 -25828776 -24998108 -24122121 -23255810 -22469229 -21829947 -21379163 -21110245 -20959798 -20816738
14453 -20816738 -20545061 -20010202 -19101650 -17749699 -15935123 -13691365 -11103194 -8306298
14445 -8306298 -5482697 -2838991 -564668 1211185 2440046 3144584 3395845 3296067 2970248
14436 2970248 2554200 2167333 1874102 1655481 1413846 1014804 343148 -658209 -1980926
14427 -1980926 -3567312 -5333025 -7185452 -9035331 -10804025 -12430978 -13883888 -15167299
14419 -15167299 -16320495 -17400665 -18458976 -19522845 -20591770 -21642951 -22637295 -23520657
14411 -23520657 -24224626 -24675711 -24815035 -24618433 -24103186 -23317917 -22325386 -21190134 -19974459
14402 -19974459 -18738072 -17535800 -16411859 -15394036 -14493110 -13709262 -13040378 -12485784 -12046257
14393 -12046257 -11727320 -11546912 -11537506 -11733416 -12148510 -12760517 -13512569 -14328393 -15129920 -15848507
14383 -15848507 -16426669 -16812652 -16955473 -16810319 -16358082 -15630375 -14722800 -13783676 -12980278
14374 -12980278 -12458442 -12312995 -12575833 -13216829 -14150947 -15251411 -16372956 -17384076 -18198464
14365 -18198464 -18792218 -19198300 -19479857 -19693968 -19861991 -19958332 -19918464 -19657626 -19090207 -18144779
14355 -18144779 -16775345 -14971619 -12769458 -10258031 -7577278 -4902828 -2423347 -318008
14347 -318008 1264157 2226449 2546059 2282932 1565709 559783 -565741 -1660662 -2607983
14338 -2607983 -3336168 -3826489 -4105053 -4215501 -4184056 -3998147 -3613633 -2988514 -2125478 -1101948
14328 -1101948 -74097 746771 1138063 917489 -12979 -1645482 -3873543 -6521296 -9378752
14319 -9378752 -12231281 -14883576 -17184099 -19048292 -20467828 -21494441 -22202339 -22648286
14311 -22648286 -22848922 -22782119 -22405391 -21678696 -20581504 -19120736 -17332632 -15283693 -13070757
14302 -13070757 -10813306 -8632334 -6622221 -4833594 -3280761 -1967734 -910093 -133479
14294 -133479 348870 557940 549772 394979 155481 -122814 -399428 -624422 -732904 -650979
14284 -650979 -306737 358389 1377106 2742302 4397093 6237176 8128922 9937665 11555129
14275 11555129 12916942 14007523 14854355 15513614 16048515 16505679 16900716 17222858 17456531
14266 17456531 17605037 17700559 17795726 17943138 18172741 18475523 18801156 19074743 19229252 19238892
14256 19238892 19135066 18996179 18918565 18985318 19246417 19712976 20360945 21139444 21981443 22814776
14246 22814776 23570941 24191170 24631811 24868681 24895114 24709702 24299688 23633769 22672405
14237 22672405 21388885 19786327 17902128 15803814 13585021 11364915 9286762 7509276
14229 7509276 6187867 5447438 5352087 5880759 6920678 8287071 9765852 11162546 12337345
14220 12337345 13216314 13782693 14058526 14085008 13906613 13562587 13085593 12501152 11819958
14211 11819958 11023440 10054866 8830571 7273970 5357996 3134137 733615 -1658577
14203 -1658577 -3844968 -5658548 -6997976 -7849916 -8294924 -8493698 -8653192 -8978969 -9628238
14194 -9628238 -10680194 -12131594 -13911363 -15901010 -17953448 -19912386 -21635818 -23019894
14186 -23019894 -24014377 -24624442 -24900560 -24921825 -24777618 -24551597 -24311515 -24106910 -23973253
14177 -23973253 -23936491 -24008721 -24169515 -24340532 -24375200 -24083435 -23288842 -21889692 -19890045
14168 -19890045 -17388186 -14536385 -11496810 -8410481 -5382254 -2477437 274193 2868876
14160 2868876 5315776 7624504 9797838 11830989 13714594 15437787 16989912 18360555
14152 18360555 19537210 20501548 21229091 21696789 21895550 21837900 21553561 21075354 20423853
14143 20423853 19598027 18576578 17332812 15859845 14193282 12415786 10639366 8977029
14135 8977029 7520422 6332628 5455294 4923197 4776274 5059886 5811972 7046337 8743649
14126 8743649 10852839 13295856 15967707 18729704 21401016 23759753 25566461 26613388
14118 26613388 26783254 26088083 24666603 22741925 20559743 18330349 16191053 14196654
14110 14196654 12335863 10562540 8827001 7096741 5362382 3629855 1904636 177967
14102 177967 -1575851 -3389264 -5284063 -7254911 -9260566 -11227984 -13070434 -14711825
14094 -14711825 -16101483 -17207424 -17993253 -18400417 -18356595 -17809961 -16765122 -15292662 -13505527
14085 -13505527 -11522478 -9445988 -7364236 -5364168 -3536216 -1963001 -699331 243447
14077 243447 899661 1336767 1633032 1853860 2035698 2184281 2288583 2344218 2374254 2436705
14067 2436705 2615670 3000324 3657932 4606422 5794013 7096077 8335611 9322531 9896916
14058 9896916 9961722 9499500 8575280 7327255 5943085 4621844 3531349 2777781 2399244
14049 2399244 2379758 2669081 3196277 3876677 4619313 5338196 5962264 6437418 6722157 6786158
14039 6786158 6618261 6239551 5711108 5130347 4616976 4291802 4251626 4547613 5177922 6099195
14029 6099195 7248413 8559451 9964670 11383494 12708687 13804557 14527697 14766753
14021 14766753 14479287 13699521 12510527 11002654 9249932 7318422 5292357 3289595
14013 3289595 1447755 -113115 -1326736 -2192695 -2760323 -3097642 -3262006 -3282362 -3157505
14004 -3157505 -2871279 -2418536 -1827329 -1163410 -515186 29824 403055 560493 477587 140569
13994 140569 -458775 -1321356 -2433225 -3756619 -5225012 -6746566 -8216293 -9532228 -10609345
13985 -10609345 -11388917 -11844515 -11983999 -11843866 -11475648 -10931697 -10259148 -9503483 -8715013
13976 -8715013 -7951083 -7271666 -6730715 -6367633 -6202594 -6236474 -6453238 -6823464 -7310061 -7875920
13966 -7875920 -8488706 -9118301 -9729612 -10278835 -10717365 -10999475 -11087824 -10955781 -10589979 -9995755
13956 -9995755 -9203907 -8273221 -7283074 -6316471 -5442748 -4710984 -4155105 -3799784 -3657153
13947 -3657153 -3717725 -3948122 -4302232 -4739127 -5235534 -5786343 -6394507 -7055367 -7741407 -8393954
13937 -8393954 -8925907 -9233662 -9212793 -8775476 -7871938 -6514001 -4788272 -2844533 -858442
13928 -858442 1014722 2673906 4082235 5254325 6228934 7037988 7684350 8137295 8345254
13919 8345254 8256517 7837084 7080121 6007921 4670735 3145889 1536441 -34963 -1439737
13910 -1439737 -2560920 -3307073 -3617425 -3459449 -2824544 -1727536 -211391 1648314 3748208
13901 3748208 5974492 8224348 10416846 12486256 14363744 15960562 17164083 17852133
13893 17852133 17923273 17331774 16111119 14375574 12302084 10103023 7997707 6183707
13885 6183707 4807693 3941281 3572728 3621419 3969046 4489996 5066291 5588646 5958432
13876 5958432 6101062 5984985 5630626 5100412 4475833 3835807 3246606 2762478 2427422
13867 2427422 2269578 2289988 2456953 2714917 3003558 3272466 3480993 3587705 3544181 3303610
13857 3303610 2840158 2164417 1323194 384909 -578142 -1500770 -2327551 -3011436 -3512793
13848 -3512793 -3801598 -3863440 -3706569 -3363840 -2885037 -2322138 -1716159 -1093945 -476863 105229
13838 105229 607705 982866 1205681 1293791 1301997 1291029 1291560 1286454 1218244 1012735 605451
13827 605451 -38579 -916476 -1991051 -3202108 -4479875 -5757412 -6980957 -8115372 -9140841
13818 -9140841 -10042207 -10800445 -11396677 -11829925 -12137968 -12406190 -12754273 -13301837 -14126458
13809 -14126458 -15234275 -16558213 -17982561 -19378075 -20631395 -21664032 -22443925 -22988415
13801 -22988415 -23351572 -23594155 -23748628 -23799193 -23688608 -23347532 -22730824 -21844343 -20752365
13792 -20752365 -19564850 -18411025 -17408381 -16635174 -16113057 -15805236 -15631501 -15494450 -15305951
13783 -15305951 -15004264 -14558787 -13965673 -13240830 -12416198 -11540508 -10678921 -9903260 -9270962
13774 -9270962 -8801894 -8467035 -8196195 -7900334 -7497679 -6934444 -6195342 -5301569 -4296782
13765 -4296782 -3228052 -2134047 -1048885 -16295 901756 1632672 2111791 2297505 2175393
13756 2175393 1755873 1072847 184143 -831119 -1882233 -2883513 -3773212 -4525922 -5149526
13747 -5149526 -5666842 -6095102 -6438886 -6698993 -6884750 -7016360 -7115740 -7194403 -7247682 -7260095
13737 -7260095 -7221292 -7144967 -7077320 -7085167 -7228318 -7533426 -7984235 -8528887 -9094014 -9596069
13727 -9596069 -9947496 -10060076 -9848790 -9239505 -8182710 -6671081 -4752810 -2531608 -151122
13718 -151122 2228920 4454115 6389179 7926583 8993369 9554275 9607182 9172675 8285822
13709 8285822 6996119 5372670 3507056 1509599 -500273 -2407623 -4116752 -5561548
13701 -5561548 -6706519 -7540897 -8074252 -8337481 -8383043 -8277201 -8086867 -7870322 -7675395
13692 -7675395 -7539507 -7486709 -7525339 -7652889 -7867571 -8178800 -8609767 -9191561 -9951386 -10896822
13682 -10896822 -11998804 -13180081 -14317909 -15264923 -15882823 -16076466 -15815772 -15138365 -14133256
13673 -14133256 -12912074 -11577689 -10200009 -8805895 -7385597 -5912470 -4366837 -2752436
13665 -2752436 -1098941 545218 2119056 3548423 4744338 5610662 6063832 6055577 5585327
13656 5585327 4695430 3452762 1927551 181084 -1731672 -3747436 -5777868 -7701495
13648 -7701495 -9370580 -10633571 -11367734 -11510384 -11073563 -10132807 -8795554 -7167966 -5338147
13639 -5338147 -3379599 -1364766 623533 2488037 4120205 5411687 6275690 6673918
13631 6673918 6636469 6261461 5691513 5076997 4540946 4155774 3933987 3831077 3759302 3610991
13621 3610991 3285962 2713654 1863625 747334 -580566 -2019461 -3427168 -4641050 -5513775
13612 -5513775 -5949357 -5923941 -5484995 -4733242 -3797832 -2815124 -1915136 -1211266 -785888 -671358
13602 -671358 -835539 -1182827 -1574175 -1860232 -1916892 -1672483 -1119565 -311224 652121 1640025
13592 1640025 2514127 3157001 3500664 3538564 3310280 2867626 2245874 1458906 517251 -547503
13582 -547503 -1668589 -2747560 -3674925 -4362785 -4778582 -4963803 -5024861 -5096966 -5296019 -5677585
13572 -5677585 -6216510 -6812334 -7318488 -7586936 -7514982 -7079948 -6349948 -5464866 -4591541 -3870205
13562 -3870205 -3375823 -3109743 -3018287 -3021288 -3034608 -2981099 -2794299 -2423225 -1843695 -1072105
13552 -1072105 -168373 782153 1701386 2544708 3303705 3986784 4593331 5096903 5444791
13543 5444791 5573602 5433851 5011199 4333231 3460586 2470911 1443428 443740 -494554
13534 -494554 -1387330 -2303467 -3343962 -4601266 -6119182 -7875734 -9797004 -11790593 -13778062
13525 -13778062 -15711631 -17573453 -19365403 -21099156 -22792346 -24469187 -26157401 -27873980
13517 -27873980 -29602638 -31277813 -32790876 -34020633 -34873304 -35310831 -35354587 -35067181 -34526423
13508 -34526423 -33805094 -32959600 -32021138 -30985189 -29806350 -28411181 -26732505 -24752073
13500 -24752073 -22530305 -20208066 -17979096 -16043614 -14559893 -13610548 -13193667 -13238155 -13633378
13491 -13633378 -14259913 -15011316 -15803622 -16575793 -17287079 -17914731 -18451393 -18900132 -19266929
13482 -19266929 -19552167 -19743294 -19811586 -19716169 -19415437 -18880998 -18108236 -17121906 -15978234
13473 -15978234 -14762126 -13574240 -12506599 -11616087 -10910912 -10358387 -9908382 -9518437 -9169909
13464 -9169909 -8873315 -8664606 -8591053 -8685066 -8933320 -9259112 -9533310 -9612090 -9382597 -8795313
13454 -8795313 -7872550 -6694953 -5375468 -4032714 -2773340 -1685453 -837480 -274940 -11989
13445 -11989 -20331 -221542 -490005 -671909 -620267 -238312 482961 1450033 2487256 3389558
13435 3389558 3984687 4174243 3937835 3310450 2356684 1157906 -187044 -1557202 -2813050
13426 -2813050 -3816476 -4463365 -4711363 -4585155 -4158399 -3528080 -2795797 -2057051 -1392782
13417 -1392782 -861933 -498411 -313675 -303221 -455850 -764678 -1235280 -1884580 -2728454 -3763051
13407 -3763051 -4948535 -6204043 -7419822 -8485242 -9321301 -9901957 -10255934 -10453115 -10585347
13398 -10585347 -10747838 -11022837 -11467204 -12106121 -12931877 -13903346 -14944844 -15950001 -16796797
13389 -16796797 -17370599 -17582882 -17376443 -16720929 -15610486 -14069701 -12162519 -9994674 -7705409
13380 -7705409 -5450322 -3378321 -1605456 -191449 871793 1652822 2256918 2797521 3375209
13371 3375209 4068089 4927656 5972759 7182230 8494842 9823275 11078349 12191217
13363 12191217 13122923 13859494 14398877 14738802 14872311 14792233 14499548 14007811 13339722
13354 13339722 12519868 11571902 10523900 9416256 8302029 7235740 6258046 5389345 4639370
13345 4639370 4027098 3596746 3417452 3564321 4089083 4993347 6215175 7634032 9093948
13336 9093948 10439894 11556744 12395926 12977721 13368555 13645335 13864101 14045950 14183226
13327 14183226 14258654 14263420 14202610 14087886 13928890 13734697 13525052 13340297 13239641 13286949
13317 13286949 13532523 14001484 14693588 15589270 16651420 17819594 19007473 20117078 21066841
13308 21066841 21812106 22340456 22649095 22729074 22571451 22186005 21611678 20908642 20138608
13299 20138608 19346347 18550928 17748763 16925787 16071741 15188267 14287663 13388037 12513097
13290 12513097 11697550 10990058 10445562 10107780 9991239 10072255 10291674 10565872 10801296
13281 10801296 10909404 10820125 10491929 9917322 9124413 8174991 7156670 6166164 5286609
13272 5286609 4568865 4024783 3630225 3330312 3046919 2697439 2228187 1648078 1038993
13263 1038993 531088 253979 288547 640653 1244014 1985627 2740122 3400337 3896523 4201233
13253 4201233 4320523 4276799 4092536 3781673 3347202 2778898 2050507 1124157 -31293
13244 -31293 -1412427 -2959076 -4552459 -6037514 -7259594 -8098315 -8485564 -8406993 -7895766
13235 -7895766 -7025789 -5903379 -4652827 -3395946 -2231337 -1219449 -376385 322500 929241
13226 929241 1502925 2088894 2704812 3337160 3945633 4469114 4829307 4935189 4695974 4045221
13216 4045221 2967512 1513092 -207893 -2047703 -3849133 -5470942 -6807224 -7799680
13208 -7799680 -8442128 -8777836 -8891884 -8899097 -8925225 -9080776 -9435298 -10005937 -10767653 -11676877
13198 -11676877 -12690764 -13770565 -14872141 -15935135 -16880628 -17621436 -18083711 -18232594 -18089932
13189 -18089932 -17734153 -17281757 -16859205 -16576963 -16514521 -16719206 -17214157 -18005422 -19080023
13180 -19080023 -20395763 -21871568 -23388206 -24804744 -25989421 -26854758 -27379308 -27602023
13172 -27602023 -27592474 -27417036 -27120565 -26726914 -26248432 -25695727 -25086613 -24454565 -23852000 -23341946
13162 -23341946 -22978118 -22782457 -22732026 -22761016 -22774433 -22665916 -22335014 -21703277 -20728149 -19411000
13152 -19411000 -17796896 -15968203 -14035596 -12125971 -10363758 -8846269 -7621693 -6681299
13144 -6681299 -5971116 -5417111 -4950555 -4522359 -4104842 -3688203 -3279528 -2905832 -2616929
13135 -2616929 -2483362 -2586582 -3000350 -3765709 -4867779 -6226320 -7707585 -9154501 -10423760
13126 -10423760 -11416516 -12092632 -12464224 -12571887 -12455146 -12131457 -11592294 -10813561 -9770061
13117 -9770061 -8445276 -6835414 -4951924 -2825166 -506995 1931526 4408010 6839852
13109 6839852 9155871 11304876 13254828 14977562 16425051 17516185 18151211 18249975 17788586
13100 17788586 16809554 15402544 13673540 11721254 9626926 7454980 5262346 3113535
13092 3113535 1091528 -708409 -2203739 -3352599 -4164206 -4685674 -4977742 -5096354 -5086935
13083 -5086935 -4987611 -4835240 -4670709 -4540932 -4495278 -4576684 -4811110 -5199176 -5711714 -6291097
13073 -6291097 -6861796 -7350329 -7705627 -7905948 -7946844 -7820556 -7504045 -6963878 -6172302 -5124256
13063 -5124256 -3849906 -2420989 -947288 441125 1623749 2520046 3106816 3416822 3523737
13054 3523737 3523004 3514184 3583888 3786628 4126005 4544589 4930571 5142385 5044675 4545415 3624034
13043 3624034 2342324 833701 -727076 -2164500 -3340348 -4178383 -4671365 -4873766 -4887400
13034 -4887400 -4843898 -4881296 -5111361 -5584630 -6271448 -7074296 -7867403 -8540970 -9027606 -9306301
13024 -9306301 -9395180 -9343458 -9220968 -9098139 -9018360 -8977877 -8929375 -8811245 -8587049 -8272937
13014 -8272937 -7938217 -7679958 -7586990 -7713622 -8075082 -8660928 -9452304 -10431393 -11581555
13005 -11581555 -12883405 -14312227 -15839118 -17434832 -19071516 -20717165 -22324674 -23826242
12997 -23826242 -25142010 -26197906 -26937586 -27320565 -27315280 -26901603 -26085729 -24915366 -23480695
12988 -23480695 -21897547 -20281421 -18724528 -17282621 -15971353 -14769859 -13631744 -12504622
12980 -12504622 -11354102 -10180852 -9018755 -7911963 -6882910 -5911710 -4942547 -3915715
12972 -3915715 -2805836 -1641353 -493348 557200 1451694 2166807 2702744 3056440 3198081
12963 3198081 3067482 2594002 1728153 466723 -1139545 -2994688 -4974470 -6943521 -8768677
12954 -8768677 -10330093 -11535523 -12340572 -12768652 -12916776 -12935903 -12987029 -13188666 -13579718
12945 -13579718 -14117347 -14710884 -15270056 -15737591 -16091574 -16327205 -16438313 -16411034 -16229511
12936 -16229511 -15887595 -15399457 -14802379 -14149344 -13497088 -12898130 -12398257 -12033086 -11819427
12927 -11819427 -11745685 -11768823 -11820072 -11815417 -11666192 -11288040 -10609294 -9581397 -8193139 -6485379
12917 -6485379 -4557213 -2555331 -647822 1006088 2277462 3075251 3344126 3059243 2221812
12908 2221812 855870 -993629 -3260093 -5851610 -8647443 -11500353 -14248067 -16731083
12900 -16731083 -18809700 -20375456 -21358886 -21738902 -21553739 -20904700 -19943057 -18840812 -17757544
12891 -17757544 -16816268 -16092312 -15611945 -15357225 -15275606 -15292957 -15328729 -15313365 -15206149 -15006390
12881 -15006390 -14749461 -14487603 -14265784 -14104601 -13995408 -13906518 -13796875 -13631391 -13390323
12872 -13390323 -13068307 -12666367 -12184634 -11620051 -10967671 -10223048 -9385699 -8464968 -7487469
12863 -7487469 -6502275 -5579023 -4797093 -4229397 -3927597 -3913627 -4178700 -4689662 -5402833 -6282348
12853 -6282348 -7314867 -8512238 -9900089 -11498031 -13300758 -15268989 -17334950 -19418535
12845 -19418535 -21442212 -23334295 -25021474 -26421026 -27442148 -27999318 -28035946 -27552400 -26625992
12836 -26625992 -25407735 -24090516 -22859939 -21848173 -21106564 -20602689 -20240337 -19896348 -19463679
12827 -19463679 -18886532 -18174387 -17388800 -16609403 -15897366 -15275312 -14728768 -14218313 -13689775
12818 -13689775 -13080876 -12329260 -11381428 -10197032 -8748928 -7027020 -5048552 -2864374
12810 -2864374 -549108 1821652 4189701 6513813 8752383 10843248 12695190 14198825
12802 14198825 15256079 15818209 15914549 15654780 15199764 14712718 14311371 14038338 13857409
12793 13857409 13674856 13377447 12872423 12113541 11106381 9899770 8575338 7239539 6012421
12784 6012421 5007594 4307304 3943715 3895631 4102143 4487549 4987146 5562571 6199974
12775 6199974 6893663 7625433 8349922 8991243 9452139 9635063 9470865 8944091 8100914
12766 8100914 7032378 5839292 4596499 3335771 2056957 760657 -518698 -1702367
12758 -1702367 -2688231 -3390765 -3776094 -3874102 -3765762 -3557002 -3352831 -3239641 -3275768 -3486565
12748 -3486565 -3862487 -4362927 -4927317 -5487990 -5975709 -6316169 -6427748 -6232453 -5679813
12739 -5679813 -4769829 -3559607 -2148882 -651730 832543 2237976 3534971 4720412
12731 4720412 5802549 6788474 7679363 8475506 9188774 9853450 10523296 11250017 12053428
12722 12053428 12902609 13720747 14410358 14884665 15091647 15024802 14721636 14254360 13716355
12713 13716355 13203998 12792082 12507545 12315734 12131851 11853646 11395257 10704509 9762705
12704 9762705 8577099 7172683 5583760 3848434 2013484 150819 -1626769 -3167919
12696 -3167919 -4309856 -4920581 -4936450 -4377547 -3335516 -1944175 -351693 1293236 2844208
12687 2844208 4161027 5122195 5642934 5690188 5287607 4508451 3460583 2272507 1086675
12678 1086675 54900 -677268 -1002369 -884888 -373502 419524 1359817 2329516 3247285
12669 3247285 4070003 4785119 5399680 5925952 6362906 6679016 6807654 6664082 6181024
12660 6181024 5345252 4212868 2892386 1505874 152906 -1102084 -2216798 -3147491
12652 -3147491 -3834043 -4203963 -4192267 -3765027 -2933414 -1752050 -305566 1306654 2979868
12643 2979868 4608361 6092711 7355954 8364440 9139566 9748650 10277645 10802061 11371862
12634 11371862 12012720 12735165 13543864 14445151 15451412 16577702 17828324 19180421 20577715
12625 20577715 21941777 23195110 24282015 25176290 25874464 26380500 26688498 26768455 26561109
12616 26561109 25988420 24979744 23501810 21575432 19271382 16692789 13956593 11179764
12608 11179764 8469227 5915207 3589629 1547460 -175176 -1568045 -2651464 -3469038
12600 -3469038 -4068861 -4485133 -4732968 -4818722 -4756577 -4579261 -4337459 -4091651 -3903590 -3830726
12590 -3830726 -3921646 -4210597 -4712980 -5425282 -6329700 -7400576 -8610364 -9934336 -11352805
12581 -11352805 -12849003 -14403448 -15988380 -17564490 -19078654 -20462855 -21639743 -22540021
12573 -22540021 -23127272 -23416375 -23474132 -23402414 -23312666 -23299386 -23416512 -23661855 -23978077 -24274625
12563 -24274625 -24462262 -24481420 -24310090 -23954154 -23435783 -22790217 -22065117 -21310111 -20555700
12554 -20555700 -19795954 -18990196 -18085118 -17045442 -15877990 -14638405 -13417170 -12311213
12546 -12311213 -11395353 -10706378 -10241589 -9964050 -9807948 -9684729 -9494114 -9140873 -8553862
12537 -8553862 -7702103 -6603533 -5324156 -3968096 -2660388 -1524300 -656712 -109035 118114
12528 118114 65062 -204524 -619723 -1113096 -1626477 -2111709 -2526453 -2829862 -2985814 -2975205
12518 -2975205 -2807514 -2518229 -2149290 -1725416 -1244289 -687283 -40682 689517 1478352
12509 1478352 2294551 3113665 3920485 4695816 5393418 5923269 6157993 5966220 5259093
12500 5259093 4028546 2361644 426323 -1566621 -3413256 -4961015 -6132810 -6924631
12492 -6924631 -7381727 -7565893 -7528252 -7298526 -6892936 -6332631 -5659605 -4940641 -4257385 -3686756
12482 -3686756 -3279442 -3045601 -2954883 -2951828 -2981188 -3013783 -3062241 -3177694 -3425659 -3851007
12472 -3851007 -4449703 -5161275 -5883797 -6502888 -6923088 -7091449 -7006262 -6709537 -6269449 -5762985
12462 -5762985 -5265244 -4844505 -4559223 -4456073 -4570386 -4926802 -5534366 -6375111 -7396153
12453 -7396153 -8518823 -9666015 -10791109 -11887444 -12971470 -14052030 -15106054 -16073971
12445 -16073971 -16874593 -17429005 -17681697 -17614221 -17254042 -16680258 -16019621 -15423403 -15026815
12436 -15026815 -14909226 -15077913 -15484653 -16064071 -16770542 -17592924 -18540606 -19611975 -20767668
12427 -20767668 -21927936 -22997597 -23903768 -24623223 -25182577 -25631102 -26002502 -26287631 -26431263
12418 -26431263 -26349915 -25957175 -25184822 -23997024 -22401240 -20458645 -18291453 -16080045 -14042703
12409 -14042703 -12396626 -11308678 -10852581 -10989749 -11582327 -12434255 -13346325 -14167741 -14829231
12400 -14829231 -15349333 -15814584 -16343146 -17046083 -17998919 -19229692 -20722155 -22427521 -24277665
12391 -24277665 -26196934 -28114594 -29979011 -31767880 -33484827 -35139810 -36724193 -38197123
12383 -38197123 -39491525 -40533858 -41264301 -41646841 -41666897 -41322084 -40615203 -39555316 -38164624
12374 -38164624 -36483828 -34571391 -32498386 -30342535 -28182440 -26091414 -24131702 -22350485
12366 -22350485 -20777730 -19425866 -18292875 -17369122 -16643099 -16099463 -15709454 -15423214 -15174476
12357 -15174476 -14898037 -14549459 -14114786 -13605866 -13045428 -12449885 -11817291 -11126321 -10348050
12348 -10348050 -9464655 -8483165 -7436289 -6374947 -5364075 -4485364 -3837016 -3519420 -3609488
12339 -3609488 -4138727 -5087329 -6393896 -7972138 -9727009 -11566399 -13405974 -15165795
12331 -15165795 -16760851 -18091977 -19045043 -19503342 -19371493 -18601989 -17212043 -15281686 -12933243
12322 -12933243 -10301776 -7510207 -4658671 -1827684 914239 3509034 5917034 8129108
12314 8129108 10173910 12113164 14022741 15963782 17955085 19960868 21901363 23680378
12306 23680378 25214342 26449266 27362357 27954166 28239748 28244783 28008101 27586955 27057427
12297 27057427 26503393 25995089 25567527 25211201 24880229 24513230 24057425 23487234 22810570
12288 22810570 22059180 21266838 20447916 19589133 18656595 17609782 16415088 15059435 13564954
12279 13564954 11997052 10454445 9041201 7837436 6888231 6214917 5834504 5768515 6033628
12270 6033628 6620885 7476512 8494076 9521274 10380322 10898114 10939465 10434310 9390620
12261 9390620 7888793 6058559 4044815 1974114 -64673 -2018239 -3850878 -5525665
12253 -5525665 -6998020 -8224268 -9177328 -9857242 -10286945 -10493355 -10486383 -10253406 -9775463
12244 -9775463 -9051681 -8110446 -6999367 -5766965 -4454840 -3105219 -1771427 -515862
12236 -515862 607954 1577754 2413329 3168794 3913514 4714673 5626587 6680774 7871261
12227 7871261 9141334 10384877 11466943 12254412 12644015 12581789 12072519 11175658 9985190
12218 9985190 8600526 7104047 5556296 4005992 2503218 1106723 -116148 -1094734
12210 -1094734 -1763710 -2073530 -1999742 -1547445 -748622 346891 1683259 3208169 4875149
12201 4875149 6636381 8429169 10165347 11734357 13023155 13943697 14452887 14556587 14301949
12192 14301949 13767976 13058838 12295974 11603032 11083906 10802559 10775936 10983547 11384308
12183 11384308 11924884 12532602 13102692 13497380 13565691 13177502 12257545 10807449 8910051
12174 8910051 6715633 4414060 2199843 237752 -1363736 -2563916 -3381581 -3870939
12166 -3870939 -4095256 -4112320 -3975231 -3740747 -3475986 -3260512 -3184108 -3337440 -3791259 -4567500
12156 -4567500 -5616986 -6820265 -8015332 -9040281 -9774227 -10165738 -10243273 -10102552 -9870168
12147 -9870168 -9655084 -9509164 -9412112 -9281261 -8997989 -8443222 -7534039 -6248478 -4626724
12138 -4626724 -2749908 -711197 1405338 3532065 5613253 7593897 9409907 10989509
12130 10989509 12270663 13228133 13895577 14368982 14786462 15290848 15990623 16935557 18113630
12121 18113630 19463044 20889342 22284388 23549500 24620923 25487212 26186747 26783219
12113 26783219 27330092 27841889 28285689 28593548 28685741 28493382 27974670 27122578 25960789
12104 25960789 24526788 22849817 20938242 18785182 16387262 13763176 10962855 8067111
12096 8067111 5182010 2430614 -58046 -2163329 -3788652 -4873708 -5398993 -5383155 -4877444
12087 -4877444 -3959602 -2725314 -1276650 287054 1870142 3377195 4716910 5818718
12079 5818718 6652388 7235084 7620417 7877933 8074479 8262606 8476377 8735133 9054610
12070 9054610 9459401 9987224 10679948 11565193 12637479 13846821 15099437 16272709 17242587
12061 17242587 17914576 18244282 18237018 17928352 17358729 16555648 15527409 14263962 12741061
12052 12741061 10929318 8810275 6395143 3736680 927636 -1912537 -4655971 -7184274
12044 -7184274 -9404480 -11262852 -12754526 -13924670 -14857683 -15656084 -16416810 -17213527 -18087519
12035 -18087519 -19043404 -20047063 -21030384 -21910229 -22620658 -23144451 -23525180 -23851029 -24218360
12026 -24218360 -24693780 -25290717 -25965520 -26629641 -27173212 -27496043 -27538423 -27298580 -26825224
12017 -26825224 -26186439 -25431614 -24568639 -23568854 -22394195 -21028065 -19491913 -17841090 -16145677
12008 -16145677 -14467251 -12841300 -11271098 -9733556 -8191780 -6607049 -4947589 -3197221
12000 -3197221 -1365910 502167 2329210 4013176 5441038 6503569 7114035 7230814
11992 7230814 6875910 6137377 5149693 4058409 2985391 2011018 1178244 508331 12560
11983 12560 -307527 -466819 -501620 -467219 -425179 -421095 -461762 -507629 -489709 -341130 -21347
11972 -21347 480987 1161463 2013977 3033882 4209309 5507335 6864398 8188597 9375685
11963 9375685 10333101 11002148 11369552 11464706 11345305 11079184 10730200 10349961 9970695 9595982
11953 9595982 9194887 8710185 8083864 7288509 6345855 5320814 4294079 3327969 2443062
11944 2443062 1617497 809074 -12558 -841709 -1632179 -2311688 -2806029 -3063545 -3073351 -2872415
11934 -2872415 -2538965 -2174705 -1882974 -1750614 -1837775 -2175441 -2766728 -3587893 -4589593
11925 -4589593 -5704224 -6862217 -8009470 -9112448 -10147337 -11085305 -11889076 -12523089 -12966731
11916 -12966731 -13220336 -13302259 -13240469 -13062162 -12784682 -12411661 -11935496 -11341955 -10611612 -9718597
11906 -9718597 -8633165 -7332674 -5816809 -4117081 -2294471 -427895 1399857 3114995
11898 3114995 4663149 6014097 7157292 8091655 8819711 9351175 9708186 9920459 10010214
11889 10010214 9980077 9815914 9503059 9044234 8469029 7833217 7211440 6686121 6332909
11880 6332909 6204722 6321642 6674159 7237238 7981532 8871433 9856312 10870575 11847431
11871 11847431 12734589 13499852 14128758 14623583 15004396 15303864 15552346 15761662 15918561
11862 15918561 15990367 15936775 15721025 15317136 14712184 13903440 12893103 11687620 10308112
11853 10308112 8809147 7290642 5885997 4724680 3887405 3378097 3124788 3005192 2884556
11844 2884556 2653341 2254455 1693729 1033424 372716 -180575 -541094 -668047 -565493
11835 -565493 -260605 222858 875524 1692769 2656363 3722145 4819971 5864922 6777128
11826 6777128 7507028 8059757 8507953 8980907 9624676 10544341 11756701 13181856 14678722
11817 14678722 16099964 17332594 18307885 18988641 19352422 19383853 19078746 18455115 17561702
11808 17561702 16475060 15283583 14067090 12883654 11767526 10731645 9766856 8838898
11800 8838898 7892274 6867496 5726940 4476303 3170898 1905101 790127 -72928
11792 -72928 -617717 -827178 -732673 -399583 91679 660302 1233243 1750844 2173183 2485551
11782 2485551 2698917 2844988 2970663 3135775 3409880 3858819 4520168 5382499 6388130
11773 6388130 7462902 8554351 9653365 10788539 12001264 13318287 14735585 16218811
11765 16218811 17715954 19171913 20536707 21766756 22823669 23673863 24290086 24655794
11757 24655794 24771347 24655694 24336704 23832868 23139870 22233896 21090402 19705417 18105843
11748 18105843 16343443 14478381 12566103 10659457 8824196 7151775 5753871 4738638
11740 4738638 4182276 4108695 4481354 5206991 6151778 7168677 8128927 8946858 9589940
11731 9589940 10072477 10437300 10733220 10996042 11238234 11449101 11604404 11680791 11666955 11564489
11721 11564489 11379000 11110017 10748993 10288464 9738380 9140893 8572104 8121572 7852223
11712 7852223 7759976 7759141 7707423 7460983 6932416 6123626 5120153 4054149 3057942 2229946
11702 2229946 1621769 1242199 1070335 1073009 1221932 1503548 1917227 2465683 3145874 3943966
11692 3943966 4831651 5762210 6669624 7473820 8090199 8440207 8463023 8128323 7444093 6451246
11682 6451246 5206124 3763718 2174028 490810 -1218410 -2869378 -4364423 -5598631
11674 -5598631 -6470484 -6900800 -6857515 -6374897 -5554195 -4541326 -3489670 -2523941 -1719244
11665 -1719244 -1099609 -649395 -326886 -73439 181206 512938 992629 1670188 2557225
11656 2557225 3616864 4769536 5915396 6961807 7839270 8498369 8896537 8991559 8750945
11647 8750945 8170102 7282889 6154455 4861739 3476067 2056319 648302 -717931
11639 -717931 -2032656 -3304727 -4549756 -5775259 -6973094 -8121991 -9195281 -10168457
11631 -10168457 -11024035 -11752416 -12349095 -12812526 -13147663 -13373285 -13523086 -13632803 -13718179
11622 -13718179 -13759172 -13703352 -13488246 -13069469 -12438579 -11622449 -10668017 -9623428 -8525171
11613 -8525171 -7394407 -6240113 -5063959 -3862433 -2625836 -1339699 4881 1393704
11605 1393704 2777076 4075471 5203468 6098452 6738265 7141514 7354436 7431574 7415308
11596 7415308 7318430 7116532 6758169 6194001 5413028 4465378 3456580 2514910 1748297
11587 1748297 1211000 893474 737022 662696 596962 481299 267390 -88518 -620625 -1339171
11577 -1339171 -2217576 -3190867 -4167768 -5052432 -5768002 -6272417 -6558969 -6641576 -6533424 -6230804
11567 -6230804 -5709844 -4937022 -3888931 -2573475 -1043109 606820 2254392 3773593
11559 3773593 5052724 6004829 6574244 6744148 6543125 6043032 5343200 4545028 3727422
11550 3727422 2932785 2168267 1421293 682506 -36005 -698278 -1258114 -1675781 -1922454
11541 -1922454 -1969622 -1775589 -1283582 -435106 808916 2448398 4430198 6642032 8917635
11532 8917635 11057067 12861135 14171216 14901884 15056833 14725447 14062122 13251983 12469194
11523 12469194 11839699 11422285 11213551 11167624 11214640 11269452 11234807 11007967 10495080 9631348
11513 9631348 8401389 6851140 5081684 3221910 1390231 -335252 -1923629 -3375933
11505 -3375933 -4701806 -5904033 -6978593 -7925932 -8761223 -9512117 -10201869 -10827543 -11348586
11496 -11348586 -11695546 -11795467 -11598973 -11093338 -10296893 -9243783 -7972701 -6525726 -4952057
11487 -4952057 -3307518 -1647186 -17782 1541457 2988728 4269886 5319152 6069756
11479 6069756 6463413 6450737 5989396 5055305 3671260 1935676 24592 -1845225 -3476163
11470 -3476163 -4739630 -5591232 -6052497 -6181375 -6052894 -5753458 -5376957 -5012484 -4725863
11461 -4725863 -4545287 -4458047 -4418038 -4360237 -4217985 -3937180 -3480209 -2817694 -1916969 -742744
11451 -742744 722131 2445442 4325505 6198738 7873644 9175209 9981773 10244059 9984472
11442 9984472 9280171 8237335 6966035 5562916 4103746 2644292 1227170 -109164
11434 -109164 -1326289 -2392399 -3296638 -4058788 -4723069 -5337260 -5930254 -6501071 -7022306
11425 -7022306 -7452132 -7747963 -7878730 -7834221 -7627807 -7288278 -6842194 -6297054 -5638548 -4846884
11415 -4846884 -3923722 -2913707 -1908116 -1027597 -389428 -70633 -81500 -361473 -798497
11406 -798497 -1260506 -1624661 -1798147 -1733109 -1437304 -974778 -449728 23325 348453 462671
11396 462671 336034 -30049 -598035 -1290854 -2005009 -2641364 -3133609 -3451470 -3576764 -3474066
11386 -3474066 -3080740 -2323837 -1152508 432867 2369736 4545724 6827231 9088152
11378 9088152 11224285 13150962 14793885 16085207 16968922 17410795 17406181 16983537 16205248
11369 16205248 15165508 13980693 12768808 11623413 10594957 9689233 8881010 8132910
11361 8132910 7411424 6697827 5993647 5319179 4705134 4182200 3774772 3499300 3360002
11352 3360002 3335659 3363810 3340679 3149946 2710435 2013142 1123481 150805 -792155 -1619267
11342 -1619267 -2285275 -2788664 -3165414 -3472492 -3763299 -4064378 -4365315 -4627328 -4804587
11333 -4804587 -4864717 -4797974 -4614672 -4337148 -3991279 -3599701 -3179975 -2751554 -2349017 -2030906
11323 -2030906 -1874532 -1957605 -2336241 -3028761 -4010383 -5220703 -6582110 -8021080 -9480868
11314 -9480868 -10919598 -12297941 -13566730 -14663012 -15517842 -16074031 -16306896 -16237031 -15926254
11305 -15926254 -15458265 -14916502 -14371983 -13882440 -13493269 -13232905 -13106863 -13099938 -13187477 -13345520
11295 -13345520 -13550963 -13775257 -13981961 -14131879 -14189648 -14125267 -13911490 -13522168 -12934514 -12135906
11285 -12135906 -11135447 -9977040 -8743399 -7539236 -6453778 -5520177 -4695607 -3874468
11277 -3874468 -2927541 -1746721 -275532 1483308 3478868 5630507 7845035 10029617
11269 10029617 12100451 13987092 15633309 16998101 18059942 18822113 19312892 19576672
11261 19576672 19657868 19583082 19347998 18915586 18229265 17236431 15910135 14258436 12321358
11252 12321358 10163509 7869300 5541472 3299287 1272054 -414151 -1653936 -2376230
11244 -2376230 -2546542 -2158214 -1221614 238586 2174725 4501057 7082299 9736117 12254621
11235 12254621 14440880 16148423 17309917 17945618 18149597 18059381 17820152 17555231 17350015
11226 17350015 17250883 17276455 17434303 17731611 18170049 18727562 19343724 19925887 20378397 20640529
11216 20640529 20713695 20664721 20602581 20637201 20838387 21214002 21715514 22262843 22773194 23183890
11206 23183890 23467462 23637447 23739138 23822502 23907838 23965401 23923985 23702702 23243665 22526255
11196 22526255 21561699 20381649 19033603 17583681 16117229 14728880 13503097 12494412
11188 12494412 11717785 11154442 10771109 10543242 10469360 10567983 10860227 11350404 12014642 12797623
11178 12797623 13612675 14345780 14869899 15071947 14884516 14308637 13417568 12340282 11231386
11169 11231386 10238122 9472904 8993818 8792391 8791598 8861091 8852701 8647968 8200192 7552975
11159 7552975 6825733 6171279 5724588 5565287 5705367 6098512 6661839 7304227 7955883
11150 7955883 8588202 9212192 9854404 10523455 11186008 11765941 12168437 12316351 12177732
11141 12177732 11770238 11147257 10383512 9571271 8821608 8257739 7994229 8106597 8602541
11132 8602541 9408643 10383269 11353787 12160530 12685926 12860612 12655876 12077425 11167721
11123 11167721 10012627 8741466 7510402 6468276 5717958 5293753 5166538 5268690 5519186
11114 5519186 5836412 6142481 6369801 6473585 6444966 6319146 6177534 6142739 6361442 6972879
11104 6972879 8072358 9688286 11784679 14282411 17078916 20051048 23044795 25870739
11096 25870739 28320874 30203899 31379936 31777147 31388599 30261166 28487511 26202329
11088 26202329 23577349 20810250 18106452 15655845 13609535 12063823 11056446 10574393
11080 10574393 10568404 10969531 11703596 12697509 13872504 15128456 16334136 17336711 17988541
11071 17988541 18175929 17837208 16970886 15640381 13974353 12153792 10381560 8842273
11063 8842273 7666249 6907233 6538002 6465969 6567105 6727316 6873434 6981546 7065842 7162061
11053 7162061 7316821 7583322 8017414 8669429 9570931 10717876 12054634 13468422 14803657
11044 14803657 15895172 16605261 16847471 16592978 15868110 14749929 13356769 11828485 10300842
11035 10300842 8885986 7665945 6694953 6002179 5591883 5444747 5524199 5786337 6188320
11026 6188320 6692231 7267227 7894443 8573221 9320240 10155193 11078158 12053112 13009067
11017 13009067 13858223 14520483 14942682 15106557 15026013 14737230 14284571 13704677 13013219
11008 13013219 12200973 11243192 10118824 8830703 7418462 5959450 4555850 3310528
11000 3310528 2300577 1560311 1079311 811762 691061 647926 631575 627700 662596 788075
10990 788075 1054106 1484672 2070267 2779220 3577194 4439164 5345330 6266324 7151657 7932329
10980 7932329 8538301 8922886 9082779 9064141 8950859 8839816 8814227 8925113 9184429 9568012
10970 9568012 10025435 10494210 10914730 11242086 11453322 11551035 11563411 11539201 11538277 11622503 11851100
10959 11851100 12278164 12945636 13869268 15024178 16340303 17712534 19020652 20148687
10951 20148687 20995931 21480526 21543017 21154509 20324626 19100517 17556166 15781049 13875297
10942 13875297 11947583 10107797 8454295 7062833 5981480 5229519 4798689 4658150
10934 4658150 4761754 5051385 5454016 5880438 6236104 6443455 6462951 6299653 5992057 5589381
10924 5589381 5127323 4611912 4017754 3300839 2419485 1353798 115714 -1254052 -2701266
10915 -2701266 -4180809 -5678365 -7220492 -8864362 -10667660 -12653175 -14790274 -17006557
10907 -17006557 -19221512 -21378203 -23452875 -25441079 -27334963 -29108627 -30719500 -32122449
10899 -32122449 -33285655 -34196510 -34853456 -35251667 -35376728 -35213431 -34762450 -34050322 -33125239
10890 -33125239 -32044051 -30860831 -29621195 -28358015 -27083328 -25778298 -24390554 -22848120
10882 -22848120 -21089559 -19097037 -16913509 -14633210 -12370714 -10226212 -8264802 -6517112
10874 -6517112 -4994654 -3705557 -2660358 -1870021 -1346143 -1106700 -1178341 -1585564 -2331039
10865 -2331039 -3382157 -4672918 -6116439 -7618810 -9091313 -10461845 -11683265 -12734154
10857 -12734154 -13612373 -14327668 -14899120 -15357097 -15743548 -16103827 -16469354 -16840057 -17179780
10848 -17179780 -17430063 -17534399 -17460113 -17211272 -16832016 -16398096 -15993267 -15676235 -15456056
10839 -15456056 -15292658 -15122300 -14890792 -14576093 -14194017 -13791773 -13434615 -13186222 -13084285
10830 -13084285 -13120803 -13240963 -13365799 -13427296 -13395460 -13283090 -13128804 -12970557 -12825398 -12686987
10820 -12686987 -12542113 -12395338 -12284622 -12276134 -12439183 -12813181 -13381834 -14065456 -14733653 -15232492
10810 -15232492 -15417150 -15182987 -14488891 -13364629 -11895186 -10185718 -8323766 -6357612
10802 -6357612 -4297900 -2136022 132217 2486558 4870941 7193572 9338219 11184215
10794 11184215 12631292 13623801 14166182 14321542 14191288 13883068 13479634 13019841 12497369
10785 12497369 11876517 11118227 10205710 9160302 8043808 6948687 5979220 5227940 4754280
10776 4754280 4573032 4655054 4934600 5315628 5676015 5876582 5781534 5288454 4357467 3027878
10766 3027878 1415907 -306466 -1947304 -3338001 -4373497 -5036666 -5396647 -5579497 -5720154
10757 -5720154 -5912086 -6172221 -6434253 -6574007 -6458280 -5998743 -5190916 -4125571 -2970452
10748 -2970452 -1928241 -1182432 -846947 -936015 -1364019 -1973044 -2575862 -2999199 -3115794
10739 -3115794 -2859986 -2227754 -1265804 -54521 1312370 2748988 4194495 5619188 7014362
10730 7014362 8368338 9640742 10752499 11603824 12116218 12276086 12151624 11868507 11555829
10721 11555829 11293256 11088986 10896713 10654355 10316561 9863365 9287717 8577229 7703244
10712 7703244 6621180 5280116 3638265 1679804 -573000 -3056898 -5673904 -8303612
10704 -8303612 -10819863 -13111797 -15106998 -16788956 -18198305 -19411488 -20502015 -21502024
10696 -21502024 -22385958 -23087173 -23538126 -23710253 -23632009 -23378593 -23042298 -22699671 -22390621
10687 -22390621 -22117145 -21858499 -21590972 -21300672 -20985856 -20652838 -20310661 -19967136 -19627161
10678 -19627161 -19293066 -18963786 -18628496 -18255675 -17787298 -17148982 -16275503 -15136979 -13749526
10669 -13749526 -12168258 -10474642 -8768268 -7158829 -5748384 -4607011 -3759880 -3198242
10661 -3198242 -2904066 -2865518 -3072268 -3499795 -4098289 -4794526 -5507210 -6171247 -6759896 -7290126
10651 -7290126 -7805367 -8345991 -8924707 -9517127 -10068587 -10514747 -10809053 -10942674 -10942622 -10848285
10641 -10848285 -10682812 -10437615 -10076019 -9550086 -8820810 -7874083 -6728729 -5436682 -4077474
10632 -4077474 -2749442 -1559940 -616086 -14567 172882 -84075 -767035 -1819507 -3168567
10623 -3168567 -4739820 -6457751 -8242159 -10015065 -11717966 -13326105 -14848429 -16312872
10615 -16312872 -17745225 -19152528 -20519491 -21818401 -23022862 -24112903 -25067460 -25852145
10607 -25852145 -26414765 -26695240 -26645961 -26250987 -25532773 -24543371 -23347027 -22005180 -20570868
10598 -20570868 -19091574 -17613315 -16178269 -14814096 -13521405 -12269506 -11006310 -9680110
10590 -9680110 -8264698 -6776730 -5275779 -3844824 -2559686 -1462106 -547717 227683
10582 227683 926154 1598073 2259743 2892482 3463758 3953316 4364024 4711546 5003216 5221051
10572 5221051 5317863 5228019 4889670 4272181 3399202 2355054 1265292 255301 -592784
10563 -592784 -1261391 -1789513 -2247106 -2707478 -3224864 -3819957 -4477962 -5160094 -5818407 -6400271
10553 -6400271 -6840666 -7055211 -6948523 -6440453 -5498820 -4161376 -2535212 -774226 954087
10544 954087 2500039 3754011 4657201 5201045 5419092 5377113 5164190 4883214 4640471
10535 4640471 4537922 4669978 5119647 5946721 7167052 8731633 10521194 12370463 14120745
10526 14120745 15676374 17032692 18263561 19485203 20819423 22364387 24172145 26238694
10518 26238694 28515526 30939366 33463328 36073178 38783439 41619898 44603417 47749467
10510 47749467 51083550 54656192 58541549 62820571 67563203 72823514 78653718 85132712
10502 85132712 92393732 100635201 110115779 121148206 134094748 149349698 167303739
10495 167303739 188305465 212623946 240380652 271410059 305037230 339802438 373234109
10488 373234109 401885542 421881535 429980683 424718845 406971809 379581006 346306345
10481 346306345 310739207 275650207 242830066 213222519 187150961 164537740 145075977
10474 145075977 128346593 113899969 101321161 90272741 80501046 71811653 64036959
10467 64036959 57016417 50601310 44684728 39237272 34315075 30023529 26455443 23638722
10459 23638722 21515880 19958554 18807555 17917294 17178730 16512114 15848098 15122303 14288241
10450 14288241 13334678 12293875 11235834 10247971 9404301 8736211 8219137 7781046 7327503
10441 7327503 6771811 6057639 5166559 4113555 2939251 1700187 450307 -785438 -2028547
10432 -2028547 -3339174 -4786504 -6415964 -8228339 -10174964 -12167981 -14102385 -15881978
10424 -15881978 -17438918 -18740086 -19779160 -20559053 -21076273 -21320400 -21289411 -21003797 -20501405
10415 -20501405 -19815472 -18957899 -17926649 -16735000 -15441028 -14152022 -12992780 -12051474
10407 -12051474 -11334727 -10758875 -10180320 -9446131 -8440625 -7110851 -5465556 -3556438 -1460782
10398 -1460782 720694 2856804 4789220 6357521 7436946 7968308 7965105 7497744 6667898
10389 6667898 5588661 4375995 3143920 1994773 1007024 229893 -313647 -623319 -722175
10380 -722175 -655899 -483760 -263023 -35400 177512 368897 536144 673671 775977 848319
10370 848319 913257 1004354 1151917 1374676 1685159 2102203 2655715 3374071 4258577 5261087
10360 5261087 6280803 7184132 7837838 8141353 8049385 7581559 6816554 5868505 4850351
10351 4850351 3839537 2865219 1925284 1021743 189686 -500327 -967426 -1155436 -1055988
10342 -1055988 -709571 -190800 408060 986734 1442785 1682140 1637307 1287020 667964 -126450
10332 -126450 -959678 -1675515 -2128146 -2213608 -1895338 -1216553 -294762 702104 1593296 2227139
10322 2227139 2515824 2453761 2115055 1631592 1158578 837774 769008 997483 1517991 2289161
10312 2289161 3246626 4308605 5377862 6349077 7124925 7635257 7851800 7794255 7524592
10303 7524592 7125789 6667585 6174646 5617873 4937479 4084855 3057579 1908953 733509
10294 733509 -354588 -1235840 -1793769 -1928841 -1582157 -758976 461441 1934406 3473908
10285 3473908 4888153 6019683 6776340 7139067 7146116 6868443 6392500 5814342 5237290
10276 5237290 4763685 4477503 4423092 4590807 4919529 5318145 5698263 6004525 6229882 6410206
10266 6410206 6602836 6860809 7213187 7654595 8142656 8603134 8942837 9066408 8891072
10257 8891072 8357314 7436936 6136729 4493044 2558735 393422 -1933776 -4333991
10249 -4333991 -6696078 -8902039 -10856262 -12514338 -13896352 -15075498 -16143662 -17169082
10241 -17169082 -18169038 -19113269 -19953408 -20656398 -21221202 -21675173 -22060977 -22424367 -22803500
10232 -22803500 -23216797 -23651682 -24061638 -24376045 -24519895 -24435258 -24095693 -23508656 -22708748
10223 -22708748 -21751026 -20710136 -19679303 -18757126 -18020107 -17495429 -17153222 -16924828 -16736489
10214 -16736489 -16540288 -16328490 -16127024 -15973368 -15890662 -15871390 -15878956 -15865406 -15794056 -15653413
10204 -15653413 -15455765 -15224351 -14978556 -14724574 -14454218 -14151605 -13805450 -13421810 -13030637
10195 -13030637 -12681871 -12431931 -12326181 -12385260 -12601296 -12943817 -13369402 -13829940 -14279833
10186 -14279833 -14683355 -15018194 -15269966 -15420893 -15443063 -15301877 -14965485 -14415704 -13662334
10177 -13662334 -12760920 -11822341 -10999718 -10453506 -10313575 -10656749 -11502206 -12815531 -14514858
10168 -14514858 -16480032 -18566410 -20620804 -22496802 -24070937 -25261562 -26045828 -26464444
10160 -26464444 -26608054 -26589895 -26515719 -26459371 -26447924 -26459616 -26436382 -26305579 -25998434 -25455822
10150 -25455822 -24623285 -23445122 -21865881 -19841653 -17358257 -14448074 -11194289 -7717526
10142 -7717526 -4154527 -646676 2654474 5577772 7939746 9575175 10377235 10326530 9497327
10133 9497327 8041347 6154771 4035709 1843536 -324533 -2429428 -4463815 -6422085
10125 -6422085 -8285279 -10025188 -11616497 -13041740 -14283304 -15310578 -16077117 -16536537
10117 -16536537 -16671746 -16521327 -16186800 -15814014 -15554446 -15521748 -15761451 -16245263 -16888979
10108 -16888979 -17583376 -18226392 -18749084 -19130351 -19395518 -19597405 -19787106 -19988809 -20191592
10099 -20191592 -20361299 -20464079 -20487409 -20448000 -20385688 -20350087 -20386084 -20518669 -20735875 -20974359
10089 -20974359 -21118423 -21020974 -20543049 -19594944 -18157538 -16272391 -14008550 -11429483 -8582839
10080 -8582839 -5518600 -2320430 874546 3884186 6515711 8607603 10058544 10834999
10072 10834999 10963681 10520294 9620175 8408085 7042406 5673730 4423906 3372774
10064 3372774 2554768 1961767 1548676 1244049 970235 669875 324947 -45317 -407628
10055 -407628 -743665 -1066605 -1416954 -1843109 -2379609 -3034224 -3788074 -4606235 -5452543 -6300849
10045 -6300849 -7136138 -7944739 -8701220 -9362583 -9873479 -10177272 -10226739 -9993672 -9477969 -8712442
10035 -8712442 -7758614 -6695431 -5608305 -4582176 -3695355 -3010378 -2564156 -2363497 -2389136
10026 -2389136 -2605539 -2970467 -3439708 -3967432 -4506709 -5014191 -5458802 -5831075 -6149145
10017 -6149145 -6456975 -6811019 -7257667 -7813202 -8459567 -9157653 -9866394 -10554820 -11203912
10008 -11203912 -11802558 -12340814 -12801221 -13150695 -13338595 -13305449 -13001517 -12408610 -11555238
9999 -11555238 -10516160 -9393816 -8288101 -7267234 -6352487 -5523681 -4743019 -3985409 -3259900
9990 -3259900 -2612457 -2111187 -1823353 -1795218 -2043299 -2560851 -3336238 -4372139 -5692235
9981 -5692235 -7327846 -9287881 -11525349 -13918590 -16282048 -18408583 -20127478 -21351325
9973 -21351325 -22089964 -22428296 -22484141 -22369802 -22173450 -21961477 -21791464 -21723797 -21825677 -22167548
9963 -22167548 -22814326 -23813292 -25180525 -26889332 -28865633 -30994305 -33136614 -35154639
9955 -35154639 -36936036 -38411844 -39560683 -40397208 -40952057 -41257858 -41350929 -41281788 -41116610
9946 -41116610 -40919635 -40726360 -40528286 -40282320 -39940706 -39485093 -38947498 -38409060 -37979213
9937 -37979213 -37766286 -37850770 -38267192 -38996708 -39972717 -41101222 -42292321 -43491435 -44695096
9928 -44695096 -45941290 -47278526 -48732989 -50295997 -51938993 -53642682 -55419136 -57314715
9920 -57314715 -59395107 -61721568 -64329767 -67221113 -70368856 -73731248 -77262022 -80916283
9912 -80916283 -84655456 -88450999 -92281576 -96122274 -99932600 -103650964 -107196605 -110471901
9904 -110471901 -113353683 -115664701 -117128745 -117328403 -115691345 -111529697 -104157573 -93100221
9896 -93100221 -78352960 -60564720 -41000205 -21245039 -2790863 13287241 26439428
9889 26439428 36569239 43889250 48780891 51680060 52992228 53044381 52075306 50254475
9881 50254475 47716817 44600762 41073663 37332386 33582391 30009958 26756980 23898922
9873 23898922 21430742 19274287 17314086 15448177 13628056 11869533 10234599 8798095
9865 8798095 7615715 6704207 6036650 5550880 5168017 4816206 4450475 4058827 3651753
9856 3651753 3242421 2829336 2390864 1894876 1319163 671106 -5402 -639195 -1150316 -1468895
9846 -1468895 -1550553 -1387537 -1012379 -489859 102211 695887 1249285 1748943 2198740 2603057
9836 2603057 2954344 3231103 3405483 3455293 3373898 3172451 2874059 2507339 2109180 1736849
9826 1736849 1476658 1435766 1717107 2390395 3472960 4926841 6672184 8612510 10662119
9817 10662119 12763417 14886866 17016133 19127111 21169441 23056866 24671232 25882156
9809 25882156 26577566 26692758 26223802 25219440 23759648 21937499 19855080 17628400 15385832
9800 15385832 13249831 11307916 9591325 8077739 6719486 5481043 4362702 3397043
9792 3397043 2624302 2066628 1718896 1558688 1562803 1712955 1983013 2318417 2630296 2818945
9782 2818945 2817332 2627357 2327162 2048768 1940083 2124908 2669335 3562563 4720188 6010106
9772 6010106 7289127 8433186 9350751 9981426 10290047 10265526 9926121 9325876 8555858
9763 8555858 7736287 6997469 6450257 6154898 6105277 6240671 6477155 6734260 6938839 7011753
9753 7011753 6859322 6385215 5518844 4242812 2603147 697707 -1349203 -3412347 -5381902
9744 -5381902 -7170299 -8713894 -9971807 -10922603 -11561879 -11904405 -11987915 -11868740 -11603636
9735 -11603636 -11225346 -10727764 -10070920 -9203169 -8089043 -6730322 -5172467 -3495683 -1796833
9726 -1796833 -170894 1302237 2564328 3579842 4333009 4823284 5061155 5064664 4856587
9717 4856587 4464509 3925950 3294616 2638064 2021224 1482918 1021250 599955 175061 -271265
9707 -271265 -708638 -1062464 -1242962 -1181010 -849098 -260383 543057 1498789 2527492 3540036
9697 3540036 4453962 5214124 5805401 6248213 6577544 6817087 6965031 7001511 6912737 6714753
9687 6714753 6460709 6228188 6096050 6123814 6340400 6740372 7282757 7892515 8470874 8918782
9677 8918782 9165975 9188133 8999376 8625705 8080881 7364099 6480366 5465877 4397194
9668 4397194 3375858 2497799 1826291 1383294 1160469 1137634 1292201 1592537 1985021 2393705
9658 2393705 2741717 2981590 3109716 3152031 3132521 3048729 2869106 2549448 2056912 1391481
9648 1391481 597462 -241220 -1022364 -1653827 -2074150 -2257918 -2210867 -1964716 -1575488 -1120601
9638 -1120601 -689457 -368879 -230307 -324105 -680482 -1312939 -2220850 -3389983 -4790765
9629 -4790765 -6375135 -8074807 -9804866 -11474066 -12998878 -14316066 -15390047 -16214192
9621 -16214192 -16807591 -17209071 -17468578 -17633955 -17732860 -17756002 -17653111 -17349289 -16777320 -15911057
9611 -15911057 -14783690 -13482281 -12120509 -10801029 -9583045 -8467101 -7399645 -6292435
9603 -6292435 -5050357 -3602493 -1929834 -80936 1831062 3650445 5214581 6394314
9595 6394314 7127185 7430488 7387202 7111085 6709027 6258633 5806556 5378579 4987926 4635974
9585 4635974 4309914 3984255 3627069 3207121 2699852 2093461 1394811 630982 -156359 -920834
9575 -920834 -1619985 -2221030 -2705982 -3076504 -3352958 -3560175 -3699522 -3720415 -3513427 -2939052
9565 -2939052 -1881821 -298667 1765425 4194975 6832612 9498840 12002791 14158000
9557 14158000 15812195 16883671 17385089 17418322 17138531 16700796 16208609 15680524 15045922
9548 15045922 14174511 12932271 11240418 9108152 6624857 3923788 1144597 -1584949
9540 -1584949 -4147718 -6431518 -8334622 -9786003 -10768869 -11330838 -11572553 -11620796 -11599332
9531 -11599332 -11606922 -11703501 -11900690 -12154498 -12364328 -12387563 -12074956 -11317796 -10085382 -8434379
9521 -8434379 -6487900 -4395676 -2289611 -249138 1707788 3599568 5434639 7175062
9513 7175062 8733451 9998494 10865602 11256596 11129730 10486396 9373162 7873941 6092741
9504 6092741 4133880 2086361 16087 -2032365 -4025804 -5931283 -7712677 -9337092
9496 -9337092 -10783094 -12040111 -13096832 -13927941 -14491855 -14743271 -14650498 -14202383 -13400406
9487 -13400406 -12248799 -10759940 -8976566 -6992192 -4948423 -3004985 -1297396 97842
9479 97842 1178244 2008123 2693723 3349325 4064291 4879446 5778333 6695833 7541651 8229430
9469 8229430 8699254 8925454 8909511 8664063 8197490 7509402 6601976 5500403 4267601
9460 4267601 3003413 1830874 877656 256184 42864 261229 877127 1807889 2938027
9451 2938027 4132256 5242211 6109344 6569581 6467040 5680507 4155340 1923510 -901690
9442 -901690 -4153228 -7644412 -11195630 -14650885 -17888640 -20831760 -23457155 -25799971
9434 -25799971 -27942881 -29984824 -31997020 -33987143 -35891092 -37595211 -38974466 -39927565
9426 -39927565 -40397543 -40376048 -39894805 -39009212 -37779793 -36257500 -34477438 -32461522 -30225836
9417 -30225836 -27786520 -25161458 -22371313 -19445962 -16436528 -13423715 -10510903 -7800572
9409 -7800572 -5366571 -3238510 -1404159 177613 1564224 2821239 4016152 5211404
9401 5211404 6457066 7784794 9203850 10699401 12232615 13741247 15141176 16333807
9393 16333807 17224816 17750790 17898714 17703034 17220034 16496269 15550947 14380205 12975848
9384 12975848 11344557 9517341 7547606 5502016 3448628 1444726 -473301 -2293656
9376 -2293656 -4022918 -5671704 -7238984 -8701851 -10014344 -11116574 -11952662 -12490673 -12733442
9367 -12733442 -12713429 -12476087 -12063864 -11509189 -10835625 -10062654 -9212792 -8321762 -7447766 -6670214
9357 -6670214 -6071078 -5704447 -5571122 -5613684 -5733503 -5817876 -5764447 -5499195 -4990626 -4259598
9347 -4259598 -3378201 -2452959 -1596774 -900530 -412698 -129087 6922 91476 234298 527505
9337 527505 1023334 1730551 2626139 3669115 4805709 5966377 7063769 7999947 8682599
9328 8682599 9041761 9037664 8657238 7905515 6800107 5371159 3663047 1734531 -341690
9319 -341690 -2479153 -4581755 -6556760 -8332976 -9870843 -11154007 -12167948 -12884503 -13266865
9310 -13266865 -13290924 -12964375 -12328794 -11446556 -10386138 -9216060 -8006368 -6830027 -5758957
9301 -5758957 -4854983 -4158934 -3681293 -3397106 -3246958 -3145115 -2995009 -2709940 -2232706 -1545847
9291 -1545847 -668109 359587 1491003 2688130 3928339 5203393 6510533 7840137
9283 7840137 9167775 10456215 11666764 12773934 13775191 14688716 15537953 16330611 17045058
9274 17045058 17632708 18034765 18204892 18129855 17842510 17421483 16973031 16598547 16362452 16278865
9264 16278865 16324238 16464755 16677258 16950107 17268236 17598047 17884165 18057590 18047028 17788098
9254 17788098 17232685 16362813 15206578 13845074 12399655 11000447 9749925 8697876
9246 8697876 7836006 7111155 6451163 5793961 5106825 4385005 3631668 2835484 1964223 979028
9236 979028 -142386 -1390029 -2720623 -4066380 -5345468 -6472325 -7371115 -7991211 -8315360
9227 -8315360 -8352379 -8118962 -7625059 -6872646 -5864935 -4616967 -3162373 -1555671 130190
9218 130190 1811204 3401731 4821656 5999947 6877409 7411403 7582290 7398619 6897145
9209 6897145 6135459 5178968 4087571 2906389 1660773 354037 -1031334 -2527392 -4170746
9200 -4170746 -5992556 -8009038 -10209686 -12543630 -14912024 -17176310 -19184245 -20804636
9192 -20804636 -21956824 -22624765 -22853390 -22730692 -22361300 -21838257 -21221944 -20535659 -19781109
9183 -19781109 -18964264 -18113239 -17274986 -16494622 -15795094 -15172881 -14609817 -14087031 -13587647
9174 -13587647 -13088522 -12553919 -11943292 -11232597 -10436175 -9614205 -8859087 -8265158 -7893796
9165 -7893796 -7747524 -7763030 -7825904 -7802032 -7574690 -7074410 -6292259 -5275210 -4110587 -2909083
9155 -2909083 -1791241 -875572 -264398 -26732 -181937 -689554 -1449980 -2319570 -3140983
9146 -3140983 -3783091 -4176245 -4326624 -4303457 -4209061 -4149685 -4218522 -4489202 -5011976 -5808247
9136 -5808247 -6865079 -8133774 -9535703 -10975535 -12357563 -13597775 -14626794 -15385120
9128 -15385120 -15816354 -15863485 -15471739 -14599999 -13238473 -11423327 -9238175 -6801793 -4252258
9119 -4252258 -1736437 598108 2619241 4237073 5429156 6245760 6787475 7165647 7466545
9110 7466545 7735075 7979233 8185525 8335353 8418329 8441824 8434058 8436747 8488412 8607962 8791255
9099 8791255 9025029 9308786 9667831 10147017 10789120 11612224 12599601 13706065 14874013
9090 14874013 16047222 17173866 18200429 19066752 19711079 20083555 20157395 19927983 19399794
9081 19399794 18571143 17429785 15965653 14193289 12166749 9975398 7728057 5544996
9073 5544996 3565110 1949968 858288 389228 528416 1139758 2015851 2956310 3824268
9064 3824268 4551417 5102439 5436631 5498769 5241602 4657004 3791889 2743516 1644061
9055 1644061 642657 -116720 -524246 -532810 -171989 461152 1230893 2000422 2666433 3180819
9045 3180819 3553046 3833753 4087154 4361764 4667514 4967239 5189437 5260352 5139630 4839097
9035 4839097 4416013 3949711 3517758 3180940 2975998 2911003 2961848 3074057 3175583 3200352
9025 3200352 3113443 2925128 2686924 2473577 2361447 2412056 2662877 3122107 3764823 4532727
9015 4532727 5341903 6097763 6708830 7091251 7165500 6855194 6095925 4852790 3138619
9006 3138619 1024837 -1359902 -3845173 -6246999 -8402750 -10201268 -11594410 -12582235
8998 -12582235 -13179258 -13383908 -13172642 -12521315 -11435325 -9965826 -8203525 -6258510 -4240572
8989 -4240572 -2249131 -372935 1306707 2717158 3804966 4553264 4995831 5215309 5320762
8980 5320762 5413659 5560236 5783649 6075961 6419894 6808891 7256836 7793082 8445710 9224124
8970 9224124 10111844 11070151 12044657 12969655 13773159 14387118 14761773 14878363 14753866 14433413
8960 14433413 13971642 13412675 12781612 12091353 11355542 10596145 9842826 9127775 8478472
8951 8478472 7909293 7416259 6980603 6580924 6205985 5859061 5550623 5284266 5046306 4808519
8941 4808519 4544150 4246067 3933431 3641903 3403211 3225016 3081931 2924872 2707011 2413262
8931 2413262 2076547 1772952 1600676 1652377 1987687 2610088 3453624 4385652 5228794 5799137
8921 5799137 5951017 5613628 4805087 3618428 2187454 649422 -880826 -2322200 -3630292
8912 -3630292 -4796450 -5839375 -6784582 -7637874 -8368284 -8910337 -9181354 -9104300 -8632584
8903 -8632584 -7775237 -6612797 -5289686 -3979961 -2840864 -1975186 -1415750 -1132874 -1056037
8894 -1056037 -1096918 -1165048 -1177759 -1071889 -818271 -429625 47146 551994 1034849 1470181
8884 1470181 1857875 2211184 2539380 2837826 3094113 3305901 3496876 3720696 4052616 4573074
8874 4573074 5345951 6394803 7685878 9128888 10598114 11963071 13112082 13959745 14442240
8865 14442240 14510758 14129667 13279463 11961967 10205860 8070995 5649172 3058910 432839
8856 432839 -2101717 -4444932 -6541678 -8385610 -10007600 -11454496 -12769122 -13980233
8848 -13980233 -15102936 -16142111 -17090608 -17922255 -18588574 -19027059 -19178524 -19003710 -18492636
8839 -18492636 -17667509 -16581421 -15311589 -13944982 -12558191 -11198520 -9875627 -8570314
8831 -8570314 -7258003 -5933463 -4621550 -3369504 -2228776 -1235687 -394892 330822 1016712
8822 1016712 1753608 2614541 3627022 4764165 5957459 7124534 8198930 9146977 9964481
8813 9964481 10659829 11237224 11687863 11988586 12108027 12023609 11746317 11337851 10903270 10557804
8803 10557804 10385108 10409404 10594756 10870935 11173718 11480398 11821958 12265703 12880555 13706939
8793 13706939 14744334 15951361 17246036 18504937 19574095 20301520 20582060 20390630 19785436
8784 19785436 18882443 17818148 16719136 15686934 14794731 14086473 13572314 13223648 12977294
8775 12977294 12754868 12492317 12165013 11793643 11426623 11109482 10859888 10662356 10483121
8766 10483121 10295045 10101082 9948081 9924608 10138565 10678498 11573976 12775044 14162053
8757 14162053 15580967 16886829 17976324 18798556 19345140 19629187 19663441 19443275 18937006
8748 18937006 18087756 16831975 15132996 13015754 10582839 8000592 5461042 3137706
8740 3137706 1153680 -427133 -1585575 -2321473 -2636816 -2542582 -2083477 -1356468 -502778
8731 -502778 324159 994897 1428990 1608837 1587294 1485418 1470869 1714892 2339477 3373292
8721 3373292 4732136 6231954 7632556 8698474 9254525 9215627 8584279 7425004 5832386
8712 5832386 3906825 1745434 -552883 -2878652 -5114658 -7157650 -8948242 -10488124
8704 -10488124 -11832712 -13065416 -14267471 -15491715 -16744017 -17979732 -19123903 -20111629
8696 -20111629 -20927270 -21617065 -22265721 -22950610 -23700095 -24477971 -25199307 -25765042 -26094974
8687 -26094974 -26144623 -25904290 -25387200 -24613628 -23595360 -22325923 -20784362 -18956555 -16866496
8678 -16866496 -14599627 -12302031 -10153341 -8326413 -6951451 -6095913 -5762630 -5902790 -6437151
8669 -6437151 -7275940 -8328463 -9499913 -10682528 -11753287 -12586717 -13080811 -13183945 -12907789
8660 -12907789 -12318902 -11514583 -10596652 -9653833 -8753702 -7939095 -7225760 -6603400 -6043198
8651 -6043198 -5510315 -4975267 -4419143 -3833069 -3216251 -2575866 -1928612 -1301697 -731256 -257169
8641 -257169 84784 269616 284845 128437 -191554 -653150 -1217018 -1829059 -2427551 -2949154
8631 -2949154 -3332669 -3525154 -3492418 -3229417 -2765506 -2164477 -1520942 -951733 -579989 -513078
8621 -513078 -818097 -1499144 -2483279 -3625883 -4741850 -5654148 -6238173 -6442931 -6284883
8612 -6284883 -5823437 -5130527 -4265060 -3260724 -2131136 -887515 443485 1813160 3157239
8603 3157239 4408157 5504584 6395010 7036446 7389900 7415145 7070491 6323297 5168802
8594 5168802 3645207 1833378 -159190 -2220722 -4254806 -6193826 -8004217 -9680946
8586 -9680946 -11231821 -12658790 -13945469 -15055182 -15937545 -16539069 -16814232 -16735337 -16300775
8577 -16300775 -15540914 -14518852 -13323177 -12054862 -10815788 -9703949 -8810891 -8212341 -7950537
8568 -7950537 -8018599 -8359667 -8884239 -9497851 -10126200 -10726406 -11279113 -11766297 -12149988 -12369374
8558 -12369374 -12361920 -12095829 -11591470 -10918125 -10172490 -9458545 -8882305 -8556010 -8593882 -9088667
8548 -9088667 -10077640 -11519548 -13298932 -15256950 -17232590 -19095054 -20757029 -22171840
8540 -22171840 -23325517 -24232560 -24935986 -25506102 -26032033 -26603263 -27283383 -28085416 -28963334
8531 -28963334 -29829401 -30590675 -31183650 -31588607 -31822186 -31920555 -31924503 -31868312 -31770342 -31627768
8521 -31627768 -31421062 -31127830 -30735859 -30244331 -29653426 -28954606 -28132996 -27180356 -26106554
8512 -26106554 -24939556 -23713893 -22454231 -21161150 -19804868 -18330929 -16677602 -14799116
8504 -14799116 -12687043 -10385338 -7997224 -5680976 -3630065 -2036714 -1046122 -715222
8496 -715222 -990453 -1712607 -2647886 -3536985 -4150286 -4335367 -4043819 -3330694 -2331309 -1227618
8486 -1227618 -213499 539060 911552 860815 422455 -304487 -1182637 -2061068 -2795111 -3261176
8476 -3261176 -3368687 -3070988 -2373942 -1336569 -59352 1336335 2728606 4009820 5097024
8467 5097024 5939742 6522616 6860671 6989599 6954646 6798113 6544891 6190348 5698383 5013751
8457 5013751 4085221 2890921 1455825 -146647 -1810941 -3427117 -4907624 -6201683
8449 -6201683 -7292427 -8180168 -8861800 -9318707 -9520958 -9445078 -9092952 -8497672 -7711202 -6783059
8439 -6783059 -5747814 -4633098 -3482174 -2371543 -1407304 -699891 -330795 -327563 -657603
8430 -657603 -1242586 -1986262 -2802280 -3628981 -4425039 -5149122 -5735441 -6083068 -6073614 -5614862
8420 -5614862 -4686934 -3363040 -1794544 -172908 1311874 2505015 3310113 3700189 3714533
8411 3714533 3442573 3000650 2508320 2067943 1748497 1574863 1526545 1550005 1582046 1571770
8401 1571770 1487503 1307596 1008534 564143 -43641 -812804 -1716099 -2702350 -3701308 -4632193
8391 -4632193 -5416453 -5990949 -6315490 -6372940 -6166411 -5718821 -5074874 -4300663 -3476888 -2686917
8381 -2686917 -2005351 -1492560 -1196117 -1153969 -1390712 -1901801 -2631208 -3458957 -4215456 -4725848
8371 -4725848 -4868005 -4616387 -4049025 -3312721 -2562051 -1900111 -1347922 -856258 -354278 188411
8361 188411 717316 1088970 1107941 583404 -622284 -2568191 -5230334 -8508601 -12238812
8352 -12238812 -16208882 -20179252 -23907217 -27174019 -29812010 -31725999 -32902103 -33400315
8344 -33400315 -33332819 -32835154 -32039287 -31055010 -29960628 -28800670 -27590197 -26327445 -25012655
8335 -25012655 -23663660 -22318511 -21025572 -19831553 -18776204 -17891377 -17195691 -16682031 -16306087
8326 -16306087 -15987459 -15626866 -15132582 -14446048 -13560967 -12533902 -11482625 -10566062 -9944902
8317 -9944902 -9734714 -9972519 -10613138 -11554745 -12677197 -13873633 -15065630 -16204328 -17264536
8308 -17264536 -18235931 -19112056 -19878623 -20504888 -20941517 -21125978 -20994079 -20494200 -19598540
8299 -19598540 -18306952 -16645865 -14670783 -12476351 -10204669 -8036131 -6158705 -4730881
8291 -4730881 -3859010 -3594662 -3939164 -4841370 -6190852 -7821130 -9531538 -11119591 -12408504
8282 -12408504 -13262346 -13591620 -13352820 -12542007 -11185094 -9333848 -7073770 -4536502 -1900089
8273 -1900089 632639 2870546 4668591 5946813 6691261 6942638 6780480 6307435 5633582
8264 5633582 4859763 4062359 3284779 2538062 1808005 1065251 277534 -577128 -1502003 -2483762
8254 -2483762 -3502337 -4537204 -5562503 -6536674 -7399571 -8082850 -8527174 -8696486 -8585951
8245 -8585951 -8224761 -7672632 -7006402 -6298077 -5593726 -4904195 -4211651 -3487434 -2712037 -1888039
8235 -1888039 -1040843 -209192 566713 1252893 1824416 2265264 2563962 2702489 2641533 2310810
8225 2310810 1611640 432916 -1321681 -3699567 -6668461 -10104651 -13810509 -17555456
8217 -17555456 -21122035 -24339838 -27100117 -29353460 -31097938 -32365900 -33213289 -33709191
8209 -33709191 -33922199 -33906041 -33691208 -33285427 -32679628 -31856827 -30805750 -29539388 -28110658
8200 -28110658 -26613850 -25166543 -23876230 -22802654 -21931320 -21174013 -20401682 -19494828 -18382688
8191 -18382688 -17050942 -15521538 -13825020 -11982118 -9997283 -7859792 -5551842 -3066749
8183 -3066749 -434567 2258546 4873312 7246527 9232410 10734437 11714972 12185647 12189704
8174 12189704 11785364 11034324 9997639 8739902 7337913 5885303 4487202 3248316
8166 3248316 2263948 1618672 1387271 1629306 2376078 3617591 5297784 7320372 9562371
8157 9562371 11890373 14173620 16289563 18124753 19580849 20591654 21143371 21282997 21108730
8148 21108730 20750006 20346797 20029978 19902079 20022916 20405612 21020431 21799331 22641184
8139 22641184 23424547 24028906 24353634 24324935 23894636 23042244 21782442 20167557 18275848
8130 18275848 16190509 13984103 11718719 9459675 7290605 5316018 3643709 2351895
8122 2351895 1458647 913859 621778 482642 431006 452548 574594 838421 1268777 1856473
8112 1856473 2561160 3327236 4098826 4827312 5476790 6032008 6501469 6905035 7249647 7511680
8102 7511680 7640538 7579861 7291443 6770558 6049363 5188464 4259124 3323531 2422211 1571135
8092 1571135 762813 -34233 -876154 -1837776 -2995639 -4402832 -6064612 -7925480 -9874579
8083 -9874579 -11768049 -13458988 -14823379 -15774918 -16268712 -16297552 -15883670 -15067005 -13892232
8074 -13892232 -12400272 -10630214 -8631727 -6480076 -4282672 -2170569 -276569 1290882
8066 1290882 2466172 3229824 3597967 3606255 3295816 2704267 1862828 801072 -442000
8057 -442000 -1807490 -3214493 -4567507 -5768602 -6730663 -7391222 -7724520 -7745425 -7500462
8048 -7500462 -7048957 -6443471 -5718630 -4892782 -3980459 -3007799 -2021947 -1090851 -296706 273569
8038 273569 542832 466183 56275 -603159 -1368842 -2074334 -2576294 -2791577 -2714035 -2410627
8028 -2410627 -2000849 -1623063 -1393947 -1374882 -1561362 -1900471 -2323772 -2775169 -3221940 -3651828
8018 -3651828 -4065742 -4471157 -4874360 -5268888 -5623066 -5874150 -5933919 -5703264 -5089713 -4024879
8008 -4024879 -2481465 -485846 1881684 4501984 7239158 9957263 12527433 14831720
8000 14831720 16770482 18272664 19302950 19861681 19978417 19702048 19088707 18187759 17029242
7991 17029242 15620875 13961401 12066301 9991156 7838729 5747916 3872024 2352732
7983 2352732 1291995 727139 620523 873128 1359069 1966190 2626001 3323636 4088185
7974 4088185 4969765 6011531 7224125 8569250 9957800 11264267 12353668 13113669 13484626
7965 13484626 13480485 13192396 12769028 12376997 12156512 12191054 12502074 13066406 13843413 14795359
7955 14795359 15889548 17083035 18303376 19443163 20378130 21003701 21272429 21212739 20919514
7946 20919514 20522780 20150841 19901892 19828209 19930215 20158578 20426601 20635398 20708427 20623099
7936 20623099 20422983 20200646 20056970 20055548 20190733 20378020 20467140 20275215 19634240 18440583
7926 18440583 16689774 14482946 12001685 9461238 7062812 4965841 3285870 2103377
7918 2103377 1463126 1359974 1727360 2447033 3381887 4415287 5475163 6530185 7562443
7909 7562443 8537111 9393100 10063286 10509037 10742463 10821239 10822670 10816096 10848546 10945978 11122839
7898 11122839 11390647 11760132 12236893 12814534 13470729 14170272 14874379 15549580 16168059
7889 16168059 16698323 17095621 17304528 17277119 16997015 16494105 15840387 15128309 14441365 13828880
7879 13828880 13293637 12795222 12266900 11640368 10870504 9951715 8921118 7850554 6834343
7870 6834343 5978214 5389677 5167209 5387152 6089537 7265338 8849609 10727387 12756615
7861 12756615 14801912 16762415 18578633 20218288 21655732 22859659 23792165 24413080
7853 24413080 24685414 24583500 24104871 23280501 22175631 20879041 19486174 18083129 16734980
7844 16734980 15479155 14325053 13261147 12267630 11328937 10440626 9608939 8845357 8160102
7835 8160102 7558650 7043989 6623172 6310981 6122385 6053636 6063926 6073752 5986112 5720235
7825 5720235 5238563 4553615 3716904 2804305 1910724 1152368 661588 562368 932950 1777871
7815 1777871 3027433 4562987 6251159 7971229 9630271 11167799 12552304 13771689
7807 13771689 14821220 15693167 16370306 16823440 17013816 16902477 16466473 15716641 14707895
7798 14707895 13535065 12314194 11156618 10146564 9330970 8722657 8308818 8053406 7890001
7789 7890001 7715501 7399902 6816239 5878006 4565654 2932515 1092057 -806422 -2606007
7780 -2606007 -4166718 -5381020 -6180498 -6537991 -6467927 -6023777 -5291017 -4375200 -3384606
7771 -3384606 -2407739 -1491469 -630487 225329 1150010 2216927 3476284 4935646 6547021
7762 6547021 8207849 9778838 11112072 12079052 12593324 12627531 12222914 11484810 10558820
7753 10558820 9590649 8682714 7864907 7092394 6270828 5296076 4090098 2620789 904796
7744 904796 -1001279 -3016635 -5055410 -7042465 -8917482 -10626393 -12111071 -13310911
7736 -13310911 -14177982 -14693360 -14871839 -14754872 -14401481 -13883244 -13279727 -12668456 -12112012
7727 -12112012 -11652123 -11316239 -11129140 -11115374 -11286668 -11624957 -12079177 -12584098 -13091450 -13594359
7717 -13594359 -14131968 -14773598 -15589848 -16619492 -17840840 -19157047 -20403564 -21379222 -21892269
7708 -21892269 -21805675 -21067127 -19716715 -17873472 -15706872 -13402292 -11131237 -9034879 -7221120
7699 -7221120 -5766851 -4717006 -4080262 -3827694 -3898558 -4211316 -4675720 -5203516 -5716667
7690 -5716667 -6151969 -6462322 -6617050 -6602819 -6423326 -6095170 -5641705 -5091551 -4486949 -3897497
7680 -3897497 -3424500 -3181257 -3250314 -3639753 -4266959 -4981698 -5615296 -6031292 -6160507 -6015465
7670 -6015465 -5683883 -5301622 -5010079 -4910792 -5034409 -5338067 -5734315 -6137995 -6504244 -6834469
7660 -6834469 -7149566 -7453037 -7710174 -7853420 -7806317 -7511936 -6954139 -6165146 -5219615 -4222148
7650 -4222148 -3295605 -2570250 -2167466 -2175734 -2627340 -3489897 -4680285 -6094963 -7640154
7641 -7640154 -9246198 -10862023 -12439225 -13919353 -15230638 -16291353 -17015958 -17324907 -17159772
7632 -17159772 -16499722 -15371081 -13845087 -12026537 -10039334 -8011676 -6059697 -4270129
7624 -4270129 -2688200 -1318624 -140023 877178 1760771 2535831 3223183 3828539 4325864
7615 4325864 4649150 4706148 4415618 3754529 2792196 1691755 675609 -29167 -241083
7606 -241083 146496 1157802 2738637 4761912 7033547 9306381 11310087 12794999 13575810
7597 13575810 13559081 12748988 11237651 9188895 6818248 4366482 2064815 95268 -1444435
7588 -1444435 -2558779 -3345010 -3955181 -4540697 -5199258 -5945185 -6715881 -7411909 -7951469
7579 -7951469 -8311919 -8537967 -8714337 -8918701 -9179026 -9455925 -9657318 -9675681 -9427208 -8875231
7569 -8875231 -8033882 -6958957 -5732624 -4443111 -3161178 -1922307 -725724 448924
7561 448924 1620236 2794396 3968408 5137007 6293022 7421970 8499633 9497151 10388434
7552 10388434 11151345 11760432 12177813 12352828 12237228 11812655 11116231 10247110 9347048
7543 9347048 8564016 8016155 7768551 7826102 8141576 8636865 9230814 9860714 10486285 11077841
7533 11077841 11603068 12026382 12321213 12483205 12532447 12503187 12427864 12323405 12185190 11992032
7523 11992032 11721063 11363852 10932058 10449092 9936069 9401975 8839270 8221880 7509065
7514 7509065 6662863 5676691 4597966 3528416 2602856 1960835 1722122 1966176 2714082
7505 2714082 3918915 5473550 7236082 9061508 10826599 12443543 13866227 15092142
7497 15092142 16156531 17113629 18006329 18834782 19538288 20001369 20085212 19672608 18705586
7488 18705586 17198929 15229827 12918971 10416525 7891938 5517521 3441601 1759056
7480 1759056 492740 -403828 -1020248 -1448348 -1745433 -1920648 -1949432 -1802497 -1468913 -961504
7470 -961504 -306899 469705 1355531 2351812 3465545 4694588 6011771 7354443 8625272
7461 8625272 9707542 10493460 10917922 10985152 10774922 10421553 10072185 9843375 9796214 9937002
7451 9937002 10234217 10637260 11090048 11541413 11954511 12311857 12610521 12848171 13009651 13066655
7441 13066655 12994830 12798056 12521174 12238955 12026680 11930839 11956550 12075285 12244898 12431395
7431 12431395 12625375 12849500 13154677 13604478 14251632 15115491 16170669 17351740 18570218
7422 18570218 19734265 20762620 21590026 22166848 22458018 22445188 22131660 21544552 20728115
7413 20728115 19729235 18585704 17328760 16000033 14669137 13435650 12410132 11682405
7405 11682405 11291110 11206600 11334797 11543376 11701865 11718156 11554672 11220136 10748107 10178547
7395 10178547 9551663 8911902 8312639 7812991 7465753 7303807 7333600 7537219 7877979 8306580
7385 8306580 8771266 9233786 9682982 10133434 10607321 11112629 11632354 12126821 12540822 12810126
7375 12810126 12870431 12672319 12197075 11462070 10509984 9389018 8138035 6784125 5347495
7366 5347495 3844275 2285739 681052 -952787 -2581578 -4156569 -5630281 -6974652
7358 -6974652 -8190360 -9304719 -10360948 -11400811 -12442941 -13463634 -14389171 -15103728 -15469947
7349 -15469947 -15357008 -14671777 -13386494 -11552624 -9292940 -6774847 -4178854 -1676327
7341 -1676327 579761 2458321 3856797 4713112 5017748 4818958 4216863 3346177 2351209
7332 2351209 1361291 476503 -231139 -705813 -897506 -764166 -288711 497649 1501351
7323 1501351 2575450 3552965 4289819 4697028 4752250 4495909 4019711 3446449 2896828 2451387
7313 2451387 2129378 1900721 1722344 1570012 1441424 1331613 1204847 989868 607382 15094
7303 15094 -756623 -1599109 -2352500 -2852457 -2978573 -2689694 -2035783 -1141520 -167421 733435
7293 733435 1442824 1882209 2005897 1797771 1276088 499115 -436233 -1404199 -2265643 -2886520
7283 -2886520 -3156732 -3005971 -2414375 -1417695 -106242 1384956 2895586 4265549 5360900
7274 5360900 6095245 6440300 6418047 6074006 5446114 4551095 3397589 2012910 461005
7265 461005 -1158866 -2725476 -4108604 -5178217 -5815582 -5930892 -5482791 -4489399 -3024715
7256 -3024715 -1204315 830639 2925753 4923219 6671866 8038437 8920377 9260151 9057163
7247 9057163 8368620 7293645 5946778 4436163 2857712 1303555 -126352 -1319489
7239 -1319489 -2156635 -2527171 -2350719 -1599769 -315154 1393735 3366311 5419055 7372598
7230 7372598 9068875 10378566 11205993 11497491 11251898 10525264 9422641 8077965 6631740
7221 6631740 5216775 3953152 2943832 2262774 1938457 1946069 2220098 2685157 3287842
7212 3287842 4008993 4848778 5797790 6818164 7849034 8829350 9718624 10502960 11189222
7203 11189222 11797472 12356665 12900857 13461992 14059811 14693138 15336343 15941783 16446959
7194 16446959 16784915 16896255 16740048 16300744 15591295 14655390 13568744 12432102 11347624
7185 11347624 10382185 9536905 8745030 7903517 6919708 5743703 4368902 2808049 1068595
7176 1068595 -854062 -2966649 -5265679 -7732272 -10331229 -13008144 -15686416 -18271909
7168 -18271909 -20667570 -22790611 -24582848 -26011911 -27067960 -27759886 -28109477 -28139845 -27859259
7159 -27859259 -27248691 -26263084 -24849309 -22972635 -20636882 -17887547 -14800013 -11466246
7151 -11466246 -7992024 -4502925 -1145977 1922608 4560243 6661577 8177488 9126298
7143 9126298 9589472 9685450 9531032 9213230 8785305 8277485 7704547 7066737 6354105 5558885
7133 5558885 4687823 3766132 2834038 1940124 1131426 440706 -121590 -562101 -887712 -1089094
7123 -1089094 -1134906 -977241 -562955 153298 1195739 2555877 4186348 6002984 7894951
7114 7894951 9740157 11422026 12843013 13930953 14638740 14944002 14855510 14423260 13739245
7105 13739245 12919460 12073581 11279737 10576667 9972190 9459281 9030944 8687070 8430835
7096 8430835 8260915 8170932 8158870 8233423 8402342 8646261 8901007 9069349 9060652 8835603
7086 8835603 8430172 7947358 7523399 7285171 7313964 7623825 8158032 8805656 9435678 9936854
7076 9936854 10245380 10348015 10263682 10019520 9637717 9138011 8547480 7904899 7253972 6630190
7066 6630190 6050191 5508431 4980399 4428904 3809081 3068865 2147234 979422 -483139
7057 -483139 -2243305 -4236674 -6333076 -8361610 -10147914 -11550985 -12490540 -12958568 -13012129
7048 -13012129 -12750520 -12285135 -11711112 -11088198 -10435920 -9743539 -8988299 -8152057 -7230776
7039 -7230776 -6238251 -5207046 -4185632 -3228724 -2381186 -1660635 -1045712 -475989 133454
7030 133454 865560 1773679 2867091 4116911 5475507 6893452 8323073 9711833 10998108
7021 10998108 12117591 13016906 13664765 14054324 14197083 14111543 13810791 13295082 12556309
7012 12556309 11596154 10450100 9203083 7984634 6940834 6192297 5795691 5725488 5882377
7003 5882377 6123021 6300929 6308838 6111777 5757442 5355862 5036179 4901637 5002322 5332239
6993 5332239 5845802 6483629 7195549 7949767 8725320 9496641 10224066 10858233 11356407 11702049
6983 11702049 11915859 12048300 12153219 12256486 12339451 12346625 12208997 11865732 11273183 10403665
6973 10403665 9245002 7809177 6146358 4350403 2545578 859768 -600193 -1761322
6965 -1761322 -2588354 -3084292 -3286548 -3255237 -3056197 -2745437 -2358130 -1901716 -1355136 -678181
6955 -678181 169992 1211024 2434362 3794364 5216272 6607659 7870088 8907284 9631892
6946 9631892 9976362 9907607 9436094 8610187 7497880 6168008 4681382 3092358 1453660
6937 1453660 -182092 -1764590 -3247165 -4583595 -5722786 -6608688 -7190903 -7443774 -7384211
6928 -7384211 -7075654 -6610173 -6072733 -5505575 -4894749 -4188256 -3334718 -2319781 -1182016
6919 -1182016 -3732 1115448 2087641 2854514 3389282 3690276 3777163 3692551 3502171 3287238
6909 3287238 3130890 3105754 3267572 3655363 4296038 5209187 6406114 7879640 9588613
6900 9588613 11447614 13330904 15090768 16581554 17679480 18295476 18385631 17962171 17098113
6891 17098113 15914149 14547025 13115784 11705332 10369405 9137383 8013125 6973675
6883 6973675 5984125 5028701 4136630 3381371 2853259 2623120 2712099 3072550 3584162 4074755
6873 4074755 4368486 4343242 3965519 3283415 2387369 1367503 291650 -791521 -1836727
6864 -1836727 -2790727 -3596041 -4208471 -4617256 -4854516 -4987412 -5096699 -5251735 -5492042 -5821052
6854 -5821052 -6212531 -6626082 -7025465 -7392379 -7729669 -8053087 -8377704 -8708569 -9040791 -9365421
6844 -9365421 -9673412 -9954741 -10196731 -10385706 -10510297 -10561888 -10532689 -10416918 -10216797 -9945510
6834 -9945510 -9617066 -9224869 -8726072 -8050216 -7133574 -5959180 -4575857 -3083024 -1590767
6825 -1590767 -179665 1116734 2299757 3375395 4326953 5106189 5645377 5881927 5784072
6816 5784072 5367178 4693152 3851888 2933646 2007081 1111767 261595 -550533 -1350453 -2177824
6806 -2177824 -3073230 -4059854 -5128681 -6235481 -7311794 -8285503 -9102000 -9736255 -10190883
6797 -10190883 -10483711 -10634487 -10659312 -10573894 -10399473 -10164421 -9901056 -9644079 -9435546 -9331517
6787 -9331517 -9398318 -9693058 -10239180 -11015892 -11969271 -13032766 -14136738 -15198882 -16107150
6778 -16107150 -16715048 -16860065 -16399795 -15250361 -13411730 -10970657 -8080121 -4923318 -1677732
6769 -1677732 1505974 4506840 7228568 9600344 11587381 13202620 14508282 15603209
6761 15603209 16600200 17600495 18671245 19830077 21040243 22219365 23263419 24083520
6753 24083520 24645702 24997242 25263790 25613452 26200890 27114931 28349584 29804386 31307653
6744 31307653 32653099 33642618 34126674 34029198 33346526 32124312 30430312 28339288 25931822
6735 25931822 23298467 20542945 17783178 15147156 12757993 10708833 9039602 7730037
6727 7730037 6713483 5903840 5223423 4621282 4075773 3581916 3132423 2705468 2267270
6718 2267270 1786585 1249787 664651 48768 -590032 -1266844 -2016269 -2875221 -3863958 -4975586
6708 -4975586 -6176667 -7417530 -8649758 -9844587 -11001638 -12141431 -13286855 -14445875
6700 -14445875 -15603201 -16720868 -17746777 -18632351 -19355057 -19931439 -20406920 -20825432 -21199656
6691 -21199656 -21502115 -21679274 -21674319 -21443911 -20965359 -20238400 -19284367 -18141444 -16855807
6682 -16855807 -15472996 -14034999 -12584326 -11171252 -9858505 -8718574 -7821354 -7214729
6674 -7214729 -6906378 -6856602 -6986501 -7197933 -7398216 -7523354 -7554491 -7522227 -7496241 -7563835
6664 -7563835 -7805201 -8272326 -8975796 -9882627 -10926410 -12025429 -13098987 -14073802 -14881189
6655 -14881189 -15453823 -15730682 -15670634 -15265827 -14543837 -13555271 -12355184 -10991277 -9504092
6646 -9504092 -7932979 -6319039 -4703488 -3126237 -1627355 -248885 965608 1972437
6638 1972437 2728098 3190721 3327900 3133229 2646596 1967052 1245982 655381 339639 371388
6628 371388 732367 1326923 2019498 2679394 3217867 3607321 3876733 4084462 4279965 4473271
6618 4473271 4627483 4676059 4552847 4217649 3665671 2920317 2018249 997785 -103812
6609 -103812 -1246474 -2383184 -3459972 -4421093 -5218626 -5824306 -6238475 -6489092 -6617479
6600 -6617479 -6656422 -6612855 -6465262 -6176433 -5713134 -5062044 -4236349 -3274540 -2236352 -1198142
6590 -1198142 -244670 547445 1133639 1522479 1779376 2005013 2295394 2702937 3218766 3784128
6580 3784128 4322066 4770263 5098097 5302660 5391935 5370033 5235607 4993209 4666819 4303248
6570 4303248 3961712 3697541 3553230 3564176 3773429 4240094 5028506 6179744 7681978
6561 7681978 9458404 11379201 13288607 15033569 16487554 17570677 18265921 18623695 18745394
6552 18745394 18746750 18716099 18687476 18638795 18509974 18227343 17723343 16948299 15876366 14507819
6542 14507819 12867655 10999391 8954885 6784675 4534961 2254150 5406 -2123205
6534 -2123205 -4018687 -5556061 -6621461 -7139108 -7094780 -6548646 -5631249 -4519241 -3394863
6525 -3394863 -2402869 -1622647 -1064979 -687922 -418744 -174191 121080 519152 1043389 1696419
6515 1696419 2473127 3364566 4348398 5376270 6371637 7241545 7895555 8263725 8310026 8039952
6505 8039952 7500456 6771049 5948228 5128843 4397938 3822984 3451746 3308502 3385757 3635139
6495 3635139 3966850 4265085 4416780 4340778 4003983 3420783 2642466 1744823 816250 -55058
6485 -55058 -793323 -1341473 -1659114 -1717849 -1503221 -1026012 -334403 486562 1335502 2129189
6475 2129189 2834282 3478327 4131579 4866619 5715587 6646718 7570814 8371708 8944047 9222488
6465 9222488 9194783 8899038 8409201 7814155 7196429 6615830 6101158 5650779 5240881 4838186
6455 4838186 4412711 3948148 3450668 2956053 2528841 2244850 2158363 2270776 2521420 2807263
6445 2807263 3019899 3082432 2975216 2744869 2491152 2330475 2348536 2566703 2941554 3395318
6435 3395318 3855442 4280238 4662273 5017174 5371078 5755160 6207139 6773842 7507659 8452881
6425 8452881 9624120 10986018 12446849 13873951 15127059 16094775 16718751 17000050 16992395
6416 16992395 16788214 16497982 16222757 16028623 15939626 15958560 16103249 16429426 17017729 17928393
6406 17928393 19150638 20576304 22011069 23217005 23968976 24106071 23564074 22382485 20687104
6397 20687104 18654904 16472627 14304018 12278291 10500066 9064684 8057952 7533646
6389 7533646 7484168 7828567 8430172 9135316 9812445 10374159 10776922 11005420 11054858 10922826
6379 10922826 10614266 10153373 9591933 9007138 8489586 8127483 7993235 8135525 8576827
6370 8576827 9313991 10318505 11534772 12879073 14244926 15517802 16594751 17399686 17887699
6361 17887699 18039400 17851982 17333752 16504640 15399998 14071771 12581876 10987432 9323718
6352 9323718 7593726 5770831 3814466 1692062 -602266 -3039293 -5557484 -8073171
6344 -8073171 -10493395 -12728751 -14704862 -16370156 -17697258 -18678062 -19316815 -19625931 -19624262
6335 -19624262 -19332823 -18765681 -17922614 -16794803 -15387234 -13746827 -11977235 -10227397 -8656537
6326 -8656537 -7391862 -6498380 -5972089 -5753927 -5752204 -5862465 -5982099 -6022649 -5920740 -5644254
6316 -5644254 -5190061 -4573244 -3811704 -2913396 -1874601 -692410 617208 2012217 3437786
6307 3437786 4851791 6242546 7624267 9012951 10399244 11735416 12941897 13925534
6299 13925534 14598117 14890935 14768274 14239924 13364826 12238720 10969303 9650278 8342339
6290 8342339 7062710 5785485 4458273 3035344 1514236 -44925 -1530824 -2818610
6282 -2818610 -3813428 -4475954 -4818430 -4880054 -4703280 -4326777 -3793771 -3163329 -2514904 -1944203
6272 -1944203 -1551699 -1425442 -1622890 -2160439 -3016686 -4146534 -5496192 -7010258 -8629267
6263 -8629267 -10283474 -11891589 -13369428 -14644204 -15663083 -16388683 -16788046 -16830614 -16502953
6254 -16502953 -15830517 -14888643 -13794477 -12685927 -11697215 -10934137 -10449629 -10226733 -10181375
6245 -10181375 -10190219 -10133517 -9933794 -9575782 -9104393 -8605210 -8173468 -7878261 -7731813 -7675299
6235 -7675299 -7588361 -7320547 -6735252 -5752718 -4377588 -2699177 -862726 975303 2686279
6226 2686279 4187429 5438695 6428466 7157825 7628071 7833775 7762687 7401437 6743276
6217 6743276 5793772 4572609 3112609 1459337 -326738 -2169696 -3987860 -5716198
6209 -5716198 -7328731 -8841436 -10289487 -11695208 -13050528 -14322899 -15473244 -16469272
6201 -16469272 -17289090 -17923023 -18382706 -18715862 -19014213 -19401625 -20001428 -20896222 -22098930
6192 -22098930 -23547158 -25120785 -26672911 -28060926 -29167487 -29909304 -30238729 -30143182 -29641633
6183 -29641633 -28774949 -27592679 -26145150 -24486208 -22681304 -20810832 -18965512 -17239426
6175 -17239426 -15725525 -14510198 -13660238 -13202452 -13105663 -13276900 -13576532 -13847820 -13950876
6166 -13950876 -13790669 -13332207 -12600652 -11668843 -10638053 -9618336 -8711280 -7992597 -7491715
6157 -7491715 -7173922 -6939673 -6651483 -6180515 -5449286 -4450748 -3242093 -1925087 -623784
6148 -623784 536191 1444866 2018329 2200440 1958667 1280116 172688 -1328837 -3158053
6139 -3158053 -5221262 -7412185 -9629074 -11784565 -13806342 -15634058 -17217831 -18519883
6131 -18519883 -19519787 -20222521 -20663611 -20903217 -21008848 -21037733 -21030617 -21016925 -21020747 -21059218 -21134883
6120 -21134883 -21230467 -21313047 -21347371 -21310154 -21194185 -20996753 -20698372 -20246423 -19557158 -18539127
6110 -18539127 -17127320 -15309039 -13127139 -10662459 -8011678 -5275594 -2558527 32262
6102 32262 2396604 4460294 6194008 7621337 8808947 9840483 10784834 11671919 12483617
6093 12483617 13161258 13628085 13821522 13722638 13366100 12822453 12161797 11419729 10583974 9607484
6083 9607484 8440632 7067736 5532446 3941600 2445610 1203003 343262 -58574 9534
6074 9534 501295 1324681 2360119 3480942 4567787 5510554 6203625 6548889 6473333 5951431
6064 5951431 5016587 3755757 2293301 772627 -660149 -1869513 -2741180 -3191482 -3176181
6055 -3176181 -2695710 -1792137 -538080 974765 2639123 4327819 5891413 7168783 8012810
6046 8012810 8322609 8069291 7305656 6156335 4789623 3376327 2046352 858087 -206130
6037 -206130 -1214774 -2242073 -3324129 -4438744 -5519284 -6492113 -7312409 -7976838 -8509451
6028 -8509451 -8932793 -9238855 -9369866 -9216082 -8636503 -7501117 -5740239 -3379129 -543713
6019 -543713 2559307 5672959 8519508 10829010 12372699 13001057 12676528 11486865 9629918
6010 9629918 7370180 4978206 2673275 591420 -1209443 -2714270 -3907795 -4747908
6002 -4747908 -5168557 -5108087 -4545487 -3524272 -2152857 -583819 1017078 2501221 3760005
5993 3760005 4736598 5425616 5863288 6113608 6255063 6367962 6518264 6735755 6993046 7200509
5983 7200509 7229460 6959034 6324056 5338937 4088555 2695622 1281196 -67896 -1315338
5974 -1315338 -2470629 -3567485 -4638541 -5699857 -6748683 -7767863 -8730102 -9602320 -10354199
5965 -10354199 -10971265 -11465881 -11876949 -12254063 -12631143 -13001649 -13307615 -13448006 -13303480
5956 -13303480 -12768698 -11781267 -10337618 -8490896 -6333640 -3974815 -1521500 930049
5948 930049 3296003 5503744 7490380 9200938 10586356 11603756 12223255 12442812 12305179
5939 12305179 11904374 11371622 10843520 10427599 10180473 10102848 10146897 10231880 10266427 10172035
$$ [...]
##END NTUPLES=NMR SPECTRUM
##END=
