##TITLE=31Pdec_DE-27_Et-EA
 D2O
  24 sc
 29.11.2023
##JCAMPDX= 6.0         $$ Bruker NMR JCAMP-DX V2.0
##DATA TYPE= NMR SPECTRUM
##DATA CLASS= NTUPLES
##ORIGIN= UXNMR, Bruker Analytische Messtechnik GmbH
##OWNER= root
$$ XWIN-NMR		Version 3.5
$$ Wed Nov 29 14:27:51 2023 Russian Standard Time (UT+4h)  she@DPX200
##.OBSERVE FREQUENCY= 81.013821
##.OBSERVE NUCLEUS= ^31P
##.ACQUISITION MODE= SIMULTANEOUS
##.ACQUISITION SCHEME= undefined
##.AVERAGES= 24
##.DIGITISER RES= 16
##SPECTROMETER/DATA SYSTEM= spect
##.PULSE SEQUENCE= zgpg30
##.SOLVENT NAME= D2O
##.SHIFT REFERENCE= (INTERNAL, D2O, 0, 248.564)
##AUDIT TRAIL= $$ (NUMBER, WHEN, WHO, WHERE, WHAT)
$$ ##TITLE= Audit trail, XWIN-NMR		Version 3.5
$$ ##JCAMPDX= 5.01
$$ ##ORIGIN= Bruker BioSpin GmbH
$$ ##OWNER= she
$$ F:/spectra/data/she/nmr/P31/1/pdata/1/auditp.txt
$$ ##AUDIT TRAIL=  $$ (NUMBER, WHEN, WHO, WHERE, WHAT)
(   1,<2023-11-29 14:26:35.39 +0400>,<she>,<DPX200>,
      <created by zg, POWCHK disabled, PULCHK disabled
       configuration hash MD5:
       00 E9 B6 7A A2 85 ED C7 34 08 36 98 17 FE 4E 26
       data hash MD5: 32K
       28 32 54 44 3B 75 42 A3 53 4F E3 3D 84 DD A6 F3>)
(   2,<2023-11-29 14:26:37.87 +0400>,<she>,<DPX200>,
      <Start of raw data processing
       efp BC_mod = 2 LB = 10 FT_mod = 6 PKNL = 1 PHC0 = -11814.48 PHC1 = 322.6937 SI = 64K 
       data hash MD5: 64K
       8C 63 3C 67 61 4F 69 A3 F2 AA F7 16 7C 63 1D CB>)
(   3,<2023-11-29 14:26:56.84 +0400>,<she>,<DPX200>,
      <pk PHC0 = 138.0858 PHC1 = -389.2001 
       data hash MD5: 64K
       50 8A 9D F5 1A 4A B2 98 8B C4 8A DC B8 A5 33 9B>)
(   4,<2023-11-29 14:27:00.06 +0400>,<she>,<DPX200>,
      <abs ABSG = 5 
       data hash MD5: 64K
       4F D4 7B 7E F4 3D ED 58 C4 69 FE C3 0C 53 02 AC>)
(   5,<2023-11-29 14:27:15.40 +0400>,<she>,<DPX200>,
      <pk PHC0 = -1.133441 PHC1 = -1.4 
       data hash MD5: 64K
       16 A6 33 E4 14 68 1E 05 F6 27 D7 B8 1F 9F 0F 32>)
(   6,<2023-11-29 14:27:18.76 +0400>,<she>,<DPX200>,
      <abs ABSG = 5 
       data hash MD5: 64K
       17 4B DF 62 D8 7E D7 66 35 CB F1 83 65 F0 C0 44>)
$$ ##END=
$$ 
$$ hash MD5
$$ 4A 23 78 12 3A 19 A8 D9 36 75 D3 21 66 6F FC 99
##$RELAX= 
##$RELAX= 
##$RELAX= 
##$RELAX= 
##$RELAX= 
##$RELAX= 
##$RELAX= 
##$RELAX= 
##$RELAX= 
$$ Bruker specific parameters
$$ --------------------------
##$DU= <F:/spectra>
##$EXPNO= 1
##$NAME= <P31>
##$PROCNO= 1
##$TYPE= <nmr>
##$USER= <she>
##$AMP= (0..31)
100 100 100 100 100 100 100 100 100 100 100 100 100 100 100 100 100 100 
100 100 100 100 100 100 100 100 100 100 100 100 100 100 
##$AQSEQ= 0
##$AQ_mod= 1
##$AUNM= <au_zg>
##$AUTOPOS= <>
##$BF1= 81.014009
##$BF2= 200.13
##$BF3= 200.13
##$BF4= 200.13
##$BF5= 200.13
##$BF6= 200.13
##$BF7= 200.13
##$BF8= 200.13
##$BYTORDA= 1
##$CFDGTYP= 0
##$CFRGTYP= 5
##$CHEMSTR= <none>
##$CNST= (0..31)
1 1 145 1 1 1 1 1 1 1 1 1 1 1 1 1 1 1 1 1 1 1 1 1 1 1 1 1 1 1 1 1 
##$CPDPRG= <waltz16>
##$CPDPRG1= <>
##$CPDPRG2= <waltz16>
##$CPDPRG3= <>
##$CPDPRG4= <mlev>
##$CPDPRG5= <mlev>
$$ [...]
##$SUBNAM3= <"">
##$SUBNAM4= <"">
##$SUBNAM5= <"">
##$SUBNAM6= <"">
##$SUBNAM7= <"">
##$SUBNAM8= <"">
##$SUBNAM9= <"">
##$SW= 501.771253377433
##$SWIBOX= (0..15)
0 1 3 0 0 0 0 0 0 0 0 0 0 0 0 0 
##$SW_h= 40650.406504065
##$TD= 32768
##$TD0= 1
##$TE= 0
##$TE2= 300
##$TE3= 300
##$TEG= 300
##$TL= (0..7)
0 120 53 12 22 120 120 120 
##$TP= (0..7)
150 150 150 150 150 150 150 150 
##$TP07= 0
##$TPNAME0= <>
##$TPNAME1= <>
##$TPNAME2= <>
##$TPNAME3= <>
##$TPNAME4= <>
##$TPNAME5= <>
##$TPNAME6= <>
##$TPNAME7= <>
##$TPOAL= (0..7)
0.5 0.5 0.5 0.5 0.5 0.5 0.5 0.5 
##$TPOFFS= (0..7)
0 0 0 0 0 0 0 0 
##$TUNHIN= 0
##$TUNHOUT= 0
##$TUNXOUT= 0
##$USERA1= <user>
##$USERA2= <user>
##$USERA3= <user>
##$USERA4= <user>
##$USERA5= <user>
##$V9= 5
##$VALIST= <valist>
##$VCLIST= <CCCCCCCCCCCCCCC>
##$VD= 0
##$VDLIST= <DDDDDDDDDDDDDDD>
##$VPLIST= <PPPPPPPPPPPPPPP>
##$VTLIST= <TTTTTTTTTTTTTTT>
##$WBST= 1024
##$WBSW= 4
##$XGAIN= (0..3)
0 0 0 0 
##$XL= 0
##$YL= 0
##$YMAX_a= 2004
##$YMIN_a= -1814
##$ZGOPTNS= <>
##$ZL1= 120
##$ZL2= 120
##$ZL3= 120
##$ZL4= 120
##$ABSF1= 248.5645
##$ABSF2= -253.2056
##$ABSG= 5
##$ABSL= 3
##$ALPHA= 0
##$AQORDER= 0
##$ASSFAC= 0
##$ASSFACI= 0
##$ASSFACX= 0
##$ASSWID= 0
##$AUNMP= <proc_1d>
##$AZFE= 0.1
##$AZFW= 0.5
##$BCFW= 0
##$BC_mod= 2
##$BYTORDP= 0
##$COROFFS= 0
##$CY= -3
##$DATMOD= 1
##$DC= 0
##$DFILT= <>
##$DTYPP= 0
##$F1P= 0
##$F2P= 0
##$FCOR= 1
##$FTSIZE= 65536
##$FT_mod= 6
##$GAMMA= 0
##$GB= 0
##$INTBC= 1
##$INTSCL= 6.047779e-11
##$ISEN= 30
##$LB= 10
##$LEV0= 0
##$LPBIN= 0
##$MAXI= 10000
##$MC2= 0
##$MEAN= 0
##$ME_mod= 0
##$MI= 50
##$NCOEF= 0
##$NC_proc= -9
##$NLEV= 6
##$NOISF1= 182.463
##$NOISF2= 159.3651
##$NSP= 0
##$NTH_PI= 0
##$NZP= 0
##$OFFSET= 248.5645
##$PC= 4
##$PHC0= -11677.52
##$PHC1= -67.90641
##$PH_mod= 1
##$PKNL= yes
##$PPARMOD= 0
##$PSCAL= 0
##$PSIGN= 0
##$REVERSE= no
##$SF= 81.0140089999694
##$SI= 65536
##$SIGF1= 159.3651
##$SIGF2= -187.1042
##$SINO= 113.3802
##$SIOLD= 16384
##$SREGLST= <1H.CDCl3>
##$SSB= 0
##$STSI= 65536
##$STSR= 0
##$SW_p= 40650.406504065
##$SYMM= 0
##$S_DEV= 0
##$TDeff= 32768
##$TDoff= 0
##$TI= <>
##$TILT= no
##$TM1= 0
##$TM2= 0
##$TOPLEV= 0
##$USERP1= <user>
##$USERP2= <user>
##$USERP3= <user>
##$USERP4= <user>
##$USERP5= <user>
##$WDW= 1
##$XDIM= 65536
##$YMAX_p= 417485318
##$YMIN_p= -103717814
$$ End of Bruker specific parameters
$$ ---------------------------------
##NTUPLES= NMR SPECTRUM
##VAR_NAME=  FREQUENCY,     SPECTRUM/REAL,   SPECTRUM/IMAG
##SYMBOL=    X,             R,               I
##VAR_TYPE=  INDEPENDENT,   DEPENDENT,       DEPENDENT
##VAR_FORM=  AFFN,          ASDF,            ASDF
##VAR_DIM=   65536,         65536,           65536
##UNITS=     HZ,            ARBITRARY UNITS, ARBITRARY UNITS
##FACTOR=    0.620285442955139, 1,           1
##FIRST=     20137.2065510682, 0,            0
##LAST=      -20513.1999529968, 0,           0
##MIN=       -20513.1999529968, -103717814,  0
##MAX=       20137.2065510682, 417485318,    0
$$ Real data points
##PAGE= N=1
##DATA TABLE= (X++(R..R)), XYDATA
$$ [...]
37122f375114j14487j4972P6981J64316K54048L49816M46861N32799N93435O19545
$$ -6375114 -6489601 -6504573 -6427592 -6263276 -6009228 -5659412 -5212551 -4679752 -4086317 -3466772
37112c466772O10381N72715N16727M51141L79877L02078K15799J22959L1605m6513
$$ -3466772 -2856391 -2283676 -1766949 -1315808 -935931 -633853 -418054 -295095 -263490 -310003
37102c10003j01108j27352j26467j03988o7623k5768J3638M3867N9517N6114L0350
$$ -310003 -411111 -538463 -664930 -768918 -836541 -862309 -848671 -804804 -745287 -689173 -658823
37091f58823j8320q5703j62512k36786k97919l39744l60702l61760l44357l10341
$$ -658823 -677143 -762846 -925358 -1162144 -1460063 -1799807 -2160509 -2522269 -2866626 -3176967
37081c176967k63373k09711j56854j10852p4237m6035k3590m576J2559L0267N3879
$$ -3176967 -3440340 -3650051 -3806905 -3917757 -3991994 -4038029 -4061619 -4066195 -4053636 -4023369 -3969490
37070c969490R0722J45139K12761K79409L27039L42683L23896K77529K14424J44801
$$ -3969490 -3878768 -3733629 -3520868 -3241459 -2914420 -2571737 -2247841 -1970312 -1755888 -1611087
37060a611087P6583J5656l3538o7199q0832o8554k5130M9093J43263K35462K98257
$$ -1611087 -1534504 -1518848 -1552386 -1619585 -1700417 -1768971 -1794101 -1745008 -1601745 -1366283 -1068026
37049a068026L08494K56778J51983J8249j14216k19528k82549k99697k76586k25051
$$ -1068026 -759532 -502754 -350771 -332522 -446738 -666266 -948815 -1248512 -1525098 -1750149
37039a750149j59938r5321m1382l959J4027J2222n099k7438m0918l5248r764K6477
$$ -1750149 -1910087 -2005408 -2046790 -2050749 -2036722 -2024500 -2029599 -2057037 -2097955 -2133203 -2142967 -2116490
37027b116490O0798Q4577R6959J02843J07801J14582J23455J34679J49535J68514
$$ -2116490 -2055692 -1971115 -1874156 -1771313 -1663512 -1548930 -1425475 -1290796 -1141261 -972747
37017i72747J88783K03914K06548J91612J57600J05549L7439m4068j34139k23990
$$ -972747 -783964 -580050 -373502 -181890 -24290 81259 118698 74630 -59509 -283499
37007b83499l01238l53446l73291l61851l27807k83300k39098k01202j69775j40550
$$ -283499 -584737 -938183 -1311474 -1673325 -2001132 -2284432 -2523530 -2724732 -2894507 -3035057
36997c035057j08152o9664k6542J5505M7868O1039M7517N157o0760j38027k10204
$$ -3035057 -3143209 -3212873 -3239415 -3223910 -3176042 -3115003 -3067486 -3062329 -3123089 -3261116 -3471320
36986c471320k60214k74344k46104j78453q2690K5684J31703K24028K95782L44249
$$ -3471320 -3731534 -4005878 -4251982 -4430435 -4513125 -4487441 -4355738 -4131710 -3835928 -3491679
36976c491679L70166L77143L70584L55824L35755L09741K74947K29261J73138
$$ -3491679 -3121513 -2744370 -2373786 -2017962 -1682207 -1372466 -1097519 -868258 -695120
36967f95120J09173M0826k7736r0852j41510j73437j83376j71325j38613q6440
$$ -695120 -585947 -545121 -572857 -663709 -805219 -978656 -1162032 -1333357 -1471970 -1558410
36957a558410j7182O2371J39510J98319K25214K13310J63314Q1847k0434j30208
$$ -1558410 -1575592 -1513221 -1373711 -1175392 -950178 -736868 -573554 -491707 -512141 -642349
36947f42349k33109l16292l71290l95653l92383l67513l27343k77082k21238j64492
$$ -642349 -875458 -1191750 -1563040 -1958693 -2351076 -2718589 -3045932 -3323014 -3544252 -3708744
36937c708744j11543o5920k9106j099J8141K7954K7818J9021N371p885j6129j6721
$$ -3708744 -3820287 -3886207 -3915313 -3916412 -3898271 -3870317 -3842499 -3823478 -3818107 -3825992 -3842121 -3858842
36925c858842q809P744L3034O6772J07356J51461J94770K33622K66339K93085
$$ -3858842 -3867651 -3859907 -3826873 -3760101 -3652745 -3501284 -3306514 -3072892 -2806553 -2513468
36915b513468L14543L30591L40018L41168L32722L14258K86518K51260K10482
$$ -2513468 -2198925 -1868334 -1528316 -1187148 -854426 -540168 -253650 -2390 208092
36906B08092J65476J16613O4404J1296l7391p4580r4451r5318q0213n4638k3586
$$ 208092 373568 490181 554585 565881 528490 453910 359459 264141 183928 129290 105704
36895A05704R371M0393O3104O8717M9464L374o2891j35573j99241k42899k62798
$$ 105704 115075 155468 218572 287289 336753 340127 277236 141663 -57578 -300477 -563275
36884e63275k60355k37462j93331j25190l1661Q3934K12049L37454M41831N08353
$$ -563275 -823630 -1061092 -1254423 -1379613 -1411274 -1327340 -1115291 -777837 -336006 172347
36874A72347N26924M97452M29215L36835K35211J36016M6550k9566r1344j39446
$$ 172347 699271 1196723 1625938 1962773 2197984 2334000 2380550 2350984 2259640 2120194
36864B120194j74601j94897j93590j60680q8936J9376J50233K81466L89386M55083
$$ 2120194 1945593 1750696 1557106 1396426 1307490 1326866 1477099 1758565 2147951 2603034
36854B603034M69158M34454L65399K83062K07400J50110J10933P8745L7306k6059
$$ 2603034 3072192 3506646 3872045 4155107 4362507 4512617 4623550 4702295 4739601 4713542
36844D713542j12815k10946k99921l60290l82434l69350l32122k81788k23867
$$ 4713542 4600727 4389781 4089860 3729570 3347136 2977786 2645664 2363876 2140009
36835B140009j59504r0937k5395K6102N3071M8738J0607n9458j53829k57659l50412
$$ 2140009 1980505 1889568 1864173 1890275 1943346 1992084 2002691 1943233 1789404 1531745 1181333
36824A181333m11673m28719m01383l40976k63851j83788j07804l7130K8916Q9809
$$ 1181333 769660 340941 -60442 -401418 -665269 -849057 -956861 -993991 -965075 -875266
36814h75266J43411J87351K20397K42714K55269K58970K54463K42834K26607K09436
$$ -875266 -731855 -544504 -324107 -81393 173876 432846 687309 930143 1156750 1366186
36804A366186J93930J79321J61335J34855R7059M8741o756o5357j22999j74660
$$ 1366186 1560116 1739437 1900772 2035627 2132686 2181427 2174671 2109314 1986315 1811655
36794A811655k12769k27502k10384j59655q3259L273Q2730J42132J76061J87141
$$ 1811655 1598886 1371384 1161000 1001345 918086 921359 1004089 1146221 1322282 1509423
36784A509423J84116J77829J76390J82243J92963K04502K13915K19816K21476
$$ 1509423 1693539 1871368 2047758 2230001 2422964 2627466 2841381 3061197 3282673
36775C282673K18223K09521J95078J74742J48509J16980Q1928M6883J7572J268
$$ 3282673 3500896 3710417 3905495 4080237 4228746 4345726 4427654 4474537 4492109 4493377
36765D493377L920K5780N9112R1030J10151J11935R8952P6945N0738K2723n950
$$ 4493377 4497297 4523077 4582189 4673219 4783370 4895305 4994257 5071202 5121940 5144663 5138713
36754E138713l3065n3937o2218n2747k4638J7002O1298R3802J01023P6052K2109
$$ 5138713 5105648 5051711 4989493 4936746 4912108 4929110 4990408 5084210 5185233 5261285 5283394
36743E283394m9072j22511j85038k27590k45907k40979k18547j86699j52761j21760
$$ 5283394 5234322 5111811 4926773 4699183 4453276 4212297 3993750 3807051 3654290 3532530
36733C532530r6627p8887o9247o8587p9016j03383j42587j92919k46248k93245
$$ 3532530 3435903 3357016 3287769 3219182 3140166 3036783 2894196 2701277 2455029 2161784
36723B161784l26914l43775l42961l25241k93001k50209k01287j49273r4794l6361
$$ 2161784 1834870 1491095 1148134 822893 529892 279683 78396 -70877 -165671 -202032
36713b02032K8017R8347J70178K34317K80128L00529K94465K65146K16677J52992
$$ -202032 -174015 -75668 94510 328827 608955 909484 1203949 1469095 1685772 1838764
36703A838764P9207K522o9369j31081j80679k18034k41809k47978k31454j89733
$$ 1838764 1917971 1920493 1851124 1720043 1539364 1321330 1079521 831543 600089 410356
36693D10356j25220m4162M6570J41889K38262L31664M15826M82470N23942N37212
$$ 410356 285136 240974 287544 429433 667695 999359 1415185 1897655 2421597 2958809
36683B958809N26538N01976M73838M46373M15082L69812L01863K10354J03679
$$ 2958809 3485347 3987323 4461161 4907534 5322616 5692428 5994291 6204645 6308324
36674F308324m548j01769j80879k41512k89291l33765l84459m45879n14097n77457
$$ 6308324 6303776 6202007 6021128 5779616 5490325 5156560 4772101 4326222 3812125 3234668
36664C234668o20754o30293n97690n21800m08982k71868j26982Q524J20527K01198
$$ 3234668 2613914 1983621 1385931 864131 455149 183281 56299 64823 185350 386548
36654C86548K50215K73270K78798K74528K64787K48927K21989J77967J14284L4411
$$ 386548 636763 910033 1188831 1463359 1728146 1977073 2199062 2377029 2491313 2525724
36644B525724n2933j36836k07243k56568k80045k75725k44939j93109j29539o5125
$$ 2525724 2472791 2335955 2128712 1872144 1592099 1316374 1071435 878326 748787 683662
36634F83662q766L5245O7537R2203J14772J39798J68695J99056K26323K46347
$$ 683662 674896 710141 777678 869881 984653 1124451 1293146 1492202 1718525 1964872
36624A964872K56559K55089K39426K05999J51177P3185k5558j36830k47176l40801
$$ 1964872 2221431 2476520 2715946 2921945 3073122 3146307 3120749 2983919 2736743 2395942
36614B395942m03238m24168l98923l29246k23372r5057L8522J59517K52114L05091
$$ 2395942 1992704 1568536 1169613 840367 616995 521938 560460 719977 972091 1277182
36604A277182L13849K81413K17604J36346N2062k3279q1865j20926j43138j55269
$$ 1277182 1591031 1872444 2090048 2226394 2278456 2255177 2173312 2052386 1909248 1753979
36594A753979j64190j72029j74430j63672j34045q5311k2718M4958J07615J56188
$$ 1753979 1589789 1417760 1243330 1079658 945613 860302 837584 882542 990157 1146345
36584A146345J85222J94607J89015J74990J57344J37345J13917Q6777N8548L3959
$$ 1146345 1331567 1526174 1715189 1890179 2047523 2184868 2298785 2385562 2444110 2478069
36574B478069J7276J0693J4723K9105N2529Q1624J10680J32763J41533J32958
$$ 2478069 2495345 2506038 2520761 2549866 2602395 2684019 2794699 2927462 3068995 3201953
36564C201953J06252O3949J1320m3801r0947j18306j16775q5088l1582K9906Q7615
$$ 3201953 3308205 3372154 3383474 3339673 3248726 3130420 3013645 2928557 2896975 2926881 3014496
36553C014496J37130J80924K23679K67834L11965L51252L78321L84493L62620
$$ 3014496 3151626 3332550 3556229 3824063 4136028 4487280 4865601 5250094 5612714
36544E612714L11210K36855J52089O9527l564o6021j18820j60373j85353j87663
$$ 5612714 5923924 6160779 6312868 6382395 6378831 6312810 6193990 6033617 5848264 5660601
36534E660601j64553j18468n6467J1176P2307J15249J32554J24381R8769O8246
$$ 5660601 5496048 5377580 5321113 5332289 5404596 5519845 5652399 5776780 5875549 5943795
36524E943795M4616L5008M1126O1627R5181J41481J99888K68338L44372M26814
$$ 5943795 5988411 6023419 6064545 6126172 6221353 6362834 6562722 6831060 7175432 7602246
36514G602246N15038O06154O93555P69168Q27564Q68561Q97010R20797R48196
$$ 7602246 8117284 8723438 9416993 10186161 11013725 11882286 12779296 13700093 14648289
36505A4648289R85575J036798J105150J196097J317871J478745J683163J929778
$$ 14648289 15633864 16670662 17775812 18971909 20289780 21768525 23451688 25381466
36497B5381466K212554K524233K860934L226201L632009M095181M630564N245117
$$ 25381466 27594020 30118253 32979187 36205388 39837397 43932578 48563142 53808259
36489E3808259N936144O693735P505176Q359510R250868J0178756J1143605J2138357
$$ 53808259 59744403 66438138 73943314 82302824 91553692 101732448 112876053 125014410
36481A25014410J3139477J4100324J4946740J5573605J5843396J5591873J4647603
$$ 125014410 138153887 152254211 167200951 182774556 198617952 214209825 228857428
36474B28857428J2870141J0203703O729861K690989j540023n542745q952552j1539290
$$ 228857428 241727569 251931272 258661133 261352122 259812099 254269354 245316802 233777512
36466B33777512j3233369j4101956j4297915j4005292j3396262j2606363j1728752
$$ 233777512 220544143 206442187 192144272 178138980 164742718 152136355 140407603
36459A40407603j0822442r925021r061960q250338p499951o815085o197143n646273
$$ 140407603 129585161 119660140 110598180 102347842 94847891 88032806 81835663 76189390
36451G6189390n160807m735845m363064m032261l733102l455584l189778k926400
$$ 76189390 71028583 66292738 61929674 57897413 54164311 50708727 47518949 44592549
36443D4592549k658575k383385k101770j817101j533690j256251r90184p41899
$$ 44592549 41933974 39550589 37448819 35631718 34098028 32841777 31851593 31109694
36435C1109694n18154l23910j59947k2486R3798J91653K70406L30514L80016M36245
$$ 31109694 30591540 30267630 30107683 30085197 30178995 30370648 30641054 30971568 31351584 31787829
36425C1787829N19315O41141P97924R71217J135474J265644J340228J340551J250177
$$ 31787829 32307144 32948285 33746209 34717426 35852900 37118544 38458772 39799323 41049500
36416D1049500J056846P56629L58735j10794o08784j080967j474603j752935j904020
$$ 41049500 42106346 42862975 43221710 43110916 42502132 41421165 39946562 38193627 36289607
36407C6289607j939783j887888j782229j655501j533641j431698j352559j289888
$$ 36289607 34349824 32461936 30679707 29024206 27490565 26058867 24706308 23416420
36399B3416420j233421j172954j099590j006148q89041p51067o02696m60637l44359
$$ 23416420 22182999 21010045 19910455 18904307 18015266 17264199 16661503 16200866 15856507
36390A5856507k71470k52635k87268l62524m57213n49133o21868o67791o86827
$$ 15856507 15585037 15332402 15045134 14682610 14225397 13676264 13054396 12386605 11699778
36381A1699778o83225o62719o31131n94166n57458n26322n05154m96684n01399
$$ 11699778 11016553 10353834 9722703 9128537 8571079 8044757 7539603 7042919 6541520
36372F541520n17204n39312n60348n70965n61259n23309m54147l57617k43719
$$ 6541520 6024316 5485004 4924656 4353691 3792432 3269123 2814976 2457359 2213640
36363B213640j25321j4016Q2402J59939K17054K53953K72874K77579K70671K50353
$$ 2213640 2088319 2074303 2156705 2316644 2533698 2787651 3060525 3338104 3608775 3859128
36353C859128K09984J41989M3874p7955k08842l29939m22918m73506m73575m22118
$$ 3859128 4069112 4211101 4254975 4177020 3968178 3638239 3215321 2741815 2268240 1846122
36343A846122l25615j97713n7475P4610J82374K58975L07628L36992L54247L61008
$$ 1846122 1520507 1322794 1265319 1339929 1522303 1781278 2088906 2425898 2780145 3141153
36333C141153L54801L34328L03823K73067K53115K50735K65191K89241L13446
$$ 3141153 3495954 3830282 4134105 4407172 4660287 4911022 5176213 5465454 5778900
36324E778900L30502L37044L32745L18637K96089K66213K28983J82410J23123
$$ 5778900 6109402 6446446 6779191 7097828 7393917 7660130 7889113 8071523 8194646
36315H194646M9429l4249j14969j74413j97548j81339j36658q1626l1973M234
$$ 8194646 8244075 8209826 8094857 7920444 7722896 7541557 7404899 7323273 7291300 7295534
36305G295534K5276L1561K3263J176l0961o5417r2196j03084r5607p4167m7914
$$ 7295534 7320810 7352371 7375634 7376810 7345849 7280432 7188236 7085152 6989545 6915378 6867464
36294F867464k7089k0274l2841o6043j16294j75418k32279k75327k94830k84366
$$ 6867464 6840375 6820101 6787260 6721217 6604923 6429505 6197226 5921899 5627069 5342703
36284E342703k41983j71500q3041Q845Q9705J49740J85241J96173J82495J42592
$$ 5342703 5100720 4929220 4846179 4855024 4944729 5094469 5279710 5475883 5658378 5800970
36274E800970P5190j6726j23185k28654l17473l79774m13337m20789m05826l72228
$$ 5800970 5876160 5859434 5736249 5507595 5190122 4810348 4397011 3976222 3570396 3198168
36264C198168l25332k72596k21233j74639j31259q7789m4743r573O080o650m8498
$$ 3198168 2872836 2600240 2379007 2204368 2073109 1985320 1940577 1931004 1937084 1930434 1881936
36253A881936j12394j87985k65436l36032l91525m24958m32846m16375l79924
$$ 1881936 1769542 1581557 1316121 980089 588564 163606 -269240 -685615 -1065539
36244a065539l28296k65454j96097j28016p1612l5542k1673k3455k8673k4259
$$ -1065539 -1393835 -1659289 -1855386 -1983402 -2055014 -2090556 -2112229 -2135684 -2164357 -2188616
36234b188616j006M2654R9213J54995J96990K19231K23906K16946K02481J80552
$$ -2188616 -2189622 -2146968 -2047755 -1892760 -1695770 -1476539 -1252633 -1035687 -833206 -652654
36224f52654J48872J06451N6300N470l7428o5925p8254p7388o8585n6211m1956
$$ -652654 -503782 -397331 -341031 -335561 -372989 -438914 -517168 -594556 -663141 -719352 -761308
36213g61308k5574p330J0215K2796K7130K3661J7624J7686L2907O9592J29661
$$ -761308 -786882 -794212 -783997 -761201 -734071 -710410 -692786 -675100 -642193 -572601 -442940
36202d42940K10870L07270M08281M97296N53552N59154N08351M12485K96607J89685
$$ -442940 -232070 75200 483481 980777 1534329 2093483 2601834 3014319 3310926 3500611
36192C500611J14168P9398Q0142R9810J17603J17136R2317M7008j0157p0950j29037
$$ 3500611 3614779 3694177 3774319 3874129 3991732 4108868 4201185 4248193 4238036 4167086 4038049
36181D038049j78778k14478k31640k29137k10493j83149j55326j31495j09483
$$ 4038049 3859271 3644793 3413153 3184016 2973523 2790374 2635048 2503553 2394070
36172B394070q2298m4071M718N7420J06502J48755J85943K20883K52975K77007
$$ 2394070 2311772 2267701 2272419 2329839 2436341 2585096 2771039 2991922 3244897 3521904
36162C521904K85988K75376K45295J99215J41054P4002K354o6023j20117j49595
$$ 3521904 3807892 4083268 4328563 4527778 4668832 4742834 4745188 4679165 4559048 4409453
36152D409453j49182j20300o9663o956N6784J10356J44194J52869J37184J04459
$$ 4409453 4260271 4139971 4070308 4063352 4120136 4230492 4374686 4527555 4664739 4769198
36142D769198O6406L5251J9972K4635M9197R1153J45607K03384K49746K67148
$$ 4769198 4835604 4870855 4890827 4915462 4964659 5055812 5201419 5404803 5654549 5921697
36132E921697K42444J74286P4991l4998j36019k15475k69059k98668l09572l07626
$$ 5921697 6164141 6338427 6413418 6378420 6242401 6026926 5757867 5459199 5149627 4842001
36122D842001k96563k76324k43828j96178j34772o7835r462K5237K5996r873p9272
$$ 4842001 4545438 4269114 4025286 3829108 3694336 3626501 3617039 3642276 3668272 3658399 3579127
36111C579127j76081k90520m05880m98118n42132n21999m38176l06753j51394
$$ 3579127 3403046 3112526 2706646 2208528 1666396 1144397 706221 399468 248074
36102B48074O863J55864K91668M13105N16699N95563O41634O48850O16001N48971
$$ 248074 254937 410801 702469 1115574 1632273 2227836 2869470 3518320 4134321 4683292
36092D683292M61079L69652K89783K28915J85702J53194J24025R4883O8060M8690
$$ 4683292 5144371 5514023 5803806 6032721 6218423 6371617 6495642 6590525 6658585 6707275
36082F707275L8937L3654K1941n717n0528j04676j57447k03174k44989k91810
$$ 6707275 6746212 6779866 6801807 6796090 6745562 6640886 6483439 6280265 6035276 5743466
36072E743466l51010m21688m93107n49292n76732n70215n33650m76715m10574
$$ 5743466 5392456 4970768 4477661 3928369 3351637 2781422 2247772 1771057 1360483
36063A360483l45243k88703k46292k19439k04341j92314j72878j38696q9639l3347
$$ 1360483 1015240 726537 480245 260806 56465 -135849 -308727 -447423 -537062 -570409
36053e70409J8145N3893O8647O4292M7588K5953M748j1962j8807q717K3592P7157
$$ -570409 -552264 -498371 -429724 -365432 -317844 -291891 -287143 -299105 -317912 -326629 -303037 -225880
36041b25880J43477K09443K61821K90647K91022K63776K15025J54419R2711L9629
$$ -225880 -82403 127040 388861 679508 970530 1234306 1449331 1603750 1696461 1736090
36031A736090K368j5293j3377M344L0542N4905O6082N5432K1373k8323p8180j10537
$$ 1736090 1738458 1723165 1709788 1714132 1744674 1799579 1865661 1921093 1942466 1914143 1835963 1725426
36019A725426j12627q1746k5579M2317J08718J64697K06244K33303K49104K59640
$$ 1725426 1612799 1531053 1505474 1547791 1656509 1821206 2027450 2260753 2509857 2769497
36009B769497K72041K91914L20933L55706L88351M08702M07804L81238L30400
$$ 2769497 3041538 3333452 3654385 4010091 4398442 4807144 5214948 5596186 5926586
36000E926586K61139J81407R9871K5479l3856p4285r8687j15804j35279j62002
$$ 5926586 6187725 6369132 6469003 6494482 6460626 6386341 6287654 6171850 6036571 5874569
35990E874569j94005k24644k46190k51713k35377j93508j26964m2661M8129J33803
$$ 5874569 5680564 5455920 5209730 4958017 4722640 4529132 4402168 4359507 4407636 4541439
35980D541439K05490K57168K84334K84054K56853K08034J46002P8424R239o1076
$$ 4541439 4746929 5004097 5288431 5572485 5829338 6037372 6183374 6261798 6271037 6209961
35970F209961j32599k03255k68595l23906l66242l94329m06710m00699l74078
$$ 6209961 6077362 5874107 5605512 5281606 4915364 4521035 4114325 3713626 3339548
35961C339548l28114k68909k05464j46083r5736n5550k3837K236K4758M3523N5340
$$ 3339548 3011434 2742525 2537061 2390978 2295242 2239692 2215855 2218091 2242849 2286372 2341712
35950B341712N4516L4282j0785q1666j72307k69593l56508m17348m42660m32217
$$ 2341712 2396228 2430510 2419725 2338059 2165752 1896159 1539651 1122303 679643 247426
35940B47426l94715l43848k92014k45279k02519j58522j08020m8114K1142R7018
$$ 247426 -147289 -491137 -783151 -1028430 -1230949 -1389471 -1497491 -1545605 -1524463 -1427445
35930a427445J74861K48947L12467L56421L69047L38456K58579J35270j2416j57898
$$ -1427445 -1252584 -1003637 -691170 -334749 34298 372754 631333 766603 754187 596289
35920E96289k77584l60207m09105m36269m52699m62167m61894m47990m20626l85188
$$ 596289 318705 -41502 -450607 -886876 -1339575 -1801742 -2263636 -2711626 -3132252 -3517440
35910c517440l49568l20141k99508k86951k80208k76185k70334k56594k29540
$$ -3517440 -3867008 -4187149 -4486657 -4773608 -5053816 -5330001 -5600335 -5856929 -6086469
35901f086469j87371j32965p2165j1233M4526R1105J26432J51569J71554J94851
$$ -6086469 -6273840 -6406805 -6478970 -6490203 -6445677 -6354572 -6228140 -6076571 -5905017 -5710166
35891e710166K31136K87493L63715M48808N21547N56744N35374M53687L26068
$$ -5710166 -5479030 -5191537 -4827822 -4379014 -3857467 -3300723 -2765349 -2311662 -1985594
35882a985594J79962M5740n2972j04277j07596p0120k835Q2110J72342K55259
$$ -1985594 -1805632 -1759892 -1812864 -1917141 -2024737 -2094857 -2097692 -2015582 -1843240 -1587981
35872a587981L18731L53453L56147L31223K89390K44108K08226J92497K04880
$$ -1587981 -1269250 -915797 -559650 -228427 60963 305071 513297 705794 910674
35863I10674K49047L21840M12007N02751N78075O29149O56006O63085O52161O18673
$$ 910674 1159721 1481561 1893568 2396319 2974394 3603543 4259549 4922634 5574795 6193468
35853F193468N54709M56364L29707J90838O0218m4992j16097j53415j62957j52112
$$ 6193468 6748177 7204541 7534248 7725086 7785304 7740312 7624215 7470800 7307843 7155731
35843G155731j27260r4278o0311l4301k5548m1390q5191j54714k40986l29153
$$ 7155731 7028471 6934193 6873882 6839581 6814033 6772643 6687452 6532738 6291752 5962599
35833E962599m02536m48520m62937m50852m24225l97964l84638l88458m01389
$$ 5962599 5560063 5111543 4648606 4197754 3773529 3375565 2990927 2602469 2201080
35824B201080m05340l80926l17800k20077j03922R822J03156J65449J94593J95461
$$ 2201080 1795740 1414814 1097014 876937 773015 782837 885993 1051442 1246035 1441496
35814A441496J76780J47826J16454Q8649O8235N5843M7782L6457J2533l2215j02302
$$ 1441496 1618276 1766102 1882556 1971205 2039440 2095283 2143065 2179522 2192055 2159840 2057538
35803B057538j96225l04961m12787n01518n56647n71994n50151m99071m27622
$$ 2057538 1861313 1556352 1143565 642047 85400 -486594 -1036745 -1535816 -1963438
35794a963438l42784k49553j52532n7518K8259R7443J44712J68503J71313J58683
$$ -1963438 -2306222 -2555775 -2708307 -2765825 -2737566 -2640123 -2495411 -2326908 -2155595 -1996912
35784a996912J37756J16002R9706R1969R1649R5039R9779J07784J24635J56473
$$ -1996912 -1859156 -1743154 -1643448 -1551479 -1459830 -1364791 -1265012 -1157228 -1032593 -876120
35774h76120K07401K78404L66613M64287N59070O37174O88137P08027O99094O67090
$$ -876120 -668719 -390315 -23702 440585 999655 1636829 2324966 3032993 3732087 4399177
35764D399177O18907N61842N03430M50074M04512L64133L21909K69481K00214
$$ 4399177 5018084 5579926 6083356 6533430 6937942 7302075 7623984 7893465 8093679
35755H093679J10897K341j20257k47290l65936m63276n31063n70148n91350o10576
$$ 8093679 8204576 8206917 8086660 7839370 7473434 7010158 6479095 5908947 5317597 4707021
35745D707021o39678o78504p13928p27102p04660o46931n68382m90788m34119
$$ 4707021 4067343 3388839 2674911 1947809 1243149 596218 27836 -462952 -897071
35736h97071m10246m20990m58739n08197n49791n65154n42787m81072l87464k74947
$$ -897071 -1307317 -1728307 -2187046 -2695243 -3245034 -3810188 -4352975 -4834047 -5221511 -5496458
35726e496458j57378m5554N4096J37402J99245K32901K33120K00281J42272P3060
$$ -5496458 -5653836 -5699390 -5645294 -5507892 -5308647 -5075746 -4842626 -4642345 -4500073 -4427013
35716d427013R202l4370m8073k9749J5823P9664J52089K25595K95941L60979M18165
$$ -4427013 -4417811 -4452181 -4500254 -4530003 -4514180 -4434516 -4282427 -4056832 -3760891 -3399912 -2981747
35705b981747M62832M88767M90691M66884M20587L59616K94076K32756J79780
$$ -2981747 -2518915 -2030148 -1539457 -1072573 -651986 -292370 1706 234462 414242
35696D14242J33503Q7867L5657k7336r8418j66923k18138k40984k33983k05028
$$ 414242 547745 635612 671269 643933 545515 378592 160454 -80530 -314513 -519541
35686e19541j65649j24994q7371n3036j9474J7761O3712J21265J88404K57674
$$ -519541 -685190 -810184 -897555 -950591 -970065 -952304 -888592 -767327 -578923 -321249
35676c21249L18694L62524L85159L88426L78198L61363L43164L25573L06948K83299
$$ -321249 -2555 359969 745128 1133554 1511752 1873115 2216279 2541852 2848800 3132099
35666C132099K51399K12285J72559J42037J29437J39104J69933K15253K63130
$$ 3132099 3383498 3595783 3768342 3910379 4039816 4178920 4348853 4564106 4827236
35657D827236K98291L06679K81071K24484J49648P4888J8015r423n089K5126P0491
$$ 4827236 5125527 5432206 5713277 5937761 6087409 6162297 6180312 6170889 6165800 6190926 6261417
35646F261417J18569J57553J78932J80363J66470J45767J25134J05150P8798L4404
$$ 6261417 6379986 6537539 6716471 6896834 7063304 7209071 7334205 7439355 7518153 7552557
35636G552557l7721j37993k54480l67428m58836n20572n55963n75571n91226o11434
$$ 7552557 7514836 7376843 7122363 6754935 6296099 5775527 5219564 4643993 4052767 3441333
35626C441333o38894o69641o94135p00689o80705o33430n67116m95145m29116
$$ 3441333 2802439 2132798 1438663 737974 57269 -576161 -1143277 -1638422 -2067538
35617b067538l73449l25188k78631k30744j83098j39219r9812n9877j0176N7707
$$ -2067538 -2440987 -2766175 -3044806 -3275550 -3458648 -3597867 -3697679 -3757556 -3767732 -3710025
35607c710025J46109K49397L56633M56560N41247O06219O47950O61512O40755
$$ -3710025 -3563916 -3314519 -2957886 -2501326 -1960079 -1353860 -705910 -44398 596357
35598E96357N81131M83572L56805K16163P8794m2420j42682k24587k93459l51734
$$ 596357 1177488 1661060 2017865 2234028 2312822 2270402 2127720 1903133 1609674 1257940
35588A257940l95764m17203m08275l67757l03891k32218j69798j28579j11140
$$ 1257940 862176 444973 36698 -331059 -634950 -867168 -1036966 -1165545 -1276685
35579a276685j10286j12723j04871p8085l1292K9295R2703J47139J83735J98139
$$ -1276685 -1386971 -1499694 -1604565 -1682650 -1713942 -1684647 -1591944 -1444805 -1261070 -1062931
35569a062931J89487J58985J10385N1694m926m6210o1999m8081o962N3089J20873
$$ -1062931 -873444 -714459 -604074 -552380 -557306 -603516 -665515 -713596 -720558 -667469 -546596
35558e46596J86323K43422K89744L23100L38926L31443K97913K42535J76565J13968
$$ -546596 -360273 -116851 172893 495993 834919 1166362 1464275 1706810 1883375 1997343
35548A997343O5135L2564J0743j0110l8853p9448j29728j82930k30749k66247
$$ 1997343 2062478 2095042 2105785 2095675 2056822 1977374 1847646 1664716 1433967 1167720
35538A167720k85711k89365k80900k65578k47357k26628k00023j62464j10362
$$ 1167720 882009 592644 311744 46166 -201191 -427819 -627842 -790306 -900668
35529i00668m4672K7429R3529J39943J57399J45704J15261Q4471P3683R7718J60072
$$ -900668 -945340 -917911 -824382 -684439 -527040 -381336 -266075 -181604 -107921 -10203 149869
35518A49869K51494L53429M44318N06025N28359N10639M60030L87390L02768K12810
$$ 149869 401363 754792 1199110 1705135 2233494 2744133 3204163 3591553 3894321 4107131
35508D107131J21158L0622n5325j33186k01182k59905l11000l55474l93598m25968
$$ 4107131 4228289 4258911 4203586 4070400 3869218 3609313 3298313 2942839 2549241 2123273
35498B123273m53872m78045m97223n08360n08713m97905m77770m49833m12594
$$ 2123273 1669401 1191356 694133 185773 -322940 -820845 -1298615 -1748448 -2161042
35489b161042l61931k94992k14248j27631m4583K8201Q7878J33698J64983J80923
$$ -2161042 -2522973 -2817965 -3032213 -3159844 -3204427 -3176226 -3088348 -2954650 -2789667 -2608744
35479b608744J82428J74891J69421J79907K16151K77338L51267M20227M69090
$$ -2608744 -2426316 -2251425 -2082004 -1902097 -1685946 -1408608 -1057341 -637114 -168024
35470a68024M90425M84694M57144M14015L59825K96572K24550J43682N4473m1039
$$ -168024 322401 807095 1264239 1678254 2038079 2334651 2559201 2702883 2757356 2716317
35460B716317j38215k29486l05881l59678l85965l82234l47523k82951j93174
$$ 2716317 2578102 2348616 2042735 1683057 1297092 914858 567335 284384 91210
35451I1210q6793K4708J28423K11035K60789K71366K46083J99072J51664J25463
$$ 91210 4417 29125 157548 368583 629372 900738 1146821 1345893 1497557 1623020
35441A623020J35103J83242K59202L41866M06334M32336M10942L46690K53889
$$ 1623020 1758123 1941365 2200567 2542433 2948767 3381103 3792045 4138735 4392624
35432D392624J49345M5756n0555j37513k13775k76612l21537l42787l34694k94558
$$ 4392624 4541969 4587725 4537170 4399657 4185882 3909270 3587733 3244946 2910252 2615694
35422B615694k26226j41843n9818P94K6982J6532k1822p3636j26837j77520k29214
$$ 2615694 2389468 2247625 2187807 2188601 2215583 2232115 2210293 2136657 2009820 1832300 1603086
35411A603086k86124l45621l95881m20252m05146l46348k50697j33572j4050R0207
$$ 1603086 1316962 971341 575460 155208 -249938 -596286 -846983 -980555 -994605 -904398
35401i04398J67044K11878K27074K18858J93268J53289R8908L0137m9330j30778
$$ -904398 -737354 -525476 -298402 -79544 113724 267013 365921 396058 346728 215950
35391B15950k02867k55894k84705k88808k71292k38294j98838j63287j39737j30078
$$ 215950 13083 -242811 -527516 -816324 -1087616 -1325910 -1524748 -1688035 -1827772 -1957850
35381a957850j28333j22592j00243n4394J1954Q7002J56401K10404K46957K69617
$$ -1957850 -2086183 -2208775 -2309018 -2363412 -2351458 -2264456 -2108055 -1897651 -1650694 -1381077
35371a381077K83668K94054L05401L21875L45604L74603M01642M15217M02768
$$ -1381077 -1097409 -803355 -497954 -176079 169525 544128 945770 1360987 1763755
35362A763755L55723K73979J66945N0324n8953j46415k01686k19601k01665j56510
$$ 1763755 2119478 2393457 2560402 2610726 2551773 2405358 2203672 1984071 1782406 1625896
35352A625896r7371l6722J9144P2156J29695J98966K81826L72522M58306N21999
$$ 1625896 1528525 1491803 1510947 1583103 1712798 1911764 2193590 2566112 3024418 3546417
35342C546417N46089N17988M34902L05558J47566j8062j72088k99812l91344m40659
$$ 3546417 4092506 4610494 5045396 5350954 5498520 5480458 5308370 5008558 4617214 4176555
35332D176555m44910m05104l28113k28478j27477m8069p523j1736n4478j21058
$$ 4176555 3731645 3326541 2998428 2769950 2642473 2594404 2586881 2575145 2520667 2399609
35322B399609j93551k55230k93721l02999k83516k40116j79329j08137l4362L3512
$$ 2399609 2206058 1950828 1657107 1354108 1070592 830476 651147 543010 508648 542160
35312E42160Q8600J28634J56890J79878K03348K29332K55483K75994K83031K68654
$$ 542160 630760 759394 916284 1096162 1299510 1528842 1784325 2060319 2343350 2612004
35302B612004K27860J61959P9698n678q1774j41033j80949k01720k04161j89529
$$ 2612004 2839864 3001823 3081521 3075843 2994069 2853036 2672087 2470367 2266206 2076677
35292B076677j60568j21903p8519l2797J7195P5832J44991K20123K90717L44926
$$ 2076677 1916109 1794206 1715687 1682890 1700085 1775917 1920908 2141031 2431748 2776674
35282B776674L74870L79348L63152L33545K95683K49302J89356J11077J6821q0236
$$ 2776674 3151544 3530892 3894044 4227589 4523272 4772574 4961930 5073007 5089828 5009592
35272E009592j59137k00448j96524j56044r9572m9108j8295q765j3585k4876m0710
$$ 5009592 4850455 4650007 4453483 4297439 4197867 4148759 4130464 4121699 4108114 4083238 4042528
35261D042528o7015j13256j84994k78694l82051m78633n53425n96633o05383n83534
$$ 4042528 3975513 3862257 3677263 3398569 3016518 2537885 1984460 1387827 782444 198910
35251A98910n39838m84791m26952l70138l12749k49916j77732r7244j5794N5233
$$ 198910 -340928 -825719 -1252671 -1622809 -1935558 -2185474 -2363206 -2460450 -2476244 -2421011
35241b421011J04872J26851J21825R7002O3828L4718J9892K5147N1069R3795J46275
$$ -2421011 -2316139 -2189288 -2067463 -1970461 -1906633 -1871915 -1852023 -1826876 -1775807 -1682012 -1535737
35230a535737J99271K42165K64561K59101K24252J65202R2063J6043n4398j15695
$$ -1535737 -1336466 -1094301 -829740 -570639 -346387 -181185 -89122 -73079 -127477 -243172
35220b43172j68592k15452k57296k92327l16517l25708l18006k95276k62977k28740
$$ -243172 -411764 -627216 -884512 -1176839 -1493356 -1819064 -2137070 -2432346 -2695323 -2924063
35210b924063k00743j86542j91907k19187k65599l22381l75380m07382m02433
$$ -2924063 -3124806 -3311348 -3503255 -3722442 -3988041 -4310422 -4685802 -5093184 -5495617
35201e495617l51153k54650j24567K0422J59381K73504L50279L87058L92023L80645
$$ -5495617 -5846770 -6101420 -6225987 -6205565 -6046184 -5772680 -5422401 -5035343 -4643320 -4262675
35191d262675L68770L65935L72236L79612L76361L52429L03042K29855J40546
$$ -4262675 -3893905 -3527970 -3155734 -2776122 -2399761 -2047332 -1744290 -1514435 -1373889
35182a373889M8095l0628p8243q2255m0009L9569J38568K35442L10548L50184
$$ -1373889 -1325794 -1356422 -1434665 -1516920 -1556929 -1517360 -1378792 -1143350 -832802 -482618
35172d82618L48918L10351K45657J69050R1965J9935m5006r8895j33276j38757
$$ -482618 -133700 176651 422308 591358 683323 703258 658252 559357 426081 287324
35162B87324j11666n7942Q940P4242J28179J68373J97616K18954K32047K33231
$$ 287324 175658 117716 126656 200898 329077 497450 695066 914020 1146067 1379298
35152A379298K18199J83738J27171M5730o1327j88560l22102m42407n30724n75123
$$ 1379298 1597497 1781235 1908406 1954136 1892809 1704249 1382147 939740 409016 -166107
35142a66107n72659n27386m46404l36588k04015n6234R4457K30159L31116L82845
$$ -166107 -738766 -1266152 -1712556 -2049144 -2253159 -2309393 -2214936 -1984777 -1653661 -1270816
35132a270816L82320L39116K70728J94777J22629N7844j66n0350q6922j01442
$$ -1270816 -888496 -549380 -278652 -83875 38754 96598 96432 46082 -40840 -142282
35122a42282q8287m9066P078O7069J18495J52405J63169J46755J00421K5479o8744
$$ -142282 -230569 -279635 -272557 -205488 -86993 65412 228581 375336 475757 501236 432492
35111D32492j63944k37477k70270k53257j88781q7685L5103J63939K84385L84740
$$ 432492 268548 31071 -239199 -492456 -681237 -768922 -733819 -569880 -285495 99245
35101I9245M57710N00975N15362N01605M59118L88762K96737J95036R7270J3751
$$ 99245 556955 1057930 1573292 2074897 2534015 2922777 3219514 3414550 3511820 3525571
35091C525571n0092r2334j13359j16483j08957j01257j04261j25468j65955k19477
$$ 3525571 3475479 3383145 3269786 3153303 3044346 2943089 2838828 2713360 2547405 2327928
35081B327928k74280l16634l34227l18355k65252j77297o3722O0319J76757K68790
$$ 2327928 2053648 1737014 1402787 1084432 819180 641883 578161 638480 815237 1084027
35071A084027L24513L38435L11130K48481J61835O8131j2349o1565p0359m2404
$$ 1084027 1408540 1746975 2058105 2306586 2468421 2536552 2524203 2462638 2392279 2349875
35061B349875O658N4435P9160O6797J5190o6446j62116k54819l30349l78338l92371
$$ 2349875 2356533 2410968 2490128 2556925 2572115 2505669 2343553 2088734 1758385 1380047 987676
35050I87676l71077l19875k50801j78426j13537n9126j1929L2153P3467J07996
$$ 987676 616599 296724 45923 -132503 -246040 -305166 -317095 -284942 -211475 -103479
35040a03479J29755J33741J18027Q4995M1117n058m5660p5170r0698r2144q2602
$$ -103479 26276 160017 278044 363039 404156 399098 353438 278268 187570 95426 12824
35029A2824o7640n2378l8028k1112L444L7267P4832J03573J07994P6011M557r8226
$$ 12824 -54816 -107194 -145222 -166334 -162890 -125623 -50791 52782 160776 236787 241344 143118
35017A43118k14911l24116m07297m54583m66622m51365m18283l74669l25887k76990
$$ 143118 -71793 -395909 -803206 -1257789 -1724411 -2175776 -2594059 -2968728 -3294615 -3571605
35007c571605k32086j91659j51454j05044m8053J9766R5797J77021K60874L43544
$$ -3571605 -3803691 -3995350 -4146804 -4251848 -4299901 -4280135 -4184338 -4007317 -3746443 -3402899
34997c402899M17536M71227M91933M71099M08350L11795J94625P0157n2228j68350
$$ -3402899 -2985363 -2514136 -2022203 -1551104 -1142754 -830959 -636334 -566177 -618405 -786755
34987g86755k77239l76719m59566n13656n27189m95714m25795l32446k32948j42076
$$ -786755 -1063994 -1440713 -1900279 -2413935 -2941124 -3436838 -3862633 -4195079 -4428027 -4570103
34977d570103p1070k7967j6062l1188o1838r3888j16825j26913j26104j19113
$$ -4570103 -4641173 -4669140 -4685202 -4716390 -4778228 -4872116 -4988941 -5115854 -5241958 -5361071
34967e361071j10879j04625j00458r5423q5570o8851m6445k1744J716K1148L3817
$$ -5361071 -5471950 -5576575 -5677033 -5772456 -5858026 -5926877 -5973322 -5995066 -5993350 -5972202 -5938385
34956e938385L6258K5673L740j9872k8224l618O2889J64710K80785L84437M54588
$$ -5938385 -5902127 -5876454 -5872714 -5892586 -5920810 -5924428 -5861539 -5696829 -5416044 -5031607 -4577019
34945d577019M81943M67570M17859L41633K50616J59565Q3320L2430J0720J5568
$$ -4577019 -4095076 -3627506 -3209647 -2868014 -2617398 -2457833 -2374513 -2342083 -2331363 -2315795
34935b315795L9466P1955J02317J22651J30097J27391J21713J21562J32018J51004
$$ -2315795 -2276329 -2204374 -2102057 -1979406 -1849309 -1721918 -1600205 -1478643 -1346625 -1195621
34925a195621J70197J80681J78649J66067J46538J21431Q9988N2339J1455k7995
$$ -1195621 -1025424 -844743 -666094 -500027 -353489 -232058 -142070 -89731 -78276 -106271
34915a06271o2614r2376j20452j51299j88174k31357k77567l20763l53764l69862
$$ -106271 -168885 -261261 -381713 -533012 -721186 -952543 -1230110 -1550873 -1904637 -2274499
34905b274499l63596l30702k68268j76091n9126P0961J97338L02748L74654M07399
$$ -2274499 -2638095 -2968797 -3237065 -3413156 -3472282 -3401321 -3203983 -2901235 -2526581 -2119182
34895b119182M01037L59507K90495K06072J21471N1367N718j2488p258J2017L3451
$$ -2119182 -1718145 -1358638 -1068143 -862071 -740600 -689233 -683515 -696003 -703261 -691244 -657793
34884f57793M6496M5197K9209K602k8007n4680o9042o3900l5863J2236P0716J25448
$$ -657793 -611297 -566100 -536891 -534289 -562296 -616976 -686018 -749918 -785781 -773545 -702829 -577381
34872e77381J62844J74989J62143J31284R2260N4114K3180K445q720j4405k0842
$$ -577381 -414537 -239548 -77405 53879 146139 200253 223433 225878 217158 202753 181911
34861A81911l3639n4727q0785j04223j16363j10927q5894m2980J4348Q2731J59507
$$ 181911 148272 93545 12760 -91463 -207826 -318753 -404647 -447627 -433279 -350548 -191041
34850a91041K42034L26236M05518M71152N14425N29327N14159M71475M07131L28952
$$ -191041 50993 377229 782747 1253899 1768324 2297651 2811810 3283285 3690416 4019368
34840D019368K44989J61782Q3702J3578m7055r9026j46420j94824k47415l02118
$$ 4019368 4264357 4426139 4509841 4523419 4476364 4377338 4230918 4036094 3788679 3486561
34830C486561l51966l87806m01353l88001l48897k90839k23176j53667q6623k4330
$$ 3486561 3134595 2746789 2345436 1957435 1608538 1317699 1094523 940856 854233 829903
34820H29903L0502P3990J02576J15380J15648J10207J06876J11228J24527J44038
$$ 829903 860405 934395 1036971 1152351 1267999 1378206 1485082 1596310 1720837 1864875
34810A864875J65034J82887J93898J94748J81740J51349J02554L9181l0186r5263
$$ 1864875 2029909 2212796 2406694 2601442 2783182 2934531 3037085 3076266 3046080 2950817
34800B950817j48031j84593k03969k05393j86723j45562q2794n933P0816J30897
$$ 2950817 2802786 2618193 2414224 2208831 2022108 1876546 1793752 1787819 1858635 1989532
34790A989532J61862J59880J29824Q1820K6858k6467p3580j14237j51954j93010
$$ 1989532 2151394 2311274 2441098 2522918 2549776 2523309 2449729 2335492 2183538 1990528
34780A990528k45095l15118m05699n11274o16140o96451p26085o84499n63730
$$ 1990528 1745433 1430315 1024616 513342 -102798 -799249 -1525334 -2209833 -2773563
34771b773563l72104j32630J23900L68004N77958P41084Q51571R08296R13950
$$ -2773563 -3145667 -3278297 -3154397 -2786393 -2208435 -1467351 -615780 292516 1206466
34762A206466Q74074P95214O83678N46541L93750K38072R1575l8373j49425k40546
$$ 1206466 2080540 2875754 3559432 4105973 4499723 4737795 4829370 4790997 4641572 4401026
34752D401026l08649l49449l61107l45912l08165k51697j80482j01028k2284M7727
$$ 4401026 4092377 3742928 3381821 3035909 2727744 2476047 2295565 2194537 2172253 2219980
34742B219980J04713J46705J70058J67844J33362O6253k4046j20746k06365k68743
$$ 2219980 2324693 2471398 2641456 2809300 2942662 3008915 2984869 2864123 2657758 2389015
34732B389015l02516l06832k82901k34240j68429r7624l6130L982J6977N113k3049
$$ 2389015 2086499 1779667 1496766 1262526 1094097 996473 960343 964325 981302 986415 963366
34721I63366n6984q8871j16218j40992j65790j89442k04963k02001j72402j15150
$$ 963366 906382 817511 701293 560301 394511 205069 106 -201895 -374297 -489447
34711d89447l7313M9021J31102J98759K46080K72125K81066K81355K83300K94960
$$ -489447 -526760 -477739 -346637 -147878 98202 370327 651393 932748 1216048 1511008
34701A511008L17949L45694L66049L67277L43794K98177K38543J73449J07655
$$ 1511008 1828957 2174651 2540700 2907977 3251771 3549948 3788491 3961940 4069595
34692D069595M1122k8872j04444j85032k67759l49360m27994n03207n74047o37003
$$ 4069595 4110717 4081845 3977401 3792369 3524610 3175250 2747256 2244049 1670002 1032999
34682A032999o85941p14525p19448p02388o70152o33142o02128n83503n75306
$$ 1032999 347058 -367467 -1086915 -1789303 -2459455 -3092597 -3694725 -4278228 -4853534
34673d853534n67480n47171n05768m42830l64860k80614j96238j12796k7303O3478
$$ -4853534 -5421014 -5968185 -6473953 -6916783 -7281643 -7562257 -7758495 -7871291 -7898594 -7835116
34663g835116J58972K53079L35804L96805M28554M28101L97377L42059K69217
$$ -7835116 -7676144 -7423065 -7087261 -6690456 -6261902 -5833801 -5436424 -5094365 -4825148
34654d825148J84850R3258r42r0142j63849k12801k34171k32977k17653j92753
$$ -4825148 -4640298 -4547040 -4547982 -4638124 -4801973 -5014774 -5248945 -5481922 -5699575 -5892328
34644e892328j54478r2680J858J29525K78481M27819N55413O45990O95381P09643
$$ -5892328 -6046806 -6139486 -6137628 -6008103 -5729622 -5301803 -4746390 -4100400 -3405019 -2695376
34634b695376P00495O79699O54845O27986N96808N56817N03073M31569L40927
$$ -2695376 -1994881 -1315182 -660337 -32351 564457 1121274 1624347 2055916 2396843
34625B396843K34380J20297J0109q5281j58453k06538k30923k36088k27796k10909
$$ 2396843 2631223 2751520 2761629 2676348 2517895 2311357 2080434 1844346 1616550 1405641
34615A405641j88204j60749j28887r2787n2951j1776K4723M7532M8567K5506j5978
$$ 1405641 1217437 1056688 927801 835014 782063 770287 795010 842542 891109 916615 900637
34604I00637o3642j02380j18599j04581o1915j956N7639R8940J09353Q4832L0447
$$ 900637 836995 734615 616016 511435 449520 447564 505203 604143 713496 798328 828775
34593H28775m1436j15165j77056k19520k41343k43936k26763j86246j19404k9217
$$ 828775 787339 672174 495118 275598 34255 -209681 -436444 -622690 -742094 -771311
34583g71311P2984J69675K41885K73603K54986J84910P2353o4836k04203l23894
$$ -771311 -698327 -528652 -286767 -13164 241822 426732 499085 434249 230046 -93848
34573i3848m06490m40698m21928l52312k39540r4366P1969K48223M21353N74632
$$ -93848 -500338 -941036 -1362964 -1715276 -1954816 -2049182 -1977213 -1728990 -1307637 -733005
34563g33005O88880P47435P42292O77497N67950M34571K98450J76009P5993j245
$$ -733005 -44125 703310 1445602 2123099 2691049 3125620 3424070 3600079 3676072 3674827
34553C674827o1877j14665j66665k20644k74954l25025l65311l91089l99917l92309
$$ 3674827 3612950 3498285 3331620 3110976 2836022 2510997 2145686 1754597 1354680 962371
34543I62371l71113l39949l01795k58615k11903j63247j14322o6387j9811K5940
$$ 962371 591258 251309 -50486 -309101 -521004 -684251 -798573 -864960 -884771 -858831
34533h58831P1951J19289J68238K17159K61535K94715L10952L09397K95843K80829
$$ -858831 -786880 -667591 -499353 -282194 -20659 274056 585008 894405 1190248 1471077
34523A471077K75398K87001L16688L57921L97687M20799M15832L79053L13558
$$ 1471077 1746475 2033476 2350164 2708085 3105772 3526571 3942403 4321456 4635014
34514D635014K24873J16962p994j46166k87921m16826n13587n63347n61835n16359
$$ 4635014 4859887 4976849 4968855 4822689 4534768 4117942 3604355 3041008 2479173 1962814
34504A962814m41192l50946k56295j64125q0481j2770L1206M7084L7673J3767
$$ 1962814 1521622 1170676 914381 750256 669775 657005 688211 735295 772968 786735
34494G86735q928j5239M159M9899J14760J87477K57355L17356L64719L99905M24629
$$ 786735 777807 762568 766727 816626 931386 1118863 1376218 1693574 2058293 2458198 2882827
34483B882827M39635M42887M29493L93960L33621K51306J55763N9954k2068p8728
$$ 2882827 3322462 3765349 4194842 4588802 4922423 5173729 5329492 5389446 5367378 5288650
34473E288650j04124r9753p4062l9527q374J1173J6324Q634p987k8782m9250o6706
$$ 5288650 5184526 5084773 5010711 4971184 4962810 4973983 4990307 4998941 4990954 4962172 4912922 4846216
34461D846216q1744r7883j18851j45605j75831k06148k34555k60851k85031l05415
$$ 4846216 4764472 4666589 4547738 4402133 4226302 4020154 3785599 3524748 3239717 2934302
34451B934302l17965l16754k95017k46618j67952o0407O7393J99068L13585L92360
$$ 2934302 2616337 2299583 2004566 1757948 1589996 1529589 1596982 1796050 2109635 2501995
34441B501995M27615M26850M09569L97839M06501M38578M86698N37769N78159
$$ 2501995 2929610 3356460 3766029 4163868 4570369 5008947 5495645 6033414 6611573
34432F611573N98112N94655N71708N37154M98580M59902M20308L75476L20600
$$ 6611573 7209685 7804340 8376048 8913202 9411782 9871684 10291992 10667468 10988068
34423A0988068K53525J75907R1699M884q1046j62072k33285k90213l30429l53585
$$ 10988068 11241593 11417500 11509199 11514083 11433037 11270965 11037680 10747467 10417038 10063453
34413A0063453l60102l49743l20716k69563j92331q7432M1042J81842L18615M35121
$$ 10063453 9703351 9353608 9032892 8763329 8570998 8483566 8524608 8706450 9025065 9460186
34403I460186N20905N73777N97227N94975N67565N13491M32694L28719K08850
$$ 9460186 9981091 10554868 11152095 11747070 12314635 12828126 13260820 13589539 13798389
34394A3798389Q4007l1707j23901j83447k11058k16987k15706k19138k31781k49823
$$ 13798389 13882396 13850689 13726788 13543341 13332283 13115296 12899590 12680452 12448671 12198848
34384A2198848k64310k66544k52375k23017j82791j36077q4891k7794L9002J18178
$$ 12198848 11934538 11667994 11415619 11192602 11009811 10873734 10788843 10761049 10800051 10918229
34374A0918229K07286K97392L75536M29201M50153M36463L92578L27943K55063
$$ 10918229 11125515 11422907 11798443 12227644 12677797 13114260 13506838 13834781 14089844
34365A4089844J88029J41397J28070J55700K23334L20719M31419N38589O31046
$$ 14089844 14277873 14419270 14547340 14703040 14926374 15247093 15678512 16217101 16848147
34356A6848147P06550P70352Q30075Q90612R52226J012045J067428J119715J176841
$$ 16848147 17554697 18325049 19155124 20045736 20997962 22010007 23077435 24197150 25373991
34347B5373991J252493J360803J509524J696877J914108K150987K400024K657779
$$ 25373991 26626484 27987287 29496811 31193688 33107796 35258783 37658807 40316586
34339D0316586K924461L203222L499847L822692M182170M588870N050950N572876
$$ 40316586 43241047 46444269 49944116 53766808 57948978 62537848 67588798 73161674
34331G3161674O157022O807043P530685Q340232R250320J0273589J1416109J2675382
$$ 73161674 79318696 86125739 93656424 101996656 111246976 121520565 132936674 145612056
34323A45612056J4042503J5505771J7050321J8650945K0260359K1797223K3136622
$$ 145612056 159654559 175160330 192210651 210861596 231121955 252919178 276055800
34316B76055800K4103783K4473303K3980412K2354353J9381202J4989926R332643
$$ 276055800 300159583 324632886 348613298 370967651 390348853 405338779 414671422
34309D14671422K813896l965203j0341054j5746928j9829932k2485458k3815842
$$ 414671422 417485318 413520115 403179061 387432133 367602201 345116743 321300901
34302C21300901k4050971k3469483k2341252k0894668j9304005j7690287j6129246
$$ 321300901 297249930 273780447 251439195 230544527 211240522 193550235 177420989
34295A77420989j4661563j3303291j2055777j0914434r874513q932746q085766
$$ 177420989 162759426 149456135 137400358 126485924 116611411 107678665 99592899
34288I9592899p327692o648918o036489n475830m953785m462571m002638l581732
$$ 99592899 92265207 85616289 79579800 74103970 69150185 64687614 60684976 57103244
34280E7103244l209522k890915k622570k394452k194319k011778j840236j677111
$$ 57103244 53893722 51002807 48380237 45985785 43791466 41779688 39939452 38262341
34272C8262341j523231j381822j257126j152390j067353r96508r30172q59209
$$ 38262341 36739110 35357288 34100162 32947772 31880419 30883911 29953739 29094530
34264B9094530p80958p02089o35927n95932n89386o14422o60961p14353p59790
$$ 29094530 28313572 27611483 26975556 26379624 25790238 25175816 24514855 23800502 23040712
34255B3040712p85937p86828p62253p16960o58581n94182n27145m57279l85115
$$ 23040712 22254775 21467947 20705694 19988734 19330153 18735971 18208826 17751547 17366432
34246A7366432l17134k66491k47317k66544l19866l94608m76478n54662o22229
$$ 17366432 17049298 16782807 16535490 16268946 15949080 15554472 15077994 14523332 13901103
34237A3901103o73597p02882p05462o81414o37453n85228n36771m99980m76474
$$ 13901103 13227506 12524624 11819162 11137748 10500295 9915067 9378296 8878316 8401842
34228H401842m62616m52963m44173m36821m33518m34948m37333m33629m17455
$$ 8401842 7939226 7486263 7042090 6605269 6171751 5736803 5299470 4865841 4448386
34219D448386l86837l45797l03246k69188k49309k40862k32769k10477j62669
$$ 4448386 4061549 3715752 3412506 3143318 2894009 2653147 2420378 2209901 2047232
34210B047232q6244J2390J19977K21751L06797L70262M11478M30366M25501L95007
$$ 2047232 1960988 1973378 2093355 2315106 2621903 2992165 3403643 3834009 4259510 4654517
34200D654517L38563K58678J60704N2071n8909j64449k58468l37405m00463m48809
$$ 4654517 4993080 5251758 5412462 5464533 5405624 5241175 4982707 4645302 4244839 3796030
34190C796030m83601n04088n07620m92089m58728m12605l60873l10539k67163
$$ 3796030 3312429 2808341 2300721 1808632 1349904 937299 576426 265887 -1276
34181a276k33700k08869j86414j57130j13287n2335K2558J04628J85825K57816
$$ -1276 -234976 -443845 -630259 -787389 -900676 -953011 -930453 -825825 -640000 -382184
34171c82184L12618L44283L51773L40914L23225L10942L10788L20708L32208L36878
$$ -382184 -69566 274717 626490 967404 1290629 1601571 1912359 2233067 2565275 2902153
34161B902153L32058L21482L11050L03699K97343K86383K64527K26894J71376
$$ 2902153 3234211 3555693 3866743 4170442 4467785 4754168 5018695 5245589 5416965
34152E416965J00046K0069n7489j21461j64680j85172j83607j59652j10998l6326
$$ 5416965 5517011 5537080 5479591 5358130 5193450 5008278 4824671 4665019 4554021 4517695
34142D517695O0162J66757K66996L45716L94167M10787L98013L58780K95923K14209
$$ 4517695 4577857 4744614 5011610 5357326 5751493 6162280 6560293 6919073 7214996 7429205
34132G429205J21953K9929n1915j17485j65426j97812k17772k27428k26952k15269
$$ 7429205 7551158 7581087 7529172 7411687 7246261 7048449 6830677 6603249 6376297 6161028
34122F161028j91992j59442j22873q8151n8360l2274o074K3195N5264Q6557J11467
$$ 6161028 5969036 5809594 5686721 5598570 5540210 5507936 5501862 5525057 5580321 5666878 5778345
34111E778345J23990J19532R6590N7071M487n8447j30409k09597k91374l67684
$$ 5778345 5902335 6021867 6118457 6175528 6180015 6121568 5991159 5781562 5490188 5122504
34101E122504m28834m66623m77503m64644m37549m08442l86620l73856l63810
$$ 5122504 4693670 4227047 3749544 3284900 2847351 2438909 2052289 1678433 1314623
34092A314623l45746l09906k50999j68505o5280N3127J78230K98881M03288M81629
$$ 1314623 968877 658971 407972 239467 174187 227314 405544 704425 1107713 1589342
34082A589342N27437N37641N12569M56519L77823K87364J95848J11180L6736k8806
$$ 1589342 2116779 2654420 3166989 3623508 4001331 4288695 4484543 4595723 4632459 4603653
34072D603653q9584j48941k06272k56754k94100l14060l16057l02425k76316k39993
$$ 4603653 4514069 4365128 4158856 3902102 3608002 3293942 2977885 2675460 2399144 2159151
34062B159151j94392j40055p8347j2006N4879J16816J67110J99479K10708K01728
$$ 2159151 1964759 1824704 1746357 1734351 1789230 1906046 2073156 2272635 2483343 2685071
34052B685071J75599J34699Q0782J8262m3362r1438j15356j10876q0738l2013
$$ 2685071 2860670 2995369 3076151 3094413 3051051 2959613 2844257 2733381 2652643 2620630
34042B620630K7386R0874J53026K07885K48187K67136K61818K35300J95541J52008
$$ 2620630 2648016 2738890 2891916 3099801 3347988 3615124 3876942 4112242 4307783 4459791
34032D459791J12457Q1214N9058M4241L4167K6863K1485J7975J6968K0064K9406
$$ 4459791 4572248 4653462 4712520 4756761 4790928 4817791 4839276 4857251 4874219 4894283 4923689
34021D923689M5726O6193Q4861R6421J00389J01731J07162J20227J38974J56822
$$ 4923689 4969415 5035608 5120469 5216890 5317279 5419010 5526172 5646399 5785373 5942195
34011E942195J64606J52222J10613L5175p0055j90070l00654l74642l90809l41929
$$ 5942195 6106801 6259023 6369636 6404811 6334756 6144686 5844032 5469390 5078581 4736652
34001D736652k38045j02840L5046J50931K28877K61872K49922J98468J17092J7681
$$ 4736652 4498607 4395767 4430813 4581744 4810621 5072493 5322415 5520883 5637975 5655656
33991E655656q7509j86637k67749l18781l29878k97506k27528j34559l7503M6423
$$ 5655656 5568147 5381510 5113761 4794980 4465102 4167596 3940068 3805509 3768006 3814429
33981C814429J06344J39270J48723J41358J23223R7291O3288J9327l6163j03301
$$ 3814429 3920773 4060043 4208766 4350124 4473347 4570638 4633926 4653253 4617090 4513789
33971D513789j80201k62322l42125m09987m56452m74798m62938m24367l67967
$$ 4513789 4333588 4071266 3729141 3319154 2862702 2387904 1924966 1500599 1132632
33962A132632l05987k50524k10285j89422j88050k02675k26313k49751k64594
$$ 1132632 826645 576121 365836 176414 -11636 -214311 -440624 -690375 -954969
33953i54969k65970k52524k24437j82165j27410o4733j785N1987Q6977R5040P1589
$$ -954969 -1220939 -1473463 -1697900 -1880065 -2007475 -2072208 -2073993 -2022006 -1935029 -1839989 -1768400
33942a768400J7611o0028j50883k44253l30944m02759m51498m69555m52141l99014
$$ -1768400 -1750789 -1810817 -1961700 -2205953 -2536897 -2939656 -3391154 -3860709 -4312850 -4711864
33932d711864l14277k04916p9897M9679J71078K72273L45329L88241M04111L98640
$$ -4711864 -5026141 -5231057 -5310954 -5261275 -5090197 -4817924 -4472595 -4084354 -3680243 -3281603
33922c281603L77589L45042L02644K50333J88727J21787N7419N066k8472m2480
$$ -3281603 -2904014 -2558972 -2256328 -2005995 -1817268 -1695481 -1638062 -1632996 -1661468 -1703948
33912a703948m3356m2485n1157p4491j07868j38900j54058j45576j14042o6187
$$ -1703948 -1747304 -1789789 -1840946 -1915437 -2023305 -2162205 -2316263 -2461839 -2575881 -2642068
33902b642068j0743M4258R1718J24687J36513J23119Q6390L5787j4225n0353o6339
$$ -2642068 -2652811 -2608553 -2516835 -2392148 -2255635 -2132516 -2046126 -2010339 -2024564 -2074917 -2141256
33891b141256o4612n2959l9198k7571j8697j2126q909j1735k2360l8547n3586
$$ -2141256 -2205868 -2258827 -2298025 -2325596 -2344293 -2356419 -2365328 -2377063 -2399423 -2437970 -2491556
33880b491556n9415n1226l0043j504K8245N6573Q5632J20018J62445K10561K57512
$$ -2491556 -2550971 -2602197 -2632240 -2633744 -2605499 -2548926 -2463294 -2343276 -2180831 -1970270 -1712758
33869a712758K96110L23705L43933L63725L87505M12859M31051M32097M10610
$$ -1712758 -1416648 -1092943 -749010 -385285 2220 415079 846130 1278227 1688837
33860A688837L68405L12790K52634J94928J43377R8698O0025K6245l646l1330
$$ 1688837 2057242 2370032 2622666 2817594 2960971 3059669 3119694 3145939 3142293 3110963
33850C110963n9631r1354j26947j63292j94639k14641k17794k00640j63674j12863
$$ 3110963 3051332 2959978 2833031 2669739 2475100 2260459 2042665 1842025 1678351 1565488
33840A565488n8200r068L0023N9480Q0977R4330R8012R2322Q1715P3734P4886
$$ 1565488 1507288 1498220 1528243 1587723 1668700 1763030 1861042 1953364 2035079 2108813 2183699
33829B183699Q6217J02012J12574J08981Q6391M4893j0760p1604j26267j65117
$$ 2183699 2269916 2371928 2484502 2593483 2679874 2724767 2714007 2642403 2516136 2351019
33819B351019j84921j90848j94243k07522k38360k85577l38815l83456m08649
$$ 2351019 2166098 1975250 1781007 1573485 1335125 1049548 710733 327277 -81372
33810h1372m13424m06481l99898m01517m11252m23075m30185m29183m20883m08623
$$ -81372 -494796 -901277 -1301175 -1702692 -2113944 -2537019 -2967204 -3396387 -3817270 -4225893
33800d225893l96421l88212l87445l96094m13332m34755m52972m59558m47780
$$ -4225893 -4622314 -5010526 -5397971 -5794065 -6207397 -6642152 -7095124 -7554682 -8002462
33791h002462m14622l60551k87180j95233q5017M1236J78170L18959M57863N90316
$$ -8002462 -8417084 -8777635 -9064815 -9260048 -9345065 -9303829 -9125659 -8806700 -8348837 -7758521
33781g758521P09891Q05601Q63831Q75219Q41695P77582P02826O32666N70732
$$ -7758521 -7048630 -6243029 -5379198 -4503979 -3662284 -2884702 -2181876 -1549210 -978478
33772i78478N09737M38205L48166K39434J19685J840r9738j73454k14366k26073
$$ -978478 -468741 -30536 317630 557064 676749 678589 578851 405397 191031 -35042
33762c5042k19499k08948k06980k19618k43101k63856k62981k24040j40438j8590
$$ -35042 -254541 -463489 -670469 -890087 -1133188 -1397044 -1660025 -1884065 -2024503 -2043093
33752b043093J24317K66337L87770M76234N27897N45128N33338M99598M53156
$$ -2043093 -1918776 -1652439 -1264669 -788435 -260538 284590 817928 1317526 1770682
33743A770682M04839L63653L32179L04811K70987K21714J54690P4836r344r0132
$$ 1770682 2175521 2539174 2871353 3176164 3447151 3668865 3823555 3898391 3889047 3798915
33733C798915j62839k25396k76388l12569l27287l11944k61231j79213q1127J1676
$$ 3798915 3636076 3410680 3134292 2821723 2494436 2182492 1921261 1742048 1660921 1672597
33723A672597Q0577J16610J21563J03932P2968L4739q017n3267r7318j34849j60682
$$ 1672597 1753174 1869784 1991347 2095279 2168247 2202986 2194969 2141702 2044384 1909535 1748853
33712A748853j70833j62178j32073p9479o941P8542J66807K47009L09659L47535
$$ 1748853 1578020 1415842 1283769 1204290 1197349 1275891 1442698 1689707 1999366 2346901
33702B346901L55966L33444K82525K10207J27084M5096k5427p8369j12876j31998
$$ 2346901 2702867 3036311 3318836 3529043 3656127 3701223 3675796 3597427 3484551 3352553
33692C352553j39818j39238j31912j19412j03544q5015o2155l1750Q000N4775
$$ 3352553 3212735 3073497 2941585 2822173 2718629 2633614 2571459 2539709 2547709 2602484
33682B602484J02189J43094J73966J97003K18334K43552K74103L06927L37283
$$ 2602484 2704673 2847767 3021733 3218736 3437070 3680622 3954725 4261652 4598935
33673D598935L62179L82148M00726M22922M53765M97045N53795O21369O94821
$$ 4598935 4961114 5343262 5743988 6166910 6620675 7117720 7671515 8292884 8987705
33664H987705P70447Q48207R29831J014065J094331J161895J211601J244356J264030
$$ 8987705 9758152 10606359 11536190 12550255 13644586 14806481 16018082 17262438 18526468
33655A8526468J271631J261406J221403J137638R99101Q00798N44624K40009r4355
$$ 18526468 19798099 21059505 22280908 23418546 24417647 25218445 25763069 26003078 25908723
33646B5908723m29756p31400r67397j118443j182912j175293j119462j040028
$$ 25908723 25478967 24747567 23780170 22661727 21478815 20303522 19184060 18144032
33638A8144032r55053q72997p94452p16640o37772n59984m90495m40171m18762
$$ 18144032 17188979 16315982 15521530 14804890 14167118 13607134 13116639 12676468 12257706
33629A2257706m28795m62383n03804n36358n48983n38795n09299m66652m16902
$$ 12257706 11828911 11366528 10862724 10326366 9777383 9238588 8729289 8262637 7845735
33620G845735l65317l16582k74502k41126k16383j98372j83821j68578j48880
$$ 7845735 7480418 7163836 6889334 6648208 6431825 6233453 6049632 5881054 5732174
33611E732174j23295r3498o2749l3510o792J6136L1800L4412J7532k4197r3839
$$ 5732174 5608879 5515381 5452632 5419122 5412330 5428466 5460266 5494678 5512210 5488013 5394174
33600E394174j90834l08887m34404n47857o29177o64575o50523n92478n00283
$$ 5394174 5203340 4894453 4460049 3912192 3283015 2618440 1967917 1375439 875156
33591H75156l84411k55356j24910o877Q4438J37634J48254J21377P0866J4982
$$ 875156 490745 235389 110479 103602 188040 325674 473928 595305 666171 681153
33581F81153k9218m9557l9229L849P6470J68649K64209L45400L99626M23733M22963
$$ 681153 651935 602378 563149 566998 643468 812117 1076326 1421726 1821352 2245085 2668048
33570B668048M06123L80786L51234L18574K81247K35498J76693J02492J6400p0859
$$ 2668048 3074171 3454957 3806191 4124765 4406012 4641510 4818203 4920695 4937095 4866236
33560D866236j44021j88948j97925j71823j18770n1054J8055P7020J18223J39023
$$ 4866236 4722215 4533267 4335342 4163519 4044749 3993695 4011750 4088770 4206993 4346016
33550D346016J40965J27472J01824O6705K4917k0253o5635j08437j45175j70525
$$ 4346016 4486981 4614453 4716277 4782982 4807899 4787646 4722011 4613574 4468399 4297874
33540D297874j78421j66224j38999j09833r4661j04084j37351j82512k22908k45695
$$ 4297874 4119453 3953229 3814230 3704397 3609736 3505652 3368301 3185789 2962881 2717186
33530B717186k46933k30868k05279j76931j49103j21027q8861m8372J342N5721
$$ 2717186 2470253 2239385 2034106 1857175 1708072 1587045 1498184 1449812 1451154 1506875
33520A506875J06686J47933J79436K06902K36118K66709K90563K95955K73505
$$ 1506875 1613561 1761494 1940930 2147832 2383950 2650659 2941222 3237177 3510682
33511C510682K19466J35460K7270r5341k18612l26748m06116m49862m60193m46641
$$ 3510682 3730148 3865608 3892878 3797537 3578925 3252177 2846061 2396199 1936006 1489365
33501A489365m20484l88058l47337k90407k10013j05198J7709J48100K74523L86208
$$ 1489365 1068881 680823 333486 43079 -166934 -272132 -254423 -106323 168200 554408
33491E54408M73203N26946N41712N15906M52383L58453K46348J33386L9456j8974
$$ 554408 1027611 1554557 2096269 2612175 3064558 3423011 3669359 3802745 3842201 3823227
33481C823227l5817j8605J4538M2578M9363K7887j9701q4801j55796k20939k70332
$$ 3823227 3787410 3768805 3783343 3825921 3875284 3903171 3883470 3798669 3642873 3421934 3151602
33470C151602k97231k99033k77852k39574j90716j34459o9271P807R5079J82286
$$ 3151602 2854371 2555338 2277486 2037912 1847196 1712737 1643466 1651273 1746352 1928638
33460A928638K52531K89164K83333K37499J63224P5130j4651r8415j71591k31346
$$ 1928638 2181169 2470333 2753666 2991165 3154389 3229519 3214868 3116453 2944862 2713516
33450B713516k77077l11457l39302l63884l83508l91785l81750l50798l02704
$$ 2713516 2436439 2124982 1785680 1421796 1038288 646503 264753 -86045 -388749
33441c88749k45886j90120j44127j14151j02517j06543j19706j35026j48063j57318
$$ -388749 -634635 -824755 -968882 -1083033 -1185550 -1292093 -1411799 -1546825 -1694888 -1852206
33431a852206j63036j66347j68668j69846j65955j49403j12726n3428K3363J06151
$$ -1852206 -2015242 -2181589 -2350257 -2520103 -2686058 -2835461 -2948187 -3001615 -2978252 -2872101
33421b872101J81390K39007K76245K97614L11003L22801L34733L43390L42341
$$ -2872101 -2690711 -2451704 -2175459 -1877845 -1566842 -1244041 -909308 -565918 -223577
33412b23577L26459K96407K59989K28815K13003K17900K44019K88264L45273M09227
$$ -223577 102882 399289 659278 888093 1101096 1318996 1563015 1851279 2196552 2605779
33402B605779M75897N43405O10925O76790P37467P87201Q17732Q19161P83245
$$ 2605779 3081676 3625081 4236006 4912796 5650263 6437464 7255196 8074357 8857602
33393H857602P08152O01090M75915L46665K21325J00388j9337j39369k57372l68913
$$ 8857602 9565754 10166844 10642759 10989424 11210749 11311137 11291800 11152431 10895059 10526146
33383A0526146m69970n56914o24561o65425o72085o41608n78909m96759m12097
$$ 10526146 10056176 9499262 8874701 8209276 7537191 6895583 6316674 5819915 5407818
33374E407818l40635k92489k70650k72043k89624l14289l36258l46527l38870
$$ 5407818 5067183 4774694 4504044 4232001 3942377 3628088 3291830 2945303 2606433
33365B606433l12325k72386k29013j91644j64323j44436j25603j02466p4528m7449
$$ 2606433 2294108 2021722 1792709 1601065 1436742 1292306 1166703 1064237 989709 942260
33355I42260l1056l4524o1206j06646j61547k17071k68287l13381l50169l73218
$$ 942260 911204 876680 815474 708828 547281 330210 61923 -251458 -601627 -974845
33345i74845l73764l42557k74012j69598l8793J02933K37908L49828M25840M57984
$$ -974845 -1348609 -1691166 -1965178 -2134776 -2173569 -2070636 -1832728 -1482900 -1057060 -599076
33335e99076M45512L97435L32171K71727K32696K19829K26386K39976K49169K47467
$$ -599076 -153564 243871 576042 847769 1080465 1300294 1526680 1766656 2015825 2263292
33325B263292K34441K15058J97350J88307J89529J95494J96241J83121J53828
$$ 2263292 2497733 2712791 2910141 3098448 3287977 3483471 3679712 3862833 4016661
33316D016661J13367P0411L1665j863l4335p0654j11405j51177j81815j98640
$$ 4016661 4130028 4200439 4232104 4230241 4195906 4125252 4013847 3862670 3680855 3482215
33306C482215k04787k10045k24593k52138k87592l20700l42174l47379l35721
$$ 3482215 3277428 3067383 2842790 2590652 2303060 1982360 1640186 1292807 957086
33297I57086l08325k67310k16833j63506j14662p5673m8420l1514k1358j3136
$$ 957086 648761 381451 164618 1112 -113550 -189223 -237643 -269157 -290515 -303651
33287c03651j509J8713N1856J00392J63759K36970L09678L66805L91754L72047
$$ -303651 -305160 -286447 -234591 -134199 29560 266530 576208 943013 1334767 1706814
33277A706814L04978K00494P9426l2473j13039j51752j53252j33691j11670r9595
$$ 1706814 2011792 2212286 2291712 2259239 2146200 1994448 1841196 1707505 1595835 1496240
33267A496240j00347j09554j20408j28168j32742j38074j48563j65385j86131
$$ 1496240 1395893 1286339 1165931 1037763 905021 766947 618384 452999 266868
33258B66868k07856k29978k54080k81177l09168l32153l41978l31520k98248k45926
$$ 266868 59012 -170966 -425046 -706223 -1015391 -1347544 -1689522 -2021042 -2319290 -2565216
33248b565216j83121j19473o1996j3128K9195O9621J12219J57582K01637K37115
$$ -2565216 -2748337 -2867810 -2929806 -2942934 -2913739 -2844118 -2731899 -2574317 -2372680 -2135565
33238b135565K57033K58537K44876K24092K05006J93129J88808J87839J83257
$$ -2135565 -1878532 -1619995 -1375119 -1151027 -946021 -752892 -564084 -376245 -192988
33229a92988J67398J34222Q1288J0653p1577j56120k31120k83068k98993k69784
$$ -192988 -25590 108632 189920 200573 128996 -27124 -258244 -541312 -840305 -1110089
33219a110089j93442p6712O5522K12995L44115M40387M90057M89739M43625L61119
$$ -1110089 -1303531 -1380243 -1314721 -1101726 -757611 -317224 172833 662572 1106197 1467316
33209A467316K54796J39844L4234m2553p3412m9357K5642J33677K47573L40329
$$ 1467316 1722112 1861956 1896190 1853637 1780225 1730868 1756510 1890187 2137760 2478089
33199B478089L95112M10491L97814L72575L45196L16860K81998K34485J72656
$$ 2478089 2873201 3283692 3681506 4054081 4399277 4716137 4998135 5232620 5405276
33190E405276J00025K2499n5171j31025k04824k75012l35946l78033l91269l69759
$$ 5405276 5505301 5527800 5472629 5341604 5136780 4861768 4525822 4147789 3756520 3386761
33180C386761l13819k28937j23832r839R8602J84261K29520K21150J56142M5661
$$ 3386761 3072942 2844005 2720173 2710334 2808936 2993197 3222717 3443867 3600009 3645670
33170C645670q6361k10563l01603l44564l36550k85257k06175j18083l7048K8422
$$ 3645670 3559309 3348746 3047143 2702579 2366029 2080772 1874597 1756514 1719466 1747888
33160A747888P7892J15028J42401J58937J61604J49625J27519J04057Q7596Q1397
$$ 1747888 1825780 1940808 2083209 2242146 2403750 2553375 2680894 2784951 2872547 2953944
33150B953944Q2234Q2330P2561M5493j954o7072j42507k19905k93189l58998m14614
$$ 2953944 3036178 3118508 3191069 3236562 3234608 3167536 3025029 2805124 2511935 2152937 1738323
33139A738323m56099m78513m77774m52522m04875l39944k64792j87578j16887
$$ 1738323 1282224 803711 325937 -126585 -531460 -871404 -1136196 -1323774 -1440661
33130a440661o0629k4167q761j1725k8390n4425q6897j23584j61118j93176k10392
$$ -1440661 -1501290 -1525457 -1534218 -1545943 -1574333 -1628758 -1715655 -1839239 -2000357 -2193533 -2403925
33119b403925k02977j65400j00336j9100O2149J28421J70848J87897J82881J59975
$$ -2403925 -2606902 -2772302 -2872638 -2891738 -2829589 -2701168 -2530320 -2342423 -2159542 -1999567
33109a999567J21935P0692R455n6016j18003j68574k01213k11764j98778j63553
$$ -1999567 -1877632 -1806940 -1797485 -1853501 -1971504 -2140078 -2341291 -2553055 -2751833 -2915386
33099b915386j10013m4306K5803R1641J44537J77530J87806J78448J57438J33698
$$ -2915386 -3025399 -3069705 -3043902 -2952261 -2807724 -2630194 -2442388 -2263940 -2106502 -1972804
33089a972804J12526R3597P2566M4870R480k9041o1119p5602o4737k8114K6971
$$ -1972804 -1860278 -1766681 -1694115 -1649245 -1639765 -1668806 -1729925 -1805527 -1870264 -1898378 -1871407
33078a871407Q9052J47552J95941K31248K51599K54879K39813K07424J60413J00785
$$ -1871407 -1782355 -1634803 -1438862 -1207614 -956015 -701136 -461323 -253899 -93486 7299
33068G299K8856n4687j45377k33718l07519l56050l73115l57679l12740k44323
$$ 7299 36155 -18532 -163909 -397627 -705146 -1061196 -1434311 -1791990 -2104730 -2349053
33058b349053j61568p7546q985K6626J6742l9597j27899k20486k85144k96289
$$ -2349053 -2510621 -2588167 -2597152 -2570526 -2553784 -2593381 -2721280 -2941766 -3226910 -3523199
33048c523199k42928j30408K2840J90595L44770M62019N29637N47486N24113M69684
$$ -3523199 -3766127 -3896535 -3873695 -3683100 -3338330 -2876311 -2346674 -1799188 -1275075 -805391
33038h05391L91101K92302J77873N5955o1808j62908k37813k83595l05553l15075
$$ -805391 -414290 -121988 55885 111840 50032 -112876 -350689 -634284 -939837 -1254912
33028a254912l24127l39515l60495l80617l91562l86194l59646l09500k36579
$$ -1254912 -1579039 -1918554 -2279049 -2659666 -3051228 -3437422 -3797068 -4106568 -4343147
33019d343147j46616n0852L6349J02348J40044J48000J28090Q3872K1213n0551
$$ -4343147 -4489763 -4540615 -4504266 -4401918 -4261874 -4113874 -3985784 -3901912 -3880699 -3931250
33009c931250j19035j71174j96419j89737j53586r7725l6550J5128M6342N3168
$$ -3931250 -4050285 -4221459 -4417878 -4607615 -4761201 -4858926 -4895476 -4880348 -4834006 -4780838
32999d780838M0072J8580L049N184K9948P4537J29941J83536K21754K33179K12070
$$ -4780838 -4740766 -4722186 -4719137 -4713953 -4684005 -4609468 -4479527 -4295991 -4074237 -3841058 -3628988
32988c628988J61043R0827J6734m6030q5688r5149p2296j9874N5433J44418K36276
$$ -3628988 -3467945 -3377118 -3360384 -3406414 -3492102 -3587251 -3659547 -3679421 -3623988 -3479570 -3243294
32977c243294L19069L81671M17861M29704M26576M19672M16053M16612M18689
$$ -3243294 -2924225 -2542554 -2124693 -1694989 -1268413 -848741 -432688 -16076 402613
32968D02613M20606M24601M36199M60656M98983N45638N88617O11795N99408N41783
$$ 402613 823219 1247820 1684019 2144675 2643658 3189296 3777913 4389708 4989116 5530899
32958E530899M39679L04461J53854O093j24623k30262l09037l64256m02743m33513
$$ 5530899 5970578 6275039 6428893 6434986 6310363 6080101 5771064 5406808 5004065 4570552
32948D570552m66144n07719n59231o14053o60652o87910o89279o63826o15167
$$ 4570552 4104408 3596689 3037458 2423405 1762753 1074843 385564 -278262 -893429
32939h93429n50311m78757m11054l56295l19487l00074k92318k87097k74385k46273
$$ -893429 -1443740 -1922497 -2333551 -2689846 -3009333 -3309407 -3601725 -3888822 -4163207 -4409480
32929d409480j99829j38296o8979J101O8243J31313J88797K37447K74068K98491
$$ -4409480 -4609309 -4747605 -4816584 -4815483 -4747240 -4615927 -4427130 -4189683 -3915615 -3617124
32919c617124L15014L31514L56587L95625M47191N02365N48402N74887N77961
$$ -3617124 -3302110 -2970596 -2614009 -2218384 -1771193 -1268828 -720426 -145539 432422
32910D32422N59766N24061M72064M01596L09836J96866O7178p1613k10857l41629
$$ 432422 992188 1516249 1988313 2389909 2699745 2896611 2963789 2892176 2681319 2339690
32900B339690m54089n37843n84752n92952n68618n23217m67559m06759l39178
$$ 2339690 1885601 1347758 763006 170054 -398564 -921781 -1389340 -1796099 -2135277
32891b135277k59178j61313m3981Q8158K23766L47536M45383N08894N35895N27849
$$ -2135277 -2394455 -2555768 -2599749 -2511591 -2287825 -1940289 -1494906 -986012 -450117 77732
32881G7732M87756M20319L32824K34267J33434L8160m3976j05357j39913j45588
$$ 77732 565488 985807 1318631 1552898 1686332 1724492 1680516 1575159 1435246 1289658
32871A289658j25883q9637m9008j5793K638N660j690j2148j9254j8327o194J8610
$$ 1289658 1163775 1074138 1025130 1009337 1011975 1017635 1015945 1003797 984543 966216 960022 978632
32859I78632N4696R6939J37366J67754J82248J78145J54395J09634M2123m7729
$$ 978632 1033328 1130267 1267633 1435387 1617635 1795780 1950175 2059809 2101932 2054203
32849B054203j53985k63649l58482m19625m33053l93707l06549j84237m2791J02056
$$ 2054203 1900218 1636569 1278087 858462 425409 31702 -274847 -459084 -501875 -399819
32839c99819K36361L48140M28000M70537M74706M42221L75903K80668J66864N2130
$$ -399819 -163458 184682 612682 1083219 1557925 2000146 2376049 2656717 2823581 2875711
32829B875711m1531r4943r9335o0102N423P5411J32214J67145J79260J71115J46444
$$ 2875711 2834180 2739237 2639902 2579800 2585223 2660634 2792848 2959993 3139253 3310368 3456812
32818C456812J11058P3480M2057K0027L269j6881m7980r2443j47487k07878k68960
$$ 3456812 3567870 3641350 3683407 3703434 3706703 3689822 3641842 3549399 3401912 3194034 2925074
32807B925074l27996l83467m32925m70823m88177m75529m28479l52277k61596
$$ 2925074 2597078 2213611 1780686 1309863 821686 346157 -82322 -434599 -696195
32798f96195j74495j03813n1508r649L2598Q0920J32324J78227K10878K27550
$$ -696195 -870690 -974503 -1026011 -1035660 -1003062 -922142 -789818 -611591 -400713 -173163
32788a73163K29705K19325J96875J62847J20825P8601M6047L1535L9483P0132
$$ -173163 56542 275867 472742 635589 756414 835015 881062 912597 952080 1022212
32778A022212J20761J87070K64358L48391M35435N20937N97703O55378O82502
$$ 1022212 1142973 1330043 1594401 1942792 2378227 2899164 3496867 4152245 4834747
32769D834747O70333O16105N23803M02285K62084J12849l7649j83251l18531m37650
$$ 4834747 5505080 6121185 6644988 7047273 7309357 7422206 7384557 7201306 6882775 6445125
32759F445125n33505n98422o27356o21945n92008n52176n15401m87438m65266
$$ 6445125 5911620 5313198 4685842 4063897 3471889 2919713 2404312 1916874 1451608
32750A451608m39348l98068l32594k40676j28022o632J08913K05194K72166L03975
$$ 1451608 1012260 614192 281598 40922 -87100 -93732 15181 220375 492541 796516
32740G96516K99557K63669K07306J45730R3769O0580M7103M7631N3898N8573N6350
$$ 796516 1096073 1359742 1567048 1712778 1806547 1867127 1914230 1961861 2015759 2074332 2130682
32729B130682M3372J6928k3893p7430j39480k03754k62586l08584l38007l54025
$$ 2130682 2174054 2190982 2167089 2089659 1950179 1746425 1483839 1175255 837248 483223
32719D83223l66651l88240m27364m84782n52941o18257o65175o81515o63063o14722
$$ 483223 116572 -271668 -699032 -1183814 -1736755 -2355012 -3020187 -3701702 -4364765 -4979487
32709d979487n47109m70982l93166l15796k37808j56643o9248K6627J30262K36301
$$ -4979487 -5526596 -5997578 -6390744 -6706540 -6944348 -7100991 -7170239 -7143612 -7013350 -6777049
32699f777049L35790M20082M84499N28709N54126N61280N49290N16776M63114
$$ -6777049 -6441259 -6021177 -5536678 -5007969 -4453843 -3892563 -3343273 -2826497 -2363383
32690b363383L89511K99948K01124J01211Q186p1043j30705j66138j74291j54573
$$ -2363383 -1973872 -1673924 -1472800 -1371589 -1363403 -1434446 -1565151 -1731289 -1905580 -2060153
32680b060153j09724m6233K6453R8025J59919K07001K37376K50435K44327K15034
$$ -2060153 -2169877 -2216110 -2189657 -2091632 -1931713 -1724712 -1487336 -1236901 -992574 -777540
32670g77540J58777P6672k2067j21780k06023k63145k88518k83757k55065k11577
$$ -777540 -618763 -542091 -564158 -685938 -891961 -1155106 -1443624 -1727381 -1982446 -2194023
32660b194023j63144j17445p7801m2997q965K8841P3326J24277J77988K28561
$$ -2194023 -2357167 -2474612 -2552413 -2595410 -2604375 -2575534 -2502208 -2377931 -2199943 -1971382
32650a971382K70491L01128L21487L35107L45608L54299L59477L58593L52326
$$ -1971382 -1700891 -1399763 -1078276 -743169 -397561 -43262 316215 674808 1027134
32641A027134L47152L53379L79240M25069M81668N33963N68263N79622N74554
$$ 1027134 1374286 1727665 2106905 2531974 3013642 3547605 4115868 4695490 5270044
32632E270044N65831N61527N56423N33499M74902L73815K38337Q6202o3770j97013
$$ 5270044 5835875 6397402 6953825 7487324 7962226 8336041 8574378 8660580 8596810 8399797
32622H399797l03563l76250m10294m04995l65519l02680k30493j62807j10142
$$ 8399797 8096234 7719984 7309690 6904695 6539176 6236496 6006003 5843196 5733054
32613E733054p7549o4332o6187p8320r7149j19580j41493j57745j63843j57903
$$ 5733054 5655505 5591173 5524986 5446666 5349517 5229937 5088444 4930699 4766856 4608953
32603D608953j41311j17842r1990o7496m7191l4138l2880m9127q7483j48516k27193
$$ 4608953 4467642 4349800 4257810 4190314 4143123 4108985 4076105 4026978 3939495 3790979 3563786
32592C563786l13956l97661m68531n19718n47780n53139n40279n16549m89292
$$ 3563786 3249830 2852169 2383638 1863920 1316140 763001 222722 -293827 -783119
32583g83119m63168m39125m14646l84044l39467k74114j87186q7063J0415Q8291
$$ -783119 -1246287 -1685412 -2100058 -2484102 -2823569 -3097683 -3284869 -3371932 -3361517 -3273226
32573c273226J35693J51825J44799J26308J05600Q6019O5684M0918R710k7031
$$ -3273226 -3137533 -2985708 -2840909 -2714601 -2609001 -2522982 -2457298 -2416380 -2406670 -2433701
32563b433701o7054j09512j55933k07599k61107l06232l28465l14439k56803j56890
$$ -2433701 -2500755 -2610267 -2766200 -2973799 -3234906 -3541138 -3869603 -4184042 -4440845 -4597735
32553d597735k5427J19125K55351L65469M40011M77741M82035M57122M06473L33268
$$ -4597735 -4623162 -4504037 -4248686 -3883217 -3443206 -2965465 -2483430 -2026308 -1619835 -1286567
32543a286567K41915J39390L4812o3131j48993k20547k75707l09864l17046k94159
$$ -1286567 -1044652 -905262 -870450 -933581 -1082574 -1303121 -1578828 -1888692 -2205738 -2499897
32533b499897k44253j75978j00077k5967L9548R1792J27571J45123J43986J24091
$$ -2499897 -2744150 -2920128 -3020205 -3046172 -3006624 -2914832 -2787261 -2642138 -2498152 -2374061
32523b374061Q4746K5331n1923j39212k23171k88365l22499l20832k87724k34018
$$ -2374061 -2289315 -2263984 -2315907 -2455119 -2678290 -2966655 -3289154 -3609986 -3897710 -4131728
32513d131728j71172j05947l9896K6434Q9027J39863J70106J73747J49681J02246
$$ -4131728 -4302900 -4408847 -4448743 -4422309 -4333282 -4193419 -4023313 -3849566 -3699885 -3597639
32503c597639M0397k4614q2107j23745j43968j40751j17453q3734n3007l6752
$$ -3597639 -3557242 -3581856 -3663963 -3787708 -3931676 -4072427 -4189880 -4273614 -4326621 -4363373
32493d363373l9124n5259p3975q2913p3391m3203L037N5442J01676J30683J36490
$$ -4363373 -4402497 -4457756 -4531731 -4614644 -4688035 -4731238 -4728201 -4672759 -4571083 -4440400 -4303910
32482d303910J20613R1482O0723L8182K8826L3376N1639Q5346J38196K13572L11761
$$ -4303910 -4183297 -4091815 -4031092 -3992910 -3964084 -3930708 -3879069 -3793723 -3655527 -3441955 -3130194
32471c130194M27827N50385O62447P45979P89155P91597P62965P15537O56462
$$ -3130194 -2702367 -2151982 -1489535 -743556 45599 837196 1600161 2315698 2972160
32462B972160N85522M99038L95493K77975J52454K4800j00230k17977l23005m09612
$$ 2972160 3557682 4056720 4452213 4730188 4882642 4907442 4807212 4589235 4266230 3856618
32452C856618m72888n09691n20417n11728m97323m93326n09509n42407n75861
$$ 3856618 3383730 2874039 2353622 1841894 1344571 851245 341736 -200671 -776532
32443g76532n88558n63616m95237l90437k65922j41317l1442N8709J33750K03019
$$ -776532 -1365090 -1928706 -2423943 -2814380 -3080302 -3221619 -3253061 -3194352 -3060602 -2857583
32433b857583K74065L47683M16267M66223M83562M60475L99359L12050K15175
$$ -2857583 -2583518 -2235835 -1819568 -1353345 -869783 -409308 -9949 302101 517276
32424E17276J24853N3299P658j0016k339K4490O2551J04577J46058J86196K27169
$$ 517276 642129 695428 703086 693070 690731 715221 777772 882349 1028407 1214603 1441772
32413A441772K71626L19419L65267L98861M08241L85279L30534K54471J73796
$$ 1441772 1713398 2032817 2398084 2796945 3205186 3590465 3920999 4175470 4349266
32404D349266J04449N4757K2318l293l3434p3524j21346j71271k19873k68026
$$ 4349266 4453715 4508472 4530790 4527497 4494063 4420539 4299193 4127922 3908049 3640023
32394C640023l18431l71457m22424m61674m77843m63637m21271l63651l09553
$$ 3640023 3321592 2950135 2527711 2066037 1588194 1124557 703286 339635 30082
32385C0082k75378k67940k81824l02488l13671l05352k77607k38290j96989j59775
$$ 30082 -245296 -513236 -795060 -1097548 -1411219 -1716571 -1994178 -2232468 -2429457 -2589232
32375b589232j27291r5913o0534j8021K9843P5724J09341J22107J10870P8708
$$ -2589232 -2716523 -2812436 -2872970 -2890991 -2861148 -2785424 -2676083 -2553976 -2443106 -2364398
32365b364398L2912j7544o3181r4012j00187p4425j4965P3110J79287K90644L94429
$$ -2364398 -2331486 -2349030 -2412211 -2506223 -2606410 -2680835 -2695800 -2622690 -2443403 -2152759 -1758330
32354a758330M79092N34505N53045N32424M78455M04961L29337K65888K20523
$$ -1758330 -1279238 -744733 -191688 340736 819191 1224152 1553489 1819377 2039900
32345B039900J89341J61125J22359O2972j8889j14458k05492k69543k88501k56984
$$ 2039900 2229241 2390366 2512725 2575697 2556808 2442350 2236858 1967315 1678814 1421830
32335A421830j85939r8862k2545K2807L0051O162l2079o5906q2085p6283n1610
$$ 1421830 1235891 1137029 1114484 1137291 1167342 1173504 1141425 1075519 993434 917151 865541
32324H65541j4688K8164P3571J21781J74309K29026K76551L02148K93054K46034
$$ 865541 850853 879017 952588 1074369 1248678 1477704 1754255 2056403 2349457 2595491
32314B595491J69399P7973j5017j03157j86000k63757l32433l83115m05762l94452
$$ 2595491 2764890 2842863 2827846 2724689 2538689 2274932 1942499 1559384 1153622 759170
32304G59170l50815k83662k05172j25930n1913J5037P4839J27603J74045K16104
$$ 759170 408355 124693 -80479 -206409 -258322 -243285 -168446 -40843 133202 349306
32294C49306K55890K93206L24264L43720L49235L44613L37921L35023L33626L23313
$$ 349306 605196 898402 1222666 1566386 1915621 2260234 2598155 2933178 3266804 3590117
32284C590117K92323K35911J59978P8038M951m7956p4389p2553m4273N859P1687
$$ 3590117 3882440 4118351 4278329 4356367 4361318 4313362 4238973 4166420 4122147 4128006 4199693
32273D199693J46762K24812K99180L62400M07095M28194M24973M01368L64115
$$ 4199693 4346455 4571267 4870447 5232847 5639942 6068136 6493109 6894477 7258592
32264G258592L19755K72051K20854J62253Q9313o658j33561k94368m82506o79327
$$ 7258592 7578347 7850398 8071252 8233505 8322818 8316160 8182599 7888231 7405725 6726398
32254F726398q55969r80180j025836r81297q52905o62924m43808k31185n6693
$$ 6726398 5870429 4890249 3864413 2883116 2030211 1367287 923479 692294 635601
32245F35601N8728J09311J04311O2570M285n6065j12677j66847k22679k82902
$$ 635601 694329 803640 907951 970521 974806 918741 806064 639217 416538 133636
32235A33636l47084m12320m74950n31776n80633o20365o50003o66850o64748o34638
$$ 133636 -213448 -625768 -1100718 -1632494 -2213127 -2833492 -3483495 -4150345 -4815093 -5449731
32225e449731n68224m62841l24443j66971q709J32446K43094L16885L55084L64886
$$ -5449731 -6017955 -6480796 -6805239 -6972210 -6980919 -6848473 -6605379 -6288494 -5933410 -5568524
32215e568524L55777L35301L06424K68150K18799J59634R6016L5455j5855n5372
$$ -5568524 -5212747 -4877446 -4571022 -4302872 -4084073 -3924439 -3828423 -3792968 -3808823 -3864195
32205c864195q4096j04676j19522j29850j35469j34819j25502j05502p4689l5876
$$ -3864195 -3948291 -4052967 -4172489 -4302339 -4437808 -4572627 -4698129 -4803631 -4878320 -4914196
32195d914196M595L6989N0220L6605k987n8133j13727j56733j79269j77045j47414
$$ -4914196 -4909601 -4872612 -4822392 -4785787 -4788774 -4846907 -4960634 -5117367 -5296636 -5473681 -5621095
32184e621095r0566j2346P5150J57239K22661K68410L00322L28532L60757L98027
$$ -5621095 -5711661 -5724007 -5648857 -5491618 -5268957 -5000547 -4700225 -4371693 -4010936 -3612909
32174c612909M35779M67905M89430M95946M82190M42646L74510K81299J74844
$$ -3612909 -3177130 -2709225 -2219795 -1723849 -1241659 -799013 -424503 -143204 31640
32165C1640P3843j856l9137l7065o245L7227P8689J08699J23270J22317J08054
$$ 31640 105483 103627 64490 27425 21180 58407 137096 245795 369065 491382 599436
32154E99436Q3637N2012J5035k6595p2703j22734j74932k25586k68546k95813
$$ 599436 683073 735085 750120 723525 650822 528088 353156 127570 -140976 -436789
32144d36789k99928k77407k30980j68605r9392k9123M1239J12761J83724K47330
$$ -436789 -736717 -1014124 -1245104 -1413709 -1513101 -1542224 -1500985 -1388224 -1204500 -957170
32134i57170K94212L17473L15420K90180K44955J83762J13482M4865r703m0521
$$ -957170 -662958 -345485 -30065 260115 505070 688832 802314 847179 837476 796955
32124G96955m4089k4081J0356M7962P9063R8051J04011R9711Q9560P7324O4802
$$ 796955 752866 728785 739141 787103 866166 964217 1068228 1167939 1257499 1334823 1399625
32113A399625N2683M2982M0068M8093O6450Q7634J00139R4296O6664K0637l5862
$$ 1399625 1452308 1495290 1535358 1583451 1649901 1737535 1837674 1931970 1998634 2019271 1983409
32102A983409r3423j43842j82273k08421k26153k41472k59790k83908l13556l46185
$$ 1983409 1889986 1746144 1563871 1355450 1129297 887825 628035 344127 30571 -315614
32092c15614l78019m04453m20032m18595l94159l42261k61571j55449l2712R3350
$$ -315614 -693633 -1098086 -1518118 -1936713 -2330872 -2673133 -2934704 -3090153 -3122865 -3029515
32082c029515K07934K98265L56270L79865L73118L45043L06852K68670K37456
$$ -3029515 -2821581 -2523316 -2167046 -1787181 -1414063 -1069020 -762168 -493498 -256042
32073b56042K16727K06979K05925K09060K11061K07388J95218J73910J45455J14120
$$ -256042 -39315 167664 373589 582649 793710 1001098 1196316 1370226 1515681 1629801
32063A629801Q4249N7085K9421m371m8295j01708j59099k12393k54092k79364
$$ 1629801 1714050 1771135 1800556 1796185 1747890 1646182 1487083 1274690 1020598 741234
32053G41234k86030k73330k41359j92014j29945o1983M579O2679J04504J20899
$$ 741234 455204 181874 -59485 -251499 -381444 -443427 -438848 -376169 -271665 -150766
32043a50766J03451M8712l8623j46013k56651l54186m26345m66713m74657m54117
$$ -150766 -47315 1397 -37226 -183239 -439890 -794076 -1220421 -1687134 -2161791 -2615908
32033b615908m12282l59002l06606k68704k56882k76064l21327l78650m29895
$$ -2615908 -3028190 -3387192 -3693798 -3962502 -4219384 -4495448 -4816775 -5195425 -5625320
32024e625320m59448m59152m29246l75742l06676k29792j52292q1213k2666J9963
$$ -5625320 -6084768 -6543920 -6973166 -7348908 -7655584 -7885376 -8037668 -8118881 -8141547 -8121584
32014h121584M6855O0274O2275N4349L9726K5473K1465L6709P6401J41577K29991
$$ -8121584 -8074729 -8014455 -7952180 -7897831 -7858105 -7832632 -7811167 -7774458 -7698057 -7556480 -7326489
32003g326489L35984M49677N57796O46965P07819P37323P38598P18989O87417
$$ -7326489 -6990505 -6540828 -5983032 -5336067 -4628248 -3890925 -3152327 -2433338 -1745921
31994a745921O51601O15668N78977N37035M84221M17140L36470K46460J52673
$$ -1745921 -1094320 -478652 100325 637360 1121581 1538721 1875191 2121651 2274324
31985B274324N9830k8799j10218j79929k31139k56111k49372k11256j49877q0357
$$ 2274324 2334154 2305355 2195137 2015208 1784069 1527958 1278586 1067330 917453 837096
31975H37096k1266J0888P180l0467q9995j53593k03908k29482k27599k03476j66438
$$ 837096 815830 826718 833898 803431 713436 559843 355935 126453 -101146 -304622 -471060
31964d71060j25258q5052m6827r270K8381O3781R1163J04412J01654Q7661P1700
$$ -471060 -596318 -681370 -728197 -737467 -709086 -645305 -554142 -449730 -348076 -260415 -188715
31953a88715O2824O6246Q2539J08820J40494J72966K02384K24581K32987K18258
$$ -188715 -125891 -59645 22894 131714 272208 445174 647558 872139 1105126 1323384
31943A323384J71324Q8270k6393j60157k96116m17580n11896n72296n98033n93826
$$ 1323384 1494708 1582978 1556585 1396428 1100312 682732 170836 -401460 -999493 -1593319
31933a593319n69406n38005n12398m99320m95810m90500m69705m24817l56935
$$ -1593319 -2162725 -2700730 -3213128 -3712448 -4208258 -4698758 -5168463 -5593280 -5950215
31924e950215k76389j97759j33671r1032p0715o8594p6082q1476p4119n0012j4172
$$ -5950215 -6226604 -6424363 -6558034 -6649066 -6719781 -6788375 -6864457 -6945933 -7020052 -7070064 -7084236
31913g084236K2882N1826O9211P7938Q4827R7452J21090J56166J97100K33210
$$ -7084236 -7061354 -7009528 -6940317 -6862379 -6777552 -6680100 -6559010 -6402844 -6205744 -5972534
31903e972534K51582K40969J95895J19707K5162o8410j40999j78630j77704j44418
$$ -5972534 -5720952 -5479983 -5284088 -5164381 -5139219 -5207629 -5348628 -5527258 -5704962 -5849380
31893e849380q9603k2319N3612J38427K32645L33940M36487N31889O10010O59246
$$ -5849380 -5938983 -5961302 -5907690 -5769263 -5536618 -5202678 -4766191 -4234302 -3624292 -2965046
31883b965046O67785O27086N36440M05547K53224J02984k2686j08359j50699j59407
$$ -2965046 -2297261 -1670175 -1133735 -728188 -474964 -371980 -394666 -503025 -653724 -813131
31873h13131j51619j41976j35170j26121j06430p1383k2695L3187Q8739J37956
$$ -813131 -964750 -1106726 -1241896 -1368017 -1474447 -1545830 -1568525 -1535338 -1446599 -1308643
31863a308643J76680K01279K07741J92488J54186R5083K1274n7758j30521j86263
$$ -1308643 -1131963 -930684 -722943 -530455 -376269 -281186 -259912 -317670 -448191 -634454
31853f34454k18188k24932k08972j73445j20130n0130L3894J26026K17328K97788
$$ -634454 -852642 -1077574 -1286546 -1459991 -1580121 -1630251 -1596357 -1470331 -1253003 -955215
31843i55215L58713L94666M04801L93622L70271L45544L27097L15445L03289K78335
$$ -955215 -596502 -201836 202965 596587 966858 1312402 1639499 1954944 2258233 2536568
31833B536568K28425J47304L9556p8271j82794k53959k84047k79353k54285k23623
$$ 2536568 2764993 2912297 2951853 2873582 2690788 2436829 2152782 1873429 1619144 1395521
31823A395521j98380j85522j88426k06205k33355k61546k83133k94098k94414
$$ 1395521 1197141 1011619 823193 616988 383633 122087 -161046 -455144 -749558
31814g49558k85720k68180k38966j94052j32437n9812J1386O6288R4025R2586
$$ -749558 -1035278 -1303458 -1542424 -1736476 -1868913 -1928725 -1917339 -1851051 -1757026 -1664440
31804a664440O9545L8857J6212J5090M3886J03849J88644K86773L85919M76510
$$ -1664440 -1594895 -1556038 -1539826 -1524736 -1480850 -1377001 -1188357 -901584 -515665 -39155
31794c9155N52617O10998O50110O69682O70328O53094O19327N70638N08786M35892
$$ -39155 513462 1124460 1774570 2444252 3114580 3767674 4387001 4957639 5466425 5902317
31784E902317L55860K76029K07102J60088J41369J48462J68931J83744J74490
$$ 5902317 6258177 6534206 6741308 6901396 7042765 7191227 7360158 7543902 7718392
31775G718392J31058N5406m0645j41207k31440k99850l39263l48558l34601l11399
$$ 7718392 7849450 7904856 7864211 7723004 7491564 7191714 6852451 6503893 6169292 5857893
31765E857893k94793k94620l09406l27417l33660l18108k79811k25035j62328
$$ 5857893 5563100 5268480 4959074 4631657 4297997 3979889 3700078 3475043 3312715
31756C312715r9138m1981J920K4905K1708p663n7360j17553j76873k24443k51530
$$ 3312715 3213577 3171596 3173516 3198421 3220129 3212466 3155106 3037553 2860680 2636237 2384707
31745B384707k53410k31072j91819j47667j11524r2757r4730j15388j49410j89471
$$ 2384707 2131297 1900225 1708406 1560739 1449215 1356458 1261728 1146340 996930 807459
31735H07459k26211k48791k47887k20060j70519j11728n8510k2327p830j2708
$$ 807459 581248 332457 84570 -135490 -306009 -417737 -476247 -498574 -506404 -519112
31725e19112l0012n1630p1795q9290j07238j30555j62964k05551k57155l15535
$$ -519112 -549124 -600754 -672549 -761839 -869077 -999632 -1162596 -1368147 -1625302 -1940837
31715a940837l78229m42602n04872n58649n94592o02449n74684n09358m10903
$$ -1940837 -2319066 -2761668 -3266540 -3825189 -4419781 -5022230 -5596914 -6106272 -6517175
31706f517175k89184j57705l1167P7342J58558K08131K26952K21089K00826J78428
$$ -6517175 -6806359 -6964064 -6995231 -6917889 -6759331 -6551200 -6324248 -6103159 -5902333 -5723905
31696e723905J65099J67900J87044K14559K36359K38314K13442J65360J05860
$$ -5723905 -5558806 -5390906 -5203862 -4989303 -4752944 -4514630 -4301188 -4135828 -4029968
31687d029968M8939N185k1125l2250l5018l7680m6767o5194r1927j22582j50415
$$ -4029968 -3981029 -3975844 -3996969 -4029219 -4064237 -4101917 -4148684 -4213878 -4305805 -4428387 -4578802
31676d578802j67513j66189j40649q9179j6555O4818J37094J82986J92941J69251
$$ -4578802 -4746315 -4912504 -5053153 -5142332 -5158887 -5094069 -4956975 -4773989 -4581048 -4411797
31666d411797J24278P3894L0059l372l0261n8363r4436j40145j90184k34073k61403
$$ -4411797 -4287519 -4213625 -4183566 -4186938 -4217199 -4275562 -4369998 -4510143 -4700327 -4934400 -5195803
31655e195803k67606k55623k32014k01055j62245j12705n1139K0303R6536J70800
$$ -5195803 -5463409 -5719032 -5951046 -6152101 -6314346 -6427051 -6478190 -6457887 -6361351 -6190551
31645f190551K35835K85232L14577L21793L07443K76039K37162K03300J83676
$$ -6190551 -5954716 -5669484 -5354907 -5033114 -4725671 -4449632 -4212470 -4009170 -3825494
31636c825494J78260J77276J67350J39612R3940L7214k1719p5950j21081j53634
$$ -3825494 -3647234 -3469958 -3302608 -3162996 -3069056 -3031842 -3053561 -3129511 -3250592 -3404226
31626c404226j69848j66213j41142r6753m0028J7585O3172Q7365Q8255P0963M3224
$$ -3404226 -3574074 -3740287 -3881429 -3978182 -4018210 -4000625 -3937453 -3850088 -3761833 -3690870 -3647646
31615c647646J1051k1940n2181p4863q6374q8535q9658r9661j21908j48169j61141
$$ -3647646 -3636595 -3658535 -3710716 -3785579 -3871953 -3960488 -4050146 -4149807 -4271715 -4419884 -4581025
31604d581025j43219q5415R025J27037K50831L62093M44876M88663M91601M61214
$$ -4581025 -4724244 -4809659 -4800634 -4673597 -4422766 -4060673 -3615797 -3127134 -2635533 -2174319
31594b174319M10480L51267K90155K29421J70922J18141P4387L9567R152k3557
$$ -2174319 -1763839 -1412572 -1122417 -892996 -722074 -603933 -529546 -489979 -480827 -504384
31584e04384o3431j10182j57162j92715k03909j81605j24577m0466N6863J51713
$$ -504384 -567815 -677997 -835159 -1027874 -1231783 -1413388 -1537965 -1578431 -1521568 -1369855
31574a369855K30450K83853L08279L05539K81050K40928J89797J31013O8369P354
$$ -1369855 -1139405 -855552 -547273 -241734 39316 280244 470041 601054 669423 676777
31564F76777m5190q2265r7915q8440n4022k6O3546J24991J74714K07140K19984
$$ 676777 631587 549322 451407 362967 308945 308919 372465 497456 672170 879310 1099294
31553A099294K12417J84676J39686Q5238L4548L776O741M8796J23197K12262K92714
$$ 1099294 1311711 1496387 1636073 1721311 1755859 1759635 1766376 1815172 1938369 2150631 2443345
31542B443345L42185L44693K94778J99869P9317m1346j38874j99426k21134k12271
$$ 2443345 2785530 3130223 3425001 3624870 3704187 3662841 3523967 3324541 3103407 2891136
31532B891136j86967j60185j43157j40214j48296j59343j64669j59100j43237
$$ 2891136 2704169 2543984 2400827 2260613 2112317 1952974 1788305 1629205 1485968
31523A485968j23087j07626j04871j17760j41932j67467j83894j85261j71952
$$ 1485968 1362881 1255255 1150384 1032624 890692 723225 539331 354070 182118
31514A82118j49042j23294j00522q3919p3555o7294o2487n7385n1549m5522l9925
$$ 182118 33076 -90218 -190740 -274659 -348214 -415508 -477995 -535380 -586929 -632451 -672376
31503f72376l4450k7810j9391j1339q380j4862l1653n5991q3948j12485j39573
$$ -672376 -706826 -734636 -754027 -765366 -773746 -788608 -820261 -876252 -960200 -1072685 -1212258
$$ [...]
##END NTUPLES=NMR SPECTRUM
##END=
