##TITLE=31Pdec_DE-27_Et2
 D2O
  24 sc
 1.12.2023
##JCAMPDX= 6.0         $$ Bruker NMR JCAMP-DX V2.0
##DATA TYPE= NMR SPECTRUM
##DATA CLASS= NTUPLES
##ORIGIN= UXNMR, Bruker Analytische Messtechnik GmbH
##OWNER= root
$$ XWIN-NMR		Version 3.5
$$ Fri Dec  1 15:30:29 2023 Russian Standard Time (UT+4h)  she@DPX200
##.OBSERVE FREQUENCY= 81.013821
##.OBSERVE NUCLEUS= ^31P
##.ACQUISITION MODE= SIMULTANEOUS
##.ACQUISITION SCHEME= undefined
##.AVERAGES= 24
##.DIGITISER RES= 16
##SPECTROMETER/DATA SYSTEM= spect
##.PULSE SEQUENCE= zgpg30
##.SOLVENT NAME= D2O
##.SHIFT REFERENCE= (INTERNAL, D2O, 0, 248.564)
##AUDIT TRAIL= $$ (NUMBER, WHEN, WHO, WHERE, WHAT)
$$ ##TITLE= Audit trail, XWIN-NMR		Version 3.5
$$ ##JCAMPDX= 5.01
$$ ##ORIGIN= Bruker BioSpin GmbH
$$ ##OWNER= she
$$ F:/spectra/data/she/nmr/P31/1/pdata/1/auditp.txt
$$ ##AUDIT TRAIL=  $$ (NUMBER, WHEN, WHO, WHERE, WHAT)
(   1,<2023-12-01 15:29:30.89 +0400>,<she>,<DPX200>,
      <created by zg, POWCHK disabled, PULCHK disabled
       configuration hash MD5:
       00 E9 B6 7A A2 85 ED C7 34 08 36 98 17 FE 4E 26
       data hash MD5: 32K
       77 5D 59 9A 32 51 52 6D AC 63 B7 0E 99 8D FE 29>)
(   2,<2023-12-01 15:29:33.40 +0400>,<she>,<DPX200>,
      <Start of raw data processing
       efp BC_mod = 2 LB = 10 FT_mod = 6 PKNL = 1 PHC0 = -11685.8 PHC1 = -67.90641 SI = 64K 
       data hash MD5: 64K
       9A 5D 0B 09 10 68 16 05 8D 48 53 4D 52 99 49 4B>)
(   3,<2023-12-01 15:29:50.67 +0400>,<she>,<DPX200>,
      <pk PHC0 = -85.61845 PHC1 = 192.6001 
       data hash MD5: 64K
       54 FD E3 2A 61 E0 A0 95 A5 51 60 FB 71 02 B2 6E>)
(   4,<2023-12-01 15:29:54.57 +0400>,<she>,<DPX200>,
      <abs ABSG = 5 
       data hash MD5: 64K
       C9 2E 6D C8 1F 89 36 C1 56 DE E0 65 14 9C AD 58>)
$$ ##END=
$$ 
$$ hash MD5
$$ 69 4B F4 36 34 85 37 68 7F 88 20 6D 23 85 2D 6B
##$RELAX= 
##$RELAX= 
##$RELAX= 
##$RELAX= 
##$RELAX= 
##$RELAX= 
##$RELAX= 
##$RELAX= 
##$RELAX= 
$$ Bruker specific parameters
$$ --------------------------
##$DU= <F:/spectra>
##$EXPNO= 1
##$NAME= <P31>
##$PROCNO= 1
##$TYPE= <nmr>
##$USER= <she>
##$AMP= (0..31)
100 100 100 100 100 100 100 100 100 100 100 100 100 100 100 100 100 100 
100 100 100 100 100 100 100 100 100 100 100 100 100 100 
##$AQSEQ= 0
##$AQ_mod= 1
##$AUNM= <au_zg>
##$AUTOPOS= <>
##$BF1= 81.014009
##$BF2= 200.13
##$BF3= 200.13
##$BF4= 200.13
##$BF5= 200.13
##$BF6= 200.13
##$BF7= 200.13
##$BF8= 200.13
##$BYTORDA= 1
##$CFDGTYP= 0
##$CFRGTYP= 5
##$CHEMSTR= <none>
##$CNST= (0..31)
1 1 145 1 1 1 1 1 1 1 1 1 1 1 1 1 1 1 1 1 1 1 1 1 1 1 1 1 1 1 1 1 
##$CPDPRG= <waltz16>
##$CPDPRG1= <>
##$CPDPRG2= <waltz16>
##$CPDPRG3= <>
##$CPDPRG4= <mlev>
##$CPDPRG5= <mlev>
##$CPDPRG6= <mlev>
##$CPDPRG7= <mlev>
##$CPDPRG8= <mlev>
##$CPDPRGB= <>
##$CPDPRGT= <>
##$D= (0..31)
0 1 0 0 0 0 0 0 0 0 0 0.03 2e-05 3e-06 0 0 0 0 0 0 0 0 0 0 0 0 0 0 0 0 
0 0 
##$DATE= 1701430170
##$DBL= (0..7)
120 120 120 11 120 120 24 19 
##$DBP= (0..7)
150 150 150 150 150 150 150 150 
##$DBP07= 0
##$DBPNAM0= <>
##$DBPNAM1= <>
$$ [...]
##$SUBNAM3= <"">
##$SUBNAM4= <"">
##$SUBNAM5= <"">
##$SUBNAM6= <"">
##$SUBNAM7= <"">
##$SUBNAM8= <"">
##$SUBNAM9= <"">
##$SW= 501.771253377433
##$SWIBOX= (0..15)
0 1 3 0 0 0 0 0 0 0 0 0 0 0 0 0 
##$SW_h= 40650.406504065
##$TD= 32768
##$TD0= 1
##$TE= 0
##$TE2= 300
##$TE3= 300
##$TEG= 300
##$TL= (0..7)
0 120 53 12 22 120 120 120 
##$TP= (0..7)
150 150 150 150 150 150 150 150 
##$TP07= 0
##$TPNAME0= <>
##$TPNAME1= <>
##$TPNAME2= <>
##$TPNAME3= <>
##$TPNAME4= <>
##$TPNAME5= <>
##$TPNAME6= <>
##$TPNAME7= <>
##$TPOAL= (0..7)
0.5 0.5 0.5 0.5 0.5 0.5 0.5 0.5 
##$TPOFFS= (0..7)
0 0 0 0 0 0 0 0 
##$TUNHIN= 0
##$TUNHOUT= 0
##$TUNXOUT= 0
##$USERA1= <user>
##$USERA2= <user>
##$USERA3= <user>
##$USERA4= <user>
##$USERA5= <user>
##$V9= 5
##$VALIST= <valist>
##$VCLIST= <CCCCCCCCCCCCCCC>
##$VD= 0
##$VDLIST= <DDDDDDDDDDDDDDD>
##$VPLIST= <PPPPPPPPPPPPPPP>
##$VTLIST= <TTTTTTTTTTTTTTT>
##$WBST= 1024
##$WBSW= 4
##$XGAIN= (0..3)
0 0 0 0 
##$XL= 0
##$YL= 0
##$YMAX_a= 2593
##$YMIN_a= -2178
##$ZGOPTNS= <>
##$ZL1= 120
##$ZL2= 120
##$ZL3= 120
##$ZL4= 120
##$ABSF1= 248.5645
##$ABSF2= -253.2056
##$ABSG= 5
##$ABSL= 3
##$ALPHA= 0
##$AQORDER= 0
##$ASSFAC= 0
##$ASSFACI= 0
##$ASSFACX= 0
##$ASSWID= 0
##$AUNMP= <proc_1d>
##$AZFE= 0.1
##$AZFW= 0.5
##$BCFW= 0
##$BC_mod= 2
##$BYTORDP= 0
##$COROFFS= 0
##$CY= -3
##$DATMOD= 1
##$DC= 0
##$DFILT= <>
##$DTYPP= 0
##$F1P= 0
##$F2P= 0
##$FCOR= 1
##$FTSIZE= 65536
##$FT_mod= 6
##$GAMMA= 0
##$GB= 0
##$INTBC= 1
##$INTSCL= 6.047779e-11
##$ISEN= 30
##$LB= 10
##$LEV0= 0
##$LPBIN= 0
##$MAXI= 10000
##$MC2= 0
##$MEAN= 0
##$ME_mod= 0
##$MI= 50
##$NCOEF= 0
##$NC_proc= -9
##$NLEV= 6
##$NOISF1= 182.463
##$NOISF2= 159.3651
##$NSP= 0
##$NTH_PI= 0
##$NZP= 0
##$OFFSET= 248.5645
##$PC= 4
##$PHC0= -11771.42
##$PHC1= 124.6937
##$PH_mod= 1
##$PKNL= yes
##$PPARMOD= 0
##$PSCAL= 0
##$PSIGN= 0
##$REVERSE= no
##$SF= 81.0140089999694
##$SI= 65536
##$SIGF1= 159.3651
##$SIGF2= -187.1042
##$SINO= 113.3802
##$SIOLD= 16384
##$SREGLST= <1H.CDCl3>
##$SSB= 0
##$STSI= 65536
##$STSR= 0
##$SW_p= 40650.406504065
##$SYMM= 0
##$S_DEV= 0
##$TDeff= 32768
##$TDoff= 0
##$TI= <>
##$TILT= no
##$TM1= 0
##$TM2= 0
##$TOPLEV= 0
##$USERP1= <user>
##$USERP2= <user>
##$USERP3= <user>
##$USERP4= <user>
##$USERP5= <user>
##$WDW= 1
##$XDIM= 65536
##$YMAX_p= 446967025
##$YMIN_p= -100137346
$$ End of Bruker specific parameters
$$ ---------------------------------
##NTUPLES= NMR SPECTRUM
##VAR_NAME=  FREQUENCY,     SPECTRUM/REAL,   SPECTRUM/IMAG
##SYMBOL=    X,             R,               I
##VAR_TYPE=  INDEPENDENT,   DEPENDENT,       DEPENDENT
##VAR_FORM=  AFFN,          ASDF,            ASDF
##VAR_DIM=   65536,         65536,           65536
##UNITS=     HZ,            ARBITRARY UNITS, ARBITRARY UNITS
##FACTOR=    0.620285442955139, 1,           1
##FIRST=     20137.2065510682, 0,            0
##LAST=      -20513.1999529968, 0,           0
##MIN=       -20513.1999529968, -100137346,  0
##MAX=       20137.2065510682, 446967025,    0
$$ Real data points
##PAGE= N=1
##DATA TABLE= (X++(R..R)), XYDATA
$$ [...]
39082 5050311 5104959 5028779 4856138 4625419 4367707 4099731 3822206 3523294 3186142 2798296
39072 2798296 2359276 1882783 1392971 917920 484169 113751 -177188 -379369 -491067
39063 -491067 -518318 -474304 -377227 -246481 -98754 53403 200028 331712 439647 517315
39053 517315 561380 570695 544674 482558 383476 246546 71142 -141725 -386728 -651627 -916848
39042 -916848 -1158547 -1354616 -1491448 -1568625 -1599419 -1606768 -1616266 -1648981 -1716863 -1821831 -1957430
39031 -1957430 -2110967 -2265135 -2399904 -2495749 -2537891 -2519621 -2442820 -2314954 -2143324 -1928645
39021 -1928645 -1660996 -1321214 -888761 -353330 275497 965941 1670720 2339415 2930441
39012 2930441 3417595 3790175 4049417 4204812 4271880 4270417 4221797 4145053 4052756 3948044
39002 3948044 3824146 3667381 3463262 3203264 2888929 2531901 2151224 1770097 1412665
38993 1412665 1099891 844514 647494 499008 384961 296062 234554 214967 258904 387053
38983 387053 612073 934366 1341144 1808578 2306690 2805819 3282410 3721575 4115324 4457833
38973 4457833 4741183 4954856 5089597 5143048 5123299 5048167 4940662 4822831 4710098 4607486
38963 4607486 4508163 4394344 4240558 4019299 3708545 3299153 2799445 2234969 1643524 1067278
38953 1067278 544395 102428 -244914 -497003 -662159 -751864 -775523 -738130 -642262 -493737
38943 -493737 -307671 -110671 63336 182471 227217 196676 107757 -12002 -134333 -238426
38933 -238426 -314900 -365373 -399066 -428470 -465888 -521722 -603628 -714795 -850861 -997389 -1130705
38922 -1130705 -1222832 -1248482 -1191149 -1046691 -824387 -546047 -243363 46333 285404 441439
38912 441439 492295 430288 264939 22972 -255993 -527938 -754201 -907804 -973610 -943925
38902 -943925 -814286 -583183 -255453 154126 620652 1113465 1603340 2068943 2499088 2889764
38892 2889764 3238245 3538480 3780444 3952902 4046939 4058336 3988712 3846159 3645533 3407644
38882 3407644 3156890 2917824 2712198 2557617 2467483 2450667 2509981 2640310 2828146 3053135
38872 3053135 3290655 3514220 3697637 3817521 3856551 3806984 3673148 3471028 3223647 2953470
38862 2953470 2675745 2396878 2118326 1842499 1576256 1330465 1117329 947808 829718
38853 829718 765612 750326 770041 805039 836087 851408 850563 843467 845256 869169 920113 991441
38841 991441 1066108 1121003 1131953 1077898 944807 730010 445823 119600 -211667 -511140
38831 -511140 -752021 -922394 -1022417 -1056367 -1025596 -927314 -759174 -525379 -240025 73976
38821 73976 389593 682234 935954 1147046 1323603 1481568 1639147 1811604 2007755 2228606
38811 2228606 2467754 2712700 2946477 3149902 3304918 3398492 3425461 3388882 3297612 3161814
38801 3161814 2987736 2774031 2512589 2195105 1822473 1410613 987865 585086 224974
38792 224974 -82935 -340387 -555395 -738520 -901629 -1057385 -1217939 -1393608 -1593391 -1827210
38782 -1827210 -2106939 -2442983 -2836654 -3272797 -3718347 -4129285 -4463309 -4692026 -4807114
38773 -4807114 -4818669 -4748100 -4619519 -4452510 -4257594 -4035060 -3777369 -3473974 -3115992 -2698443
38763 -2698443 -2219978 -1681731 -1086795 -440700 247427 963528 1687840 2395552 3058985
38754 3058985 3650286 4143707 4517713 4758035 4861736 4840324 4719066 4531367 4310464 4082814
38744 4082814 3866306 3672869 3512159 3393116 3322488 3301667 3324008 3374354 3431665 3474300
38734 3474300 3486162 3461027 3402843 3321689 3227425 3124544 3011029 2881370 2731140 2559606
38724 2559606 2368711 2159720 1930763 1677523 1396377 1086973 752050 395648 22753
38715 22753 -358385 -733757 -1084445 -1391363 -1640593 -1825613 -1945588 -2001948 -1996228 -1930613
38705 -1930613 -1810422 -1646270 -1453881 -1251411 -1056083 -881965 -738848 -631175 -557044 -508553
38695 -508553 -473741 -438242 -385178 -295008 -148832 64352 340887 661701 998669 1323889
38685 1323889 1616355 1863602 2059490 2200980 2285917 2312416 2279484 2188557 2045642 1863108
38675 1863108 1659261 1454565 1265825 1101754 962693 844325 742629 656617 587095 532320
38665 532320 483881 426330 341555 215610 44245 -165466 -397629 -632313 -849878 -1033089
38655 -1033089 -1167952 -1246150 -1270352 -1259179 -1246291 -1271246 -1365686 -1541602 -1786652 -2067271
38645 -2067271 -2337115 -2547318 -2655378 -2630782 -2457265 -2132743 -1668101 -1085202 -413926 311664
38635 311664 1057269 1791315 2486472 3120347 3676170 4143510 4518465 4803151 5004993 5135762
38625 5135762 5209328 5237499 5225519 5170121 5061433 4887218 4636709 4302985 3884766 3388698
38615 3388698 2831613 2241062 1652880 1105957 635696 267975 15519 -121939 -153595 -91860
38605 -91860 51279 263515 528603 824074 1123200 1400073 1634206 1812131 1926548 1975209
38595 1975209 1960979 1892773 1785753 1659364 1533135 1422118 1334492 1272694 1237089 1229687 1255541
38584 1255541 1320940 1429495 1578745 1759812 1960574 2170130 2381526 2591160 2795710 2988690
38574 2988690 3158635 3290162 3367776 3380851 3327419 3215048 3058564 2875711 2682575 2491082
38564 2491082 2310039 2148809 2019958 1937166 1908340 1928443 1977620 2026612 2046377 2016425 1928088
38553 1928088 1782573 1586264 1346430 1069493 762097 433147 94129 -243710 -574070
38544 -574070 -899324 -1231116 -1587503 -1987707 -2446188 -2968137 -3548242 -4172624 -4821429 -5469380
38534 -5469380 -6084627 -6629346 -7064915 -7360086 -7497087 -7472055 -7291307 -6968170 -6523165 -5986015
38524 -5986015 -5395852 -4797755 -4236531 -3749851 -3362851 -3085773 -2915344 -2839026 -2840327 -2903710
38514 -2903710 -3018287 -3179201 -3385738 -3636704 -3925731 -4239198 -4557430 -4857953 -5119256
38505 -5119256 -5323936 -5460498 -5523567 -5513298 -5435066 -5299629 -5122726 -4922825 -4716784 -4514796
38495 -4514796 -4317125 -4114602 -3892559 -3635565 -3330204 -2965491 -2532673 -2026302 -1446769
38486 -1446769 -802662 -110702 607620 1330980 2041422 2724178 3365832 3953709 4476999
38477 4476999 4927702 5300146 5590002 5793950 5909717 5935853 5872139 5721792 5494763 5209393
38467 5209393 4890425 4564067 4252660 3971153 3725987 3515811 3333466 3169114 3014402
38458 3014402 2866497 2729963 2614785 2530903 2481718 2460048 2448961 2427422 2378051 2293337 2177714
38447 2177714 2044922 1911799 1790914 1685407 1588793 1489592 1377304 1245988 1094831 928118
38437 928118 756572 598913 480884 430427 470782 614601 861020 1195423 1590620 2009055
38427 2009055 2407034 2742176 2983245 3118839 3160337 3136840 3084325 3034459 3007888 3012899 3047026
38416 3047026 3099392 3153960 3195102 3214833 3218059 3221739 3247491 3311862 3420074 3565996 3736293
38405 3736293 3914925 4085869 4234449 4348071 4416464 4431475 4387038 4279581 4108466 3876145
38395 3876145 3588500 3255465 2890822 2510088 2127423 1753881 1398229 1069036 775704
38386 775704 527434 331044 189415 101789 65844 80183 145500 263240 432004 643624
38376 643624 882165 1128097 1366013 1590489 1805027 2014422 2216209 2396980 2534914 2605816
38366 2605816 2589687 2476794 2272908 2002155 1704824 1428646 1215565 1089279 1049159 1073120
38356 1073120 1127548 1179702 1208004 1207347 1188837 1175079 1193140 1267218 1412615 1632404 1917973
38345 1917973 2253460 2621941 3010128 3409382 3813670 4216629 4609437 4979685 5311298
38336 5311298 5586081 5787440 5905068 5938056 5894710 5789594 5639520 5459552 5259407 5041391
38326 5041391 4801684 4535327 4242192 3929738 3610297 3294472 2984637 2672261 2340637
38317 2340637 1972034 1556213 1096200 608281 116439 -354839 -784531 -1153980 -1443452
38308 -1443452 -1631137 -1697035 -1629817 -1432156 -1121068 -723241 -268303 216277 706703 1181634
38298 1181634 1620592 2003757 2313247 2534775 2658825 2680936 2600788 2420275 2141684 1767868
38288 1767868 1305165 767310 177138 -435930 -1041679 -1615134 -2139636 -2605327 -3003879
38279 -3003879 -3322819 -3543751 -3646568 -3617375 -3455096 -3173115 -2796265 -2356144 -1887265 -1424462
38269 -1424462 -1000445 -642533 -368675 -184210 -81047 -40195 -37042 -48007 -56473 -55610 -46452
38258 -46452 -32361 -13884 12529 52074 108569 183212 274909 380755 496293 616141 735478
38247 735478 852304 969532 1094911 1236863 1397023 1563830 1712347 1811483 1834890 1769839
38237 1769839 1620437 1404798 1148265 875937 607739 357717 136595 -45174 -176343
38228 -176343 -246309 -247822 -179047 -43373 153386 406754 715127 1077155 1486670 1929349
38218 1929349 2383538 2823492 3221935 3551442 3786896 3910193 3915570 3812775 3626452 3391243
38208 3391243 3142896 2907717 2695375 2499616 2306910 2107678 1903459 1706747 1535010
38199 1535010 1403321 1319455 1282423 1282755 1302503 1314775 1284283 1170704 935960 555090 27645
38188 27645 -616332 -1321281 -2022173 -2664793 -3220505 -3689018 -4089279 -4444409 -4768744 -5062509
38178 -5062509 -5314318 -5507472 -5626113 -5660142 -5609262 -5485370 -5311705 -5118719 -4938517 -4799497
38168 -4799497 -4721805 -4714357 -4774952 -4893728 -5057499 -5251936 -5461191 -5667411 -5852272 -6000027
38158 -6000027 -6100065 -6147903 -6145172 -6099438 -6023859 -5935925 -5854801 -5797372 -5773686 -5783081 -5812873
38147 -5812873 -5841404 -5845404 -5808836 -5729032 -5617624 -5497010 -5394805 -5338082 -5348244 -5437309 -5606570
38136 -5606570 -5847805 -6146055 -6482653 -6837583 -7190718 -7522264 -7813541 -8048676 -8215780
38127 -8215780 -8305399 -8306960 -8207649 -7997425 -7677999 -7268834 -6804825 -6326567 -5868803 -5452767
38117 -5452767 -5085125 -4762586 -4478691 -4228557 -4009569 -3819307 -3653630 -3506395 -3369850
38108 -3369850 -3234067 -3085061 -2903152 -2663901 -2342735 -1921983 -1397192 -779953 -96441
38099 -96441 617263 1321632 1980382 2565572 3059526 3453654 3746036 3939776 4042297 4064333
38089 4064333 4017876 3914022 3762396 3572826 3358241 3137033 2933229 2773716 2682848 2676365
38079 2676365 2757495 2917278 3138687 3402104 3689826 3988687 4290895 4593154 4894251 5192030
38069 5192030 5481254 5753448 5998540 6207051 6371417 6486204 6548244 6557709 6519158 6440137
38059 6440137 6326347 6176319 5980736 5729242 5421912 5078182 4736427 4442653 4233609
38050 4233609 4123438 4100676 4135764 4193334 4242695 4263152 4244502 4184756 4086832 3955637 3796361
38039 3796361 3614583 3417806 3217033 3026686 2862368 2738011 2664520 2649999 2699422 2812223
38029 2812223 2979541 3184910 3409975 3642002 3877234 4116696 4357077 4583619 4770709
38020 4770709 4890268 4922865 4865705 4734153 4556357 4362714 4174261 3995660 3816671 3620830
38010 3620830 3395610 3138334 2856007 2560803 2264295 1972855 1685591 1395002 1089616
38001 1089616 757740 391565 -9266 -435714 -869442 -1284449 -1649872 -1934696 -2114931
37992 -2114931 -2181797 -2147168 -2042619 -1911083 -1793722 -1717098 -1685912 -1684270 -1684542 -1659756 -1594496
37981 -1594496 -1490544 -1365899 -1248411 -1167008 -1143689 -1188188 -1296070 -1450676 -1628492 -1806000
37971 -1806000 -1964894 -2093832 -2187483 -2244948 -2268671 -2263332 -2233748 -2181765 -2103524 -1989267 -1826703
37960 -1826703 -1606532 -1327098 -996321 -631394 -257264 96345 399919 629783 771868
37951 771868 822517 787230 678060 509303 292217 31950 -270329 -611116 -978631 -1351402
37941 -1351402 -1701893 -2003035 -2235317 -2392677 -2485392 -2538166 -2583174 -2650538 -2760417 -2919979
37931 -2919979 -3125429 -3366482 -3630067 -3901575 -4164385 -4399862 -4589531 -4719047 -4781740 -4780054
37921 -4780054 -4725252 -4636737 -4540965 -4468254 -4446328 -4491654 -4601403 -4749345 -4888691 -4963201 -4923767
37910 -4923767 -4743524 -4424266 -3991921 -3485000 -2942470 -2395758 -1866329 -1367765 -910017
37901 -910017 -503272 -159323 110503 300130 413296 463935 470524 447519 400367 328242 232249
37890 232249 122238 16907 -62433 -99783 -89400 -36139 47839 148071 252759 356339
37880 356339 460565 572868 702649 856562 1033750 1222195 1397881 1528170 1579163 1524686
37870 1524686 1353460 1071946 702409 277811 -164006 -585140 -951139 -1233764 -1413174
37861 -1413174 -1479224 -1431722 -1279981 -1041587 -739478 -396724 -30293 353170 757098 1190342
37851 1190342 1660654 2169347 2709012 3264347 3814799 4337210 4807366 5200915 5495181
37842 5495181 5672616 5724668 5653933 5473740 5206361 4881252 4533188 4198872 3911437 3694158
37832 3694158 3555696 3488224 3468391 3460375 3420734 3305501 3079707 2727986 2263057 1727855
37822 1727855 1188147 715973 369003 174177 122862 179058 295492 429477 552591 652995
37812 652995 732821 803591 881291 981304 1113459 1278426 1466985 1662838 1848254 2010916
37802 2010916 2149674 2276473 2412557 2579907 2791962 3047981 3332815 3620785 3881163
37793 3881163 4083130 4199549 4210342 4106601 3894437 3595114 3239296 2858035 2476398 2112834
37783 2112834 1781682 1493863 1254347 1059522 898428 758271 630879 515935 419557 350185
37773 350185 314614 315520 350177 410402 484107 558126 620577 661397 671229 639959 556265 409270
37761 409270 192807 -89289 -420249 -772502 -1114357 -1417840 -1664407 -1847112 -1969561 -2042950
37751 -2042950 -2082571 -2104482 -2121951 -2141475 -2159391 -2160947 -2122916 -2019504 -1830337 -1548587 -1186375
37740 -1186375 -774457 -355181 29364 349712 596699 780551 921255 1035245 1126032 1183811
37730 1183811 1192995 1142155 1030810 870512 680901 483367 295406 127733 -15521 -134646
37720 -134646 -231702 -308304 -364201 -396902 -402583 -378122 -323202 -240795 -135158 -8637 140011
37709 140011 314291 517058 748820 1008148 1292158 1594387 1900130 2182694 2404865 2527238
37699 2527238 2520751 2377683 2115543 1771706 1391440 1015036 669543 367359 110254 -104569
37689 -104569 -279617 -414997 -508761 -558344 -561975 -520108 -437503 -325680 -203960 -97167 -30085
37678 -30085 -21202 -79060 -202838 -386154 -621371 -901946 -1222172 -1575310 -1951758 -2338312
37668 -2338312 -2718746 -3075507 -3392149 -3655923 -3859760 -4002826 -4089104 -4124339 -4112586 -4054249
37658 -4054249 -3946608 -3786102 -3570472 -3299610 -2975649 -2603678 -2193332 -1759721 -1321899
37649 -1321899 -898940 -505979 -152829 154459 411270 613848 760931 855735 906346 924251
37639 924251 922469 914473 913644 931899 976749 1047739 1134439 1218013 1276477 1291365 1252236 1156919
37627 1156919 1008725 813964 581730 324719 58608 -200821 -441518 -658586 -856670
37618 -856670 -1050405 -1261418 -1511626 -1815093 -2172426 -2570786 -2990026 -3412007 -3827818 -4238275
37608 -4238275 -4647556 -5054789 -5449578 -5813911 -6128583 -6380196 -6565319 -6689970 -6765184 -6801926
37598 -6801926 -6808794 -6793005 -6761764 -6720924 -6671054 -6604374 -6506418 -6362885 -6167765 -5926969 -5654870
37587 -5654870 -5366794 -5073052 -4777544 -4479811 -4178144 -3872650 -3567921 -3274101 -3005131
37578 -3005131 -2774452 -2589878 -2449373 -2338978 -2234008 -2104129 -1921442 -1669144 -1348142
37569 -1348142 -979599 -602390 -265207 -14559 118118 125408 24422 -152079 -369565 -602913
37559 -602913 -839153 -1072046 -1293962 -1491021 -1644061 -1734082 -1748949 -1688279 -1564703 -1401303
37549 -1401303 -1226477 -1068123 -948919 -883421 -876476 -922325 -1005068 -1102188 -1191501 -1258516 -1299650
37538 -1299650 -1319549 -1325569 -1324271 -1321617 -1324293 -1338887 -1368824 -1412151 -1462817 -1514991 -1567555 -1625989
37526 -1625989 -1700854 -1803651 -1941859 -2114952 -2312701 -2516058 -2700097 -2838312 -2907171 -2889152
37516 -2889152 -2772759 -2550470 -2218102 -1778366 -1247055 -656951 -55607 502631 967299
37507 967299 1302351 1494072 1553366 1509890 1399219 1248714 1068923 853892 589056 262396
37497 262396 -125858 -558719 -1004824 -1426658 -1791262 -2079302 -2289534 -2437457 -2549158 -2653071
37487 -2653071 -2772912 -2923887 -3112008 -3334812 -3581689 -3833543 -4063221 -4238731 -4329775 -4315402
37477 -4315402 -4189296 -3960516 -3649973 -3284243 -2888563 -2481273 -2072299 -1666560 -1269886
37468 -1269886 -893206 -552536 -265622 -47880 90497 145943 121907 28491 -119099 -303880
37458 -303880 -511772 -735799 -977376 -1243609 -1541416 -1870720 -2219609 -2563718 -2869994 -3102601
37448 -3102601 -3228179 -3219667 -3059694 -2744160 -2285292 -1712993 -1073543 -424572 174154 671898
37438 671898 1035314 1250656 1320847 1261547 1098970 868996 615174 383668 215213 136741
37428 136741 156941 268404 454662 697365 979750 1286125 1599891 1902884 2177251 2409159
37418 2409159 2592244 2728984 2829546 2908742 2982024 3061672 3154905 3265087 3395008 3549148
37408 3549148 3732585 3947090 4187355 4440376 4689196 4919922 5128942 5326615 5534741
37399 5534741 5777816 6071204 6411585 6774758 7122288 7413733 7618814 7725406 7742174 7696062
37389 7696062 7625068 7567897 7553892 7596758 7693572 7828294 7977964 8119388 8234017 8309591
37379 8309591 8339282 8320482 8254551 8146884 8005710 7839245 7652435 7445135 7212523 6946908
37369 6946908 6639559 6282041 5867846 5394791 4867164 4295677 3694412 3076013 2447702
37360 2447702 1810541 1162908 506931 -145639 -771843 -1341717 -1826238 -2205195 -2472067
37351 -2472067 -2635114 -2715119 -2740530 -2741020 -2741075 -2755254 -2785964 -2823857 -2850957 -2846720 -2795794 -2694139
37339 -2694139 -2550169 -2380829 -2206103 -2045630 -1917702 -1838105 -1817051 -1855392 -1942865 -2060182
37329 -2060182 -2184368 -2294759 -2376738 -2421926 -2426420 -2390183 -2318919 -2226318 -2133199 -2062447 -2032271
37318 -2032271 -2051584 -2119551 -2228566 -2368183 -2527673 -2696419 -2863468 -3018231 -3153079 -3266308
37308 -3266308 -3363148 -3453796 -3549303 -3656989 -3777067 -3901852 -4018160 -4111799 -4171476 -4190118
37298 -4190118 -4164023 -4091944 -3975446 -3819704 -3633263 -3426523 -3210298 -2995743 -2795545 -2624970
37288 -2624970 -2501097 -2439525 -2449490 -2529941 -2669521 -2851542 -3061854 -3295388 -3558051 -3863470
37278 -3863470 -4226424 -4655176 -5144739 -5673329 -6204217 -6693312 -7099566 -7393678 -7562151
37269 -7562151 -7606810 -7541776 -7389743 -7178320 -6936708 -6692967 -6471968 -6293891 -6172765 -6114785
37259 -6114785 -6116900 -6167043 -6246997 -6337135 -6420205 -6481832 -6508338 -6485244 -6399508 -6244843 -6026289
37248 -6026289 -5760203 -5469090 -5174381 -4891330 -4628351 -4389596 -4177516 -3992848 -3832509
37239 -3832509 -3688105 -3547447 -3399100 -3237799 -3067977 -2903279 -2761669 -2658193 -2599361 -2581994
37229 -2581994 -2595903 -2627221 -2660715 -2682328 -2683276 -2663780 -2632903 -2603469 -2584952 -2577940 -2571858 -2546233
37217 -2546233 -2475981 -2340233 -2131596 -1861129 -1556610 -1255390 -995174 -805471 -701382 -681122
37207 -681122 -727806 -814635 -911615 -992337 -1039831 -1050240 -1033000 -1007254 -995673 -1017272 -1080728
37196 -1080728 -1180322 -1297012 -1405323 -1482930 -1517761 -1509404 -1465462 -1395820 -1307581 -1202292 -1076302
37185 -1076302 -923812 -740689 -526764 -285769 -23921 251270 531303 806648 1067716
37176 1067716 1307714 1526530 1732979 1942670 2171332 2426938 2705441 2993015 3273395
37167 3273395 3535624 3777743 4005305 4227213 4452029 4685975 4931780 5187353 5444368
37158 5444368 5687628 5895964 6044748 6109328 6068212 5905523 5613384 5195320 4670239 4074444
37148 4074444 3458580 2878476 2382505 2000804 1741078 1591972 1531033 1533305 1578447 1655735
37138 1655735 1765760 1917399 2120750 2379833 2689083 3034670 3398410 3761224 4104432
37129 4104432 4409027 4654502 4819437 4885106 4841346 4691897 4456221 4166532 3861238 3577569
37119 3577569 3345966 3187146 3111288 3118417 3199695 3339802 3520307 3723379 3934509 4142778
37109 4142778 4338415 4509804 4643588 4729725 4768868 4776058 4776079 4791424 4829506 4876765 4903077
37098 4903077 4873500 4760950 4554271 4259607 3896058 3488647 3062202 2638374 2235040 1865651
37088 1865651 1537536 1250558 997789 767906 548271 328490 104117 -121590 -340162
37079 -340162 -543599 -728641 -896077 -1046282 -1175423 -1275271 -1335828 -1348268 -1307030 -1211848
37069 -1211848 -1070186 -898254 -717828 -548555 -399596 -265806 -130632 26437 222066
37060 222066 464206 751597 1077049 1432044 1809315 2201716 2598859 2984968 3340436 3646713
37050 3646713 3891951 4074896 4206190 4307590 4409293 4544582 4741953 5017649 5372726
37041 5372726 5795819 6268131 6765736 7257762 7703538 8053239 8254407 8262810 8052959 7622935
37031 7622935 6991452 6190316 5258081 4238005 3178045 2128890 1139352 252685 -493227
37022 -493227 -1063455 -1426221 -1558258 -1452844 -1125682 -615886 17371 701393 1359722 1925311
37012 1925311 2354640 2637828 2799966 2892263 2975571 3101584 3297702 3560433 3859190 4148071
37002 4148071 4380201 4519383 4546806 4463147 4286666 4047435 3778866 3509555 3258240 3032296
36992 3032296 2828589 2636249 2441682 2234855 2014026 1786687 1567030 1371872 1216809
36983 1216809 1113571 1069002 1085060 1158192 1277266 1421650 1562371 1667624 1710799 1677331
36973 1677331 1567423 1393829 1176491 937121 696104 471817 280414 134255 39003 -8232
36963 -8232 -16546 6433 64197 176572 375805 694484 1151176 1740308 2429951 3167759 3892228
36952 3892228 4544460 5076165 5452862 5654244 5673651 5516805 5199506 4745124 4183044 3547597
36942 3547597 2876063 2205281 1568159 991460 495080 91831 -213005 -422062 -544793
36933 -544793 -593889 -580079 -508139 -376800 -183143 70225 368243 680228 963399 1173093
36923 1173093 1275731 1258621 1132894 929728 692331 466485 292118 197882 199106 297542
36913 297542 481362 725890 996986 1257711 1476241 1631904 1717224 1736043 1699320 1620702
36903 1620702 1513300 1387797 1251274 1106358 951055 779651 584613 358960 98555
36894 98555 -196040 -518464 -856073 -1189871 -1495173 -1744169 -1910621 -1975007 -1927600 -1768970
36884 -1768970 -1509897 -1172198 -788993 -401317 -50223 232802 432896 553542 612513 633453
36874 633453 636364 631075 616361 584074 525177 434816 315294 176843 36090 -87644 -177085
36863 -177085 -220851 -214867 -161030 -64419 68908 232334 418209 618626 828176 1046619
36853 1046619 1278361 1527912 1793650 2063321 2313368 2512330 2627474 2632777 2515151 2276036
36843 2276036 1928054 1489724 982343 430708 -134155 -673877 -1145677 -1509089 -1734013
36834 -1734013 -1806821 -1732042 -1529156 -1226309 -853898 -440355 -10530 414428 816882 1182414
36824 1182414 1499044 1756055 1943966 2057194 2099006 2085399 2044049 2007542 2004381 2052876 2160611
36813 2160611 2328300 2554782 2840285 3186888 3596829 4070284 4603835 5189434 5812858
36804 5812858 6451792 7075559 7648323 8135017 8506985 8745236 8841514 8798305 8627584 8347607
36794 8347607 7978685 7540462 7052036 6533344 6004971 5485391 4987091 4513867 4060807
36785 4060807 3617521 3174262 2729033 2292287 1886168 1537833 1269431 1088991 985940
36776 985940 933081 894287 834821 730171 570308 358708 107821 -166249 -447756 -723139
36766 -723139 -981084 -1211472 -1403767 -1545564 -1622516 -1620635 -1530584 -1352007 -1095637 -781909
36756 -781909 -436176 -81666 267512 610101 955723 1317634 1703626 2109286 2515713 2891491
36746 2891491 3197828 3396243 3457776 3371420 3148548 2821470 2436706 2045313 1692891 1411590
36736 1411590 1216181 1105209 1066094 1081211 1132643 1205320 1289413 1381790 1485422 1606521
36726 1606521 1750892 1921195 2115213 2324211 2531483 2713138 2843278 2902842 2887562 2809393
36716 2809393 2689471 2546749 2389529 2214506 2012092 1773148 1493379 1174865 825983
36707 825983 460474 95505 -251208 -563953 -829776 -1037338 -1175505 -1233405 -1202060 -1076249
36697 -1076249 -855693 -546006 -159843 282633 755320 1229688 1678447 2077543 2406184
36688 2406184 2645862 2779921 2794966 2684355 2452302 2115945 1703627 1249763 788504 348698
36678 348698 -48292 -387892 -660514 -860804 -988437 -1048418 -1048717 -995971 -892654 -738359
36668 -738359 -533971 -284939 -822 307988 633113 968130 1306341 1639341 1958654 2259695
36658 2259695 2545014 2824017 3108760 3407757 3720843 4037607 4340188 4608995 4828531
36649 4828531 4991018 5097304 5155546 5178209 5177630 5161368 5129590 5076076 4992144 4870790 4708747
36638 4708747 4506097 4264936 3988783 3683495 3359205 3031657 2721138 2448427 2229368
36629 2229368 2071003 1971197 1921279 1909491 1923286 1949920 1975981 1986952 1967745 1904817 1789699
36618 1789699 1622601 1413776 1180683 941506 708724 486944 276017 76492 -106275
36609 -106275 -260547 -368585 -409222 -363588 -222605 8074 309621 657766 1032515 1425132
36599 1425132 1839557 2287440 2778195 3308216 3855005 4379706 4836569 5184051 5392812
36590 5392812 5449317 5356297 5131129 4802018 4402251 3964410 3516940 3083436 2682992 2330139
36580 2330139 2034804 1803495 1641502 1554573 1548929 1629639 1797820 2047192 2361227 2712986
36570 2712986 3068999 3396008 3667445 3866918 3988450 4035359 4019726 3962248 3890288 3832511
36560 3832511 3811676 3839450 3916048 4033779 4181286 4346420 4518001 4687784 4852892 5017516
36550 5017516 5192027 5388394 5612744 5858443 6103921 6317352 6466284 6527461 6492499 6367897
36540 6367897 6170806 5923256 5647187 5361492 5081166 4818076 4582433 4383848 4230773
36531 4230773 4127763 4071379 4047112 4030078 3990505 3901850 3747328 3521618 3227625 2870794
36521 2870794 2453889 1974383 1425660 802034 105644 -648042 -1428747 -2194364 -2897400
36512 -2897400 -3493423 -3949487 -4249637 -4395267 -4400771 -4287203 -4076308 -3785661 -3425420 -2998272
36502 -2998272 -2503620 -1944221 -1331002 -682649 -20196 639812 1289399 1928236 2558544
36493 2558544 3178639 3777989 4335488 4821725 5205380 5462287 5583514 5578412 5471446 5295395
36483 5295395 5084553 4869702 4674728 4514672 4395475 4315440 4267614 4242251 4228951 4218261
36473 4218261 4202784 4178216 4145056 4110763 4090640 4105219 4173566 4304859 4492790 4716614 4949067
36462 4949067 5167152 5360304 5532752 5700376 5884262 6103002 6365654 6668019 6994691
36453 6994691 7326546 7649417 7958342 8254978 8540958 8812437 9058958 9266131 9419989
36444 9419989 9511690 9541786 9522401 9475344 9426132 9396421 9398163 9431622 9487566 9552388 9613823
36433 9613823 9664912 9705435 9741609 9784740 9848448 9944267 10076945 10241563 10423657 10602148
36423 10602148 10754543 10863517 10923244 10943286 10948729 10976352 11066958 11254630 11555753 11962433
36413 11962433 12443767 12954234 13444941 13873460 14210122 14440463 14564203 14591793 14540488 14431655
36403 14431655 14289353 14138756 14003824 13905403 13861192 13887042 13997433 14204182 14514842 14932941
36393 14932941 15460272 16099642 16856283 17737355 18750037 19899306 21186669 22610318 24165861
36384 24165861 25846438 27642288 29541211 31531086 33604261 35762612 38021816 40413120
36376 40413120 42980961 45776320 48848520 52239965 55986961 60125958 64700716 69765214
36368 69765214 75380219 81606258 88498809 96110498 104500551 113746717 123952559 135244996
36360 135244996 147762149 161636122 176976112 193853842 212288509 232225289 253501421
36353 253501421 275797745 298581404 321055724 342143343 360534054 374822036 383729751
36346 383729751 386369911 382457207 372382502 357116148 337983249 316401534 293666617
36339 293666617 270826629 248643987 227617542 208033523 190020858 173598434 158712526
36332 158712526 145266980 133147219 122237167 112428807 103626203 95746310 88717372
36325 88717372 82474275 76951009 72073373 67757073 63914134 60464393 57344580 54509702
36317 54509702 51927628 49572075 47418526 45444584 43633804 41980466 40492006 39186821
36309 39186821 38088170 37217368 36589435 36212146 36087311 36212545 36582771 37192164 38037441
36300 38037441 39121565 40454777 42050526 43917184 46049458 48422590 50989236 53676538
36292 53676538 56381768 58968089 61265515 63083304 64236811 64584343 64061767 62700221
36284 62700221 60618176 57990409 55006810 51837120 48612509 45424772 42335808 39388328
36276 39388328 36612789 34030574 31655446 29494300 27546966 25805152 24251787 22862138
36268 22862138 21606866 20456000 19382686 18365873 17391015 16448206 15528887 14624112 13727134
36259 13727134 12839672 11977569 11170859 10456486 9866467 9416921 9102387 8896739 8759205
36250 8759205 8643245 8506412 8319031 8068710 7758499 7399715 7004037 6579816 6134193
36241 6134193 5678327 5231197 4818994 4470387 4210193 4054339 4007884 4066492 4220355 4458228
36231 4458228 4768876 5138760 5547850 5967426 6362979 6702251 6965276 7151883 7282819
36222 7282819 7393371 7521767 7697193 7932271 8222314 8550191 8893169 9228198 9534457
36213 9534457 9794209 9993398 10122157 10174816 10149700 10049431 9881443 9657495 9391631 9097333
36203 9097333 8784881 8459451 8120579 7764022 7385694 6985341 6567536 6140323 5714065
36194 5714065 5302091 4921842 4593822 4337055 4162355 4066761 4032454 4031152 4031630 4006387 3935106
36183 3935106 3805195 3610671 3350183 3025157 2639849 2204278 1737886 1269760 833416
36174 833416 458932 167650 -27818 -120386 -106553 11856 223947 507705 831805 1160402
36164 1160402 1458483 1695981 1850245 1907175 1861394 1715767 1480511 1171753 809307 413838
36154 413838 4342 -403070 -794810 -1158769 -1484068 -1762303 -1989550 -2167362 -2301512 -2399007
36144 -2399007 -2465363 -2503961 -2517501 -2509798 -2485893 -2449810 -2401222 -2333246 -2233013 -2085228 -1877409
36133 -1877409 -1604582 -1271165 -889206 -474533 -43792 385957 796291 1167544 1480792
36124 1480792 1719979 1872682 1930231 1889277 1755237 1545291 1287709 1016405 762910 549850
36114 549850 388851 282466 226770 211584 218732 221896 191200 101606 -59408 -289310 -573969
36103 -573969 -893734 -1227474 -1552197 -1840037 -2057231 -2168365 -2144914 -1973283 -1657867 -1218508
36093 -1218508 -685356 -94465 515208 1105244 1643329 2109826 2501907 2832125 3121635
36084 3121635 3391677 3657292 3925013 4193668 4457013 4707556 4941145 5160645 5376499
36075 5376499 5602956 5851395 6124173 6412186 6696734 6953326 7154616 7272092 7278771 7154734
36065 7154734 6893773 6506643 6017676 5456292 4848838 4215840 3575551 2950118 2369191
36056 2369191 1867982 1480563 1231913 1132568 1177901 1351333 1628846 1982416 2381788 2795925
36046 2795925 3195242 3554252 3853462 4079812 4226059 4289793 4272377 4177576 4009648 3771575
36036 3771575 3465384 3096169 2678561 2240743 1821092 1457467 1174834 978161 853614
36027 853614 775780 716068 648558 552693 414882 231072 9530 -229194 -457001 -645852
36017 -645852 -774382 -831288 -816383 -740824 -626396 -502378 -399379 -341630 -340556 -392171 -479135
36006 -479135 -576142 -656012 -694399 -672778 -580535 -416476 -188828 87198 393506 712538
35996 712538 1028512 1327177 1595891 1824534 2006356 2138374 2222231 2266011 2285567 2303294
35986 2303294 2343908 2428762 2570560 2769939 3015069 3284790 3554076 3799389 4002025 4149497
35976 4149497 4235722 4260484 4228331 4147456 4029118 3887639 3740681 3609548 3518957 3495102
35966 3495102 3561102 3730734 4003043 4360300 4769947 5189418 5572532 5876988 6072462 6147280
35956 6147280 6110335 5986306 5806092 5597436 5379846 5164398 4956358 4758403 4573225 4404984
35946 4404984 4259517 4143687 4064174 4025632 4028520 4067885 4134127 4214815 4295678 4360703 4393423
35935 4393423 4380480 4315273 4198704 4037071 3840148 3621392 3398621 3192268 3020735 2895396
35925 2895396 2818070 2781851 2774440 2782739 2797588 2817364 2849255 2907888 3011987 3180079 3425685
35914 3425685 3752126 4148065 4586251 5027663 5430597 5760905 5998804 6140157 6193700 6177293
35904 6177293 6115181 6035996 5970026 5944626 5978248 6075192 6223642 6398485 6568124 6702903
35894 6702903 6782451 6800074 6763513 6692326 6612725 6550994 6526982 6549886 6618473 6726180 6868366
35883 6868366 7046986 7269212 7540374 7855135 8191854 8513572 8775916 8938943 8978048 8889553
35873 8889553 8689061 8403864 8063152 7690507 7301872 6908819 6523432 6159939 5830710
35864 5830710 5538934 5273666 5012310 4730614 4414552 4066358 3700842 3334808 2976818
35855 2976818 2623348 2262471 1881571 1474311 1043908 602499 167807 -241525 -610586
35846 -610586 -930846 -1199298 -1414859 -1575343 -1677856 -1722145 -1713835 -1665110 -1592812 -1515167 -1447910
35835 -1447910 -1400401 -1373011 -1357419 -1340046 -1306901 -1247121 -1153680 -1021974 -848716 -632946 -378716
35824 -378716 -97113 194732 478118 739152 974062 1190377 1402771 1625484 1865399 2119069
35814 2119069 2374099 2613080 2818084 2974576 3074195 3116108 3106927 3059330 2989382 2912745 2840798
35803 2840798 2778055 2721482 2661107 2581149 2461824 2282688 2027554 1689523 1273822 796984
35793 796984 282758 -243391 -758932 -1246624 -1694654 -2095942 -2448317 -2755881 -3029800 -3286353
35783 -3286353 -3542016 -3807949 -4086402 -4369602 -4640282 -4873652 -5041264 -5116353 -5078624 -4917156
35773 -4917156 -4632178 -4237232 -3760986 -3245696 -2740352 -2290774 -1931703 -1684379 -1558445
35764 -1558445 -1554146 -1662260 -1862972 -2127250 -2422526 -2720947 -3006085 -3274937 -3534803 -3797067
35754 -3797067 -4070395 -4355074 -4639573 -4900366 -5105876 -5224257 -5232891 -5126354 -4919722 -4645570
35744 -4645570 -4345296 -4057757 -3809755 -3612374 -3464066 -3357472 -3284900 -3239184 -3211072 -3187623
35734 -3187623 -3155227 -3106433 -3046110 -2992844 -2974689 -3021049 -3153137 -3375513 -3671521 -4005004
35724 -4005004 -4328155 -4592263 -4757368 -4798437 -4707980 -4495607 -4184725 -3806782 -3394764 -2978397
35714 -2978397 -2582286 -2225729 -1922037 -1677132 -1489600 -1354009 -1266212 -1227002 -1241745 -1316610
35704 -1316610 -1453889 -1648483 -1886780 -2148509 -2411495 -2657810 -2878568 -3074382 -3250437
35695 -3250437 -3408479 -3541003 -3632039 -3663964 -3624880 -3511359 -3326299 -3075819 -2768249 -2414715
35685 -2414715 -2028730 -1623791 -1210495 -795759 -384975 14765 393561 740870 1048434
35676 1048434 1310314 1519581 1665548 1735649 1721741 1626113 1462351 1250137 1007463 745154
35666 745154 466498 170950 -141758 -470148 -812222 -1166818 -1532771 -1906141 -2277947 -2634103
35656 -2634103 -2956771 -3225024 -3414367 -3497304 -3447214 -3244850 -2884292 -2375863 -1746091 -1035894
35646 -1035894 -297470 410315 1027780 1500660 1786043 1857478 1708423 1353109 824571 170011
35636 170011 -556366 -1302494 -2027515 -2707936 -3338761 -3929307 -4494897 -5047065 -5586276 -6100848
35626 -6100848 -6572416 -6984196 -7327080 -7600919 -7811396 -7964439 -8060650 -8092404 -8045616 -7905857
35616 -7905857 -7665969 -7331142 -6918587 -6451628 -5951563 -5432399 -4901740 -4366120 -3835417
35607 -3835417 -3322210 -2836933 -2383211 -1957154 -1550848 -1157540 -775379 -407887 -61504
35598 -61504 257630 545127 797511 1010936 1181910 1310096 1400704 1463556 1508642 1540850
35588 1540850 1557176 1547752 1499496 1400024 1240053 1014092 720492 361861 -54198 -514886
35578 -514886 -1002928 -1497832 -1977318 -2419523 -2806730 -3129665 -3389759 -3597136 -3764779 -3902172
35568 -3902172 -4012341 -4094084 -4147563 -4178987 -4200754 -4226803 -4266547 -4321350 -4384965 -4446162 -4490813
35557 -4490813 -4502535 -4463385 -4356376 -4169781 -3901497 -3561899 -3174718 -2775479 -2406279 -2106905
35547 -2106905 -1905376 -1812594 -1823092 -1919345 -2075875 -2262072 -2445370 -2595500 -2687964 -2704528
35537 -2704528 -2631168 -2456354 -2172192 -1778409 -1287059 -725405 -135275 431789 923044 1294488
35527 1294488 1518681 1587514 1509658 1305149 1000219 624303 209832 -205683 -577520 -855621
35517 -855621 -993262 -960378 -754597 -403328 44057 529303 997514 1404945 1721978 1932971
35507 1932971 2035246 2038522 1963989 1840991 1700696 1569126 1462956 1389294 1347741 1332484
35497 1332484 1333969 1340740 1341725 1328342 1295872 1243888 1175768 1097849 1019333 953481 918434 934816
35485 934816 1019090 1175584 1392190 1642959 1896602 2126573 2317867 2467873 2581988 2667382
35475 2667382 2728470 2765918 2778579 2766414 2732286 2681673 2620929 2555938 2492318 2436628 2396914
35464 2396914 2381347 2395056 2436164 2492704 2542131 2554488 2498583 2349374 2094820 1740870 1313018
35453 1313018 852748 408979 27616 -256632 -424082 -470799 -408571 -264514 -78488 103474
35443 103474 238605 295894 259945 129363 -87879 -378834 -727822 -1116568 -1523455 -1923286
35433 -1923286 -2288341 -2590629 -2804659 -2910483 -2897213 -2766679 -2535566 -2234312 -1902480 -1581734
35423 -1581734 -1307505 -1100099 -957102 -851017 -736162 -564810 -306475 39429 444713
35414 444713 866265 1263945 1612619 1904644 2145958 2350902 2537735 2724209 2923075 3139106
35404 3139106 3368777 3602009 3824626 4020787 4175305 4275782 4314590 4290705 4210217 4083829
35394 4083829 3921564 3728446 3505177 3253369 2980232 2698371 2421487 2159988 1918808
35385 1918808 1696536 1484761 1268682 1030766 756703 440266 83701 -306523 -725317
35376 -725317 -1172033 -1649504 -2160708 -2705803 -3281112 -3879883 -4493544 -5111636 -5718972 -6290799
35366 -6290799 -6789972 -7171025 -7392114 -7429728 -7288082 -6997699 -6604025 -6152431 -5677485 -5201053
35356 -5201053 -4738042 -4304659 -3924393 -3629570 -3457859 -3443303 -3603115 -3925086 -4362396 -4840075
35346 -4840075 -5271829 -5581372 -5720871 -5680512 -5486711 -5190997 -4854729 -4534843 -4273774 -4094380
35336 -4094380 -3999214 -3972632 -3984557 -3995927 -3966347 -3862758 -3665982 -3372685 -2993222 -2547725
35326 -2547725 -2062088 -1564152 -1079958 -630066 -225877 133414 460982 777454 1101937
35317 1101937 1443791 1799809 2157038 2497251 2799281 3039321 3192348 3236812 3160896 2966137
35307 2966137 2665822 2279464 1827012 1325350 787671 225142 -350105 -922504 -1472855
35298 -1472855 -1980410 -2425528 -2791644 -3066953 -3245897 -3328749 -3317958 -3213307 -3010350 -2704330
35288 -2704330 -2297057 -1801866 -1243657 -654261 -65690 495735 1011893 1471297 1864978
35279 1864978 2182931 2413897 2549187 2588642 2545244 2445431 2324332 2217729 2153805 2147650
35269 2147650 2200095 2300431 2430828 2570429 2698591 2797795 2856021 2867529 2831842 2752334
35259 2752334 2635670 2491490 2331095 2165269 2002508 1848249 1704579 1570484 1443600
35250 1443600 1323732 1216335 1133375 1090432 1101097 1171016 1294129 1452749 1621271 1771595
35240 1771595 1878237 1922499 1895742 1800822 1649753 1457066 1231685 972413 670544 318688
35230 318688 -79245 -502813 -917408 -1282780 -1563564 -1737797 -1801032 -1765311 -1653727 -1492776
35220 -1492776 -1305460 -1107412 -906211 -702770 -493726 -274636 -44072 192046 417505
35211 417505 606223 727333 754414 676023 503176 269527 22707 -190629 -339929 -419442
35201 -419442 -447395 -457522 -487444 -567508 -711659 -911736 -1137558 -1344654 -1488289 -1538745
35191 -1538745 -1491376 -1366588 -1199365 -1023482 -859050 -710037 -571339 -438418 -312103 -196587
35181 -196587 -94264 -2182 87842 186238 301840 438913 596244 768402 947915 1126287
35171 1126287 1292730 1431728 1522235 1540415 1465266 1284462 998027 619196 172994 -306725
35161 -306725 -781403 -1212618 -1567244 -1822144 -1966902 -2002923 -1938988 -1786020 -1554627 -1256895
35151 -1256895 -910657 -543070 -190956 102997 297438 360791 278130 54400 -286632 -707381
35141 -707381 -1164454 -1617849 -2038437 -2411163 -2733534 -3011068 -3252170 -3464195 -3651651 -3816729
35131 -3816729 -3961120 -4086719 -4193118 -4272627 -4306950 -4270106 -4138133 -3900789 -3568513 -3170781
35121 -3170781 -2747289 -2336917 -1969418 -1662158 -1420855 -1241548 -1111904 -1012405 -918956 -807343
35111 -807343 -658345 -462227 -221824 47037 319614 570841 784771 959221 1102482 1223962
35101 1223962 1324638 1393078 1409178 1352615 1210428 980152 669797 298205 -103321 -491430
35091 -491430 -816467 -1032644 -1107727 -1027939 -797677 -436785 22088 535976 1055827 1533947
35081 1533947 1933572 2237065 2448935 2592088 2698606 2798451 2909757 3033488 3153772 3243554
35071 3243554 3273554 3221213 3076177 2840676 2526177 2149775 1733206 1304109 896355 546279
35061 546279 284815 129090 77670 111439 199043 304779 397159 456363 477871 470072 446796
35050 446796 419565 394722 376682 373539 399702 473177 609607 817187 1094775 1432188 1810369
35039 1810369 2200773 2565695 2861715 3046484 3086964 2966519 2688934 2278576 1776657 1234232
35029 1234232 703282 228066 -160767 -447934 -631814 -721670 -735436 -697351 -633392 -564202
35019 -564202 -498514 -431420 -349298 -238739 -94108 80363 274149 476047 677365 870619
35009 870619 1045417 1185602 1270719 1281187 1203403 1031575 766763 416402 -3753 -467510
34999 -467510 -939841 -1383228 -1765450 -2064906 -2272612 -2392384 -2439541 -2436606 -2405961 -2363384
34989 -2363384 -2317283 -2274210 -2245458 -2248632 -2302599 -2419305 -2597145 -2818329 -3050377 -3251251
34979 -3251251 -3377502 -3393855 -3281445 -3042065 -2697448 -2284492 -1848041 -1432839 -1076270 -803603
34969 -803603 -626654 -545263 -550021 -625139 -751390 -908986 -1079627 -1247114 -1397201 -1518011
34959 -1518011 -1601430 -1644429 -1649014 -1620670 -1566387 -1493608 -1410770 -1328891 -1262504 -1227879 -1237734 -1294316
34947 -1294316 -1384883 -1483282 -1557663 -1580164 -1533206 -1410249 -1213704 -954034 -650982 -333733
34937 -333733 -36467 210702 391395 508195 580703 637121 703027 792170 903171 1023085
34927 1023085 1135228 1226682 1291831 1331506 1350268 1354620 1352860 1355284 1373315 1417264 1493340 1601010
34915 1601010 1732150 1873034 2008475 2125503 2214134 2265640 2271258 2223874 2122112 1973672
34905 1973672 1795020 1607366 1431215 1282118 1168719 1092875 1051306 1038084 1046691 1070535
34895 1070535 1102318 1134141 1159361 1174459 1178169 1167734 1135760 1071214 964202 810669 613577
34884 613577 380939 123589 -145268 -409362 -649286 -843917 -973014 -1020429 -977086 -842071
34874 -842071 -620759 -321692 43799 457150 886352 1283933 1592589 1756910 1736447 1515313
34864 1515313 1105045 539795 -133765 -866871 -1614940 -2338912 -3004305 -3581364 -4047658
34855 -4047658 -4392235 -4619165 -4748360 -4812639 -4851521 -4903677 -5000471 -5162046 -5395416 -5692997
34845 -5692997 -6031341 -6372327 -6669203 -6876608 -6960348 -6903181 -6706415 -6389145 -5985938 -5542100
34835 -5542100 -5106234 -4721779 -4419838 -4214795 -4103247 -4066524 -4076796 -4105673 -4132688 -4150206
34825 -4150206 -4162263 -4178194 -4205487 -4246792 -4302331 -4374375 -4469461 -4596849 -4765191 -4980094 -5243436
34814 -5243436 -5553435 -5904231 -6285018 -6680254 -7072328 -7446268 -7794293 -8117672 -8424715
34805 -8424715 -8725605 -9026334 -9324837 -9611622 -9874571 -10104690 -10299128 -10460307 -10592953
34796 -10592953 -10701451 -10788405 -10853836 -10894772 -10906011 -10882836 -10824598 -10736377 -10626679 -10502278
34786 -10502278 -10364172 -10208062 -10029277 -9828548 -9614439 -9400526 -9198941 -9013984 -8839211
34777 -8839211 -8659252 -8455119 -8210698 -7917876 -7578187 -7199980 -6792511 -6360169 -5899642
34768 -5899642 -5400647 -4849140 -4231793 -3540400 -2774540 -1941572 -1055136 -134120 797812
34759 797812 1713886 2587837 3397644 4127263 4766317 5309283 5755191 6107629 6374600 6567772
34749 6567772 6700777 6786921 6837825 6864233 6878173 6893987 6926452 6986394 7075970 7186313 7299257
34738 7299257 7392405 7444537 7438905 7365096 7221659 7019024 6778988 6528139 6287830 6066782
34728 6066782 5860683 5658582 5452405 5245167 5054414 4909397 4842757 4879227 5024866 5261006
34718 5261006 5546452 5828085 6054908 6187973 6201771 6079326 5807503 5377617 4791103 4065583
34708 4065583 3236555 2353430 1472214 647788 -72952 -656783 -1087590 -1366108 -1506169
34699 -1506169 -1529955 -1464593 -1340229 -1188036 -1037172 -911002 -823806 -779371 -772549 -793527 -832602
34688 -832602 -882506 -936732 -985022 -1009155 -982504 -875352 -664525 -342380 80676 582039
34678 582039 1137253 1728017 2343503 2976048 3615996 4249852 4862067 5437313 5960438 6414829
34668 6414829 6782923 7051030 7216007 7288548 7289938 7243787 7167311 7066505 6937279 6771556
34658 6771556 6564332 6316934 6034730 5722444 5382131 5015706 4629085 4233743 3844475
34649 3844475 3475505 3137321 2834458 2563261 2310098 2052781 1767780 1442218 1085071
34640 1085071 730465 429423 232878 173961 258000 464047 755308 1091855 1439721 1774254
34630 1774254 2079003 2342605 2555778 2709845 2797002 2811202 2748108 2604118 2376213 2064270
34620 2064270 1675283 1226809 746737 268619 -175254 -559193 -865518 -1083704 -1211020
34611 -1211020 -1255873 -1240245 -1196181 -1155805 -1140106 -1153266 -1185307 -1220519 -1246446 -1259038 -1262463
34600 -1262463 -1264919 -1273060 -1287458 -1300472 -1297160 -1259021 -1169522 -1019527 -810809 -556675 -279649
34589 -279649 -7002 234426 422283 540116 576172 521250 368013 112987 -239712 -675278
34579 -675278 -1167591 -1681633 -2178331 -2620606 -2978785 -3233414 -3374911 -3401599 -3318164 -3135138
34569 -3135138 -2868396 -2537654 -2163769 -1765333 -1355501 -940727 -522824 -103615 310823
34560 310823 709503 1080065 1414325 1712273 1982318 2238314 2496202 2772297 3082050 3436445
34550 3436445 3836075 4267135 4703705 5116151 5480878 5786618 6035477 6240082 6419235
34541 6419235 6593945 6783886 7003239 7256131 7534369 7820158 8092638 8333525 8528362
34532 8528362 8664534 8729920 8714526 8614224 8434260 8190615 7908301 7616897 7344849 7114691
34522 7114691 6940501 6827643 6773992 6771875 6810260 6876848 6959790 7048758 7135347 7213058 7277090
34511 7277090 7324156 7352624 7363727 7363993 7366892 7390123 7446946 7535169 7631295 7695123 7683283 7564463
34499 7564463 7328680 6987222 6565224 6091986 5594283 5094933 4614735 4173575 3787981
34490 3787981 3466372 3205929 2993902 2812945 2647750 2490137 2341068 2209488 2109067
34481 2109067 2054695 2060180 2137208 2294201 2533627 2847698 3214235 3595506 3942540 4205247
34471 4205247 4345406 4347327 4221454 3999713 3725288 3441557 3183800 2974815 2823487 2725060
34461 2725060 2662765 2611096 2540512 2422374 2232624 1953581 1574331 1090864 506871 -164743
34451 -164743 -900706 -1668411 -2430016 -3148180 -3790344 -4329774 -4744950 -5020240 -5148479 -5132662
34441 -5132662 -4983965 -4717075 -4346808 -3889047 -3365543 -2809424 -2267703 -1797829 -1457436
34432 -1457436 -1290080 -1313222 -1514420 -1857062 -2291664 -2767038 -3237966 -3669255 -4037476 -4331082
34422 -4331082 -4548689 -4695518 -4779144 -4806122 -4780109 -4700753 -4563111 -4358759 -4079794 -3724392
34412 -3724392 -3300559 -2825750 -2323225 -1817661 -1331641 -883237 -484838 -143609 136885
34403 136885 355635 515180 624065 698194 758661 826082 914498 1028780 1167110 1325916
34393 1325916 1502492 1692755 1886512 2065486 2207464 2295056 2324072 2306641 2267009 2231246
34383 2231246 2215149 2216407 2215879 2187808 2112999 1987245 1821074 1632780 1440037 1254735 1082570
34372 1082570 925861 786577 667517 571852 502411 461152 448084 459556 487417 520518 548086
34361 548086 563151 564784 559269 560661 590494 675764 844433 1118757 1508367 2005759 2585791
34350 2585791 3208880 3826902 4391484 4864035 5224495 5474374 5632029 5722816 5769350 5785635
34340 5785635 5775842 5736919 5664150 5558394 5432604 5314463 5242871 5258615 5392621 5656914
34330 5656914 6042182 6522049 7060419 7617935 8156566 8644243 9060854 9403798 9689334
34321 9689334 9948007 10216073 10526775 10904086 11359213 11889053 12476520 13093943 13710340
34312 13710340 14301051 14855328 15377426 15880253 16375179 16863435 17333134 17763254 18133068
34303 18133068 18432739 18669250 18863985 19043419 19228452 19427555 19635842 19839794 20026309
34294 20026309 20193298 20357001 20551448 20819020 21196115 21700689 22327594 23053779 23850633
34285 23850633 24697383 25589533 26539673 27572451 28717682 30004961 31460919 33108663
34277 33108663 34968306 37057337 39389909 41975226 44816579 47913002 51263990 54875977
34269 54875977 58768510 62978573 67562168 72593061 78159580 84361028 91304546 99102037
34261 99102037 107867056 117712735 128751842 141098410 154868864 170180942 187149170
34254 187149170 205875502 226432992 248839783 273020123 298749472 325585090 352792352
34247 352792352 379288857 403640791 424153350 439084848 446967025 446944289 439000091 423967637
34239 423967637 403319384 378830239 352246466 325054700 298377025 272966986 249264054
34232 249264054 227469850 207622679 189659279 173460644 158882535 145773238 133982687
34225 133982687 123367276 113792787 105136092 97286510 90148308 83644282 77717143 72324932
34217 72324932 67430563 62991177 58954582 55265843 51879739 48770466 45931938 43368743
34209 43368743 41083735 39069076 37303963 35757894 34396562 33187871 32106433 31135140
34201 31135140 30263350 29483134 28786263 28163362 27603808 27094250 26616087 26144677 25652119
34192 25652119 25112273 24505235 23820292 23058256 22233658 21375164 20521770 19713929 18981972
34183 18981972 18336926 17768512 17251117 16753366 16245532 15702727 15106289 14446055 13723087
34174 13723087 12950191 12149022 11345072 10562664 9821476 9135224 8512377 7957521 7471483
34165 7471483 7049586 6679899 6344253 6023143 5702670 5379954 5063997 4771640 4520829
34156 4520829 4324322 4185658 4097757 4043983 4001718 3947697 3862981 3735844 3563025 3351285
34146 3351285 3119285 2896935 2719256 2615630 2599254 2662217 2778642 2914253 3037722 3128576
34136 3128576 3178673 3188272 3160591 3098379 3003675 2880006 2735714 2586786 2457167 2375108 2365929
34125 2365929 2443328 2602027 2814716 3036012 3214160 3306711 3293032 3177740 2984630 2745428
34115 2745428 2488538 2231422 1978807 1727458 1475293 1229639 1009619 841759 752139 759479
34105 759479 871385 1083278 1378385 1727923 2092344 2425615 2683104 2830524 2849832 2739870
34095 2739870 2513343 2193032 1808644 1393880 983366 609684 300270 73296 -67002
34086 -67002 -132823 -149903 -149114 -156088 -183629 -229648 -280155 -314913 -313150 -257626 -136323 58035
34074 58035 329704 681253 1112988 1619999 2188270 2792717 3399794 3974783 4490667 4934242
34064 4934242 5307097 5622621 5901644 6167806 6441774 6734250 7040693 7341858 7611343
34055 7611343 7826378 7975602 8059764 8086358 8062810 7992640 7875757 7710926 7497804 7237367
34045 7237367 6931231 6580745 6186313 5747067 5261229 4727827 4150124 3539992 2921130
34036 2921130 2328779 1804987 1390724 1117583 1001776 1042006 1221389 1512162 1881028 2293171
34026 2293171 2714257 3111338 3454253 3718523 3888969 3961634 3941766 3838152 3657523 3403462
34016 3403462 3080948 2703084 2294923 1891907 1534246 1260057 1099216 1068753 1170667 1393152
34006 1393152 1715062 2111759 2559903 3039925 3536357 4036844 4530591 5007019 5455138
33997 5455138 5863713 6221822 6519579 6749039 6904946 6984779 6988219 6916948 6775339 6570912
33987 6570912 6312897 6009040 5662955 5274593 4844042 4376401 3884495 3387491 2905994
33978 2905994 2456661 2049663 1690149 1381797 1129465 939226 815965 759425 759997 796378
33968 796378 837764 851388 812462 711174 553149 354368 134637 -87130 -295595 -481001
33958 -481001 -641105 -782369 -919453 -1072700 -1263463 -1507404 -1806917 -2145178 -2484972 -2774237
33948 -2774237 -2957724 -2991238 -2853331 -2550225 -2112963 -1588639 -1028703 -477350 36908 503572
33938 503572 925819 1312520 1671070 2003618 2306486 2571667 2790043 2955628 3068487 3133858
33928 3133858 3157397 3139910 3075722 2956073 2775225 2535379 2248141 1932877 1613159 1311703
33918 1311703 1043833 811483 601502 390775 156100 -116857 -430052 -774878 -1135602
33909 -1135602 -1491447 -1817749 -2088402 -2280370 -2378450 -2378070 -2285373 -2115036 -1886203 -1617284
33899 -1617284 -1321832 -1007994 -681392 -348323 -16514 305766 609600 883623 1112876
33890 1112876 1280494 1372124 1381231 1313580 1189249 1040424 904379 813946 789638 836664 946988
33879 946988 1104337 1289432 1483760 1671505 1840342 1981680 2090307 2163105 2197314 2189506
33869 2189506 2136125 2035501 1890578 1711210 1514534 1322452 1157053 1036334 972121 970021
33859 970021 1030085 1147499 1313492 1516522 1743525 1981520 2220134 2454197 2683940 2911306
33849 2911306 3134338 3344110 3526955 3670288 3767623 3819671 3831792 3810213 3759164 3679954
33839 3679954 3572243 3436965 3279519 3111504 2950550 2819198 2743467 2750172 2861533 3087674
33829 3087674 3420327 3831617 4279325 4716396 5100443 5399749 5594992 5678516 5653520 5533901
33819 5533901 5343467 5112721 4872693 4647203 4446168 4262836 4076579 3860669 3592129
33810 3592129 3259945 2868943 2438628 1997956 1578103 1205761 899242 668122 515201
33801 515201 438753 433999 494292 612746 784015 1005047 1274066 1587889 1938428 2309665
33791 2309665 2676969 3010268 3280454 3465921 3555841 3549397 3453062 3278577 3042705 2768009
33781 2768009 2483090 2220855 2014143 1889460 1861087 1928169 2076380 2283750 2528389 2795020
33771 2795020 3077716 3378012 3699407 4040710 4391374 4731504 5036947 5286584 5467479
33762 5467479 5576090 5617654 5606598 5567399 5532183 5533092 5592654 5717968 5901699 6127349 6373898
33751 6373898 6617321 6830631 6985623 7057243 7028429 6892472 6651839 6314965 5893506 5401730
33741 5401730 4857851 4285246 3710878 3160099 2650143 2186492 1764427 1374314 1006965
33732 1006965 656415 320044 -2424 -309486 -597239 -858147 -1080928 -1252950 -1364416
33723 -1364416 -1411415 -1395489 -1320257 -1187901 -997546 -745528 -426766 -37455 420540 935005
33713 935005 1481838 2029331 2547115 3014735 3424800 3779554 4084235 4341535 4549138 4699915
33703 4699915 4784074 4792986 4723537 4580533 4375714 4124547 3843367 3548170 3254575 2977933
33693 2977933 2732772 2530699 2376622 2265238 2181088 2103734 2016059 1911654 1797975 1694045
33683 1694045 1623509 1605751 1648829 1746869 1881897 2028196 2157264 2242318 2261929 2202844 2062446
33672 2062446 1850557 1588705 1305042 1026005 769005 540640 341293 172615 42621
33663 42621 -34870 -45640 18909 159063 368212 636050 951033 1301288 1674423 2056666
33653 2056666 2431869 2781704 3088536 3340952 3539539 3699587 3848874 4021466 4250279
33644 4250279 4560930 4968123 5474670 6072595 6745121 7468325 8212743 8947029 9645018
33635 9645018 10294150 10900797 11489678 12098349 12769648 13544137 14453713 15517501 16740879
33626 16740879 18117281 19631792 21266333 23006249 24846211 26791187 28848999 31015108
33618 31015108 33254967 35491292 37602097 39431548 40812363 41596215 41686284 41062752 39790817
33609 39790817 38005813 35880336 33586806 31269043 29029251 26928524 24995073 23234510
33601 23234510 21638697 20191739 18873074 17658412 16519825 15426648 14348556 13260656
33593 13260656 12148951 11014199 9872553 8751832 7683366 6692005 5789412 4974476
33585 4974476 4239520 3576497 2978248 2435438 1934167 1458797 999934 562926 171107
33576 171107 -139175 -330104 -375501 -270521 -35289 287716 641458 965386 1206906 1329961
33566 1329961 1318645 1175844 918698 573050 168463 -265527 -702446 -1121747 -1511345 -1868278
33556 -1868278 -2196452 -2502153 -2789884 -3060627 -3312679 -3543243 -3748736 -3923175 -4056409
33547 -4056409 -4135211 -4148723 -4095847 -3989360 -3853263 -3714828 -3596425 -3511154 -3462537 -3445864
33537 -3445864 -3449233 -3454137 -3437133 -3374092 -3247131 -3051733 -2799975 -2516921 -2231235 -1965088
33527 -1965088 -1729117 -1524483 -1348821 -1200302 -1076334 -968106 -855726 -708456 -491657
33518 -491657 -178110 241652 755391 1333204 1935990 2522775 3054581 3496736 3822305 4015971
33508 4015971 4075411 4008609 3828779 3550183 3186836 2753674 2268121 1750312 1221637 702830
33498 702830 212773 -232085 -618722 -939593 -1195142 -1395299 -1558555 -1708039 -1865329 -2044075
33488 -2044075 -2245844 -2459826 -2666655 -2845354 -2981066 -3070349 -3121430 -3149439 -3169595 -3192198
33478 -3192198 -3221456 -3257411 -3298643 -3343862 -3391859 -3440466 -3485458 -3519797 -3533226 -3512138 -3440041
33467 -3440041 -3299217 -3074252 -2757231 -2352806 -1880190 -1370045 -857212 -373032 59029
33458 59029 423445 710516 915112 1037704 1086490 1078307 1036959 989332 960400 967910 1017887
33447 1017887 1103086 1206268 1307612 1393151 1460862 1522808 1602846 1730084 1929785 2215403
33437 2215403 2585248 3024353 3509116 4012130 4506063 4966272 5371681 5703899 5945715
33428 5945715 6080586 6093861 5975150 5720691 5334992 4831664 4233714 3572932 2887258 2215601
33418 2215601 1591797 1041270 582521 231774 6201 -77964 -12527 193935 510920 888584
33408 888584 1268261 1596063 1832514 1954214 1949559 1813983 1548266 1159596 663360 84720
33398 84720 -540478 -1167128 -1746385 -2234484 -2600674 -2830097 -2921180 -2880872 -2721496 -2460389
33388 -2460389 -2120819 -1731869 -1326075 -935363 -586865 -299875 -84406 58639 135505 156113
33378 156113 130601 67820 -23500 -132028 -241097 -326968 -359138 -304320 -134546 163245 581156
33367 581156 1091403 1653907 2226525 2773708 3271367 3707768 4081659 4398979 4668802 4898732
33357 4898732 5090687 5239248 5334422 5367931 5339319 5258144 5141293 5007465 4871490 4740172
33347 4740172 4610231 4468728 4296207 4072136 3781415 3420292 3000342 2549221 2106974
33338 2106974 1717485 1416938 1223822 1135273 1131261 1183276 1262193 1342379 1403190 1430579 1419544
33327 1419544 1375499 1312620 1249516 1204457 1191899 1220375 1290920 1396025 1520114 1642469 1742643
33316 1742643 1807323 1836488 1845750 1862306 1915198 2024871 2198010 2429580 2708406 3020968
33306 3020968 3351431 3680330 3985841 4249498 4464458 4641240 4805604 4987363 5205468
33297 5205468 5458222 5724104 5971506 6170674 6301668 6356067 6333857 6238853 6075849 5850356
33287 5850356 5568910 5237343 4857237 4423969 3929732 3371112 2756803 2110395 1466048
33278 1466048 859253 317687 -143124 -517932 -805980 -1005326 -1110410 -1113891 -1011537 -807295
33268 -807295 -515185 -156342 247250 678411 1126705 1586961 2057226 2538465 3035389 3556138
33258 3556138 4109704 4702615 5337146 6011562 6721047 7457770 8210023 8961213 9689507
33249 9689507 10368642 10970486 11469323 11846759 12095158 12218017 12227532 12141089 11978625 11761472
33239 11761472 11511859 11251932 11002000 10778514 10592304 10447194 10339581 10259766 10195143 10133795
33229 10133795 10066536 9986613 9887829 9762736 9602377 9398300 9145968 8847314 8510627 8147945
33219 8147945 7771623 7390948 7009140 6622105 6221347 5800900 5363926 4923786 4499061
33210 4499061 4107046 3760623 3469394 3242214 3087285 3007950 2995643 3025115 3057628 3053476
33200 3053476 2988097 2862658 2703338 2550567 2444303 2411483 2459106 2573658 2725897 2878970
33190 2878970 2997188 3052985 3030810 2928226 2755030 2530831 2281351 2034487 1817441 1654494
33180 1654494 1563085 1546989 1589745 1654125 1690690 1652459 1508974 1254591 909570 515404
33170 515404 126234 -202105 -424019 -514932 -478022 -343938 -162729 9700 125804 156553
33160 156553 94894 -47587 -248651 -484356 -735297 -988011 -1232261 -1457249 -1650050 -1797671
33150 -1797671 -1891365 -1930317 -1922493 -1882283 -1826021 -1767023 -1711987 -1660488 -1608020 -1550606 -1487212
33139 -1487212 -1417613 -1337244 -1233789 -1089406 -887816 -621168 -291537 93509 526953 1004675
33129 1004675 1522173 2068261 2620594 3146385 3608212 3971708 4211427 4313306 4274708 4103848
33119 4103848 3819115 3447673 3022896 2580944 2157092 1782149 1479185 1261173 1130172
33110 1130172 1078420 1091099 1150143 1238396 1343568 1461069 1594140 1749976 1933055 2139700
33100 2139700 2357574 2569745 2759386 2911876 3014959 3059795 3043905 2973534 2861968 2722894
33090 2722894 2562148 2373471 2142007 1853921 1506061 1109737 687264 264515 -136151
33081 -136151 -500121 -821407 -1100643 -1341320 -1546310 -1716850 -1854531 -1964418 -2056308 -2142329
33071 -2142329 -2231886 -2326850 -2419733 -2495688 -2537008 -2527935 -2458185 -2324965 -2134005 -1899660 -1643217
33060 -1643217 -1388766 -1157410 -961883 -803571 -672815 -552282 -422202 -265828 -73863
33051 -73863 152361 398891 639507 840211 967374 995800 912538 715919 413075 19161
33041 19161 -441750 -936763 -1427548 -1876849 -2255471 -2546285 -2743314 -2847045 -2859585 -2783126
33031 -2783126 -2622445 -2388913 -2102346 -1788497 -1473243 -1177003 -912739 -688099 -509166
33022 -509166 -382350 -312635 -299339 -332448 -392538 -455044 -496857 -501680 -461796 -376578 -250151
33011 -250151 -90322 91402 280816 464634 635386 793919 946836 1100071 1252794 1395382
33001 1395382 1512316 1588363 1615312 1596409 1546321 1486379 1437110 1411309 1410373 1425338 1442136
32990 1442136 1448481 1438691 1414184 1380790 1345902 1317160 1301603 1303639 1322089 1348447 1368288 1365990
32978 1365990 1331197 1264271 1177834 1092919 1031553 1010174 1037604 1117391 1250890 1437632 1672877
32967 1672877 1944851 2234224 2516487 2766374 2962732 3092289 3151265 3144932 3086043 2992856
32957 2992856 2886575 2787981 2713767 2673912 2670998 2701410 2757757 2831914 2917935 3013604 3119468
32946 3119468 3235470 3357185 3474254 3572004 3634803 3648618 3601438 3482280 3280866 2989547
32936 2989547 2607413 2144672 1624787 1082750 559832 96328 -275626 -536918 -682071
32927 -682071 -715766 -648317 -493894 -271979 -8594 266389 525557 750204 933279 1078389
32917 1078389 1195634 1295421 1382299 1452122 1494736 1500921 1469401 1410140 1342961 1292509 1280833
32906 1280833 1319063 1400863 1501198 1582253 1604186 1535134 1355905 1059512 649749 142483
32896 142483 -431375 -1026019 -1587436 -2064789 -2420746 -2636097 -2708387 -2647300 -2469311 -2192850
32886 -2192850 -1834715 -1408738 -926894 -401619 152561 719426 1283254 1831142 2352831
32877 2352831 2836525 3262685 3601000 3815086 3874251 3766368 3505228 3129365 2693784 2258038
32867 2258038 1874396 1579224 1389727 1306276 1318476 1412015 1573442 1791276 2053534 2343656
32857 2343656 2637810 2906062 3117840 3249792 3292820 3255152 3159861 3037495 2916844 2817683
32847 2817683 2748153 2706575 2685527 2675954 2670434 2665368 2661641 2663074 2672979 2690333 2707609 2711482 2686309
32834 2686309 2618899 2502449 2338227 2135183 1908945 1681051 1477752 1327136 1254330 1275984
32824 1275984 1395939 1603742 1876943 2186917 2506338 2815582 3105762 3377729 3637920
32815 3637920 3892876 4144530 4387550 4608882 4788834 4903550 4929270 4848020 4652975 4351673
32805 4351673 3966836 3535618 3107016 2736096 2474699 2361302 2414117 2629854 2987311 3453088
32795 3453088 3986832 4545143 5084888 5567159 5961880 6251218 6429703 6501108 6474396 6361103
32785 6361103 6174537 5929649 5642562 5329553 5005155 4679109 4353123 4020094 3667997
32776 3667997 3287275 2876953 2444903 2002173 1556323 1109704 664420 229858 -173827
32767 -173827 -519976 -784995 -956882 -1037650 -1039664 -980051 -877387 -751582 -624720 -519896
32757 -519896 -457113 -448186 -494114 -586861 -714181 -864180 -1027453 -1196986 -1366643 -1528524
32747 -1528524 -1669855 -1771705 -1811710 -1770157 -1636103 -1410474 -1105663 -743048 -349953 43286
32737 43286 406566 714489 951938 1118537 1228932 1308151 1384361 1482089 1617200 1793415
32727 1793415 2000695 2216587 2411554 2557921 2639940 2660221 2637894 2598106 2558805 2522869
32717 2522869 2479370 2411264 2303934 2150701 1954075 1723366 1470831 1209380 953389 720848
32707 720848 533412 412753 374985 426020 559399 756744 991221 1234384 1464929 1675648
32697 1675648 1874711 2080506 2312748 2583812 2893133 3225716 3554518 3845634 4064900
32688 4064900 4184868 4191318 4087707 3894943 3645123 3371459 3099547 2844136 2611628 2405007
32678 2405007 2227512 2083211 1974993 1901682 1855954 1823873 1786258 1722050 1613728 1453951
32668 1453951 1250989 1029723 826180 676772 606795 623763 718336 870653 1057341 1255979
32658 1255979 1447216 1616074 1752771 1852606 1915182 1943773 1944638 1925039 1889818 1838438 1764740
32647 1764740 1659653 1515127 1327367 1098301 834893 546368 240433 -79516 -414582
32638 -414582 -768240 -1143798 -1543111 -1966430 -2411927 -2873798 -3339488 -3788004 -4191097 -4517759
32628 -4517759 -4740611 -4841448 -4813178 -4657222 -4378452 -3981606 -3471972 -2859561 -2163327 -1412377
32618 -1412377 -643542 103804 794429 1403660 1920936 2348365 2694935 2969873 3178690
32609 3178690 3323042 3402683 3416802 3363137 3235871 3025384 2722325 2324879 1844592 1306371
32599 1306371 742071 181289 -355704 -859721 -1329266 -1765046 -2165930 -2527848 -2844522
32590 -2844522 -3108413 -3311520 -3446374 -3507299 -3491692 -3401768 -3246772 -3044352 -2819200 -2598710
32580 -2598710 -2407566 -2263409 -2174612 -2139831 -2148568 -2182017 -2214541 -2217173 -2163497 -2035633 -1826706
32569 -1826706 -1538885 -1179704 -760108 -294917 196121 688868 1157799 1580638 1942082
32560 1942082 2234160 2453371 2597510 2664645 2653929 2566953 2409654 2194790 1942544 1676008
32550 1676008 1412536 1157185 904154 645699 381871 124153 -109061 -301479 -446254
32541 -446254 -547163 -613489 -652475 -664262 -642093 -576750 -461394 -293274 -72121 201470
32531 201470 524241 885381 1262337 1621068 1921981 2130306 2227559 2218872 2131404 2003990
32521 2003990 1874356 1770988 1711053 1700519 1733382 1791636 1849257 1880445 1868633 1811793 1721506
32510 1721506 1616083 1511360 1414441 1323776 1234248 1142594 1049825 960930 883775 827910 802615
32499 802615 814113 863201 944546 1047796 1159569 1265406 1351239 1404876 1418098 1389172 1323949
32488 1323949 1233445 1127723 1009186 869939 696093 477704 219079 -56429 -310219 -499144
32478 -499144 -587978 -558093 -409653 -158396 169697 543349 930440 1303061 1642696 1943133
32468 1943133 2209189 2452361 2686249 2923447 3173392 3440462 3722706 4011744 4293544
32459 4293544 4549794 4760880 4911432 4996984 5027591 5024816 5012428 5005473 5003769 4993130 4952900
32448 4952900 4864894 4719011 4513781 4253157 3941954 3581811 3169356 2698131 2164657 1575814
32438 1575814 952389 325202 -274269 -822272 -1305041 -1715446 -2048346 -2297939 -2457564
32429 -2457564 -2521819 -2491456 -2379464 -2213652 -2031813 -1870884 -1755998 -1694515 -1676054 -1677167
32419 -1677167 -1669032 -1626435 -1535602 -1398371 -1231426 -1060481 -910674 -796542 -716341 -653875
32409 -653875 -586508 -494305 -365606 -198000 2952 224639 447852 648850 804073 895449
32399 895449 912821 852715 716380 510004 246223 -56642 -379254 -707254 -1034475 -1361862
32389 -1361862 -1694333 -2038727 -2403545 -2798055 -3228197 -3690037 -4165143 -4622221 -5025186
32380 -5025186 -5343345 -5558449 -5666247 -5673754 -5594822 -5445702 -5241040 -4990898 -4700239 -4372079
32370 -4372079 -4013106 -3638046 -3268923 -2928426 -2630566 -2373793 -2140861 -1906403 -1649186
32361 -1649186 -1363467 -1064386 -785713 -571592 -465300 -497702 -678002 -989407 -1391445 -1828351
32351 -1828351 -2240726 -2576956 -2801575 -2898634 -2869427 -2725934 -2483820 -2159331 -1771541 -1346641
32341 -1346641 -918788 -525054 -197479 42282 183052 221007 157432 -501 -237145 -527455
32331 -527455 -841188 -1152859 -1453382 -1756041 -2091286 -2491755 -2975342 -3534991 -4139078 -4740432
32321 -4740432 -5289110 -5744359 -6082923 -6302513 -6420023 -6464385 -6464993 -6439048 -6383475 -6276291
32311 -6276291 -6087693 -5795586 -5397763 -4915170 -4385454 -3850499 -3343893 -2883673 -2472779
32302 -2472779 -2105649 -1776486 -1484427 -1233371 -1028022 -869973 -756903 -684808 -650646 -652776
32292 -652776 -688762 -752034 -829441 -901252 -944286 -937564 -868345 -735747 -550316 -329898 -93696
32281 -93696 143390 374309 599874 824840 1051469 1273741 1475483 1633897 1727088 1741887
32271 1741887 1677915 1545757 1360552 1135013 876038 586348 269329 -66478 -406044 -730271
32261 -730271 -1020462 -1262011 -1445299 -1564242 -1614736 -1594604 -1504540 -1348581 -1133840 -870427
32251 -870427 -571725 -253920 65774 371156 647990 884246 1071029 1204485 1287076 1326481
32241 1326481 1331846 1308778 1255413 1161745 1013113 796520 506875 150610 -254499 -683358
32231 -683358 -1110719 -1519422 -1906118 -2281316 -2663437 -3069801 -3508657 -3975108 -4451704 -4912696
32221 -4912696 -5330132 -5680134 -5948436 -6134297 -6251331 -6323848 -6379679 -6443196 -6532483 -6660903
32211 -6660903 -6839619 -7077433 -7377431 -7732357 -8120670 -8504741 -8833327 -9050338 -9108648 -8983104
32201 -8983104 -8676044 -8213311 -7634558 -6983292 -6299209 -5612418 -4939461 -4283071 -3637636
32192 -3637636 -2999128 -2374653 -1786425 -1268133 -855620 -575736 -437153 -425983 -507793 -635544
32182 -635544 -760611 -842886 -856883 -792684 -652618 -445661 -181940 130785 487712 884674
32172 884674 1314073 1761280 2203844 2614255 2964838 3232738 3403844 3474925 3452968 3351432
32162 3351432 3185615 2970474 2721963 2459164 2203464 1974036 1782153 1627657 1499152
32153 1499152 1377539 1241431 1072826 861503 606612 314525 -6273 -350155 -715462
32144 -715462 -1100793 -1499476 -1896882 -2272959 -2608260 -2889537 -3111834 -3276707 -3388641 -3452199
32134 -3452199 -3471128 -3448826 -3388536 -3292069 -3157111 -2974515 -2727683 -2395200 -1955882 -1393947
32124 -1393947 -702549 114019 1038229 2037202 3062802 4056939 4962663 5737474 6362656
32115 6362656 6844235 7205729 7476396 7678993 7820505 7889321 7861437 7713955 7438818 7048739
32105 7048739 6572298 6042055 5483021 4907701 4319531 3721504 3123323 2541462 1991914
32096 1991914 1481367 1003831 545458 93827 -354875 -795049 -1216155 -1608099 -1964049
32087 -1964049 -2280433 -2555791 -2789838 -2983131 -3137384 -3255956 -3343425 -3403233 -3434094 -3427500
32077 -3427500 -3368967 -3243685 -3044456 -2777521 -2462647 -2127531 -1800686 -1507406 -1269831 -1108488
32067 -1108488 -1042133 -1084846 -1241315 -1502521 -1844242 -2229926 -2617235 -2965582 -3241888 -3423147
32057 -3423147 -3496053 -3455332 -3302935 -3049309 -2715365 -2332366 -1938377 -1572605 -1269822 -1055890
32047 -1055890 -944408 -934825 -1012551 -1151171 -1316612 -1473270 -1591628 -1655152 -1663413 -1630141 -1577996
32036 -1577996 -1533281 -1522499 -1570252 -1697272 -1918376 -2241178 -2666013 -3186342 -3788554 -4451167
32026 -4451167 -5144495 -5831946 -6473397 -7030094 -7469762 -7770215 -7920825 -7922682 -7788632 -7542639
32016 -7542639 -7216596 -6844011 -6453004 -6062098 -5680401 -5310629 -4952072 -4601873 -4255368
32007 -4255368 -3907592 -3556726 -3207583 -2872175 -2566355 -2304468 -2094590 -1935536 -1815869
31998 -1815869 -1715402 -1609515 -1475189 -1296574 -1068386 -796408 -495133 -183344 120487
31989 120487 400835 645071 842037 981371 1055021 1060886 1006958 913255 809403 727874 695276
31978 695276 724972 813620 942468 1082573 1201714 1270643 1267016 1176629 992799 715585 352298
31967 352298 -81162 -560373 -1055567 -1536949 -1979230 -2363626 -2677683 -2914111 -3068911 -3138800
31957 -3138800 -3118499 -2999239 -2769809 -2420924 -1952045 -1377612 -728769 -49041 613788 1215970
31947 1215970 1724480 2122122 2410439 2608312 2745390 2852543 2953560 3060969 3176301
31938 3176301 3293261 3401984 3492749 3558002 3592448 3591865 3551786 3467153 3333717 3151370 2928071
31927 2928071 2681530 2435862 2213316 2025113 1867057 1722926 1573377 1404389 1210259
31918 1210259 990895 747501 481040 194251 -105578 -406119 -692349 -950248 -1170186
31909 -1170186 -1349138 -1491279 -1606687 -1708416 -1808797 -1915973 -2031602 -2150610 -2263512
31900 -2263512 -2360587 -2435787 -2488050 -2518931 -2527564 -2505720 -2436330 -2297557 -2071673 -1754948 -1363527
31889 -1363527 -931813 -503583 -120005 189852 412548 548568 608602 609847 572210 514014
31879 514014 448444 382293 316951 250388 179539 103386 25888 -43362 -91694 -106994 -79351
31868 -79351 -134 138989 344503 617102 947894 1317338 1697695 2057842 2368384 2605546
31858 2605546 2753737 2807712 2774648 2674788 2538578 2399543 2284899 2207799 2164841 2140053
31848 2140053 2113113 2067472 1994760 1895110 1775930 1651525 1543275 1477803 1481385 1571775 1750867
31837 1750867 2001348 2288448 2566109 2786235 2909036 2911792 2793101 2571196 2277586 1948900
31827 1948900 1619306 1314707 1049536 826987 642372 487437 353260 231336 114076
31818 114076 -4485 -128436 -260759 -404064 -559672 -725035 -891504 -1044752 -1168469 -1249723
31808 -1249723 -1283342 -1273139 -1229477 -1164572 -1087654 -1001658 -902166 -778837 -618949 -411871 -152565
31797 -152565 157188 509625 892683 1291644 1690370 2071657 2416247 2701575 2903050 2999821
31787 2999821 2983114 2862004 2662529 2420180 2169170 1932347 1715026 1505541 1283333 1031190
31777 1031190 745002 435831 124462 -166966 -421367 -628821 -784838 -887059 -933149 -921462
31767 -921462 -853678 -737265 -586343 -420987 -265308 -144209 -79047 -83491 -161061 -304932
31757 -304932 -499733 -724777 -957870 -1178489 -1369545 -1518273 -1617125 -1664444 -1663717 -1621139 -1542961
31746 -1542961 -1434354 -1300023 -1145401 -977564 -805797 -641807 -499090 -390924 -327298 -312067
31736 -312067 -341959 -408327 -500830 -610701 -731336 -856228 -976936 -1084158 -1172526 -1246400
31726 -1246400 -1322398 -1425945 -1582420 -1806730 -2096146 -2429832 -2775046 -3096943 -3367520 -3570678
31716 -3570678 -3703040 -3772142 -3793464 -3786451 -3769481 -3755206 -3748953 -3751309 -3762577 -3785116 -3821597 -3871137
31704 -3871137 -3926674 -3975241 -4000187 -3983871 -3910518 -3769834 -3561324 -3298130 -3008404 -2732305
31694 -2732305 -2513503 -2386355 -2363291 -2429007 -2545567 -2666279 -2750961 -2775672 -2734863 -2638124
31684 -2638124 -2504058 -2352718 -2198228 -2044560 -1886793 -1717050 -1531328 -1333207 -1132795
31675 -1132795 -942024 -769000 -613863 -467442 -312800 -129413 100693 386716 725606
31666 725606 1103289 1499586 1893455 2265398 2596249 2864034 3042042 3100925 3015323 2772272
31656 2772272 2376780 1851501 1231002 553663 -145252 -836951 -1498210 -2108117 -2646208
31647 -2646208 -3094720 -3443791 -3695061 -3859976 -3953305 -3985631 -3958725 -3865515 -3694496 -3437331
31637 -3437331 -3097039 -2692908 -2258706 -1834011 -1452832 -1135562 -887949 -706250 -584408
31628 -584408 -518910 -509367 -555692 -654252 -795324 -962824 -1136054 -1292722 -1412472 -1480107 -1487882
31617 -1487882 -1436733 -1336238 -1202415 -1052620 -898762 -742391 -574566 -380197 -144164 142977
31607 142977 480736 857055 1250687 1636705 1991771 2296196 2533407 2689678 2755649 2728203
31597 2728203 2610236 2407581 2124801 1763018 1322021 806044 229705 -379697 -985065
31588 -985065 -1546546 -2030838 -2420397 -2719312 -2952286 -3155434 -3361805 -3587880 -3827401 -4055528
31578 -4055528 -4241105 -4360524 -4406272 -4387252 -4323028 -4236169 -4145481 -4061267 -3983747 -3905982 -3820594
31567 -3820594 -3726662 -3632744 -3555239 -3514620 -3531890 -3624819 -3802432 -4058718 -4369310 -4694198
31557 -4694198 -4985936 -5200120 -5304718 -5285823 -5148036 -4909302 -4592682 -4219306 -3805583 -3364657
31547 -3364657 -2909601 -2455445 -2018281 -1612177 -1246599 -926516 -654533 -432310 -259910
31538 -259910 -134474 -49801 3525 38441 71342 119884 198692 315521 470332 657433 868731
31527 868731 1096058 1331668 1567640 1795855 2009485 2205071 2383340 2548179 2705100 2860721
31517 2860721 3022922 3200168 3399556 3624985 3877036 4154212 4453573 4769527 5091768
31508 5091768 5404173 5685341 5910481 6055182 6102097 6049331 5915997 5740575 5571953 5456909
31498 5456909 5428050 5494874 5640655 5827817 6011015 6151898 6227983 6232525 6168548 6042723
31488 6042723 5862291 5634259 5364462 5055791 4707617 4318767 3893028 3442609 2985678
31479 2985678 2539235 2112897 1708074 1321954 952048 597925 260060 -61841 -368873
31470 -368873 -660856 -933722 -1178764 -1384971 -1543222 -1649399 -1704606 -1713458 -1682929 -1622659
31460 -1622659 -1545007 -1462781 -1385098 -1314264 -1246177 -1173768 -1090852 -994169 -883685 -762747 -639064
31449 -639064 -525674 -439703 -397435 -406716 -460519 -536165 -602037 -628738 -598385 -507164 -361503
31438 -361503 -172668 45630 276227 497223 683358 809777 855468 804217 643680 365337
31428 365337 -32767 -541853 -1140410 -1796894 -2475787 -3143403 -3770872 -4334647 -4816462 -5203993
31418 -5203993 -5492003 -5682739 -5784663 -5809594 -5769636 -5675397 -5536003 -5359764 -5154257 -4925958
31408 -4925958 -4680889 -4426916 -4175825 -3941978 -3736652 -3561618 -3407484 -3258931 -3103647
31399 -3103647 -2939647 -2777931 -2640314 -2553167 -2538535 -2606143 -2750624 -2955265 -3198664 -3459297
31389 -3459297 -3716035 -3946435 -4125665 -4227704 -4228933 -4112967 -3874829 -3523155 -3080380 -2581279
31379 -2581279 -2069374 -1590821 -1187084 -889172 -715198 -670770 -750791 -941835 -1224666 -1576451
31369 -1576451 -1972467 -2387817 -2799428 -3187599 -3536114 -3831152 -4060548 -4214733 -4289300 -4287890
31359 -4287890 -4223752 -4118736 -3999278 -3890374 -3810093 -3767343 -3763806 -3797991 -3867796 -3969545 -4095246
31348 -4095246 -4232094 -4366669 -4492072 -4613253 -4746694 -4914485 -5136244 -5422951 -5774568
31339 -5774568 -6180670 -6622037 -7072217 -7499633 -7871408 -8158831 -8342625 -8415639 -8382183 -8255103
31329 -8255103 -8052435 -7794498 -7501263 -7189839 -6872563 -6556428 -6244481 -5939260 -5647359
31320 -5647359 -5382505 -5163918 -5009228 -4925578 -4904888 -4926601 -4965839 -5001473 -5019529 -5011114 -4967508
31309 -4967508 -4876479 -4722765 -4492880 -4181708 -3797520 -3363207 -2913162 -2486286 -2116482 -1823694
31299 -1823694 -1609708 -1461287 -1359216 -1288193 -1242353 -1224443 -1240589 -1294633 -1385250 -1506348
31289 -1506348 -1648694 -1800578 -1947631 -2074133 -2167114 -2221131 -2239598 -2230895 -2201736 -2152129 -2074505
31278 -2074505 -1956598 -1785909 -1553571 -1256275 -896772 -484772 -39542 407573 814432
31269 814432 1135338 1332011 1383403 1290315 1073841 768886 415159 48467 -304811 -628603
31259 -628603 -914208 -1156248 -1350273 -1493157 -1585350 -1632961 -1647937 -1645948 -1642984 -1652097 -1681203
31248 -1681203 -1732219 -1801357 -1880435 -1958936 -2026414 -2074575 -2097994 -2092511 -2051451 -1962366 -1808135
31237 -1808135 -1574075 -1257500 -873006 -449395 -20608 383053 739043 1032637 1255808
31228 1255808 1406235 1485844 1499059 1453148 1362351 1253508 1167336 1150995 1243907 1464387 1804404
31217 1804404 2234187 2712392 3195930 3646188 4031831 4329881 4526337 4616559 4605177 4505319
31207 4505319 4337003 4124551 3893133 3664965 3456068 3274142 3117659 2976530 2835191
31198 2835191 2678382 2497714 2295401 2082778 1874742 1683952 1517951 1379778 1270694
31189 1270694 1193037 1151528 1152083 1198644 1290108 1419414 1575339 1745803 1921130 2096158 2270435
31178 2270435 2446207 2625157 2805993 2984298 3154013 3308438 3439572 3536580 3585354 3570262
31168 3570262 3477565 3298875 3033290 2687717 2275497 1813306 1316667 795765 254383 -306571
31158 -306571 -883034 -1463617 -2030146 -2561795 -3039312 -3447010 -3773042 -4009855 -4155744 -4216402
31148 -4216402 -4204660 -4137857 -4033927 -3907773 -3768463 -3617429 -3448539 -3251105 -3015208 -2736718
31138 -2736718 -2419648 -2075751 -1722775 -1382260 -1076657 -825646 -642170 -529086 -477490 -468010
31128 -468010 -475782 -477703 -458750 -414581 -350248 -276787 -207209 -151936 -113243 -79724 -23862 94221
31116 94221 316512 673862 1174748 1799438 2500440 3209142 3848272 4348141 4661652 4771951
31106 4771951 4689705 4442586 4063563 3584058 3033769 2444008 1849269 1283828 774901 337301
31096 337301 -26544 -322021 -557680 -744012 -894690 -1026646 -1157254 -1300695 -1466408 -1659740
31086 -1659740 -1882409 -2131301 -2396971 -2664145 -2914580 -3130402 -3295968 -3398120 -3426156 -3372575
31076 -3372575 -3234265 -3012847 -2713593 -2343687 -1911291 -1426145 -901305 -354872 189468
31067 189468 703947 1160221 1533468 1804987 1962260 1997390 1906051 1688429 1351879 913592
31057 913592 401100 -150597 -704614 -1228051 -1695789 -2091658 -2408302 -2646746 -2814849 -2923249
31047 -2923249 -2979603 -2984625 -2933366 -2821634 -2653917 -2448254 -2235263 -2051108 -1926589 -1876681
31037 -1876681 -1895431 -1958915 -2034819 -2093843 -2117813 -2101651 -2049776 -1970337 -1871336 -1760490 -1647408
31026 -1647408 -1545177 -1469608 -1436383 -1457372 -1537739 -1675461 -1863866 -2095650 -2365377 -2668609
31016 -2668609 -2998525 -3342779 -3683293 -3999873 -4275871 -4502050 -4675611 -4795242 -4856565 -4851592
31006 -4851592 -4771802 -4611673 -4370563 -4053341 -3670887 -3240188 -2782722 -2320858 -1874336 -1459803
30996 -1459803 -1094125 -798026 -594764 -501985 -521361 -633680 -803861 -993484 -1173952 -1333932
30986 -1333932 -1478797 -1623951 -1786030 -1975666 -2193863 -2432181 -2675830 -2908285 -3115883
30977 -3115883 -3291033 -3432840 -3544735 -3630059 -3688115 -3713263 -3697501 -3634519 -3522698 -3366117
30967 -3366117 -3174136 -2959789 -2736701 -2515065 -2299048 -2088517 -1885476 -1701631 -1561089
30958 -1561089 -1494554 -1527264 -1667844 -1904711 -2210879 -2552404 -2894976 -3207119 -3462358 -3642863
30948 -3642863 -3743974 -3776304 -3762584 -3729517 -3697984 -3675855 -3656518 -3623782 -3561010 -3459886 -3324580
30937 -3324580 -3170020 -3016528 -2883757 -2785308 -2724212 -2690297 -2661300 -2608731 -2507231 -2344296
30927 -2344296 -2126564 -1879739 -1641742 -1451648 -1338584 -1314232 -1370802 -1484358 -1621729 -1748093
30917 -1748093 -1833041 -1854764 -1802823 -1678968 -1494795 -1266774 -1011255 -741899 -469751 -204913
30907 -204913 40779 250794 402715 471259 435304 285440 27937 -316388 -716926 -1139329
30897 -1139329 -1551077 -1925376 -2242545 -2489283 -2657666 -2745932 -2761025 -2720736 -2652962 -2591153
30887 -2591153 -2566604 -2599146 -2689166 -2815018 -2938622 -3017789 -3019552 -2928654 -2748849 -2498285 -2201693
30876 -2201693 -1881856 -1552849 -1217710 -872227 -513979 -152169 187899 469873 659179
30867 659179 736439 703977 582987 405055 203440 7020 -163218 -295746 -387805 -442145
30857 -442145 -462512 -450339 -404429 -323488 -209942 -72945 71475 204245 310152 384609
30847 384609 436941 488803 568786 704943 916945 1209828 1571715 1976542 2390482 2779309
30837 2779309 3115039 3381437 3577641 3717422 3822089 3909015 3982288 4031718 4040522 3995608
30827 3995608 3893616 3740671 3548605 3330865 3099339 2862352 2624792 2391038 2169426
30818 2169426 1975155 1828853 1750495 1751386 1828844 1966948 2143027 2335888 2531558 2724670
30808 2724670 2916121 3108508 3301193 3487177 3653447 3784945 3870774 3910237 3915771 3910128
30798 3910128 3917946 3956147 4029219 4132145 4257931 4403719 4571172 4761078 4966030 5166515
30788 5166515 5333964 5439795 5465159 5405842 5270422 5074255 4833140 4558936 4257381 3927709
30778 3927709 3564104 3159165 2708618 2215425 1691524 1157202 639628 171565 -210879
30769 -210879 -473606 -593164 -565584 -410913 -170485 102619 356754 553873 676647 728920
30759 728920 730916 712431 706598 744768 851991 1043149 1320965 1677140 2096658 2563372 3063879
30748 3063879 3587389 4121857 4649516 5145681 5582302 5933874 6181709 6314343 6325474 6212747
30738 6212747 5979859 5641634 5229039 4790021 4383353 4066215 3880072 3840853 3937215 4136581
30728 4136581 4395601 4671043 4927764 5141735 5298099 5387024 5401374 5338512 5204831 5019280
30718 5019280 4812538 4620822 4476005 4395946 4379497 4408463 4454872 4489722 4490262 4444834 4354792
30707 4354792 4232532 4095612 3959469 3832462 3715407 3604816 3497109 3391062 3287287
30698 3287287 3185592 3082674 2972409 2849204 2712521 2569516 2433454 2318077 2230831 2168939
30688 2168939 2120413 2069079 2000952 1909995 1802178 1696472 1621028 1604479 1665513 1805656 2008604
30677 2008604 2245848 2485570 2701441 2878963 3017779 3129171 3229654 3333722 3449161
30668 3449161 3575985 3707621 3832563 3936132 4002445 4015953 3962109 3828191 3605821 3294908
30658 3294908 2906791 2464726 2001941 1558409 1177127 899777 761514 784730 972456 1303684
30648 1303684 1733779 2201513 2640791 2992930 3216025 3289876 3216078 3013503 2710193 2334074
30638 2334074 1905631 1435591 928935 393316 -153508 -682928 -1162617 -1566753 -1882160
30629 -1882160 -2106926 -2244093 -2295950 -2262817 -2146232 -1953579 -1700605 -1409432 -1102164 -793187
30619 -793187 -485011 -171070 155623 493337 827896 1136521 1396471 1593203 1724074 1796883
30609 1796883 1825527 1825808 1812952 1800442 1798730 1813244 1842620 1878806 1909805 1923930 1913041 1872553
30597 1872553 1798321 1683121 1516073 1286228 988377 627744 221194 -205366 -622377 -1002938
30587 -1002938 -1327506 -1584774 -1768758 -1875021 -1899335 -1839274 -1696216 -1475493 -1185307 -836510
30577 -836510 -443861 -27090 389914 781893 1125870 1404866 1610876 1745916 1820402 1850024
30567 1850024 1853472 1852026 1869236 1928136 2045648 2226593 2460577 2723355 2982271 3203819
30557 3203819 3360788 3436676 3426457 3334529 3171634 2952147 2692214 2408626 2117893 1834730
30547 1834730 1569717 1327186 1105111 897735 699393 507218 321783 146794 -10945
30538 -10945 -141872 -235915 -286800 -295818 -271775 -226660 -170376 -108494 -43977 19722 76967 120103
30526 120103 140044 126498 68674 -42386 -210168 -429851 -688711 -970226 -1259440 -1545761
30516 -1545761 -1821416 -2077401 -2300479 -2473071 -2575340 -2588305 -2497674 -2298071 -1996068 -1610144
30506 -1610144 -1167379 -698482 -232927 205015 598832 940443 1229169 1470399 1675183
30497 1675183 1859929 2043781 2242757 2463490 2701473 2945861 3187341 3422457 3650664
30488 3650664 3866707 4055085 4191600 4251180 4216601 4083074 3857898 3557875 3207021 2834424
30478 2834424 2470677 2142697 1868906 1657122 1505688 1406666 1349362 1323047 1318161 1326125 1339080
30467 1339080 1351539 1364367 1388269 1442304 1545293 1703298 1900328 2098455 2248325 2305477
30457 2305477 2245325 2071082 1812787 1519251 1246420 1045519 953481 987469 1144120 1402176
30447 1402176 1726110 2069596 2380107 2606573 2709551 2670452 2495863 2215256 1873205 1519041
30437 1519041 1197374 942133 775046 707334 742290 877002 1102961 1406165 1766934 2159094
30427 2159094 2548947 2896175 3158839 3301679 3303441 3159291 2878362 2479819 1989948 1439814
30417 1439814 861963 286023 -265407 -778967 -1249698 -1677100 -2060140 -2394830 -2676553
30408 -2676553 -2905338 -3089807 -3246798 -3396717 -3556689 -3734168 -3924053 -4111492 -4279659
30399 -4279659 -4418186 -4527278 -4615591 -4694031 -4769692 -4843100 -4909277 -4960519 -4988424 -4984432 -4940305
30388 -4940305 -4849882 -4711543 -4529549 -4313333 -4075686 -3831168 -3595137 -3382617 -3206272 -3073521
30378 -3073521 -2984219 -2931402 -2906859 -2909747 -2952606 -3058897 -3251533 -3538475 -3903759 -4308520
30368 -4308520 -4700646 -5027974 -5249825 -5343372 -5303915 -5140880 -4872894 -4524552 -4124904 -3705921
30358 -3705921 -3299522 -2933401 -2627164 -2390673 -2225721 -2130545 -2104703 -2151278 -2275099 -2478294
30348 -2478294 -2755806 -3092749 -3464110 -3836342 -4170393 -4426180 -4568670 -4575039 -4440550 -4180052
30338 -4180052 -3823760 -3409325 -2974044 -2549723 -2160373 -1821937 -1543564 -1329695 -1181433
30329 -1181433 -1096085 -1065645 -1076386 -1110722 -1150396 -1179237 -1184755 -1159381 -1102161 -1020280 -928176
30318 -928176 -842059 -770521 -705889 -622339 -483391 -255491 78979 514540 1023177 1561871
30308 1561871 2084670 2554697 2950351 3262748 3487538 3618323 3646843 3568966 3390991 3131576
30298 3131576 2818521 2482986 2154320 1857276 1611334 1430472 1321719 1282041 1294970 1329348
30288 1329348 1342224 1286247 1120091 818919 381630 -167301 -781698 -1402061 -1966517 -2422174
30278 -2422174 -2734438 -2891986 -2906157 -2805268 -2625749 -2402741 -2163124 -1923313 -1691949 -1474824
30268 -1474824 -1278411 -1110280 -977195 -882683 -825150 -797054 -785590 -775024 -749947 -698529 -615129
30257 -615129 -501758 -367458 -225086 -86708 39606 149395 238027 296308 308834 257066
30247 257066 126072 -88357 -375734 -711448 -1061379 -1389191 -1664755 -1871342 -2008493 -2088762
30237 -2088762 -2129569 -2144250 -2136619 -2100998 -2026519 -1902941 -1726094 -1502833 -1255341 -1022554
30227 -1022554 -855032 -802330 -897461 -1146432 -1528317 -2004646 -2531621 -3068996 -3583814 -4051262
30217 -4051262 -4455190 -4788262 -5050050 -5242585 -5365515 -5413812 -5379127 -5253340 -5032079 -4717216
30207 -4717216 -4318624 -3855132 -3353314 -2842851 -2349797 -1891949 -1479836 -1122179 -830469
30198 -830469 -618152 -494887 -460426 -502230 -597755 -719686 -841621 -942009 -1005132 -1019661
30188 -1019661 -977181 -873178 -711057 -507021 -292318 -110384 -8836 -28646 -194018 -506259
30178 -506259 -943616 -1467119 -2030157 -2588439 -3107549 -3567253 -3962764 -4302750 -4603599 -4880865
30168 -4880865 -5141163 -5378147 -5574052 -5705450 -5750550 -5695423 -5537216 -5283606 -4949586 -4554005
30158 -4554005 -4117618 -3662393 -3210627 -2783230 -2397794 -2067145 -1798405 -1592592 -1445160
30149 -1445160 -1347543 -1288628 -1255099 -1231166 -1199538 -1144414 -1055066 -927801 -765452 -575428 -367637
30138 -367637 -152942 57844 254505 427757 569795 675060 740709 766230 752639 702298
30128 702298 619683 511888 387517 254688 120570 -6428 -114355 -189069 -219791 -204762
30118 -204762 -152577 -78776 -1122 63522 100828 100773 59995 -16625 -116654 -223146 -318718 -388806
30106 -388806 -423010 -414731 -360400 -259620 -116360 60135 256552 459286 658843 852125
30096 852125 1041576 1232777 1432361 1646375 1878009 2125053 2378737 2625023 2847207 3027889
30086 3027889 3149332 3192717 3137810 2965122 2661841 2229938 1691667 1087798 468182 -120858
30076 -120858 -646196 -1090845 -1450400 -1726467 -1921568 -2038313 -2082208 -2065019 -2005530 -1926621
30066 -1926621 -1849654 -1788453 -1745544 -1712598 -1675166 -1619501 -1538304 -1433080 -1312846 -1190762 -1080787
30055 -1080787 -995778 -947124 -944766 -995871 -1101109 -1249429 -1414832 -1559158 -1641813 -1632273 -1518632
30044 -1518632 -1308017 -1020232 -679817 -311157 62473 418463 735901 998363 1195982
30035 1195982 1324573 1382560 1368868 1284062 1133799 931448 697223 453812 220980 12346
30025 12346 -164024 -301944 -392359 -419721 -361988 -196836 86074 472682 921467 1374931
30015 1374931 1780509 2108465 2357161 2545650 2701314 2850401 3014028 3207484 3439627
30006 3439627 3710987 4011164 4317086 4594129 4801672 4902580 4873250 4709906 4429114 4063683
29996 4063683 3655960 3249474 2879842 2567549 2316158 2117338 1960401 1841380 1766840 1750571
29986 1750571 1805669 1937559 2142022 2407301 2716120 3045284 3365069 3641982 3845366 3954523
29976 3954523 3962464 3874750 3704619 3466956 3173930 2834335 2456777 2054436 1648085 1265095
29966 1265095 934697 681562 519970 450223 458702 522245 615547 718024 816392 902218 967339
29955 967339 1001048 991128 927776 807882 637305 430344 207183 -9352 -196837 -335734
29945 -335734 -411242 -414566 -343767 -204157 -7851 227644 481002 728050 942666 1099211
29935 1099211 1177296 1167556 1075601 921268 732252 534549 344882 169439 8541 -137550
29925 -137550 -266227 -374026 -459228 -522790 -566708 -590865 -590851 -559240 -490417 -385573 -253811
29914 -253811 -108442 38590 180521 316286 448160 577652 701027 806430 874582 883764
29904 883764 817337 670127 449947 173328 -141784 -481957 -839818 -1211454 -1592218 -1974242
29894 -1974242 -2347536 -2703863 -3040086 -3358300 -3663386 -3960977 -4257526 -4561067 -4880495
29885 -4880495 -5223154 -5592245 -5985188 -6392824 -6799070 -7181076 -7510442 -7756181 -7889881
29876 -7889881 -7892306 -7759001 -7501855 -7145294 -6718681 -6248743 -5755604 -5253697 -4755525 -4274687
29866 -4274687 -3826019 -3423672 -3079342 -2801377 -2593637 -2453454 -2370135 -2326121 -2301274 -2278625
29856 -2278625 -2249598 -2217166 -2195612 -2205874 -2267346 -2389880 -2570340 -2795118 -3046018 -3305700
29846 -3305700 -3560805 -3802799 -4026656 -4226969 -4392694 -4504052 -4535256 -4463263 -4278178 -3989235
29836 -3989235 -3622805 -3213762 -2795329 -2392584 -2021455 -1691281 -1407807 -1175037 -996351
29827 -996351 -875632 -818262 -831344 -922867 -1099878 -1365627 -1715922 -2135930 -2599657 -3073537
29817 -3073537 -3523211 -3920705 -4249443 -4506403 -4701636 -4855110 -4990660 -5127964 -5275118
29808 -5275118 -5424872 -5556685 -5645043 -5671871 -5638053 -5568095 -5504852 -5496337 -5580414 -5773258 -6065286
29797 -6065286 -6425736 -6814063 -7192925 -7536240 -7828747 -8059324 -8214062 -8274033 -8218380 -8030160
29787 -8030160 -7701977 -7239755 -6664157 -6009263 -5318214 -4636337 -4003698 -3449402 -2988667
29778 -2988667 -2622086 -2336208 -2105886 -1899657 -1688065 -1452661 -1192215 -923678 -677374
29769 -677374 -487836 -383426 -378978 -474734 -661450 -927479 -1262385 -1654577 -2085421 -2525278
29759 -2525278 -2935653 -3277380 -3521045 -3655101 -3689198 -3652503 -3587954 -3543234 -3559872 -3663316
29749 -3663316 -3857655 -4127316 -4444672 -4779863 -5108782 -5417069 -5699950 -5959119 -6198513
29740 -6198513 -6421020 -6627207 -6815543 -6982585 -7122569 -7227566 -7289415 -7302733 -7266764 -7185072
29730 -7185072 -7064443 -6914884 -6750330 -6587856 -6444375 -6332727 -6259912 -6228003 -6235847 -6279838
29720 -6279838 -6354093 -6451090 -6562320 -6677552 -6782695 -6858701 -6883684 -6837420 -6704943 -6477134
29710 -6477134 -6149391 -5720867 -5195214 -4581850 -3896765 -3163221 -2412778 -1685909 -1030234
29701 -1030234 -495025 -122699 59900 46731 -147976 -495715 -961994 -1512899 -2117131 -2743903
29691 -2743903 -3360100 -3930876 -4425127 -4822764 -5118418 -5318839 -5436574 -5485249 -5479222 -5435563
29681 -5435563 -5374386 -5316051 -5277247 -5268690 -5294970 -5355263 -5444053 -5552499 -5671121 -5792781 -5913732
29670 -5913732 -6031560 -6141126 -6231149 -6283727 -6277670 -6195032 -6028810 -5788657 -5501395 -5204874
29660 -5204874 -4936976 -4724331 -4575785 -4483155 -4427868 -4389377 -4351598 -4305991 -4251991 -4195664 -4146755
29649 -4146755 -4114410 -4103024 -4110225 -4127967 -4145844 -4154689 -4148868 -4126907 -4091060 -4046592 -4000943 -3962304
29637 -3962304 -3937595 -3930970 -3944209 -3978546 -4035778 -4117332 -4222692 -4349467 -4495149 -4658283 -4837862
29626 -4837862 -5032354 -5239921 -5458947 -5686885 -5917728 -6141004 -6344400 -6518906 -6663350
29617 -6663350 -6786012 -6902736 -7032229 -7189594 -7379594 -7591532 -7797877 -7958360 -8029528 -7976984
29607 -7976984 -7785589 -7463397 -7038080 -6547966 -6031671 -5519977 -5031776 -4573813 -4142946
29598 -4142946 -3729940 -3324053 -2917287 -2506847 -2095491 -1690710 -1303497 -946069 -627714
29589 -627714 -349830 -103324 128835 364020 610690 862480 1099018 1292888 1418500 1458360
29579 1458360 1405357 1262791 1044118 772401 478296 196416 -38815 -196659 -252940 -193024
29569 -193024 -15032 267640 626038 1018853 1399443 1725366 1967465 2114760 2173045 2158331
29559 2158331 2088793 1978654 1835150 1658002 1440995 1175891 858347 493755 99680 -297293
29549 -297293 -669066 -993341 -1256171 -1448930 -1563307 -1588974 -1515832 -1339077 -1063637 -705245
29539 -705245 -287581 162624 619357 1057938 1453042 1776128 1993761 2067577 1957391 1629227
29529 1629227 1067439 285857 -668707 -1723999 -2798082 -3816263 -4722285 -5481348 -6077391
29520 -6077391 -6509028 -6786595 -6929902 -6965385 -6922635 -6831246 -6718430 -6606970 -6513125 -6444947
29510 -6444947 -6401880 -6376471 -6358156 -6338195 -6314028 -6291416 -6283673 -6308226 -6381282 -6511582 -6694839
29499 -6694839 -6911058 -7126698 -7301973 -7401051 -7401299 -7298071 -7103704 -6841601 -6537581 -6211253
29489 -6211253 -5870407 -5510500 -5119157 -4683204 -4195249 -3657655 -3082971 -2490718 -1901908
29480 -1901908 -1334187 -800253 -309646 128477 503934 805878 1023996 1149974 1179394 1114260
29470 1114260 965470 753983 509600 266683 57332 -96038 -185469 -216973 -205005 -165267
29460 -165267 -109882 -46554 20050 87709 158280 240228 348826 501610 709880 971138 1268244
29449 1268244 1576904 1876700 2158075 2420949 2667183 2893131 3087488 3235311 3324612 3350730
29439 3350730 3316290 3228511 3097071 2933638 2751860 2566788 2394549 2252938 2161527 2139075
29429 2139075 2197915 2337741 2542100 2779707 3010761 3196217 3306058 3322952 3240510 3058924
29419 3058924 2781689 2415106 1969414 1458996 900096 307020 -310019 -942797 -1579606
29410 -1579606 -2200715 -2778637 -3283351 -3689281 -3980583 -4152980 -4211921 -4167954 -4031334 -3808548
29400 -3808548 -3502557 -3116487 -2659018 -2148962 -1616481 -1099247 -633956 -246486 54930
29391 54930 280385 452424 596038 728737 855331 969549 1060604 1119714 1142528 1127414
29381 1127414 1072932 977904 844295 680258 499999 319659 151371 -831 -140682 -274950
29371 -274950 -406952 -531801 -635644 -698519 -698958 -619091 -450244 -198322 114086 452189
29361 452189 779628 1069707 1310887 1504360 1657096 1775455 1862320 1917338 1938415 1923149
$$ [...]
##END NTUPLES=NMR SPECTRUM
##END=
