##TITLE=31Pdec_DE-27_Et-EA+HP
 D2O
  24 sc
 29.11.2023
##JCAMPDX= 6.0         $$ Bruker NMR JCAMP-DX V2.0
##DATA TYPE= NMR SPECTRUM
##DATA CLASS= NTUPLES
##ORIGIN= UXNMR, Bruker Analytische Messtechnik GmbH
##OWNER= root
$$ XWIN-NMR		Version 3.5
$$ Wed Nov 29 16:34:58 2023 Russian Standard Time (UT+4h)  she@DPX200
##.OBSERVE FREQUENCY= 81.013821
##.OBSERVE NUCLEUS= ^31P
##.ACQUISITION MODE= SIMULTANEOUS
##.ACQUISITION SCHEME= undefined
##.AVERAGES= 24
##.DIGITISER RES= 16
##SPECTROMETER/DATA SYSTEM= spect
##.PULSE SEQUENCE= zgpg30
##.SOLVENT NAME= CDCl3
##.SHIFT REFERENCE= (INTERNAL, CDCl3, 0, 248.564)
##AUDIT TRAIL= $$ (NUMBER, WHEN, WHO, WHERE, WHAT)
$$ ##TITLE= Audit trail, XWIN-NMR		Version 3.5
$$ ##JCAMPDX= 5.01
$$ ##ORIGIN= Bruker BioSpin GmbH
$$ ##OWNER= she
$$ F:/spectra/data/she/nmr/P31/1/pdata/1/auditp.txt
$$ ##AUDIT TRAIL=  $$ (NUMBER, WHEN, WHO, WHERE, WHAT)
(   1,<2023-11-29 16:33:50.40 +0400>,<she>,<DPX200>,
      <created by zg, POWCHK disabled, PULCHK disabled
       configuration hash MD5:
       00 E9 B6 7A A2 85 ED C7 34 08 36 98 17 FE 4E 26
       data hash MD5: 32K
       D5 3F AB 7F 10 02 5C 3F 06 3D 34 23 F7 10 03 B8>)
(   2,<2023-11-29 16:33:54.04 +0400>,<she>,<DPX200>,
      <Start of raw data processing
       efp BC_mod = 2 LB = 10 FT_mod = 6 PKNL = 1 PHC0 = -11682.88 PHC1 = -67.90641 SI = 64K 
       data hash MD5: 64K
       6F 7B 11 A2 31 DC 11 94 1C B4 DF 31 46 61 55 4E>)
(   3,<2023-11-29 16:34:10.31 +0400>,<she>,<DPX200>,
      <pk PHC0 = -2.684428 PHC1 = 0 
       data hash MD5: 64K
       5C 9A 4F 43 51 96 8E 4D 8C BB 33 34 CA F0 73 96>)
(   4,<2023-11-29 16:34:21.03 +0400>,<she>,<DPX200>,
      <abs ABSG = 5 
       data hash MD5: 64K
       88 63 D5 3E 11 A1 22 34 70 52 CC 78 9F 97 EE 92>)
$$ ##END=
$$ 
$$ hash MD5
$$ 05 64 2E 2F E7 87 04 95 B4 3C 18 35 77 7D 18 54
##$RELAX= 
##$RELAX= 
##$RELAX= 
##$RELAX= 
##$RELAX= 
##$RELAX= 
##$RELAX= 
##$RELAX= 
##$RELAX= 
$$ Bruker specific parameters
$$ --------------------------
##$DU= <F:/spectra>
##$EXPNO= 1
##$NAME= <P31>
##$PROCNO= 1
##$TYPE= <nmr>
##$USER= <she>
##$AMP= (0..31)
100 100 100 100 100 100 100 100 100 100 100 100 100 100 100 100 100 100 
100 100 100 100 100 100 100 100 100 100 100 100 100 100 
##$AQSEQ= 0
##$AQ_mod= 1
##$AUNM= <au_zg>
##$AUTOPOS= <>
##$BF1= 81.014009
##$BF2= 200.13
##$BF3= 200.13
##$BF4= 200.13
##$BF5= 200.13
##$BF6= 200.13
##$BF7= 200.13
##$BF8= 200.13
##$BYTORDA= 1
##$CFDGTYP= 0
##$CFRGTYP= 5
##$CHEMSTR= <none>
##$CNST= (0..31)
1 1 145 1 1 1 1 1 1 1 1 1 1 1 1 1 1 1 1 1 1 1 1 1 1 1 1 1 1 1 1 1 
##$CPDPRG= <waltz16>
##$CPDPRG1= <>
##$CPDPRG2= <waltz16>
##$CPDPRG3= <>
##$CPDPRG4= <mlev>
##$CPDPRG5= <mlev>
##$CPDPRG6= <mlev>
##$CPDPRG7= <mlev>
##$CPDPRG8= <mlev>
##$CPDPRGB= <>
##$CPDPRGT= <>
##$D= (0..31)
0 1 0 0 0 0 0 0 0 0 0 0.03 2e-05 3e-06 0 0 0 0 0 0 0 0 0 0 0 0 0 0 0 0 
0 0 
##$DATE= 1701261229
##$DBL= (0..7)
120 120 120 11 120 120 24 19 
##$DBP= (0..7)
150 150 150 150 150 150 150 150 
##$DBP07= 0
##$DBPNAM0= <>
##$DBPNAM1= <>
$$ [...]
##$SUBNAM3= <"">
##$SUBNAM4= <"">
##$SUBNAM5= <"">
##$SUBNAM6= <"">
##$SUBNAM7= <"">
##$SUBNAM8= <"">
##$SUBNAM9= <"">
##$SW= 501.771253377433
##$SWIBOX= (0..15)
0 1 3 0 0 0 0 0 0 0 0 0 0 0 0 0 
##$SW_h= 40650.406504065
##$TD= 32768
##$TD0= 1
##$TE= 0
##$TE2= 300
##$TE3= 300
##$TEG= 300
##$TL= (0..7)
0 120 53 12 22 120 120 120 
##$TP= (0..7)
150 150 150 150 150 150 150 150 
##$TP07= 0
##$TPNAME0= <>
##$TPNAME1= <>
##$TPNAME2= <>
##$TPNAME3= <>
##$TPNAME4= <>
##$TPNAME5= <>
##$TPNAME6= <>
##$TPNAME7= <>
##$TPOAL= (0..7)
0.5 0.5 0.5 0.5 0.5 0.5 0.5 0.5 
##$TPOFFS= (0..7)
0 0 0 0 0 0 0 0 
##$TUNHIN= 0
##$TUNHOUT= 0
##$TUNXOUT= 0
##$USERA1= <user>
##$USERA2= <user>
##$USERA3= <user>
##$USERA4= <user>
##$USERA5= <user>
##$V9= 5
##$VALIST= <valist>
##$VCLIST= <CCCCCCCCCCCCCCC>
##$VD= 0
##$VDLIST= <DDDDDDDDDDDDDDD>
##$VPLIST= <PPPPPPPPPPPPPPP>
##$VTLIST= <TTTTTTTTTTTTTTT>
##$WBST= 1024
##$WBSW= 4
##$XGAIN= (0..3)
0 0 0 0 
##$XL= 0
##$YL= 0
##$YMAX_a= 53208
##$YMIN_a= -44478
##$ZGOPTNS= <>
##$ZL1= 120
##$ZL2= 120
##$ZL3= 120
##$ZL4= 120
##$ABSF1= 248.5645
##$ABSF2= -253.2056
##$ABSG= 5
##$ABSL= 3
##$ALPHA= 0
##$AQORDER= 0
##$ASSFAC= 0
##$ASSFACI= 0
##$ASSFACX= 0
##$ASSWID= 0
##$AUNMP= <proc_1d>
##$AZFE= 0.1
##$AZFW= 0.5
##$BCFW= 0
##$BC_mod= 2
##$BYTORDP= 0
##$COROFFS= 0
##$CY= -3
##$DATMOD= 1
##$DC= 0
##$DFILT= <>
##$DTYPP= 0
##$F1P= 0
##$F2P= 0
##$FCOR= 1
##$FTSIZE= 65536
##$FT_mod= 6
##$GAMMA= 0
##$GB= 0
##$INTBC= 1
##$INTSCL= 6.047779e-11
##$ISEN= 30
##$LB= 10
##$LEV0= 0
##$LPBIN= 0
##$MAXI= 10000
##$MC2= 0
##$MEAN= 0
##$ME_mod= 0
##$MI= 50
##$NCOEF= 0
##$NC_proc= -4
##$NLEV= 6
##$NOISF1= 182.463
##$NOISF2= 159.3651
##$NSP= 0
##$NTH_PI= 0
##$NZP= 0
##$OFFSET= 248.5645
##$PC= 4
##$PHC0= -11685.56
##$PHC1= -67.90641
##$PH_mod= 1
##$PKNL= yes
##$PPARMOD= 0
##$PSCAL= 0
##$PSIGN= 0
##$REVERSE= no
##$SF= 81.0140089999694
##$SI= 65536
##$SIGF1= 159.3651
##$SIGF2= -187.1042
##$SINO= 113.3802
##$SIOLD= 16384
##$SREGLST= <1H.CDCl3>
##$SSB= 0
##$STSI= 65536
##$STSR= 0
##$SW_p= 40650.406504065
##$SYMM= 0
##$S_DEV= 0
##$TDeff= 32768
##$TDoff= 0
##$TI= <>
##$TILT= no
##$TM1= 0
##$TM2= 0
##$TOPLEV= 0
##$USERP1= <user>
##$USERP2= <user>
##$USERP3= <user>
##$USERP4= <user>
##$USERP5= <user>
##$WDW= 1
##$XDIM= 65536
##$YMAX_p= 299411682
##$YMIN_p= -4030327
$$ End of Bruker specific parameters
$$ ---------------------------------
##NTUPLES= NMR SPECTRUM
##VAR_NAME=  FREQUENCY,     SPECTRUM/REAL,   SPECTRUM/IMAG
##SYMBOL=    X,             R,               I
##VAR_TYPE=  INDEPENDENT,   DEPENDENT,       DEPENDENT
##VAR_FORM=  AFFN,          ASDF,            ASDF
##VAR_DIM=   65536,         65536,           65536
##UNITS=     HZ,            ARBITRARY UNITS, ARBITRARY UNITS
##FACTOR=    0.620285442955139, 1,           1
##FIRST=     20137.2065510682, 0,            0
##LAST=      -20513.1999529968, 0,           0
##MIN=       -20513.1999529968, -4030327,    0
##MAX=       20137.2065510682, 299411682,    0
$$ Real data points
##PAGE= N=1
##DATA TABLE= (X++(R..R)), XYDATA
$$ [...]
$$ plain form
37915 -37782 -20212 -3700 11177 24035 34725 43293 49893 54642 57551 58563 57710 55270 51817
37902 51817 48126 44980 42976 42433 43414 45829 49515 54316 60139 66970 74818 83592 93036 102763 112433
37887 112433 121950 131490 141339 151621 162137 172450 182123 190884 198613 205212 210525 214376 216680
37874 216680 217466 216800 214695 211158 206354 200724 194941 189706 185597 183034 182349 183789 187446 193086 200059
37859 200059 207351 213829 218528 220839 220569 217888 213233 207174 200295 193138 186223 180070 175116 171528
37845 171528 169008 166738 163571 158400 150541 139941 127125 112970 98428 84298 71098 59052
37833 59052 48156 38271 29200 20716 12577 4479 -3948 -13116 -23357 -34836 -47525 -61262 -75824
37820 -75824 -90972 -106452 -121985 -137268 -151985 -165831 -178481 -189586 -198806 -205925 -210946 -214113
$$ packed form
37915c7782J7570J6512J4877J2858J0690Q568O600M749K909J012q53k440l453
37902E1817l691l146k004n43R81K415L686M801N823O831P848Q774R444R727R670
37887A12433R517R540R849J0282J0516J0313R673Q761P729O599N313L851K304
37874B16680P86o66k105l537m804n630n783n235m109k563o85J440L657N640O973
37859B00059P292O478M699K311k70k681m655o059o879p157o915o153m954l588
37845A71528k520k270l167n171p859j0600j2816j4155j4542j4130j3200j2046
37833E9052j0896r885r071q484q139q098q427r168j0241j1479j2689j3737j4562
37820g5824j5148j5480j5533j5283j4717j3846j2650j1105r220p119n021l167
$$ plain form
37808 -214113 -215865 -216786 -217550 -218767 -220739 -223247 -225550 -226655 -225716 -222322 -216564 -208863 -199711 -189424 -178038
37793 -178038 -165337 -150968 -134584 -115965 -95141 -72472 -48678 -24755 -1821 19045 36932
37782 36932 51177 61415 67630 70199 69902 67841 65250 63251 62686 64077 67720 73801 82474 93863
37768 93863 108025 124898 144251 165698 188739 212829 237420 261980 285947 308680 329395 347137
37756 347137 360857 369578 372637 369883 361768 349265 333632 316109 297644 278804 259857 240940
37744 240940 222205 203886 186307 169816 154663 140880 128260 116471 105273 94713 85221 77538
37732 77538 72486 70682 72331 77223 84887 94796 106529 119840 134682 151184 169540 189834 211853
37719 211853 235040 258587 281625 303375 323240 340862 356172 369395 380998 391597 401862
$$ packed form
37808b14113j752r21p64j217j972k508k303j105R39L394N758P701R152J0287J1386
37793a78038J2701J4369J6384J8619K0824K2669K3794K3923K2934K0866J7887
37782C6932J4245J0238O215K569k97k061k591j999n65J391L643O081Q673J1389
37768I3863J4162J6873J9353K1447K3041K4090K4591K4560K3967K2733K0715J7742
37756C47137J3720Q721L059k754q115j2503j5633j7523j8465j8840j8947j8917
37744B40940j8735j8319j7579j6491j5153j3783j2620j1789j1198j0560r492p683
37732G7538n052j804J649M892P664R909J1733J3311J4842J6502J8356K0294K2019
37719B11853K3187K3547K3038K1750J9865J7622J5310J3223J1603J0599J0265
$$ plain form
37708 401862 412406 423613 435461 447395 458388 467211 472796 474539 472388 466745 458251 447612 435500
37695 435500 422527 409238 396084 383374 371236 359612 348286 336910 325030 312137 297776
37684 297776 281734 264235 246076 228577 213375 202077 195880 195277 199921 208762 220391 233436
37672 233436 246809 259819 272174 283962 295567 307523 320390 334683 350879 369347 390204
37661 390204 413120 437233 461267 483823 503756 520439 533843 544438 553002 560379 567289 574186
37649 574186 581253 588505 595930 603624 611868 621151 632179 645826 663021 684537 710705 741188 774864
37636 774864 809920 844138 875308 901669 922250 937015 946769 952840 956704 959708 962985 967548 974367
37623 974367 984333 998067 1015623 1036249 1058298 1079405 1096825 1107828 1110030 1101628 1081661 1050227
$$ packed form
37708D01862J0544J1207J1848J1934J0993Q823N585J743k151n643q494j0639j2112
37695D35500j2973j3289j3154j2710j2138j1624j1326j1376j1880j2893j4361
37684B97776j6042j7499j8159j7499j5202j1298o197o03M644Q841J1629J3045
37672B33436J3373J3010J2355J1788J1605J1956J2867J4293J6196J8468K0857
37661C90204K2916K4113K4034K2556J9933J6683J3404J0595Q564P377O910O897
37649E74186P067P252P425P694Q244R283J1028J3647J7195K1516K6168L0483L3676
37636G74864L5056L4218L1170K6361K0581J4765R754O071L864L004L277M563O819
37623I74367R966J3734J7556K0626K2049K1107J7420J1003K202q402j9967l1434
$$ plain form
37611 1050227 1008608 959149 904853 848823 793720 741447 693114 649211 609892 575132 544796
37600 544796 518563 495894 476042 458141 441270 424532 407136 388509 368454 347279 325837
37589 325837 305374 287185 272226 260908 253192 248865 247775 249895 255208 263530 274387 287036 300578
37576 300578 314084 326720 337845 347104 354413 359845 363435 365029 364244 360571 353634 343473 330708
37563 330708 316440 301934 288222 275802 264575 254078 243850 233763 224080 215278 207751 201575
37551 201575 196471 191939 187542 183109 178785 174850 171469 168540 165721 162588 158806 154227 148916 143122
37537 143122 137251 131807 127276 123968 121912 120869 120410 120037 119277 117756 115279 111914 108016 104125 100780
37522 100780 98336 96841 96064 95583 94869 93381 90663 86437 80689 73664 65810 57731 50210 44211 40822
$$ packed form
37611A050227m1619m9459n4296n6030n5103n2273m8333m3903l9319l4760l0336
37600E44796k6233k2669j9852j7901j6871j6738j7396j8627k0055k1175k1442
37589C25837k0463j8189j4959j1318p716m327j090K120N313Q322J0857J2649J3542
37576C00578J3506J2636J1125R259P309N432L590J594p85l673o937j0161j2765
37563C30708j4268j4506j3712j2420j1227j0497j0228j0087r683q802p527o176
37551B01575n104m532m397m433m324l935l381k929k819l133l782m579n311n794
37537A43122n871n444m531l308k056j043m59l73p60j521k477l365l898l891l345
37522A00780k444j495p77m81p14j488k718m226n748p025p854q079p521n999l389
$$ plain form
37507 40822 41049 45562 54508 67471 83611 101883 121277 140996 160510 179549 198050 216096
37495 216096 233860 251548 269336 287311 305409 323422 341074 358101 374303 389524 403606
37484 403606 416367 427656 437424 445793 453030 459436 465218 470396 474768 477894 479103 477584 472583 463648
37470 463648 450817 434610 415812 395188 373237 350128 325815 300274 273782 247098 221473
37459 221473 198429 179388 165322 156585 153004 154159 159630 169041 181974 197839 215859 235129
37447 235129 254710 273757 291635 307972 322624 335553 346751 356221 364018 370245 374991 378223
37435 378223 379703 379006 375671 369392 360149 348189 333894 317607 299509 279632 257965 234639 210053
37422 210053 184924 160178 136737 115276 96094 79209 64575 52261 42503 35607 31825 31198
$$ packed form
37507D0822K27M513Q946J2963J6140J8272J9394J9719J9514J9039J8501J8046
37495B16096J7764J7688J7788J7975J8098J8013J7652J7027J6202J5221J4082
37484D03606J2761J1289R768Q369P237O406N782N178M372L126J209j519n001q935
37470D63648j2831j6207j8798k0624k1951k3109k4313k5541k6492k6684k5625
37459B21473k3044j9041j4066q737l581J155N471R411J2933J5865J8020J9270
37447B35129J9581J9047J7878J6337J4652J2929J1198R470P797O227M746L232
37435C78223J480o97l335o279r243j1960j4295j6287j8098j9877k1667k3326k4586
37422B10053k5129k4746k3441k1461j9182j6885j4634j2314r758o896l782o27
$$ plain form
37410 31198 33484 38149 44435 51443 58188 63679 67046 67748 65720 61340 55165 47615 38763 28329
37396 28329 15806 556 -18098 -40819 -68171 -100556 -138083 -180480 -227034 -276682 -328099 -379716
37384 -379716 -429578 -475223 -513820 -542656 -559818 -564696 -558040 -541551 -517307 -487335 -453463 -417314
37372 -417314 -380350 -343876 -308983 -276408 -246376 -218543 -192144 -166313 -140418 -114270 -88116
37361 -88116 -62490 -38037 -15402 4810 22083 36008 46343 53054 56374 56782 54928 51472 46969
37348 46969 41825 36340 30785 25468 20754 17033 14647 13828 14615 16816 19975 23425 26380 28055 27805
37333 27805 25296 20653 14495 7787 1569 -3377 -6806 -9158 -11484 -15166 -21532 -31546 -45709 -64120
37319 -64120 -86617 -112810 -142045 -173356 -205575 -237583 -268655 -298733 -328575 -359703 -394127 -433942
$$ packed form
37410C1198K286M665O286P008O745N491L367P02k028m380o175p550q852j0434
37396B8329j2523j5250j8654k2721k7352l2385l7527m2397m6554m9648n1417n1617
37384c79716m9862m5645l8597k8836j7162m878O656J6489K4244K9972L3872L6149
37372d17314L6964L6474L4893L2575L0032K7833K6399K5831K5895K6148K6154
37361h8116K5626K4453K2635K0212J7273J3925J0335O711L320M08j854l456m503
37348D6969n144n485n555n317m714l721k386q19P87K201L159L450K955J675k50
37333B7805k509m643o158o708o218m946l429k352k326l682o366j0014j4163j8411
37319f4120k2497k6193k9235l1311l2219l2008l1072l0078k9842l1128l4424l9815
$$ plain form
37307 -433942 -480935 -536362 -600894 -674704 -757707 -849895 -951735 -1064436 -1189984 -1330869 -1489636
37296 -1489636 -1668351 -1868137 -2088736 -2328036 -2581538 -2841786 -3097897 -3335499 -3537636
37287 -3537636 -3687085 -3769875 -3778853 -3715621 -3589952 -3416972 -3213552 -2995271 -2774640 -2560574
37277 -2560574 -2358609 -2171539 -2000162 -1844037 -1702162 -1573478 -1457173 -1352764 -1259993 -1178616
37267 -1178616 -1108175 -1047856 -996550 -953029 -916218 -885380 -860182 -840617 -826798 -818727 -816125 -818462
37255 -818462 -825126 -835610 -849606 -866976 -887654 -911528 -938301 -967357 -997667 -1027719 -1055462 -1078284
37243 -1078284 -1093179 -1097192 -1088084 -1064996 -1028753 -981646 -926759 -867130 -805115 -742186 -679119 -616386
37231 -616386 -554446 -493841 -435140 -378925 -325858 -276766 -232593 -194177 -162028 -136223 -116480
$$ packed form
37307d33942m6993n5427o4532p3810q3003r2188j01840j12701j25548j40885j58767
37296a489636j78715j99786k20599k39300k53502k60248k56111k37602k02137
37287c537636j49449q2790q978O3232J25669J72980K03420K18281K20631K14066
37277b560574K01965J87070J71377J56125J41875J28684J16305J04409R2771Q1377
37267a178616P0441O0319N1306M3521L6811L0838K5198J9565J3819Q071K602k337
37255h18462o664j0484j3996j7370k0678k3874k6773k9056l0310l0052k7743k2822
37243a078284j4895m013R108K3088L6243M7107N4887N9629O2015O2929O3067O2733
37231f16386O1940O0605N8701N6215N3067M9092M4173L8416L2149K5805J9743
$$ plain form
37220 -116480 -102321 -93152 -88278 -86866 -87949 -90482 -93424 -95771 -96594 -95073 -90538 -82509 -70758 -55359
37206 -55359 -36718 -15527 7369 31108 54892 78037 99911 119837 137027 150652 160046 164911
37194 164911 165391 161945 155142 145456 133204 118624 102089 84256 66080 48637 32830 19131
37182 19131 7458 -2756 -12354 -22157 -32697 -44030 -55692 -66803 -76283 -83127 -86652 -86650 -83397 -77513
37168 -77513 -69752 -60837 -51400 -41987 -33072 -25022 -18013 -11989 -6700 -1881 2551 6362 9049 10011 8829
37153 8829 5494 494 -5322 -11099 -16335 -21095 -25923 -31516 -38341 -46356 -54930 -63014 -69402 -73038 -73232
37138 -73232 -69805 -63096 -53867 -43099 -31795 -20851 -11034 -2979 2834 6168 7070 5821 2731 -2107
37124 -2107 -9004 -18676 -32060 -50004 -72985 -100946 -133290 -168989 -206822 -245718 -285095 -324997
$$ packed form
37220a16480J4159R169M874J412j083k533k942k347q23J521M535Q029J1751J5399
37206e5359J8641K1191K2896K3739K3784K3145K1874J9926J7190J3625R394M865
37194A64911M80l446o803r686j2252j4580j6535j7833j8176j7443j5807j3699
37182A9131j1673j0214r598r803j0540j1333j1662j1111r480o844l525KL253N884
37168g7513P761Q915R437R413Q915Q050P009O024N289M819M432L811K687R62j182
37153H829l335n000n816n777n236m760m828n593o825q015q574q084o388l636j94
37138g3232L427O709R229J0768J1304J0944R817Q055N813L334R02j249l090m838
37124b107o897r672j3384j7944k2981k7961l2344l5699l7833l8896l9377l9902
$$ plain form
37112 -324997 -365966 -408705 -453688 -500845 -549363 -597630 -643307 -683503 -715020 -734713 -740004 -729479
37100 -729479 -703283 -663124 -611794 -552476 -488143 -421271 -353866 -287601 -223935 -164083 -108913
37089 -108913 -58838 -13857 26251 61688 92492 118581 139920 156686 169345 178573 185077 189419
37077 189419 191961 192915 192442 190733 188093 185030 182336 181090 182541 187896 198055 213409 233809 258656
37063 258656 287032 317746 349345 380166 408495 432773 451767 464662 471124 471358 466176 456928
37051 456928 445296 432998 421528 412024 405217 401442 400628 402323 405767 410031 414174 417332 418679 417377
37037 417377 412661 404065 391600 375800 357589 338107 318518 299854 282923 268335 256548 247864
37025 247864 242390 239953 240111 242241 245706 250070 255222 261380 268965 278468 290370 305144 323272 345190
$$ packed form
37112c24997m0969m2739m4983m7157m8518m8267m5677m0196l1517j9693n291J0525
37100g29479K6196M0159N1330N9318O4333O6872O7405O6265O3666N9852N5170
37089a08913N0075M4981M0108L5437L0804K6089K1339J6766J2659R228O504M342
37077A89419K542R54m73j709k640l063k694j246J451N355J0159J5354K0400K4847
37063B58656K8376L0714L1599L0821K8329K4278J8994J2895O462K34n182r248
37051D56928j1632j2298j1470r504o807l775q14J695L444M264M143L158J347j302
37037D17377m716q596j2465j5800j8211j9482j9589j8664j6931j4588j1787q684
37025B47864n474k437J58K130L465M364N152O158P585R503J1902J4774J8128K1918
$$ plain form
37011 345190 371136 400967 434085 469523 506154 542886 578801 613211 645634 675741 703343
37000 703343 728458 751451 773189 795083 818964 846767 880126 920064 966915 1020463 1080227
36989 1080227 1145763 1216927 1294035 1377966 1470183 1572701 1687922 1818388 1966467 2134168
36979 2134168 2323099 2534540 2769538 3028945 3313338 3622804 3956588 4312423 4685482
36970 4685482 5066963 5442748 5792785 6092057 6313813 6434903 6441645 6333697 6124026 5835055
36960 5835055 5493040 5123004 4745575 4375765 4023199 3693187 3388117 3108716 2854901
36951 2854901 2626150 2421540 2239628 2078349 1935036 1806559 1689592 1580951 1477955
36942 1477955 1378705 1282186 1188194 1097146 1009858 927325 850582 780637 718474 665033 621168
$$ packed form
37011C45190K5946K9831L3118L5438L6631L6732L5915L4410L2423L0107K7602
37000G03343K5115K2993K1738K1894K3881K7803L3359L9938M6851N3548N9764
36989A080227O5536P1164P7108Q3931R2217J02518J15221J30466J48079J67701
36979B134168J88931K11441K34998K59407K84393L09466L33784L55835L73059
36970D685482L81481L75785L50037K99272K21756J21090O742j07948k09671k88971
36960E835055l42015l70036l77429l69810l52566l30012l05070k79401k53815
36951B854901k28751k04610j81912j61279j43313j28477j16967j08641j02996
36942A477955r9250r6519r3992r1048q7288q2533p6743o9945o2163n3441m3865
$$ plain form
36931 621168 587532 564471 551925 549395 556009 570658 592211 619736 652576 690235 732106 777181
36919 777181 823890 870049 912929 949403 976225 990449 990027 974456 945159 905309 859073 810604
36907 810604 763222 719065 679121 643472 611572 582521 555300 529001 502993 476946 450743
36896 450743 424336 397647 370567 342991 314881 286295 257428 228617 200290 172843 146501
36885 146501 121273 97062 73847 51840 31525 13578 -1286 -12464 -19588 -22561 -21512 -16711
36873 -16711 -8466 2917 17094 33515 51274 69112 85634 99646 110415 117763 121975 123608
36861 123608 123274 121525 118872 115895 113338 112059 112818 116000 121430 128396 135857 142674 147830 150582 150607
36846 150607 148098 143715 138397 133118 128747 126037 125692 128323 134276 143418 155104 168392 182348 196270
$$ packed form
36931F21168l3636k3061j2546k530O614J4649K1553K7525L2840L7659M1871M5075
36919G77181M6709M6159M2880L6474K6822J4224m22j5571k9297l9850m6236m8469
36907H10604m7382m4157l9944l5649l1900k9051k7221k6299k6008k6047k6203
36896D50743k6407k6689k7080k7576k8110k8586k8867k8811k8327k7447k6342
36885A46501k5228k4211k3215k2007k0315j7947j4864j1178p124k973J049M801
36873a6711Q245J1383J4177J6421J7759J7838J6522J4012J0769P348M212J633
36861A23608l34j749k653k977k557j279P59L182N430O966P461O817N156K752K5
36846A50607k509m383n318n279m371k710l45K631N953R142J1686J3288J3956J3922
$$ plain form
36832 196270 209709 222362 233957 244211 252828 259510 263949 265865 265096 261717 256126 249063 241579
36819 241579 234929 230346 228765 230598 235702 243570 253642 265540 279114 294262 310713 327929 345178
36806 345178 361699 376826 390066 401111 409811 416080 419794 420736 418583 412969 403591 390361 373580
36793 373580 354055 333116 312462 293885 278976 268924 264451 265788 272626 284099 298858 315313
36781 315313 331948 347567 361359 372775 381340 386541 387866 384937 377658 366295 351438 333845
36769 333845 314268 293357 271664 249653 227643 205700 183619 161036 137625 113283 88264
36758 88264 63189 38922 16374 -3723 -20924 -35082 -46269 -54707 -60750 -64868 -67605 -69505 -71018
36745 -71018 -72410 -73714 -74683 -74814 -73433 -69844 -63479 -53987 -41246 -25350 -6605 14426 36877 59562
$$ packed form
36832A96270J3439J2653J1595J0254Q617O682M439J916p69l379n591p063p484
36819B41579o650m583j581J833N104P868J0072J1898J3574J5148J6451J7216J7249
36806C45178J6521J5127J3240J1045Q700O269L714R42k153n614r378j3230j6781
36793C73580j9525k0939k0654j8577j4909j0052m473J337O838J1473J4759J6455
36781C15313J6635J5619J3792J1416Q565N201J325k929p279j1363j4857j7593
36769C33845j9577k0911k1693k2011k2010k1943k2081k2583k3411k4342k5019
36758H8264k5075k4267k2548k0097j7201j4158j1187q438o043m118k737j900j513
36745g1018j392j304r69j31J381L589O365R492J2741J5896J8745K1031K2451K2685
$$ plain form
36731 59562 81041 99778 114350 123738 127564 126193 120611 112156 102213 91970 82276 73590 66020
36718 66020 59434 53578 48183 43050 38106 33411 29154 25585 22920 21252 20473 20253 20075 19318 17432
36703 17432 14107 9400 3693 -2449 -8477 -14006 -18874 -23107 -26782 -29922 -32477 -34391 -35701 -36613 -37494
36688 -37494 -38825 -41058 -44438 -48820 -53550 -57517 -59393 -58043 -52937 -44356 -33295 -21113 -9108 1811
36674 1811 11307 19585 27269 35162 43997 54245 66027 79167 93319 108045 122849 137198 150571
36661 150571 162533 172823 181421 188598 194889 200934 207235 213899 220546 226394 230431 231593 228913 221692
36647 221692 209634 192940 172271 148602 123031 96583 70058 43974 18613 -5823 -29047
36636 -29047 -50564 -69666 -85612 -97868 -106300 -111220 -113282 -113317 -112231 -110946 -110378 -111365 -114487 -119857
$$ packed form
36731E9562K1479J8737J4572R388L826j371n582q455r943j0243r694q686p570
36718F6020o586n856n395n133m944m695m257l569k665j668p79k20j78p57j886
36703A7432l325m707n707o142o028n529m868m233l675l140k555j914j310r12q81
36688c7494j331k233l380m382m730l967j876J350N106Q581J1061J2182J2005J0919
36674A811R496Q278P684P893Q835J0248J1782J3140J4152J4726J4804J4349J3373
36661A50571J1962J0290Q598P177O291O045O301O664O647N848M037J162k680p221
36647B21692j2058j6694k0669k3669k5571k6448k6525k6084k5361k4436k3224
36636b9047k1517j9102j5946j2256q432m920k062l5J086J285N68r87l122n370
$$ plain form
36622 -119857 -127027 -135102 -143030 -149946 -155374 -159216 -161571 -162475 -161771 -159160 -154386 -147402 -138472 -128157
36608 -128157 -117217 -106440 -96468 -87662 -80100 -73626 -67944 -62706 -57578 -52224 -46296 -39429 -31335 -21925
36594 -21925 -11389 -147 11331 22736 34006 45249 56587 68023 79433 90618 101341 111339
36582 111339 120270 127712 133177 136158 136243 133197 127047 118081 106770 93688 79471 64857 50674
36569 50674 37752 26808 18366 12711 9906 9808 12154 16627 22860 30384 38602 46893 54788 62176
36555 62176 69420 77271 86572 97882 111207 126014 141433 156539 170530 182802 192967 200837
36543 200837 206427 209943 211777 212448 212516 212467 212615 213070 213780 214588 215293 215661 215473 214532 212691 209855 205996
36526 205996 201191 195631 189604 183394 177182 170978 164666 158129 151345 144392 137378 130406 123612 117199
$$ packed form
36622a19857p170q075p928o916n428l842k355r04P04K611M774O984Q930J0315
36608a28157J0940J0777R972Q806P562O474N682N238N128N354N928O867Q094R410
36594b1925J0536J1242J1478J1405J1270J1243J1338J1436J1410J1185J0723R998
36582A11339Q931P442N465K981Q5l046o150q966j1311j3082j4217j4614j4183
36569E0674j2922j0944q442n655k805r8K346M473O233P524Q218Q291P895P388
36555F2176P244P851R301J1310J3325J4807J5419J5106J3991J2272J0165P870
36543B00837N590L516J834O71O8m9J48M55P10Q08P05L68j88r41j841k836l859
36526B05996m805n560o027o210o212o204o312o537o784o953p014o972o794o413
$$ plain form
36512 117199 111386 106273 101694 97178 92032 85560 77296 67181 55575 43106 30458 18170 6601
36499 6601 -4052 -13683 -22277 -29912 -36726 -42779 -47955 -51920 -54194 -54235 -51525 -45616 -36207 -23208 -6810
36484 -6810 12492 33936 56587 79496 101859 123139 143063 161478 178148 192606 204093 211688
36472 211688 214540 212202 204851 193353 179123 163907 149506 137483 128889 124149 123166 125502 130516
36459 130516 137354 144937 152034 157519 160693 161524 160621 158968 157550 157094 158012 160523 164787 170978 179226
36444 179226 189501 201515 214726 228445 241993 254840 266631 277128 286114 293379 298806 302551
36432 302551 305174 307671 311286 317171 326065 338094 352820 369400 386838 404203 420768 436044
36420 436044 449731 461710 472077 481179 489519 497550 505457 513099 520150 526337 531667 536480 541382
$$ packed form
36512A17199n813n113m579m516n146o472q264j0115j1606j2469j2648j2288j1569
36499F601j0653r631q594p635o814o053n176l965k274m1K710N909R409J2999J6398
36484f810J9302K1444K2651K2909K2363K1280J9924J8415J6670J4458J1487P595
36472B11688K852k338p351j1498j4230j5216j4401j2023q594m740r83K336N014
36459A30516O838P583P097N485L174Q31r03j653j418m56R18K511M264O191Q248
36444A79226J0275J2014J3211J3719J3548J2847J1791J0497Q986P265N427L745
36432C02551K623K497L615N885Q894J2029J4726J6580J7438J7365J6565J5276
36420D36044J3687J1979J0367R102Q340Q031P907P642P051O187N330M813M902
$$ plain form
36407 541382 547039 553992 562493 572430 583383 594780 606169 617503 629294 642527 658303 677442
36395 677442 700215 726333 755129 785774 817466 849474 881123 911733 940625 967146 990669
36384 990669 1010594 1026364 1037619 1044403 1047301 1047423 1046209 1045109 1045240 1047122 1050585 1054888 1058948 1061595
36370 1061595 1061744 1058485 1051114 1039136 1022280 1000581 974462 944744 912471 878626 843956 808975
36358 808975 774169 740107 707386 676472 647606 620883 596431 574484 555291 538975 525511
36347 525511 514861 507074 502197 500067 500172 501734 503982 506426 509037 512227 516597 522554 530028 538423
36333 538423 546816 554247 559976 563662 565433 565829 565621 565650 566757 569841 575935 586194 601752 623500
36319 623500 651881 686781 727586 773349 823005 875552 930171 986313 1043747 1102558 1163065
$$ packed form
36407E41382N657O953Q501R937J0953J1397J1389J1334J1791J3233J5776J9139
36395F77442K2773K6118K8796L0645L1692L2008L1649L0610K8892K6521K3523
36384I90669J9925J5770J1255O784K898J22j214j100J31J882L463M303M060K647
36370A061595J49l259p371j1978j6856k1699k6119k9718l2273l3845l4670l4981
36358H08975l4806l4062l2721l0914k8866k6723k4452k1947j9193j6316j3464
36347E25511j0650p787m877k130J05J562K248K444K611L190M370N957P474Q395
36333E38423Q393P431N729L686J771L96k08K9J107L084O094J0259J5558K1748
36319F23500K8381L4900M0805M5763M9656N2547N4619N6142N7434N8811O0507
$$ plain form
36308 1163065 1225711 1291001 1359493 1431839 1508762 1590958 1678953 1772973 1872906 1978376 2088891
36297 2088891 2203909 2322789 2444590 2567768 2689855 2807275 2915481 3009463 3084557 3137390
36287 3137390 3166686 3173701 3162104 3137313 3105449 3072218 3042018 3017394 2998853 2984892 2972165
36276 2972165 2955761 2929670 2887452 2823048 2731627 2610417 2459371 2281535 2082881 1871532
36266 1871532 1656505 1446302 1247764 1065498 901873 757456 631631 523253 431161 354451
36256 354451 292449 244466 209477 185909 171665 164351 161613 161420 162260 163206 163863 164239 164591 165315 166911
36241 166911 169973 175141 183019 194027 208228 225175 243882 262937 280687 295449 305718 310347
36229 310347 308649 300348 285453 264091 236485 203056 164592 122299 77671 32233 -12720 -56277
$$ packed form
36308A163065O2646O5290O8492P2346P6923Q2196Q7995R4020R9933J05470J10515
36297B088891J15018J18880J21801J23178J22087J17420J08206R3982P5094N2833
36287C137390K9296P015j1597k4791l1864l3231l0200k4624j8541j3961j2727
36276B972165j6404k6091m2218o4404r1421j21210j51046j77836j98654k11349
36266A871532k15027k10203j98538j82266j63625j44417j25825j08378r2092p6710
36256C54451o2002m7983l4989k3568j4244p314k738j93Q40R46O57L76L52P24J596
36241A66911L062N168P878J1008J4201J6947J8707J9055J7750J4762J0269M629
36229C10347j698q301j4895k1362k7606l3429l8464m2293m4628m5438m4953m3557
$$ plain form
36217 -56277 -97928 -137468 -174846 -210028 -242955 -273580 -301885 -327833 -351300 -372065 -389894 -404607
36205 -404607 -416124 -424489 -429872 -432583 -433042 -431765 -429334 -426339 -423279 -420466 -417942 -415519 -412881 -409754
36191 -409754 -406074 -402041 -398058 -394517 -391558 -388940 -386091 -382289 -376901 -369574 -360381 -349832 -338777 -328179
36177 -328179 -318894 -311495 -306183 -302789 -300879 -299905 -299356 -298822 -297972 -296459 -293829 -289469 -282684 -272916 -259992
36162 -259992 -244259 -226497 -207650 -188544 -169737 -151605 -134540 -119160 -106323 -96925 -91582 -90288
36150 -90288 -92282 -96119 -99918 -101668 -99519 -91992 -78108 -57418 -29962 3816 43107 86721 133008
36137 133008 179802 224514 264425 297121 320895 334999 339728 336363 326976 314110 300367 287980
36125 287980 278485 272619 270462 271731 276056 283121 292685 304541 318440 333985 350551 367297 383291
$$ packed form
36217e6277m1651l9540l7378l5182l2927l0625k8305k5948k3467k0765j7829j4713
36205d04607j1517q365n383k711m59J277K431K995L060K813K524K423K638L127
36191d09754L680M033L983L541K959K618K849L802N388P327R193J0549J1055J0598
36177c28179R285P399N312L394J910R74N49N34Q50J513K630M360O785R768J2924
36162b59992J5733J7762J8847J9106J8807J8132J7065J5380J2837R398N343J294
36150i0288j994l837l799j750K149P527J3884K0690K7456L3778L9291M3614M6287
36137A33008M6794M4712L9911L2696K3774J4104M729l365r387j2866j3743j2387
36125B87980r495n866k157J269M325P065R564J1856J3899J5545J6566J6746J5994
$$ plain form
36112 383291 397721 410082 420264 428460 434955 439935 443408 445275 445474 444140 441693 438820 436341 435062
36098 435062 435639 438458 443500 450274 457859 465027 470396 472515 469929 461258 445349 421549 390002 351818
36084 351818 308991 264088 219828 178635 142286 111748 87220 68337 54369 44408 37499 32751
36072 32751 29414 26922 24970 23581 23084 23966 26664 31390 38066 46397 56026 66699 78310 90794
36058 90794 103935 117291 130321 142739 154842 167620 182543 201165 224745 254035 289238 330087
36046 330087 375975 426042 479153 533771 587805 638515 682594 716522 737195 742669 732689 708749
36034 708749 673643 630801 583643 535209 487983 443874 404191 369632 340306 315844 295608
36023 295608 278910 265148 253859 244703 237432 231829 227601 224312 221418 218442 215171 211707 208349
$$ packed form
36112C83291J4430J2361J0182Q196O495M980L473J867J99j334k447k873k479j279
36098D35062N77K819N042O774P585P168N369K119k586q671j5909k3800l1547l8184
36084C51818m2827m4903m4260m1193l6349l0538k4528j8883j3968r961o909m748
36072C2751l337k492j952j389m97Q82K698M726O676Q331R629J0673J1611J2484
36058I0794J3141J3356J3030J2418J2103J2778J4923J8622K3580K9290L5203M0849
36046C30087M5888N0067N3111N4618N4034N0710M4079L3928K0673N474r980k3940
36034G08749l5106m2842m7158m8434m7226m4109l9683l4559k9326k4462k0236
36023B95608j6698j3762j1289r156p271n603m228l289k894k976l271l464l358
$$ plain form
36010 208349 205375 202900 200943 199619 199340 200760 204521 210929 219778 230398 241890 253451 264605
35997 264605 275248 285467 295292 304570 312956 320028 325422 328983 330842 331413 331333 331427 332699 336295 343383
35982 343383 354978 371745 393847 420892 452019 486133 522245 559788 598786 639807 683714
35971 683714 731350 783328 840009 901631 968511 1041230 1120733 1208320 1305513 1413809 1534468
35960 1534468 1668390 1816181 1978267 2154999 2346670 2553490 2775502 3012399 3263155
35951 3263155 3525459 3794965 4064468 4323234 4556794 4747557 4876681 4927360 4889011 4760832
35941 4760832 4552873 4283808 3976396 3652729 3330976 3024072 2739886 2482175 2251819
35932 2251819 2047987 1869038 1713068 1578148 1462354 1363681 1279982 1208987 1148418 1096134
$$ packed form
36010B08349k974k475j957j324k79J420L761O408Q849J0620J1492J1561J1154
35997B64605J0643J0219R825R278Q386P072N394L561J859N71q0R4J272L596P088
35982C43383J1595J6767K2102K7045L1127L4114L6112L7543L8998M1021M3907
35971F83714M7636N1978N6681O1622O6880P2719P9503Q7587R7193J08296J20659
35960A534468J33922J47791J62086J76732J91671K06820K22012K36897K50756
35951C263155K62304K69506K69503K58766K33560J90763J29124N0679l8349j28179
35941D760832k07959k69065l07412l23667l21753l06904k84186k57711k30356
35932B251819k03832j78949j55970j34920j15794r8673q3699p0995o0569n2284
$$ plain form
35922 1096134 1050257 1009219 971793 937165 905058 875847 850476 830176 816120 809155 809693 817746
35910 817746 833016 855004 883071 916436 954116 994804 1036725 1077532 1114305 1143659 1161983
35899 1161983 1165888 1152906 1122207 1074973 1014185 943950 868669 792285 717819 647183 581300
35888 581300 520372 464146 412131 363753 318510 276092 236461 199817 166473 136613 110039
35877 110039 86032 63453 41081 18080 -5659 -29459 -52058 -71918 -87534 -97736 -101921 -100141
35865 -100141 -92999 -81408 -66405 -49050 -30357 -11203 7767 26148 43669 60052 74919 87819
35853 87819 98323 106148 111299 114193 115685 116877 118757 121803 125796 129912 133075 134382 133424 130381
35839 130381 125862 120644 115383 110457 105988 102035 98787 96573 95701 96236 97899 100104 102119 103214 102784
$$ packed form
35922A096134m5877m1038l7426l4628l2107k9211k5371k0300j4056o965N38Q053
35910H17746J5270K1988K8067L3365L7680M0688M1921M0807L6773K9354J8324
35899A161983L905j2982l0699m7234o0788p0235p5281p6384p4466p0636o5883
35888E81300o0928n6226n2015m8378m5243m2418l9631l6644l3344k9860k6574
35877A10039k4007k2579k2372k3001k3739k3800k2599j9860j5616j0202m185J780
35865a00141P142J1591J5003J7355J8693J9154J8970J8381J7521J6383J4867J2900
35853H7819J0504P825N151K894J492J192J880L046L993M116L163J307r58l043
35839A30381m519n218n261m926m469l953l248k214q72N35J663K205K015J095m30
$$ plain form
35824 102784 100390 95750 88719 79279 67549 53781 38375 21889 5038 -11347 -26408 -39382
35812 -39382 -49772 -57521 -63038 -67033 -70160 -72656 -74157 -73829 -70768 -64413 -54708 -42013 -26927 -10171
35798 -10171 7453 25113 41972 57263 70374 81003 89296 95898 101789 107945 114977 122942 131509
35785 131509 140325 149346 158916 169576 181821 195940 212062 230358 251284 275658 304497 338716
35773 338716 378859 425006 476831 533787 595256 660565 728856 798877 868848 936413 998677
35762 998677 1052344 1093996 1120588 1130067 1121924 1097407 1059235 1010885 955815 896903 836281 775445
35750 775445 715524 657526 602470 551360 505073 464270 429390 400699 378346 362407 352857 349551
35738 349551 352193 360305 373149 389610 408135 426859 443892 457646 467033 471498 470956 465738 456618
$$ packed form
35824A02784k394m640p031r440j1730j3768j5406j6486j6851j6385j5061j2974
35812c9382j0390p749n517l995l127k496j501L28L061O355R705J2695J5086J6756
35798a0171J7624J7660J6859J5291J3111J0629Q293O602N891O156P032P965Q567
35785A31509Q816R021R570J0660J2245J4119J6122J8296K0926K4374K8839L4219
35773C38716M0143M6147N1825N6956O1469O5309O8291P0021O9971O7565O2264
35762I98677N3667M1652K6592R479q143k4517l8172m8350n5070n8912o0622o0836
35750G75445n9921n7998n5056n1110m6287m0803l4880k8691k2353j5939r550l306
35738C49551K642Q112J2844J6461J8525J8724J7033J3754R387M465n42n218r120
$$ plain form
35725 456618 444833 432045 420228 411522 408092 411943 424627 446920 478595 518385 564149 613159
35713 613159 662434 709072 750524 784865 811011 828782 838803 842239 840549 835286 827947 819871
35701 819871 812141 805502 800311 796442 793211 789384 783354 773535 758793 738721 713608 684159 651201
35688 651201 615497 577755 538714 499165 459832 421219 383529 346723 310588 274774 238847
35677 238847 202429 165415 128088 91136 55585 22731 -5995 -29313 -46456 -57506 -63489 -66171
35665 -66171 -67656 -69950 -74642 -82732 -94574 -109881 -127795 -147050 -166211 -183997 -199525 -212418
35653 -212418 -222737 -230835 -237221 -242422 -246846 -250606 -253395 -254423 -252511 -246345 -234796 -217164 -193217
35640 -193217 -163097 -127148 -85782 -39366 11889 68057 129654 197726 273779 359550 456783
$$ packed form
35725D56618j1785j2788j1817q706l430L851J2684K2293L1675L9790M5764M9010
35713F13159M9275M6638M1452L4341K6146J7771J0021L436j690n263p339q076
35701H19871p730o639n191l869l231l827o030r819j4742k0072k5113k9449l2958
35688F51201l5704l7742l9041l9549l9333l8613l7690l6806l6135l5814l5927
35677B38847l6418l7014l7327l6952l5551l2854k8726k3318j7143j1050n983k682
35665f6171j485k294m692q090j1842j5307j7914j9255j9161j7786j5528j2893
35653b12418j0319q098o386n201m424l760k789j028J912O166J1549J7632K3947
35640a93217L0120L5949M1366M6416N1255N6168O1597O8072P6053Q5771R7233
$$ plain form
35629 456783 567165 692390 834233 994525 1175056 1377380 1602473 1850199 2118703 2403912
35619 2403912 2699402 2996741 3286342 3558683 3805675 4021851 4205149 4356998 4481772
35610 4481772 4585730 4675844 4758697 4839642 4922199 5007651 5094787 5179826 5256639 5317342 5353281
35599 5353281 5356340 5320413 5242751 5124757 4971905 4792729 4597221 4395164 4194940 4003001
35589 4003001 3823933 3660743 3515102 3387472 3277259 3183064 3103056 3035371 2978498 2931432
35579 2931432 2893617 2864659 2844035 2830884 2823945 2821629 2822168 2823800 2824910 2824078 2820136 2812215 2799848
35566 2799848 2783088 2762543 2739308 2714700 2689907 2665670 2642102 2618668 2594282 2567494 2536727
35555 2536727 2500537 2457905 2408464 2352587 2291293 2225963 2158046 2088808 2019250 1950154 1882191
$$ packed form
35629D56783J10382J25225J41843J60292J80531K02324K25093K47726K68504K85209
35619B403912K95490K97339K89601K72341K46992K16176J83298J51849J24774
35610D481772J03958R0114Q2853Q0945Q2557Q5452Q7136Q5039P6813O0703L5939
35599E353281L059l5927p7662j17994j52852j79176j95508k02057k00224j91939
35589D003001j79068j63190j45641j27630j10213r4195q0008o7685n6873m7066
35579B931432l7815k8958k0624j3151o939k316N39J632J110q32l942p921j2367
35566B799848j6760k0545k3235k4608k4793k4237k3568k3434k4386k6788l0767
35555B536727l6190m2632m9441n5877o1294o5330o7917o9238o9558o9096o7963
$$ plain form
35544 1882191 1816027 1752339 1691799 1635034 1582560 1534710 1491611 1453200 1419270 1389455 1363216
35533 1363216 1339874 1318706 1299035 1280312 1262157 1244380 1226931 1209871 1193359 1177694 1163314
35522 1163314 1150747 1140533 1133154 1129005 1128332 1131117 1136916 1144791 1153468 1161680 1168512 1173496 1176479 1177458
35508 1177458 1176508 1173861 1169995 1165666 1161840 1159520 1159561 1162496 1168439 1177093 1187811 1199740 1211959 1223568
35494 1223568 1233784 1242025 1247984 1251614 1253011 1252290 1249496 1244603 1237557 1228305 1216823 1203121 1187252
35481 1187252 1169367 1149744 1128827 1107255 1085852 1065545 1047232 1031723 1019788 1012201 1009606 1012274
35469 1012274 1019860 1031351 1045161 1059295 1071554 1079825 1082413 1078336 1067483 1050521 1028586 1002928
35457 1002928 974665 944746 914010 883265 853312 824930 798818 775561 755624 739381 727150
$$ packed form
35544A882191o6164o3688o0540n6765n2474m7850m3099l8411l3930k9815k6239
35533A363216k3342k1168j9671j8723j8155j7777j7449j7060j6512j5665j4380
35522A163314j2567j0214p379m149o73K785N799P875Q677Q212O832M984K983R79
35508A177458r50k647l866m329l826k320M1K935N943Q654J0718J1929J2219J1609
35494A223568J0216Q241N959L630J397p21k794m893p046r252j1482j3702j5869
35481A187252j7885j9623k0917k1572k1403k0307j8313j5509j1935p587k595K668
35469A012274P586J1491J3810J4134J2259Q271K588m077j0853j6962k1935k5658
35457A002928k8263k9919l0736l0745k9953k8382k6112k3257j9937j6243j2231
$$ plain form
35446 727150 719204 715822 717332 724131 736617 755091 779681 810298 846673 888430 935109 986069
35434 986069 1040358 1096656 1153412 1209117 1262552 1312869 1359534 1402240 1440903 1475780 1507501
35423 1507501 1536914 1564742 1591292 1616362 1639348 1659424 1675628 1686871 1691963 1689761 1679476 1661041
35411 1661041 1635341 1604173 1569911 1534990 1501365 1470169 1441661 1415406 1390545 1366020 1340799
35400 1340799 1314044 1285272 1254432 1221940 1188607 1155489 1123700 1094291 1068189 1046177 1028827
35389 1028827 1016405 1008783 1005396 1005297 1007259 1009898 1011802 1011710 1008781 1002821 994314 984219 973669 963758
35375 963758 955478 949722 947250 948573 953794 962519 973865 986551 999032 1009693 1017121 1020407 1019300
35362 1019300 1014185 1005855 995258 983262 970593 957852 945586 934227 923949 914583 905692 896775
$$ packed form
35446G27150p946l382J510O799J2486J8474K4590L0617L6375M1757M6679N0960
35434I86069N4289N6298N6756N5705N3435N0317M6665M2706L8663L4877L1721
35423A507501K9413K7828K6550K5070K2986K0076J6204J1243N092k202j0285j8435
35411A661041k5700l1168l4262l4921l3625l1196k8508k6255k4861k4525k5221
35400A340799k6755k8772l0840l2492l3333l3118l1789k9409k6102k2012j7350
35389A028827j2422p622l387r9J962K639J904r2k929n960q507j0095j0550r911
35375I63758q280n756k472J323N221Q725J1346J2686J2481J0661P428L286j107
35362A019300n115q330j0597j1996j2669j2741j2266j1359j0278r366q891q917
$$ plain form
35350 896775 887482 877749 867798 858050 848968 840920 834114 828543 824000 820138 816613 813257 810174 807699
35336 807699 806206 805862 806487 807618 808741 809545 810073 810735 812171 815019 819672 826123 833972 842548 851089
35321 851089 858940 865667 871098 875283 878450 880985 883400 886277 890178 895537 902519 910916 920127 929235
35307 929235 937139 942743 945179 943982 939141 931025 920264 907642 893975 879961 866064 852492 839242
35294 839242 826212 813348 800768 788783 777848 768524 761457 757305 756495 758923 763787 769694 774977
35281 774977 778078 777847 773690 765591 754125 740405 725966 712504 701563 694275 691199 692313 697098
35268 697098 704694 714029 723929 733249 741023 746617 749806 750743 749787 747232 743073 736987 728566 717691
35254 717691 704815 691021 677788 666588 658530 654218 653810 657181 664040 674003 686673 701686 718789
$$ packed form
35350H96775r293r733r951r748r082q048o806n571m543l862l525l356l083k475
35336H07699j493l44O25J131J123Q04N28O62J436K848M653O451P849Q576Q541
35321H51089P851O727N431M185L167K535K415K877L901N359O982Q397R211R108
35307I29235P904N604K436j197m841q116j0761j2622j3667j4014j3897j3572j3250
35294H39242j3030j2864j2580j1985j0935r324p067m152q10K428M864N907N283
35281G74977L101k31m157q099j1466j3720j4439j3462j0941p288l076J114M785
35268F97098P596R335R900R320P774N594L189R37r56k555m159o086q421j0875
35254G17691j2876j3794j3233j1200q058m312m08L371O859R963J2670J5013J7103
$$ plain form
35241 718789 737944 759393 783549 810699 840647 872530 904876 935872 963735 987035 1004854
35230 1004854 1016776 1022809 1023299 1018836 1010186 998257 984115 968978 954107 940621 929313 920536
35218 920536 914189 909839 906887 904721 902801 900717 898264 895469 892582 890043 888448 888432 890472 894700 900829
35203 900829 908206 915982 923373 929962 935847 941499 947416 953811 960520 967124 973166 978337 982549 985916
35189 985916 988656 990993 993087 995022 996882 998838 1001102 1003715 1006325 1008126 1008028 1004974 998281 987925
35175 987925 974635 959757 944903 931495 920350 911446 904001 896814 888731 878986 867303 853771
35163 853771 838618 822056 804307 785765 767138 749421 733759 721269 712865 709131 710239 715950
35151 715950 725590 738028 751705 764857 775845 783487 787264 787345 784447 779563 773689 767663 762107 757415
$$ packed form
35241G18789J9155K1449K4156K7150K9948L1883L2346L0996K7863K3300J7819
35230A004854J1922O033M90m463q650j1929j4142j5137j4871j3486j1308q777
35218I20536o347m350k952k166j920k084k453k795k887k539j595j6K040M228O129
35203I00829P377P776P391O589N885N652N917O395O709O604O042N171M212L367
35189I85916K740K337K094J935J860J956K264K613K610J801r8l054o693j0356
35175I87925j3290j4878j4854j3408j1145q904p445p187q083r745j1683j3532
35163H53771j5153j6562j7749j8542j8627j7717j5662j2490q404l734J108N711
35151G15950R640J2438J3677J3152J0988P642L777Q1k898m884n874o026n556m692
$$ plain form
35137 757415 753773 751223 749714 749145 749424 750533 752575 755710 760018 765401 771588 778252 785192 792452 800293
35122 800293 808990 818621 828987 839702 850341 860627 870571 880524 891091 902960 916743 932844
35110 932844 951361 972094 994673 1018731 1043947 1069969 1096313 1122347 1147381 1170799 1192163
35099 1192163 1211249 1227979 1242351 1254422 1264357 1272487 1279311 1285474 1291719 1298845 1307673 1319022 1333576
35086 1333576 1351625 1372786 1395893 1419117 1440280 1457265 1468417 1472855 1470569 1462307 1449298 1432874
35074 1432874 1414128 1393716 1371919 1348917 1325083 1301145 1278128 1257082 1238736 1223230 1210075
35063 1210075 1198260 1186436 1173134 1157009 1137093 1112949 1084697 1052923 1018472 982178 944677
35052 944677 906376 867536 828334 788914 749479 710442 672503 636584 603690 574786 550734
$$ packed form
35137G57415l642k550j509n69K79J109K042L135M308N383O187O664O940P260P841
35122H00293Q697R631J0366J0715J0639J0286R944R953J0567J1869J3783J6101
35110I32844J8517K0733K2579K4058K5216K6022K6344K6034K5034K3418K1364
35099A192163J9086J6730J4372J2071R935Q130O824O163O245P126Q828J1349J4554
35086A333576J8049K1161K3107K3224K1163J6985J1152M438k286q262j3009j6424
35074A432874j8746k0412k1797k3002k3834k3938k3017k1046j8346j5506j3155
35063A210075j1815j1824j3302j6125j9916k4144k8252l1774l4451l6294l7501
35052I44677l8301l8840l9202l9420l9435l9037l7939l5919l2894k8904k4052
$$ plain form
35041 550734 532295 520077 514380 514959 520886 530658 542524 554843 566372 576434 584988 592569 600139
35028 600139 608855 619822 633894 651579 673087 698404 727299 759258 793410 828501 862899 894709
35016 894709 922039 943367 957825 965309 966363 961916 953008 940605 925557 908603 890328 871066
35004 871066 850848 829454 806498 781570 754393 724956 693588 660958 628036 595982 565945
34993 565945 538838 515206 495232 478806 465651 455461 447998 443064 440311 438999 437846 435066 428645
34980 428645 416795 398417 373378 342542 307520 270217 232289 194779 158094 122208 86923
34969 86923 51984 17140 -17874 -53462 -90286 -129306 -171610 -218143 -269423 -325392 -385466 -448797
34957 -448797 -514549 -581994 -650382 -718727 -785635 -849142 -906625 -954768 -989703 -1007313 -1003720 -975903
$$ packed form
35041E50734j8439j2218n697N79N927R772J1866J2319J1529J0062Q554P581P570
35028F00139Q716J0967J4072J7685K1508K5317K8895L1959L4152L5091L4398L1810
35016H94709K7330K1328J4458P484J054m447q908j2403j5048j6954j8275j9262
35004H71066k0218k1394k2956k4928k7177k9437l1368l2630l2922l2054l0037
34993E65945k7107k3632j9974j6426j3155j0190p463m934k753j312j153k780o421
34980D28645j1850j8378k5039l0836l5022l7303l7928l7510l6685l5886l5285
34969H6923l4939l4844l5014l5588l6824l9020m2304m6533n1280n5969o0074o3331
34957d48797o5752o7445o8388o8345o6908o3507n7483m8143l4935j7610L593K7817
$$ plain form
34945 -975903 -922305 -843182 -740651 -618481 -481703 -335999 -186952 -39311 103534 239768
34935 239768 369023 492075 610533 726711 843599 964724 1093741 1233801 1386778 1552557
34925 1552557 1728637 1910296 2091335 2265109 2425539 2567817 2688799 2787042 2862651 2917035
34915 2917035 2952611 2972422 2979740 2977722 2969238 2956799 2942540 2928279 2915539 2905505 2898926 2896129
34903 2896129 2897132 2901753 2909639 2920209 2932612 2945730 2958279 2969012 2976936 2981427 2982249 2979526 2973723
34890 2973723 2965560 2955889 2945646 2935962 2928303 2924506 2926619 2936537 2955501 2983707 3020259 3063465 3111253
34877 3111253 3161505 3212206 3261499 3307661 3349091 3384389 3412556 3433129 3446212 3452429 3452832 3448753
34865 3448753 3441581 3432552 3422613 3412405 3402306 3392519 3383150 3374220 3365722 3357785 3350852 3345689 3343181
$$ packed form
34945i75903N3598P9123J02531J22170J36778J45704J49047J47641J42845J36234
34935B39768J29255J23052J18458J16178J16888J21125J29017J40060J52977J65779
34925A552557J76080J81659J81039J73774J60430J42278J20982R8243P5609N4384
34915B917035L5576J9811P318k018q484j2439j4259j4261j2740j0034o579k797
34903B896129J003M621P886J0570J2403J3118J2549J0733P924M491Q22k723n803
34890B973723q163r671j0243r684p659l797K113R918J8964K8206L6552M3206M7788
34877C111253N0252N0701M9293M6162M1430L5298K8167K0573J3083O217M03m079
34865C448753p172r029r939j0208j0099r787r369q930q498p937o933n163k508
$$ plain form
34852 3343181 3344086 3348926 3358023 3371572 3389695 3412408 3439499 3470409 3504266 3540039 3576680 3613155
34840 3613155 3648505 3682008 3713331 3742543 3769983 3796087 3821258 3845787 3869884 3893789 3917876
34829 3917876 3942732 3969204 3998389 4031517 4069711 4113782 4164118 4220634 4282775 4349657 4420333
34818 4420333 4494131 4570825 4650666 4734277 4822561 4916744 5018559 5130326 5254756 5394555
34808 5394555 5552181 5729873 5929770 6153924 6404206 6682246 6989427 7326885 7695546
34799 7695546 8096055 8528544 8992145 9484294 9999675 10528702 11055734 11557658 12003864
34790 12003864 12358697 12587054 12662431 12574617 12333367 11965987 11510089 11005026 10485229 9976818
34780 9976818 9497153 9056218 8658653 8305590 7995966 7727412 7496817 7300668 7135267
$$ packed form
34852C343181R05M840R097J3549J8123K2713K7091L0910L3857L5773L6641L6475
34840C613155L5350L3503L1323K9212K7440K6104K5171K4529K4097K3905K4087
34829C917876K4856K6472K9185L3128L8194M4071N0336N6516O2141O6882P0676
34818D420333P3798P6694P9841Q3611Q8284R4183J01815J11767J24430J39799
34808E394555J57626J77692J99897K24154K50282K78040L07181L37458L68661
34799G695546M00509M32489M63601M92149N15381N29027N27032N01924M46206
34790A2003864L54833K28357P5377q7814k41250l67380m55898n05063n19797n08411
34780I976818m79665m40935l97565l53063l09624k68554k30595j96149j65401
$$ plain form
34771 7135267 6996948 6882323 6788488 6713153 6654715 6612229 6585302 6573991 6578751 6600252 6639008
34760 6639008 6694940 6767162 6854065 6953570 7063490 7181908 7307493 7439632 7578412 7724458
34750 7724458 7878699 8042060 8215345 8399398 8595360 8804728 9029131 9269967 9528079
34741 9528079 9803559 10095751 10403487 10725413 11060321 11407495 11767121 12140569 12530408
34732 12530408 12940136 13373897 13836193 14331633 14864744 15439990 16061922 16735333 17465451
34723 17465451 18258346 19121370 20063398 21094784 22227304 23474199 24850305 26372189
34715 26372189 28058402 29929674 32008931 34321140 36893294 39754501 42935920 46470464
34707 46470464 50392349 54736123 59534174 64811759 70578897 76818266 83468091 90400333
$$ packed form
34771G135267j38319j14625r3835p5335n8438m2486k6927j1311M760K1501L8756
34760F639008N5932P2222Q6903R9505J09920J18418J25585J32139J38780J46046
34750G724458J54241J63361J73285J84053J95962K09368K24403K40836K58112
34741I528079K75480K92192L07736L21926L34908L47174L59626L73448L89839
34732A2530408M09728M33761M62296M95440N33111N75246O21932O73411P30118
34723A7465451P92895Q63024R42028J031386J132520J246895J376106J521884
34715B6372189J686213J871272K079257K312209K572154K861207L181419L534544
34707D6470464L921885M343774M798051N277585N767138O239369O649825O932242
$$ plain form
34699 90400333 97397345 104133903 110176704 115017721 118153094 119197595 117994740 114669842
34691 114669842 109596410 103292893 96300473 89090025 82017374 75318864 69129491 63509028
34683 63509028 58467146 53983165 50019744 46532004 43473408 40799011 38466980 36439432
34675 36439432 34682962 33168525 31870861 30768106 29841740 29076444 28459755 27981871 27635541
34666 27635541 27415704 27318877 27342824 27486499 27749838 28133282 28637374 29262352 30007229 30868100
34656 30868100 31835968 32894090 34014681 35155640 36259103 37254103 38065119 38626572 38899807
34647 38899807 38885457 38624457 38186912 37654707 37105637 36603576 36195079 35910702 35768665
34638 35768665 35778722 35945175 36269220 36750868 37390264 38188420 39147965 40274049 41574868
$$ packed form
34699I0400333O997012O736558O042801M841017L135373J044501j202855l324898
34691A14669842n073432o303517o992420p210448p072651o698510o189373n620463
34683F3509028n041882m483981l963421l487740l058596k674397k332031k027548
34675C6439432j756470j514437j297664j102755r26366p65296o16689m77884l46330
34666B7635541k19837r6827K3947J43675K63339L83444N04092O24978P44877Q60871
34656C0868100R67868J058122J120591J140959J103463R95000Q11016N61453K73235
34647C8899807j4350k61000m37545n32205n49070n02061m08497k84377j42037
34638C5768665J0057J66453L24045M81648O39396P98156R59545J126084J300819
$$ plain form
34629 41574868 43061578 44748265 46652295 48794586 51199576 53895420 56914642 60294693
34621 60294693 64078139 68313074 73053817 78361180 84302113 90949431 98381934 106684067
34613 106684067 115944837 126256388 137711110 150393997 164367272 179645323 196157520
34606 196157520 213696423 231854096 249958701 267035437 281830416 292943144 299085689
34599 299085689 299411682 293780026 282815455 267728506 249989348 231008976 211935528
34592 211935528 193583968 176458427 160817455 146747520 134226183 123168513 113458518
34585 113458518 104969788 97578109 91167984 85635686 80890765 76856294 73467846 70672120
34577 70672120 68425950 66695551 65455828 64689970 64389210 64552120 65183280 66292014 67891593
$$ packed form
34629D1574868J486710J686687J904030K142291K404990K695844L019222L380051
34621F0294693L783446M234935M740743N307363N940933O647318P432503Q302133
34613A06684067R260770J0311551J1454722J2682887J3973275J5278051J6512197
34606A96157520J7538903J8157673J8104605J7076736J4794979J1112728O142545
34599B99085689L25993n631656j0964571j5086949j7739158j8980372j9073448
34592B11935528j8351560j7125541j5640972j4069935j2521337j1057670r709995
34585A13458518q488730p391679o410125n532298m744921m034471l388448k795726
34577G0672120k246170j730399j239723p65858l00760J62910O31160J108734J599579
$$ plain form
34568 67891593 69998591 72632072 75812215 79557332 83877880 88766423 94182945 100035104
34560 100035104 106154509 112273582 118012426 122890429 126378725 127998398 127441867 124667381
34552 124667381 119917241 113648102 106409574 98727313 91028921 83618410 76684403 70324135
34544 70324135 64570520 59415276 54825945 50757638 47160905 43986578 41188375 38724298
34536 38724298 36557337 34655508 32991488 31542335 30289296 29217335 28314426 27571032
34528 27571032 26979837 26535413 26233784 26072213 26049226 26164577 26419041 26814169 27351771
34519 27351771 28032713 28854838 29810076 30880579 32033761 33217040 34354118 35345586 36077102
34510 36077102 36437321 36342989 35762266 34724967 33314124 31643330 29830766 27979519 26167935
$$ packed form
34568F7891593K106998K633481L180143L745117M320548M888543N416522N852159
34560A00035104O119405O119073N738844M878003L488296J619673n56531k774486
34552A24667381m750140o269139p238528p682261p698392p410511o934007o360268
34544G0324135n753615n155244m589331m068307l596733l174327k798203k464077
34536C8724298k166961j901829j664020j449153j253039j071961r02909p43394
34528B7571032n91195m44424l01629j61571k2987J15351K54464L95128N37602
34519B7351771O80942Q22125R55238J070503J153182J183279J137078R91468P31516
34510C6077102L60219r4332n80723j037299j410843j670794j812564j851247j811584
$$ plain form
34501 26167935 24448465 22851417 21390413 20067638 18878119 17812891 16861124 16011413
34493 16011413 15252526 14573915 13966076 13420744 12930979 12491159 12096857 11744541 11431215
34484 11431215 11154117 10910549 10697838 10513403 10354866 10220151 10107501 10015429 9942646 9887952
34474 9887952 9850161 9828087 9820654 9826997 9846523 9878938 9924259 9982761 10054805 10140661 10240408 10354004
34462 10354004 10481460 10623058 10779537 10952116 11142338 11351868 11582402 11835783 12114189
34453 12114189 12420250 12757075 13128174 13537317 13988383 14485318 15032231 15633485 16293730
34444 16293730 17017944 17811652 18681321 19634865 20682194 21835721 23110596 24524604 26097898
34435 26097898 27852770 29813476 32006020 34457947 37198220 40257068 43665702 47455953
$$ packed form
34501B6167935j719470j597048j461004j322775j189519j065228r51767q49711
34493A6011413p58887o78611o07839n45332m89765m39820l94302l52316l13326
34484A1431215k77098k43568k12711j84435j58537j34715j12650r2072p2783n4694
34474I887952l7791k2074p433O343J9526L2415M5321N8502P2044Q5856R9747J13596
34462A0354004J27456J41598J56479J72579J90222K09530K30534K53381K78406
34453A2114189L06061L36825L71099M09143M51066M96935N46913O01254O60245
34444A6293730P24214P93708Q69669R53544J047329J153527J274875J414008J573294
34435B6097898J754872J960706K192544K451927K740273L058848L408634L790251
$$ plain form
34427 47455953 51659641 56306762 61421401 67014487 73072523 79541288 86304529 93160309
34419 93160309 99801494 105811704 110692583 113935456 115131917 114087947 110888775 105878740
34411 105878740 99565521 92496487 85158353 77924739 71046962 64670532 58861414 53632009
34403 53632009 48961934 44812696 41137649 37888531 35019251 32487648 30256244 28292470
34395 28292470 26568309 25059591 23745434 22607929 21631735 20803570 20111949 19547264 19101926
34386 19101926 18770372 18548958 18435617 18429240 18528983 18733832 19042261 19451474 19955914 20545049
34376 20545049 21200480 21892518 22577096 23194552 23672414 23934137 23913951 23573965 22916177
34367 22916177 21982870 20844916 19583911 18275962 16981812 15743731 14587125 13524335
$$ packed form
34427D7455953M203688M647121N114639N593086O058036O468765O763241O855780
34419I3160309O641185O010210M880879L242873J196461j043970l199172n010035
34411A05878740o313219p069034p338134p233614o877777o376430n809118n229405
34403E3632009m670075m149238l675047l249118k869280k531603k231404j963774
34395B8292470j724161j508718j314157j137505r76194q28165o91621n64685m45338
34386A9101926l31554k21414j13341o377R9743K04849L08429M09213N04440N89135
34376B0545049O55431O92038O84578O17456M77862K61723k0186l39986o57788
34367B2916177r33307j137954j261005j307949j294150j238081j156606j062790
$$ plain form
34359 13524335 12558643 11687524 10905034 10203530 9574806 9010771 8503901 8047577 7636194
34350 7636194 7265018 6930011 6627691 6354959 6108802 5886122 5683819 5499014 5329228
34341 5329228 5172495 5027403 4893006 4768607 4653616 4547506 4449820 4360161 4278224 4203893
34331 4203893 4137236 4078343 4027137 3983279 3946122 3914691 3887745 3863948 3842025 3820866 3799612
34320 3799612 3777713 3754842 3730678 3704764 3676546 3645486 3611150 3573314 3532139 3488303 3443004
34309 3443004 3397855 3354694 3315330 3281269 3253549 3232736 3218939 3211811 3210597 3214285 3221744 3231815
34297 3231815 3243370 3255431 3267229 3278238 3288172 3296978 3304717 3311342 3316522 3319562 3319380 3314458 3302888
34284 3302888 3282505 3251043 3206183 3145632 3067330 2969745 2852190 2715130 2560473 2391728
$$ packed form
34359A3524335r65692q71119p82490p01504o28724n64035n06870m56324m11383
34350G636194l71176l35007l02320k72732k46157k22680k02303j84805j69786
34341E329228j56733j45092j34397j24399j14991j06110r7686q9659q1937p4331
34331D203893o6657n8893n1206m3858l7157l1431k6946k3797k1923k1159k1254
34320C799612k1899k2871k4164k5914k8218l1060l4336l7836m1175m3836m5299
34309C443004m5149m3161l9364l4061k7720k0813j3797p128j214L688P459J0071
34297C231815J1555J2061J1798J1009R934Q806P739O625N180L040j82m922j1570
34284C302888k0383l1462m4860o0551p8302r7585j17555j37060j54657j68745
$$ plain form
34274 2391728 2213956 2033441 1857071 1691424 1541770 1411258 1300582 1208149 1130643 1063852
34264 1063852 1003567 946289 889680 832781 776145 721830 673273 635045 612495 611277 636700
34253 636700 693065 783131 907904 1066814 1258319 1480639 1732346 2012609 2321161 2658113
34243 2658113 3023730 3418239 3841704 4293849 4773591 5278105 5801459 6332977 6855607
34234 6855607 7344785 7768735 8091349 8278255 8305067 8164812 7870896 7453840 6953302 6409263
34224 6409263 5855646 5317469 4810811 4344291 3921071 3540689 3200452 2896460 2624409
34215 2624409 2380173 2160101 1961093 1780612 1616672 1467743 1332606 1210237 1099748
34206 1099748 1000333 911258 831875 761600 699849 645972 599264 559020 524579 495341 470746
$$ packed form
34274B391728j77772j80515j76370j65647j49654j30512j10676r2433p7506o6791
34264A063852o0285n7278n6609n6899n6636n4315m8557l8228k2550j218K5423
34253F36700N6365R0066J24773J58910J91505K22320K51707K80263L08552L36952
34243B658113L65617L94509M23465M52145M79742N04514N23354N31518N22630
34234F855607M89178M23950L22614J86906K6812j40255k93916m17056n00538n44039
34224F409263n53617n38177n06658m66520m23220l80382l40237l03992k72051
34215B624409k44236k20072j99008j80481j63940j48929j35137j22369j10489
34206A099748r9415q9075p9383p0275o1751n3877m6708m0244l4441k9238k4595
$$ plain form
34195 470746 450186 432896 417987 404663 392471 381424 371911 364469 359494 357046 356852 358515 361712
34182 361712 366226 371863 378390 385540 393030 400564 407828 414463 420009 423934 425789 425400 422966 419033
34168 419033 414413 410075 407042 406350 409072 416296 428982 447794 472968 504249 540873 581624 625005
34155 625005 669461 713580 756249 796744 834720 870101 902957 933472 961945 988684 1013810
34144 1013810 1037057 1057707 1074752 1087288 1094992 1098469 1099253 1099471 1101311 1106434 1115567 1128478 1144375
34131 1144375 1162491 1182486 1204521 1228977 1256010 1285141 1315158 1344376 1371079 1393835 1411641
34120 1411641 1423954 1430681 1432092 1428647 1420864 1409305 1394665 1377895 1360196 1342798 1326563 1311662
34108 1311662 1297495 1282890 1266478 1247113 1224226 1198012 1169293 1139204 1108782 1078604 1048573
$$ packed form
34195D70746k0560j7290j4909j3324j2192j1047r513p442m975k448j94J663L197
34182C61712M514N637O527P150P490P534P264O635N546L925J855l89k434l933
34168D19033m620m338l033o92K722P224J2686J8812K5174L1281L6624M0751M3381
34155F25005M4456M4119M2669M0495L7976L5381L2856L0515K8473K6739K5126
34144A013810K3247K0650J7045J2536P704L477P84K18J840N123R133J2911J5897
34131A144375J8116J9995K2035K4456K7033K9131L0017K9218K6703K2756J7806
34120A411641J2313O727J411l445p783j1559j4640j6770j7699j7398j6235j4901
34108A311662j4167j4605j6412j9365k2887k6214k8719l0089l0422l0178l0031
$$ plain form
34097 1048573 1017904 985373 949678 909775 865106 815781 762654 707274 651702 598205 548885
34086 548885 505261 467968 436679 410279 387187 365743 344606 322999 300749 278149 255793
34075 255793 234419 214803 197637 183506 172876 166120 163503 165164 171066 180935 194179 209903
34063 209903 226969 244104 260053 273786 284691 292683 298130 301686 304044 305713 306916 307678 308071
34050 308071 308462 309637 312690 318717 328457 342103 359347 379555 401849 425079 447825 468507 485569
34037 485569 497681 503970 504248 499150 490069 478923 467790 458530 452501 450424 452340 457681 465457 474562
34023 474562 484058 493349 502211 510768 519379 528452 538245 548787 559927 571401 582847 593827 603873
34010 603873 612547 619492 624466 627287 627723 625390 619785 610473 597336 580727 561524 541020 520676
$$ packed form
34097A048573l0669l2531l5695l9903m4669m9325n3127n5380n5572n3497m9320
34086E48885m3624l7293l1289k6400k3092k1444k1137k1607k2250k2600k2356
34075B55793k1374j9616j7166j4131j0630o756k617J661N902R869J3244J5724
34063B09903J7066J7135J5949J3733J0905P992N447L556K358J669J203P62L93
34050C08071L91J175L053O027R740J3646J7244K0208K2294K3230K2746K0682J7062
34037D85569J2112O289K78n098r081j1146j1133r260o029k077J916N341P776R105
34023D74562R496R291Q862Q557Q611R073R793J0542J1140J1474J1446J0980J0046
34010F03873Q674O945M974K821M36k333n605r312j3137j6609j9203k0504k0344
$$ plain form
33997 520676 501779 485127 470865 458546 447414 436794 426377 416241 406591 397485 388719 379940
33985 379940 370916 361815 353312 346430 342214 341393 344258 350717 360434 372948 387669 403805 420362
33972 420362 436307 450816 463512 474575 484749 495161 506948 520799 536651 553687 570675
33961 570675 586427 600209 611908 621901 630732 638809 646219 652704 657767 660936 662077 661596 660435 659850
33947 659850 661054 664897 671677 681215 693051 706550 720925 735233 748515 759987 769118 775589 779222
33934 779222 779991 778110 774107 768794 763093 757778 753287 749671 746721 744157 741787 739571 737550 735746
33920 735746 734049 732150 729511 725428 719242 710574 699442 686176 671199 654850 637311 618685 599102
33907 599102 578774 557909 536546 514428 491036 465785 438308 408777 378061 347626 319109
$$ packed form
33997E20676j8897j6652j4262j2319j1132j0620j0417j0136r650r106q766q779
33985C79940r024r101q503o882m216q21K865O459R717J2514J4721J6136J6557
33972D20362J5945J4509J2696J1063J0174J0412J1787J3851J5852J7036J6988
33961E70675J5752J3782J1699R993Q831Q077P410O485N063L169J141m81j161n85
33947F59850J204L843O780R538J1836J3499J4375J4308J3282J1472R131O471L633
33934G79222P69j881m003n313n701n315m491l616k950k564k370k216k021j804
33920G35746j697j899k639m083o186q668j1132j3266j4977j6349j7539j8626j9583
33907E99102k0328k0865k1363k2118k3392k5251k7477k9531l0716l0435k8517
$$ plain form
33896 319109 293769 272151 254115 239189 226960 217302 210338 206279 205230 207088 211527 218093 226331
33883 226331 235856 246353 257554 269303 281633 294795 309112 324787 341738 359578 377688 395375
33871 395375 411995 426996 439919 450388 458134 463027 465140 464778 462473 458898 454789 450917 448105
33858 448105 447186 448882 453640 461526 472191 484982 499135 514006 529170 544397 559527 574373
33846 574373 588719 602442 615688 628966 643020 658542 675870 694868 714988 735487 755671
33835 755671 775089 793572 811140 827820 843540 858084 871158 882513 892051 899825 905936 910437
33823 910437 913293 914430 913792 911439 907635 902923 898105 894138 891901 891936 894254 898320 903248 908044 911848
33808 911848 914082 914553 913432 911187 908442 905805 903668 902047 900567 898597 895496 890868 884808 877996
$$ packed form
33896C19109k5340k1618j8036j4926j2229r658o964m059j049J858M439O566Q238
33883B26331R525J0497J1201J1749J2330J3162J4317J5675J6951J7840J8110J7687
33871C95375J6620J5001J2923J0469P746M893K113l62k305l575m109l872k812
33858D48105r19J696M758P886J0665J2791J4153J4871J5164J5227J5130J4846
33846E74373J4346J3723J3246J3278J4054J5522J7328J8998K0120K0499K0184
33835G55671J9418J8483J7568J6680J5720J4544J3074J1355R538P774O111M501
33823I10437K856J137o38k353l804m712m818l967k237L5K318M066M928M796L804
33808I11848K234M71j121k245k745k637k137j621j480j970l101m628o060o812
$$ plain form
33794 877996 871571 866807 864732 865880 870224 877314 886492 897062 908254 919094 928334 934610 936740
33781 936740 934045 926602 915355 901997 888627 877272 869451 865890 866513 870725 877859 887520 899619
33768 899619 914139 930865 949219 968323 987241 1005319 1022388 1038731 1054874 1071298 1088255
33757 1088255 1105705 1123378 1140961 1158294 1175488 1192941 1211286 1231262 1253525 1278463 1306114
33746 1306114 1336176 1368105 1401224 1434838 1468321 1501104 1532590 1562085 1588810 1612090 1631613
33735 1631613 1647615 1660874 1672466 1683494 1694936 1707567 1721882 1738012 1755731 1774604 1794185
33724 1794185 1814165 1834442 1855098 1876269 1898017 1920271 1942895 1965804 1989005 2012564 2036548
33713 2036548 2061001 2085953 2111514 2137967 2165787 2195567 2227850 2263016 2301206 2342302 2385909
$$ packed form
33794H77996o425m764k075J148M344P090R178J0570J1192J0840R240O276K130
33781I36740k695p443j1247j3358j3370j1355p821l561O23M212P134R661J2099
33768H99619J4520J6726J8354J9104J8918J8078J7069J6343J6143J6424J6957
33757A088255J7450J7673J7583J7333J7194J7453J8345J9976K2263K4938K7651
33746A306114L0062L1929L3119L3614L3483L2783L1486K9495K6725K3280J9523
33735A631613J6002J3259J1592J1028J1442J2631J4315J6130J7719J8873J9581
33724A794185J9980K0277K0656K1171K1748K2254K2624K2909K3201K3559K3984
33713B036548K4453K4952K5561K6453K7820K9780L2283L5166L8190M1096M3607
$$ plain form
33702 2385909 2431326 2477528 2523224 2566953 2607213 2642562 2671679 2693435 2707043 2712329 2710012 2701777
33690 2701777 2690030 2677337 2665831 2656868 2651019 2648259 2648223 2650346 2653900 2657986 2661614 2663940 2664606 2663992
33676 2663992 2663279 2664321 2669412 2680975 2701228 2731926 2774230 2828724 2895572 2974789 3066531 3171262
33664 3171262 3289746 3422953 3572014 3738264 3923358 4129314 4358479 4613394 4896658
33655 4896658 5210906 5558874 5943506 6368017 6836011 7351657 7919767 8545709 9235223
33646 9235223 9994246 10828582 11743189 12740851 13820138 14972460 16178190 17402269 18590427
33637 18590427 19667990 20544308 21125576 21335469 21137149 20546278 19627668 18477031 17197158
33628 17197158 15878707 14590482 13378055 12267210 11269126 10385427 9612077 8941911 8366191
$$ packed form
33702B385909M5417M6202M5696M3729M0260L5349K9117K1756J3608N286k317q235
33690B701777j1747j2693j1506q963n849k760l6K123L554M086L628K326O66o14
33676B663992p13J042N091J1563K0253L0698M2304N4494O6848P9217R1742J04731
33664C171262J18484J33207J49061J66250J85094K05956K29165K54915K83264
33655D896658L14248L47968L84632M24511M67994N15646N68110O25942O89514
33646I235223P59023Q34336R14607R97662J079287J152322J205730J224079J188158
33637A8590427J077563Q76318N81268K09893j98320n90871r18610j150637j279873
33628A7197158j318451j288225j212427j110845r98084q83699p73350o70166n75720
$$ plain form
33619 8366191 7875657 7461250 7114592 6828294 6596154 6413159 6275260 6179054 6121449 6099237
33609 6099237 6108601 6144650 6201123 6270316 6343224 6409965 6460505 6485641 6478128 6433749 6352014 6236161
33597 6236161 6092374 5928476 5752534 5571645 5391128 5214128 5041614 4872584 4704330
33588 4704330 4532765 4352875 4159387 3947696 3715009 3461450 3190640 2909374 2626454
33579 2626454 2351077 2091354 1853350 1640756 1455109 1296300 1163149 1053873 966394 898496
33569 898496 847901 812343 789680 777944 775274 779819 789646 802740 817059 830601 841445 847748
33557 847748 847788 840142 823995 799400 767346 729609 688512 646653 606597 570536 539908 515071
33545 515071 495203 478508 462713 445639 425631 401754 373806 342209 307823 271741 235061
$$ packed form
33619H366191m90534m14407l46658k86298k32140j82995j37899r6206n7605k2212
33609F099237R364L6049N6473O9193P2908O6741N0540K5136p513m4379q1735j15853
33597F236161j43787j63898j75942j80889j80517j77000j72514j69030j68254
33588D704330j71565j79890j93488k11691k32687k53559k70810k81266k82920
33579B626454k75377k59723k38004k12594j85647j58809j33151j09276q7479o7898
33569H98496n0595l5558k2663j1736k670M545R827J3094J4319J3542J0844O303
33557H47748M0p646j6147k4595l2054l7737m1097m1859m0056l6061l0628k4837
33545E15071j9868j6695j5795j7074k0008k3877k7948l1597l4386l6082l6680
$$ plain form
33534 235061 198669 163049 128252 94004 59927 25721 -8726 -43295 -77643 -111269 -143555
33523 -143555 -173833 -201472 -226038 -247390 -265626 -280922 -293412 -303182 -310391 -315398 -318852 -321643
33511 -321643 -324713 -328790 -334212 -340929 -348601 -356666 -364299 -370337 -373337 -371838 -364751 -351631 -332739 -308896
33497 -308896 -281295 -251378 -220751 -191058 -163777 -139943 -119970 -103658 -90433 -79588 -70464 -62493
33485 -62493 -55218 -48308 -41539 -34738 -27729 -20335 -12407 -3897 5082 14254 23239 31620 38985 44949
33471 44949 49194 51516 51797 49954 45884 39540 31093 21137 10790 1590 -4819 -6998 -3873 5286
33457 5286 20938 43275 72230 107434 148135 193058 240292 287343 331442 370058 401430 424880
33445 424880 440743 450043 454098 454258 451748 447626 442773 437924 433718 430715 429381 430038 432826 437757
$$ packed form
33534B35061l6392l5620l4797l4248l4077l4206l4447l4569l4348l3626l2286
33523a43555l0278k7639k4566k1352j8236j5296j2490r770p209n007l454k791
33511c21643l070m077n422o717p672q065p633o038l000J499P087J3120J8892K3843
33497c08896K7601K9917L0627K9693K7281K3834J9973J6312J3225J0845R124P971
33485f2493P275O910O769O801P009P394P928Q510Q979R172Q985Q381P365N964
33471D4949M245K322K81j843m070o344q447r956j0347r200o409k179L125R159
33457E286J5652K2337K8955L5204M0701M4923M7234M7051M4099L8616L1372K3450
33445D24880J5863R300M055J60k510m122m853m849m206l003j334O57K788M931
$$ plain form
33431 437757 444859 454332 466577 482082 501200 523990 550184 579262 610577 643410 676914 710000
33419 710000 741256 769003 791513 807364 815802 816991 812028 802722 791162 779175 767851 757339
33407 757339 746975 735638 722057 704976 683193 655603 621289 579698 530846 475450 414910
33396 414910 351092 286016 221551 159214 100107 44905 -6133 -53159 -96642 -137159 -175107
33385 -175107 -210518 -243036 -272032 -296823 -316888 -332049 -342497 -348686 -351149 -350315 -346381 -339274 -328725
33372 -328725 -314391 -295986 -273350 -246488 -215565 -180848 -142631 -101158 -56603 -9099 41212
33361 41212 94138 149418 206744 265740 325856 386201 445336 501074 550396 589644 615140 624077
33349 624077 615309 589671 549696 498933 441147 379717 317351 256103 197525 142777 92640 47463
$$ packed form
33431D37757P102R473J2245J5505J9118K2790K6194K9078L1315L2833L3504L3086
33419G10000L1256K7747K2510J5851Q438J189m963r306j1560j1987j1324j0512
33407G57339j0364j1337j3581j7081k1783k7590l4314m1591m8852n5396o0540
33396D14910o3818o5076o4465o2337n9107n5202n1038m7026m3483m0517l7948
33385a75107l5411l2518k8996k4791k0065j5161j0448o189k463Q34L934P107J0549
33372c28725J4334J8405K2636K6862L0923L4717L8217M1473M4555M7504N0311
33361D1212N2926N5280N7326N8996O0116O0345N9135N5738M9322L9248K5496Q937
33349F24077q768k5638l9975n0763n7786o1430o2366o1248n8578n4748n0137m5177
$$ plain form
33337 47463 7140 -28842 -61275 -91072 -119172 -146449 -173645 -201260 -229482 -258169 -286919 -315167
33325 -315167 -342301 -367757 -391071 -411940 -430300 -446402 -460804 -474249 -487468 -500970 -514913
33314 -514913 -529094 -543082 -556387 -568534 -579036 -587363 -592987 -595479 -594583 -590218 -582445 -571370 -557055
33301 -557055 -539455 -518449 -493942 -465971 -434751 -400671 -364262 -326184 -287214 -248151 -209632
33290 -209632 -171901 -134733 -97521 -59504 -19998 21517 65457 112278 162567 217026 276383
33279 276383 341334 412572 490853 577051 672145 777164 893073 1020741 1160999 1314714
33269 1314714 1482792 1666056 1865165 2080620 2312827 2561949 2827363 3106651 3394284
33260 3394284 3680365 3949974 4183768 4360477 4461186 4474187 4398321 4243172 4026179 3768205
$$ packed form
33337D7463m0323l5982l2433k9797k8100k7277k7196k7615k8222k8687k8750k8248
33325c15167k7134k5456k3314k0869j8360j6102j4402j3445j3219j3502j3943
33314e14913j4181j3988j3305j2147j0502q327n624k492Q96M365P773J1075J4315
33301e57055J7600K1006K4507K7971L1220L4080L6409L8078L8970L9063L8519
33290b09632L7731L7168L7212L8017L9506M1515M3940M6821N0289N4459N9357
33279B76383O4951P1238P8281Q6198R5094J05019J15909J27668J40258J53715
33269A314714J68078J83264J99109K15455K32207K49122K65414K79288K87633
33260C394284K86081K69609K33794J76709J00709J3001p5866j55149k16993k57974
$$ plain form
33250 3768205 3489420 3206591 2931910 2673021 2433806 2215471 2017558 1838786 1677654
33241 1677654 1532846 1403427 1288844 1188783 1102887 1030449 970237 920603 879760 846099
33231 846099 818367 795689 777455 763125 752111 743795 737642 733323 730800 730386 732795 739089 750521
33218 750521 768267 793047 824679 861634 900758 937370 965873 980862 978394 956926 917515 863289
33206 863289 798499 727571 654397 581987 512434 447066 386616 331329 281000 235003 192359
33195 192359 151904 112567 73698 35264 -2127 -37390 -69204 -96302 -117729 -133059 -142525 -146992
33183 -146992 -147746 -146141 -143262 -139778 -135995 -131997 -127773 -123286 -118507 -113408 -107983 -102277 -96402 -90450
33169 -90450 -84376 -77987 -71067 -63611 -55987 -48946 -43441 -40373 -40375 -43703 -50229 -59467 -70646 -82850 -95198
$$ packed form
33250C768205k78785k82829k74681k58889k39215k18335j97913j78772j61132
33241A677654j44808j29419j14583j00061q5896p2438o0212m9634m0843l3661
33231H46099k7732k2678j8234j4330j1014q316o153m319k523m14K409O294J1432
33218G50521J7746K4780L1632L6955L9124L6612K8503J4989k468k1468l9411n4226
33206H63289o4790p0928p3174p2410o9553o5368o0450n5287n0329m5997m2644
33195A92359m0455l9337l8869l8434l7391l5263l1814k7098k1427j5330r466m467
33183a46992p54J605K879L484L783L998M224M487M779N099N425N706N875N952
33169i0450O074O389O920P456P624P041N505L068kl328o526r238j1179j2204j2348
$$ plain form
33154 -95198 -106974 -117669 -126986 -134863 -141518 -147451 -153375 -160078 -168250 -178338 -190488 -204556 -220176
33141 -220176 -236851 -254027 -271160 -287749 -303335 -317461 -329659 -339500 -346727 -351432 -354128 -355692
33129 -355692 -357136 -359344 -362867 -367922 -374591 -383028 -393459 -405969 -420204 -435244 -449684 -461840 -469980
33116 -469980 -472554 -468431 -457113 -438844 -414536 -385572 -353553 -320111 -286814 -255048 -225872 -199895
33104 -199895 -177308 -158000 -141720 -128074 -116465 -106041 -95811 -84918 -72909 -59810 -45948
33093 -45948 -31669 -17119 -2184 13519 30617 49918 72296 98546 129284 164914 205631 251422
33081 251422 302046 357024 415668 477081 540097 603099 663820 719286 766013 800546 820139
33070 820139 823415 810651 783600 744959 697747 644852 588801 531721 475384 421239 370458 323997
$$ packed form
33154i5198j1776j0695r317p877o655n933n924o703q172j0088j2150j4068j5620
33141b20176j6675j7176j7133j6589j5586j4126j2198r841p227m705k696j564
33129c55692j444k208l523n055o669q437j0431j2510j4235j5040j4440j2156q140
33116d69980k574M123J1318J8269K4308K8964L2019L3442L3297L1766K9176K5977
33104a99895K2587J9308J6280J3646J1609J0424J0230J0893J2009J3099J3862
33093d5948J4279J4550J4935J5703J7098J9301K2378K6250L0738L5630M0717M5791
33081B51422N0624N4978N8644O1413O3016O3002O0721N5466M6727L4533J9593
33070H20139L276j2764k7051l8641m7212n2895n6051n7080n6337n4145n0781m6461
$$ plain form
33058 323997 282670 247175 218016 195386 179090 168522 162700 160270 159583 158777 155961 149445 138011
33045 138011 121141 99147 73121 44726 15828 -11878 -37169 -59330 -78003 -92888 -103477
33034 -103477 -108880 -107843 -98988 -81185 -54002 -18049 24887 71993 119855 165008 204505 236334
33022 236334 259619 274524 281893 282809 278344 269564 257659 244024 230166 217497 207096 199576 195013
33009 195013 192973 192570 192632 191990 189822 185879 180458 174157 167547 160978 154578 148429 142733 137883 134410
32994 134410 132884 133780 137293 143137 150450 157875 163794 166593 164954 158119 146124 129815 110583 89912
32980 89912 68975 48504 28949 10713 -5700 -19728 -30833 -38626 -42960 -44052 -42562 -39611 -36664
32967 -36664 -35320 -37031 -42854 -53265 -68077 -86473 -107139 -128522 -149093 -167560 -182927 -194457
$$ packed form
33058C23997m1327l5495k9159k2630j6296j0568n822k430o87q06k816o516j1434
33045A38011j6870k1994k6026k8395k8898k7706k5291k2161j8673j4885j0589
33034a03477n403J037Q855J7803K7183L5953M2936M7106M7862M5153L9497L1829
33022B36334K3285J4905P369R16m465q780j1905j3635j3858j2669j0401p520m563
33009A95013k040m03O2o42k168l943n421o301o610o569o400o149n696m850l473
32994A34410j526Q96L513N844P313P425N919K799j639o835j1995j6309j9232k0671
32980H9912k0937k0471j9555j8236j6413j4028j1105p793m334j092J490K951K947
32967c6664J344j711n823j0411j4812j8396k0666k1383k0571j8467j5367j1530
$$ plain form
32955 -194457 -201587 -203894 -201088 -192996 -179462 -160220 -134818 -102667 -63118 -15524 40774 106487
32943 106487 182383 269314 368212 480087 605946 746663 902717 1073876 1258929 1455494
32933 1455494 1659956 1867427 2071856 2266377 2443982 2598402 2725024 2821605 2888597 2929005
32923 2929005 2947807 2951142 2945374 2936252 2928263 2924309 2925705 2932276 2942436 2953213 2960404 2959067 2944351
32910 2944351 2912492 2861583 2791882 2705560 2606079 2497456 2383624 2268087 2153828 2043368
32900 2043368 1938834 1841949 1754021 1675951 1608266 1551172 1504631 1468457 1442349 1425842 1418184
32889 1418184 1418243 1424495 1435094 1448046 1461397 1473385 1482515 1487597 1487796 1482727 1472533 1457916 1440056
32876 1440056 1420371 1400194 1380420 1361317 1342557 1323456 1303317 1281648 1258180 1232678 1204723
$$ packed form
32955a94457p130k307K806Q092J3534J9242K5402L2151L9549M7594N6298O5713
32943A06487P5896Q6931R8898J11875J25859J40717J56054J71159J85053J96565
32933A455494K04462K07471K04429J94521J77605J54420J26622R6581O6992M0408
32923B929005J8802L335n768r122p989l954J396O571J0160J0777P191j337j4716
32910B944351l1859n0909o9701q6322r9481j08623j13832j15537j14259j10460
32900B043368j04534r6885q7928p8070o7685n7094m6541l6174k6108j6507p658
32889A418184N9O252J0599J2952J3351J1988R130N082J99n069j0194j4617j7860
32876A440056j9685k0177j9774j9103j8760j9101k0139k1669k3468k5502k7955
$$ plain form
32865 1204723 1173613 1138495 1098659 1053902 1004787 952656 899387 847005 797260 751348 709761
32854 709761 672325 638350 606847 576810 547474 518531 490197 463124 438176 416221 397948
32843 397948 383750 373660 367370 364337 363978 365826 369549 374821 381151 387796 393822 398238 400172 399073
32829 399073 394860 387928 379039 369117 359068 349663 341484 334935 330272 327598 326807 327519 329127 330937
32815 330937 332344 332927 332422 330577 327078 321626 314196 305289 295990 287724 281833 279171 279903 283610 289607
32800 289607 297256 306138 316057 326958 338796 351406 364428 377326 389530 400593 410308 418678
32788 418678 425786 431617 435962 438499 439026 437754 435486 433554 433461 436415 442923 452675 464681 477553
32774 477553 489713 499500 505161 504918 497218 481201 457237 427168 394053 361384 332183 308333
$$ packed form
32865A204723l1110l5118l9836m4757m9115n2131n3269n2382m9745m5912m1587
32854G09761l7436l3975l1503l0037k9336k8943k8334k7073k4948k1955j8273
32843C97948j4198j0090o290l033l59J848L723N272O330O645O026M416J934j099
32829C99073m213o932q889r922j0049r405q179o549m663k674p91P12J608J810
32815C30937J407N83n05j845l499n452p430q907r299q266n891k662P32L707N997
32800B89607P649Q882R919J0901J1838J2610J3022J2898J2204J1063R715Q370
32788D18678P108N831M345K537N27j272k268j932r3K954O508R752J2006J2872
32774D77553J2160R787N661k43p700j6017k3964l0069l3115l2669k9201k3850
$$ plain form
32762 308333 290440 278141 270611 266989 266605 269021 273995 281470 291627 304915 321952 343309 369293
32749 369293 399849 434553 472572 512573 552698 590739 624538 652457 673716 688506 697802 703030
32737 703030 705648 706789 707054 706469 704598 700691 693855 683207 668019 647783 622246 591448 555784
32724 555784 516057 473466 429504 385838 344142 305971 272585 244818 222987 206869 195763
32713 195763 188607 184125 180956 177768 173356 166778 157487 145449 131134 115386 99229 83673 69572
32700 69572 57486 47598 39711 33376 28060 23307 18872 14793 11365 9029 8183 9061 11695 15964 21674
32685 21674 28644 36701 45629 55135 64919 74769 84617 94523 104616 115034 125829 136822 147518
32672 147518 157185 165126 170985 174898 177379 179010 180138 180726 180407 178686 175235 170158 164092 158093 153369
$$ packed form
32762C08333j7893j2299p530l622l84K416M974P475J0157J3288J7037K1357K5984
32749C69293L0556L4704L8019M0001M0125L8041L3799K7919K1259J4790R296N228
32737G03030K618J141K65n85j871l907o836j0648j5188k0236k5537l0798l5664
32724E55784l9727m2591m3962m3666m1696l8171l3386k7767k1831j6118j1106
32713A95763p156m482l169l188m412o578r291j2038j4315j5748j6157j5556j4101
32700F9572j2086r888p887o335n316m753m435m079l428k336q46Q78K634M269N710
32685B1674O970Q057Q928R506R784R850R848R906J0093J0418J0795J0993J0696
32672A47518R667P941N859L913K481J631J128N88l19j721l451n077o066n999m724
$$ plain form
32657 153369 151042 151987 156776 165625 178371 194504 213284 233912 255684 278033 300477 322548
32645 322548 343763 363591 381441 396675 408718 417244 422316 424382 424118 422194 419037 414682 408754
32632 408754 400606 389600 375459 358541 339884 320992 303392 288160 275582 265091 255518 245527
32620 245527 234040 220472 204754 187226 168503 149326 130433 112477 95987 81394 69025
32609 69025 59032 51256 45117 39631 33565 25645 14777 222 -18227 -40179 -64733 -90729 -117038
32596 -117038 -142762 -167246 -189916 -210111 -227050 -239999 -248477 -252381 -251950 -247679 -240253 -230512 -219433
32583 -219433 -208093 -197560 -188710 -182036 -177569 -174975 -173792 -173654 -174416 -176116 -178859 -182686 -187529 -193232
32569 -193232 -199626 -206576 -213929 -221377 -228308 -233795 -236774 -236333 -231979 -223754 -212229 -198414 -183599 -169169
$$ packed form
32657A53369k327R45M789Q849J2746J6133J8780K0628K1772K2349K2444K2071
32645C22548K1215J9828J7850J5234J2043Q526N072K066k64j924l157m355n928
32632D08754q148j1006j4141j6918j8657j8892j7600j5232j2578j0491r573r991
32620B45527j1487j3568j5718j7528j8723j9177j8893j7956j6490j4593j2369
32609F9025r993p776o139n486o066p920j0868j4555j8449k1952k4554k5996k6309
32596a17038k5724k4484k2670k0195j6939j2949q478l904M31M271P426R741J1079
32583b19433J1340J0533Q850O674M467K594J183J38p62j700k743l827m843n703
32569a93232o394o950p353p448o931n487k979M41M354Q225J1525J3815J4815J4430
$$ plain form
32555 -169169 -156407 -146339 -139658 -136722 -137610 -142194 -150194 -161213 -174778 -190355 -207339 -225031 -242606
32542 -242606 -259117 -273541 -284898 -292469 -296018 -295893 -292934 -288210 -282702 -277054 -271483 -265831 -259728 -252738
32528 -252738 -244473 -234688 -223321 -210507 -196579 -182054 -167589 -153850 -141347 -130357 -120963 -113155
32516 -113155 -106879 -102004 -98278 -95345 -92817 -90430 -88157 -86241 -85073 -84983 -86067 -88128 -90770 -93561 -96197
32501 -96197 -98604 -100942 -103521 -106686 -110697 -115663 -121474 -127772 -133992 -139480 -143645 -146074 -146571 -145216 -142428
32486 -142428 -138984 -135883 -134057 -134071 -135951 -139202 -142988 -146410 -148757 -149680 -149221 -147689 -145475 -142876 -140060
32471 -140060 -137126 -134187 -131361 -128695 -126117 -123442 -120436 -116831 -112334 -106666 -99653 -91349 -82098 -72496
32457 -72496 -63260 -55017 -48154 -42760 -38682 -35650 -33414 -31802 -30722 -30146 -30107 -30707 -32084 -34354 -37570
$$ packed form
32555a69169J2762J0068O681K936q88m584q000j1019j3565j5577j6984j7692j7575
32542b42606j6511j4424j1357p571l549J25K959M724N508N648N571N652O103O990
32528b52738Q265R785J1367J2814J3928J4525J4465J3739J2503J0990R394P808
32516a13155O276M875L726K933K528K387K273J916J168R0j084k061k642k791k636
32501i6197k407k338k579l165m011m966n811o298o220n488m165k429m97J355K788
32486a42428L444L101J826j4j880l251l786l422k347r23M59J532K214K599K816
32471a40060K934K939K826K666K578K675L006L605M497N668P013Q304R251R602
32457g2496R236Q243O863N394M078L032K236J612J080N76L9o00j377k270l216
$$ plain form
32442 -37570 -41715 -46731 -52582 -59328 -67157 -76350 -87167 -99710 -113782 -128771 -143627 -157004 -167605
32429 -167605 -174583 -177847 -178123 -176741 -175230 -174898 -176578 -180589 -186807 -194785 -203838 -213152 -221871 -229193 -234459
32414 -234459 -237239 -237376 -234931 -230040 -222798 -213226 -201396 -187637 -172680 -157586 -143445 -131022 -120574
32401 -120574 -111904 -104562 -98019 -91791 -85516 -79024 -72378 -65833 -59694 -54137 -49105 -44332 -39457 -34140
32387 -34140 -28134 -21332 -13827 -5957 1678 8258 12843 14537 12656 6874 -2685 -15499 -30737 -47424
32373 -47424 -64562 -81243 -96771 -110768 -123241 -134540 -145190 -155681 -166308 -177108 -187871 -198150
32361 -198150 -207274 -214410 -218749 -219718 -217172 -211403 -203028 -192805 -181424 -169339 -156653 -143135 -128339
32348 -128339 -111837 -93449 -73423 -52484 -31740 -12434 4381 18177 29056 37642 44760 51122
$$ packed form
32442c7570m145n016n851o746p829r193j0817j2543j4072j4989j4856j3377j0601
32429a67605o978l264k76J382J511L32j680m011o218p978r053r314q719p322n266
32414b34459k780j37K445M891P242R572J1830J3759J4957J5094J4141J2423J0448
32401a20574Q670P342O543O228O275O492O646O545O139N557N032M773M875N317
32387c4140O006O802P505P870P635O580M585J694j881n782r559j2814j5238j6687
32373d7424j7138j6681j5528j3997j2473j1299j0650j0491j0627j0800j0763j0279
32361a98150r124p136m339r69K546N769Q375J0223J1381J2085J2686J3518J4796
32348a28339J6502J8388K0026K0939K0744J9306J6815J3796J0879Q586P118O362
$$ plain form
32336 51122 57178 63127 69009 74784 80357 85600 90365 94466 97606 99322 99039 96262 90792 82825 72834
32321 72834 61365 48842 35535 21705 7823 -5313 -16729 -25615 -31653 -35077 -36487 -36563 -35888
32308 -35888 -34912 -33969 -33320 -33166 -33648 -34796 -36462 -38215 -39338 -38928 -36142 -30501 -22160 -12031 -1648
32293 -1648 7167 12732 13878 10142 1774 -10447 -25495 -42366 -60298 -78873 -98039 -118080 -139476
32280 -139476 -162710 -188088 -215616 -244951 -275380 -305888 -335304 -362512 -386677 -407367 -424531
32269 -424531 -438341 -448958 -456303 -459946 -459106 -452792 -440063 -420284 -393290 -359442 -319606 -275090
32257 -275090 -227534 -178686 -130163 -83260 -38871 2526 40863 76480 110145 143012 176487
32246 176487 211989 250665 293122 339207 387870 437152 484424 526890 562280 589442 608618
$$ packed form
32336E1122O056N949N882N775N573N243M765M101L140J716k83k777n470p967r991
32321G2834j1469j2523j3307j3830j3882j3136j1416q886o038l424j410p6O75
32308c5888R76R43O49J54m82j148j666j753j123M10K786N641Q341J0129J0383
32293a648Q815N565J146l736q368j2221j5048j6871j7932j8575j9166k0041k1396
32280a39476k3234k5378k7528k9335l0429l0508k9416k7208k4165k0690j7164
32269d24531j3810j0617p345l643Q40O314J2729J9779K6994L3848L9836M4516
32257b75090M7556M8848M8523M6903M4389M1397L8337L5617L3665L2867L3475
32246A76487L5502L8676M2457M6085M8663M9282M7272M2466L5390K7162J9176
$$ plain form
32235 608618 621231 629306 634815 639189 643067 646314 648214 647763 643963 636056 623700 607107 587040
32222 587040 564669 541292 518050 495755 474867 455588 438039 422395 408927 397951 389767 384613
32210 384613 382600 383604 387171 392481 398486 404118 408502 411065 411547 410037 407020 403371 400187 398492
32196 398492 398961 401778 406690 413113 420284 427334 433296 437139 437901 434943 428173 418052 405379 390974
32182 390974 375481 359361 342999 326808 311258 296860 284073 273201 264262 256972 250858 245400
32170 245400 240148 234730 228847 222269 214828 206391 196839 186122 174345 161852 149206 137107 126241
32157 126241 117158 110171 105333 102448 101116 100819 101013 101205 100938 99734 97038 92295 85104 75426 63667
32142 63667 50649 37425 25026 14243 5538 -852 -4783 -6119 -4814 -995 5003 12704 21533
$$ packed form
32235F08618J2613Q075N509M374L878L247J900m51l800p907j2356j6593k0067
32222E87040k2371k3377k3242k2295k0888j9279j7549j5644j3468j0976q184n154
32210C84613k013J004L567N310O005N632M384K563M82j510l017l649l184j695
32196C98492M69K817M912O423P171P050N962L843P62k958o770j0121j2673j4405
32182C90974j5493j6120j6362j6191j5550j4398j2787j0872q939p290o114n458
32170B45400n252n418n883o578p441q437r552j0717j1777j2493j2646j2099j0866
32157A26241r083o987m838k885j332k97J94J92k67j204k696m743p191r678j1759
32142F3667j3018j3224j2399j0783q705o390l931j336J305L819N998P701Q829
$$ plain form
32129 21533 30793 39606 46894 51474 52289 48718 40840 29516 16208 2598 -9831 -20123 -27968
32116 -27968 -33627 -37707 -40928 -43939 -47234 -51091 -55557 -60455 -65481 -70275 -74479 -77703 -79535 -79621 -77800
32101 -77800 -74194 -69213 -63483 -57766 -52798 -49150 -47108 -46712 -47871 -50483 -54480 -59773 -66159 -73240 -80462
32086 -80462 -87254 -93251 -98380 -102816 -106774 -110292 -113038 -114261 -112871 -107690 -97804 -82877 -63322 -40252
32072 -40252 -15244 9985 33846 55022 72511 85626 94037 97845 97654 94538 89869 85051 81275
32059 81275 79363 79749 82553 87677 94911 104004 114717 126826 140078 154144 168554 182692 195751
32046 195751 206711 214378 217568 215405 207578 194442 176881 156023 132949 108502 83278 57710
32034 57710 32134 6810 -18147 -42791 -67324 -92002 -117021 -142484 -168482 -195263 -223373 -253639
$$ packed form
32129B1533R260Q813P288M580Q15l571p878j1324j3308j3610j2429j0292p845
32116b7968n659m080l221l011l295l857m466m898n026m794m204l224j832q6J821
32101g7800L606M981N730N717M968L648K042L96j159k612l997n293o386p081p222
32086h0462o792n997n129m436l958l518k746j223J390N181R886J4927J9555K3070
32072d0252K5008K5229K3861K1176J7489J3115Q411L808j91l116m669m818l776
32059H1275j912L86K804N124P234R093J0713J2109J3252J4066J4410J4138J3059
32046A95751J0960P667L190k163p827j3136j7561k0858k3074k4447k5224k5568
32034E7710k5576k5324k4957k4644k4533k4678k5019k5463k5998k6781k8110l0266
$$ plain form
32022 -253639 -287017 -324331 -366042 -412105 -461942 -514554 -568659 -622816 -675440 -724765 -768767
32011 -768767 -805132 -831334 -844919 -844001 -827882 -797484 -755340 -705078 -650603 -595331 -541725 -491183
31999 -491183 -444196 -400669 -360283 -322816 -288309 -257009 -229136 -204623 -182960 -163282 -144628
31988 -144628 -126280 -107994 -90068 -73228 -58391 -46378 -37656 -32205 -29563 -29009 -29822 -31470 -33682
31975 -33682 -36355 -39335 -42180 -44113 -44238 -41960 -37326 -31038 -24166 -17713 -12297 -8097 -5044 -3113 -2569
31960 -2569 -4042 -8429 -16723 -29787 -48142 -71808 -100266 -132568 -167541 -204093 -241540 -279795
31948 -279795 -319369 -361148 -406066 -454839 -507809 -564915 -625771 -689803 -756377 -824891 -894836
31937 -894836 -965860 -1037819 -1110857 -1185483 -1262628 -1343614 -1430059 -1523742 -1626471 -1739936 -1865592
$$ packed form
32022b53639l3378l7314m1711m6063m9837n2612n4105n4157n2624m9325m4002
32011g68767l6365k6202j3585R18J6119L0398M2144N0262N4475N5272N3606N0542
31999d91183M6987M3527M0386L7467L4507L1300K7873K4513K1663J9678J8654
31988a44628J8348J8286J7926J6840J4837J2013Q722N451K642N54q13j648k212
31975c3682k673k980k845j933j25K278M634O288O872O453N416M200L053J931N44
31960b569j473m387q294j3064j8355k3666k8458l2302l4973l6552l7447l8255
31948b79795l9574m1779m4918m8773n2970n7106o0856o4032o6574o8514o9945
31937h94836p1024p1959p3038p4626p7145q0986q6445r3683j02729j13465j25656
$$ plain form
31926 -1865592 -2004599 -2157776 -2325498 -2507459 -2702332 -2907486 -3118739 -3330112 -3533512
31917 -3533512 -3718460 -3872198 -3980613 -4030327 -4011752 -3922100 -3766854 -3558815 -3315016 -3052947
31907 -3052947 -2787591 -2530017 -2287322 -2063325 -1859466 -1675627 -1510838 -1363840 -1233509
31898 -1233509 -1119060 -1019968 -935691 -865332 -807461 -760152 -721270 -688859 -661518 -638562 -619981
31887 -619981 -606219 -597868 -595352 -598660 -607215 -619942 -635498 -652575 -670190 -687889 -705797 -724453
31875 -724453 -744460 -766049 -788637 -810538 -828878 -839892 -839659 -825118 -795008 -750274 -693728 -629172
31863 -629172 -560443 -490768 -422564 -357532 -296852 -241333 -191504 -147669 -110007 -78643 -53690
31852 -53690 -35189 -23002 -16714 -15567 -18447 -24014 -30956 -38280 -45480 -52475 -59370 -66140 -72417 -77485
$$ packed form
31926a865592j39007j53177j67722j81961j94873k05154k11253k11373k03400
31917c533512j84948j53738j08415m9714J8575Q9652J55246K08039K43799K62069
31907c052947K65356K57574K42695K23997K03859J83839J64789J46998J30331
31898a233509J14449R9092Q4277P0359N7871M7309L8882L2411K7341K2956J8581
31887f19981J3762Q351K516l308q555j2727j5556j7077j7615j7699j7908j8656
31875g24453k0007k1589k2588k1901j8340j1014K33J4541L0110M4734N6546O4556
31863f29172O8729O9675O8204O5032O0680N5519M9829M3835L7662L1364K4953
31852e3690J8501J2187O288J147k880n567o942p324p200o995o895o770o277n068
$$ plain form
31838 -77485 -80527 -80984 -78814 -74514 -68959 -63098 -57647 -52865 -48535 -44137 -39093 -32941 -25424 -16573 -6804
31823 -6804 3058 11923 18762 22971 24547 23998 22053 19398 16526 13694 10923 7992 4511 31 -5788
31808 -5788 -13002 -21265 -29859 -37928 -44780 -50111 -54028 -56914 -59224 -61284 -63146 -64511 -64786 -63258 -59358
31793 -59358 -52892 -44147 -33782 -22568 -11059 591 12614 25393 39149 53681 68263 81771
31781 81771 92992 101043 105709 107583 107920 108261 109951 113766 119766 127372 135553 143010 148393 150567 148867
31766 148867 143192 133876 121422 106312 88985 69954 49891 29566 9674 -9305 -27101 -43537
31754 -43537 -58472 -71892 -84083 -95736 -107853 -121493 -137468 -156170 -177590 -201488 -227585 -255639
31742 -255639 -285402 -316480 -348224 -379771 -410217 -438849 -465295 -489445 -511206 -530125 -545078
$$ packed form
31838g7485l042m57K170M300N555N861N451M782M330M398N044O152P517Q851R769
31823f804R862Q865O839M209J576n49j945k655k872k832k771k931l481m480n819
31808e788p214q263q594q069o852n331l917k886k310k060j862j365k75J528L900
31793e9358O466Q745J0365J1214J1509J1650J2023J2779J3756J4532J4582J3508
31781H1771J1221Q051M666J874L37L41J690L815O000P606Q181P457N383K174j700
31766A48867n675r316j2454j5110j7327j9031k0063k0325j9892j8979j7796j6436
31754d3537j4935j3420j2191j1653j2117j3640j5975j8702k1420k3898k6097k8054
31742b55639k9763l1078l1744l1547l0446k8632k6446k4150k1761j8919j4953
$$ plain form
31731 -545078 -554175 -555014 -545273 -523439 -489382 -444554 -391724 -334320 -275693 -218508 -164485 -114446
31719 -114446 -68566 -26676 11457 46017 77142 105023 129943 152253 172288 190311 206487
31708 206487 220886 233462 244043 252359 258179 261512 262776 262871 263067 264753 269120 276894 288187 302510
31694 302510 318922 336257 353365 369314 383551 395979 406906 416845 426202 435031 442972 449402
31682 449402 453656 455212 453814 449509 442643 433755 423437 412178 400246 387655 374251 359905 344705
31669 344705 328997 313289 298061 283599 269929 256869 244177 231703 219464 207571 196079
31658 196079 184868 173638 162056 149965 137551 125375 114274 105161 98814 95729 96101 99871 106795
31645 106795 116437 128137 141029 154118 166419 177112 185670 191904 195917 198012 198587 198063 196852
$$ packed form
31731e45078r097q39R741K1834L4057M4828N2830N7404N8627N7185N4023N0039
31719a14446M5880M1890L8133L4560L1125K7881K4920K2310K0035J8023J6176
31708B06487J4399J2576J0581Q316N820L333J264R5J96J686M367P774J1293J4323
31694C02510J6412J7335J7108J5949J4237J2428J0927R939R357Q829P941O430
31682D49402M254J556j398m305o866q888j0318j1259j1932j2591j3404j4346j5200
31669C44705j5708j5708j5228j4462j3670j3060j2692j2474j2239j1893j1492
31658A96079j1211j1230j1582j2091j2414j2176j1101r113o347l085L72L770O924
31645A06795R642J1700J2892J3089J2301J0693Q558O234M013K095N75n24j211
$$ plain form
31632 196852 195361 194031 193343 193736 195508 198754 203385 209152 215634 222171 227854 231628 232531 229982 224002
31617 224002 215241 204853 194241 184769 177521 173179 171962 173657 177710 183423 190215 197858 206548 216807
31603 216807 229275 244495 262766 284136 308518 335840 366115 399443 435967 475852 519189
31592 519189 565831 615192 666089 716733 764854 808035 844138 871719 890227 899906 901497 895920
31580 895920 884097 866959 845556 821126 795029 768594 742974 719072 697515 678574 662039
31569 662039 647186 632911 618003 601401 582312 560195 534697 505657 473263 438299 402275
31558 402275 367227 335273 308120 286826 271791 262924 259814 261913 268664 279520 293860 310854
31546 310854 329399 348138 365587 380303 391078 397108 398098 394273 386290 375072 361613 346785
$$ packed form
31632A96852j491j330o88L93J772L246M631N767O482O537N683L774R03k549n980
31617B24002q761j0388j0612r472p248m342j217J695M053N713O792P643Q690J0259
31603B16807J2468J5220J8271K1370K4382K7322L0275L3328L6524L9885M3337
31592E19189M6642M9361N0897N0644M8121M3181L6103K7581J8508R679J591n577
31580H95920j1823j7138k1403k4430k6097k6435k5620k3902k1557j8941j6535
31569F62039j4853j4275j4908j6602j9089k2117k5498k9040l2394l4964l6024
31558D02275l5048l1954k7153k1294j5035q867l110K099O751J0856J4340J6994
31546C10854J8545J8739J7449J4716J0775O030R90l825p983j1218j3459j4828
$$ plain form
31534 346785 331172 314993 298167 280517 262054 243162 224609 207379 192366 180107 170623 163483
31522 163483 157962 153232 148505 143197 137060 130180 122797 115056 106900 98189 88930 79432 70282 62231
31508 62231 56079 52577 52311 55564 62235 71845 83636 96753 110444 124251 138061 151988 166145
31495 166145 180499 194883 209105 223060 236749 250191 263291 275697 286766 295686 301685 304304
31483 304304 303540 299864 294072 287086 279769 272785 266539 261170 256623 252722 249217 245835 242347 238646
31469 238646 234839 231275 228548 227424 228699 233036 240826 252126 266651 283819 302830 322785 342822
31456 342822 362259 380697 398074 414568 430412 445652 460001 472824 483299 490683 494559 494923
31444 494923 492077 486423 478273 467733 454692 438950 420417 399330 376374 352686 329746 309131
$$ packed form
31534C46785j5613j6179j6826j7650j8463j8892j8553j7230j5013j2259r484p140
31522A63483n521m730m727n308o137o880p383p741q156q711r259r498r150q051
31508F2231o152l502k66L253O671R610J1791J3117J3691J3807J3810J3927J4157
31495A66145J4354J4384J4222J3955J3689J3442J3100J2406J1069Q920N999K619
31483C04304p64l676n792o986p317o984o246n369m547l901l505l382l488l701
31469B38646l807l564k727j124J275M337P790J1300J4525J7168J9011J9955K0037
31456C42822J9437J8438J7377J6494J5844J5240J4349J2823J0475P384L876L64
31444D94923k846n654q150j0540j3041j5742j8533k1087k2956k3688k2940k0615
$$ plain form
31432 309131 292235 279963 272512 269300 269117 270459 271970 272805 272778 272259 271875 272165 273296 275015 276847
31417 276847 278426 279787 281466 284345 289341 297083 307766 321123 336495 352901 369121 383842 395846
31404 395846 404139 408066 407374 402200 392984 380348 365008 347768 329552 311389 294317 279216 266625
31391 266625 256666 249083 243390 239037 235535 232455 229356 225709 220929 214535 206329 196450 185321 173526
31377 173526 161741 150655 140892 132960 127221 123892 123020 124453 127840 132762 138901 146119 154385 163558
31363 163558 173216 182599 190710 196570 199537 199560 197205 193404 189073 184786 180596 176060 170380 162668 152240
31348 152240 138795 122456 103688 83214 61990 41198 22204 6427 -4877 -10846 -11180 -6192
31336 -6192 3319 16304 31714 48667 66501 84788 103328 122111 141221 160740 180660 200833
$$ packed form
31432C09131j6896j2272p451l212j83J342J511Q35k7n19l84K90J131J719J832
31417B76847J579J361J679K879M996P742J0683J3357J5372J6406J6220J4721J2004
31404C95846Q293L927o92n174r216j2636j5340j7240j8216j8163j7072j5101j2591
31391B66625r959p583n693m353l502l080l099l647m780o394q206r879j1129j1795
31377A73526j1785j1086r763p932n739l329q72J433L387M922O139P218Q266R173
31363A63558R658R383Q111N860K967K3k355l801m331m287m190m536n680p712j0428
31348A52240j3445j6339j8768k0474k1224k0792j8994j5777j1304n969l34M988
31336f192R511J2985J5410J6953J7834J8287J8540J8783J9110J9519J9920K0173
$$ plain form
31324 200833 220948 240549 259144 276300 291686 304991 315834 323707 327984 327997 323162 313183 298234
$$ packed form
31324B00833K0115J9601J8595J7156J5386J3305J0843P873M277J3m835r979j4949
$$ [...]
##END NTUPLES=NMR SPECTRUM
##END=
