##TITLE=31Pdec_DE-27_EA
 D2O
  24 sc
 28.11.2023
##JCAMPDX= 6.0         $$ Bruker NMR JCAMP-DX V2.0
##DATA TYPE= NMR SPECTRUM
##DATA CLASS= NTUPLES
##ORIGIN= UXNMR, Bruker Analytische Messtechnik GmbH
##OWNER= root
$$ XWIN-NMR		Version 3.5
$$ Tue Nov 28 16:32:19 2023 Russian Standard Time (UT+4h)  she@DPX200
##.OBSERVE FREQUENCY= 81.013821
##.OBSERVE NUCLEUS= ^31P
##.ACQUISITION MODE= SIMULTANEOUS
##.ACQUISITION SCHEME= undefined
##.AVERAGES= 24
##.DIGITISER RES= 16
##SPECTROMETER/DATA SYSTEM= spect
##.PULSE SEQUENCE= zgpg30
##.SOLVENT NAME= CDCl3
##.SHIFT REFERENCE= (INTERNAL, CDCl3, 0, 248.564)
##AUDIT TRAIL= $$ (NUMBER, WHEN, WHO, WHERE, WHAT)
$$ ##TITLE= Audit trail, XWIN-NMR		Version 3.5
$$ ##JCAMPDX= 5.01
$$ ##ORIGIN= Bruker BioSpin GmbH
$$ ##OWNER= she
$$ F:/spectra/data/she/nmr/P31/1/pdata/1/auditp.txt
$$ ##AUDIT TRAIL=  $$ (NUMBER, WHEN, WHO, WHERE, WHAT)
(   1,<2023-11-28 16:31:13.59 +0400>,<she>,<DPX200>,
      <created by zg, POWCHK disabled, PULCHK disabled
       configuration hash MD5:
       00 E9 B6 7A A2 85 ED C7 34 08 36 98 17 FE 4E 26
       data hash MD5: 32K
       C9 E2 B0 29 9D CE E1 41 28 C2 7A 9E D5 F7 AE 66>)
(   2,<2023-11-28 16:31:16.04 +0400>,<she>,<DPX200>,
      <Start of raw data processing
       efp BC_mod = 2 LB = 10 FT_mod = 6 PKNL = 1 PHC0 = -11632.96 PHC1 = -201.9056 SI = 64K 
       data hash MD5: 64K
       60 9F 4D B7 85 A4 28 74 23 21 FE FD 1B 62 9F 4A>)
(   3,<2023-11-28 16:31:54.92 +0400>,<she>,<DPX200>,
      <pk PHC0 = 134.6629 PHC1 = -253.4 
       data hash MD5: 64K
       5D D0 6A BC 84 58 5F 81 4B 84 C1 B6 68 B3 59 49>)
(   4,<2023-11-28 16:31:57.93 +0400>,<she>,<DPX200>,
      <abs ABSG = 5 
       data hash MD5: 64K
       10 CA 1A A4 36 94 91 FF EE CB BA 0A 60 5A 37 10>)
$$ ##END=
$$ 
$$ hash MD5
$$ 9F 8E 2A C8 D0 B5 60 2E CC 1E 47 48 0D 12 B6 57
##$RELAX= 
##$RELAX= 
##$RELAX= 
##$RELAX= 
##$RELAX= 
##$RELAX= 
##$RELAX= 
##$RELAX= 
##$RELAX= 
$$ Bruker specific parameters
$$ --------------------------
##$DU= <F:/spectra>
##$EXPNO= 1
##$NAME= <P31>
##$PROCNO= 1
##$TYPE= <nmr>
##$USER= <she>
##$AMP= (0..31)
100 100 100 100 100 100 100 100 100 100 100 100 100 100 100 100 100 100 
100 100 100 100 100 100 100 100 100 100 100 100 100 100 
##$AQSEQ= 0
##$AQ_mod= 1
##$AUNM= <au_zg>
##$AUTOPOS= <>
##$BF1= 81.014009
##$BF2= 200.13
##$BF3= 200.13
##$BF4= 200.13
##$BF5= 200.13
##$BF6= 200.13
##$BF7= 200.13
##$BF8= 200.13
##$BYTORDA= 1
##$CFDGTYP= 0
##$CFRGTYP= 5
##$CHEMSTR= <none>
##$CNST= (0..31)
1 1 145 1 1 1 1 1 1 1 1 1 1 1 1 1 1 1 1 1 1 1 1 1 1 1 1 1 1 1 1 1 
##$CPDPRG= <waltz16>
##$CPDPRG1= <>
##$CPDPRG2= <waltz16>
##$CPDPRG3= <>
##$CPDPRG4= <mlev>
##$CPDPRG5= <mlev>
##$CPDPRG6= <mlev>
##$CPDPRG7= <mlev>
##$CPDPRG8= <mlev>
##$CPDPRGB= <>
##$CPDPRGT= <>
##$D= (0..31)
0 1 0 0 0 0 0 0 0 0 0 0.03 2e-05 3e-06 0 0 0 0 0 0 0 0 0 0 0 0 0 0 0 0 
0 0 
##$DATE= 1701174673
##$DBL= (0..7)
120 120 120 11 120 120 24 19 
##$DBP= (0..7)
150 150 150 150 150 150 150 150 
##$DBP07= 0
##$DBPNAM0= <>
##$DBPNAM1= <>
$$ [...]
##$SUBNAM3= <"">
##$SUBNAM4= <"">
##$SUBNAM5= <"">
##$SUBNAM6= <"">
##$SUBNAM7= <"">
##$SUBNAM8= <"">
##$SUBNAM9= <"">
##$SW= 501.771253377433
##$SWIBOX= (0..15)
0 1 3 0 0 0 0 0 0 0 0 0 0 0 0 0 
##$SW_h= 40650.406504065
##$TD= 32768
##$TD0= 1
##$TE= 0
##$TE2= 300
##$TE3= 300
##$TEG= 300
##$TL= (0..7)
0 120 53 12 22 120 120 120 
##$TP= (0..7)
150 150 150 150 150 150 150 150 
##$TP07= 0
##$TPNAME0= <>
##$TPNAME1= <>
##$TPNAME2= <>
##$TPNAME3= <>
##$TPNAME4= <>
##$TPNAME5= <>
##$TPNAME6= <>
##$TPNAME7= <>
##$TPOAL= (0..7)
0.5 0.5 0.5 0.5 0.5 0.5 0.5 0.5 
##$TPOFFS= (0..7)
0 0 0 0 0 0 0 0 
##$TUNHIN= 0
##$TUNHOUT= 0
##$TUNXOUT= 0
##$USERA1= <user>
##$USERA2= <user>
##$USERA3= <user>
##$USERA4= <user>
##$USERA5= <user>
##$V9= 5
##$VALIST= <valist>
##$VCLIST= <CCCCCCCCCCCCCCC>
##$VD= 0
##$VDLIST= <DDDDDDDDDDDDDDD>
##$VPLIST= <PPPPPPPPPPPPPPP>
##$VTLIST= <TTTTTTTTTTTTTTT>
##$WBST= 1024
##$WBSW= 4
##$XGAIN= (0..3)
0 0 0 0 
##$XL= 0
##$YL= 0
##$YMAX_a= 1731
##$YMIN_a= -1718
##$ZGOPTNS= <>
##$ZL1= 120
##$ZL2= 120
##$ZL3= 120
##$ZL4= 120
##$ABSF1= 248.5645
##$ABSF2= -253.2056
##$ABSG= 5
##$ABSL= 3
##$ALPHA= 0
##$AQORDER= 0
##$ASSFAC= 0
##$ASSFACI= 0
##$ASSFACX= 0
##$ASSWID= 0
##$AUNMP= <proc_1d>
##$AZFE= 0.1
##$AZFW= 0.5
##$BCFW= 0
##$BC_mod= 2
##$BYTORDP= 0
##$COROFFS= 0
##$CY= -3
##$DATMOD= 1
##$DC= 0
##$DFILT= <>
##$DTYPP= 0
##$F1P= 0
##$F2P= 0
##$FCOR= 1
##$FTSIZE= 65536
##$FT_mod= 6
##$GAMMA= 0
##$GB= 0
##$INTBC= 1
##$INTSCL= 6.047779e-11
##$ISEN= 30
##$LB= 10
##$LEV0= 0
##$LPBIN= 0
##$MAXI= 10000
##$MC2= 0
##$MEAN= 0
##$ME_mod= 0
##$MI= 50
##$NCOEF= 0
##$NC_proc= -10
##$NLEV= 6
##$NOISF1= 182.463
##$NOISF2= 159.3651
##$NSP= 0
##$NTH_PI= 0
##$NZP= 0
##$OFFSET= 248.5645
##$PC= 4
##$PHC0= -11498.3
##$PHC1= -455.3056
##$PH_mod= 1
##$PKNL= yes
##$PPARMOD= 0
##$PSCAL= 0
##$PSIGN= 0
##$REVERSE= no
##$SF= 81.0140089999694
##$SI= 65536
##$SIGF1= 159.3651
##$SIGF2= -187.1042
##$SINO= 113.3802
##$SIOLD= 16384
##$SREGLST= <1H.CDCl3>
##$SSB= 0
##$STSI= 65536
##$STSR= 0
##$SW_p= 40650.406504065
##$SYMM= 0
##$S_DEV= 0
##$TDeff= 32768
##$TDoff= 0
##$TI= <>
##$TILT= no
##$TM1= 0
##$TM2= 0
##$TOPLEV= 0
##$USERP1= <user>
##$USERP2= <user>
##$USERP3= <user>
##$USERP4= <user>
##$USERP5= <user>
##$WDW= 1
##$XDIM= 65536
##$YMAX_p= 546184720
##$YMIN_p= -22801185
$$ End of Bruker specific parameters
$$ ---------------------------------
##NTUPLES= NMR SPECTRUM
##VAR_NAME=  FREQUENCY,     SPECTRUM/REAL,   SPECTRUM/IMAG
##SYMBOL=    X,             R,               I
##VAR_TYPE=  INDEPENDENT,   DEPENDENT,       DEPENDENT
##VAR_FORM=  AFFN,          ASDF,            ASDF
##VAR_DIM=   65536,         65536,           65536
##UNITS=     HZ,            ARBITRARY UNITS, ARBITRARY UNITS
##FACTOR=    0.620285442955139, 1,           1
##FIRST=     20137.2065510682, 0,            0
##LAST=      -20513.1999529968, 0,           0
##MIN=       -20513.1999529968, -22801185,   0
##MAX=       20137.2065510682, 546184720,    0
$$ Real data points
##PAGE= N=1
##DATA TABLE= (X++(R..R)), XYDATA
$$ [...]
39096 -5494723 -5260726 -5162296 -5192071 -5318949 -5492628 -5654141 -5747104 -5726133 -5562940 -5251706
39086 -5251706 -4812381 -4287862 -3732676 -3196402 -2709632 -2279063 -1892490 -1529277 -1171332
39077 -1171332 -811820 -459893 -139608 117438 282760 339899 288309 142375 -72036 -321105
39067 -321105 -565372 -761303 -864444 -836774 -658042 -336439 87704 548412 968652 1277761
39057 1277761 1426538 1396239 1199085 869805 451283 -19219 -516532 -1024154 -1524755 -1992635
39047 -1992635 -2394624 -2698982 -2885242 -2947648 -2891095 -2724435 -2456059 -2092815 -1641347 -1111555
39037 -1111555 -520929 104558 737518 1362684 1988527 2648003 3386146 4240159 5221157
39028 5221157 6304905 7434322 8532113 9519130 10332546 10937397 11327051 11513953 11518179
39019 11518179 11361334 11066655 10660164 10168558 9614248 9010150 8356385 7641525 6851308
39010 6851308 5983200 5058182 4120138 3221569 2404025 1684456 1054121 489758 -29746
39001 -29746 -511199 -946371 -1320794 -1623373 -1850173 -2003353 -2090304 -2125310 -2131615 -2140459 -2185461
38990 -2185461 -2293526 -2476426 -2727945 -3028101 -3350141 -3664291 -3937099 -4131410 -4212157 -4156990
38980 -4156990 -3964982 -3656957 -3266846 -2829637 -2373210 -1917354 -1477469 -1068107 -704769
38971 -704769 -406258 -198911 -118563 -204095 -482191 -951498 -1576292 -2293028 -3025754 -3704527
38961 -3704527 -4282656 -4747776 -5119888 -5433466 -5711657 -5949066 -6115109 -6174938 -6112467 -5940638
38951 -5940638 -5695239 -5419686 -5151495 -4917390 -4737691 -4635372 -4642277 -4796018 -5126739 -5640663
38941 -5640663 -6310960 -7082180 -7885592 -8656748 -9347751 -9932400 -10406813 -10788426 -11113544
38932 -11113544 -11431321 -11792669 -12236160 -12776425 -13400233 -14071062 -14738289 -15346156 -15840067
38923 -15840067 -16170798 -16298869 -16201474 -15881917 -15376711 -14752149 -14085548 -13436851 -12825322
38914 -12825322 -12225143 -11582574 -10844923 -9986191 -9017830 -7981472 -6929348 -5903794 -4926681
38905 -4926681 -4002682 -3131037 -2315778 -1567476 -897087 -308219 205852 658513 1062399
38896 1062399 1423039 1736961 1994738 2187251 2312677 2381950 2420912 2467933 2566069 2749907
38886 2749907 3029879 3380775 3742297 4034440 4181456 4132863 3873371 3421636 2823236 2142674
38876 2142674 1455966 842793 376788 113991 82239 275745 657058 1164608 1722245 2249182
38866 2249182 2670724 2929165 2991928 2854079 2535102 2072478 1514954 916901 333297 -185610
38856 -185610 -599864 -884125 -1029941 -1047139 -965449 -834837 -720987 -694971 -820768 -1145631
38846 -1145631 -1695276 -2472824 -3460250 -4622064 -5910459 -7269640 -8637515 -9945163 -11117122
38837 -11117122 -12076146 -12754761 -13112238 -13151125 -12924794 -12529417 -12080380 -11680583 -11392065
38828 -11392065 -11221218 -11122565 -11019342 -10833319 -10512887 -10049203 -9475592 -8853132 -8250903
38819 -8250903 -7729253 -7329850 -7071577 -6950124 -6940923 -7006540 -7108125 -7216744 -7318257 -7408770
38809 -7408770 -7484814 -7537068 -7553232 -7527313 -7467090 -7393917 -7335484 -7315945 -7346818 -7420156 -7506147
38798 -7506147 -7558459 -7528283 -7382120 -7114514 -6749592 -6332281 -5915023 -5545469 -5257404 -5065446
38788 -5065446 -4964201 -4932280 -4939710 -4955543 -4952707 -4909626 -4810741 -4648430 -4425609 -4154639 -3849210
38777 -3849210 -3512243 -3128458 -2667874 -2098180 -1398314 -567152 374094 1384857 2411495
38768 2411495 3392862 4261275 4941357 5356105 5446429 5196491 4646640 3882043 3003555 2100053
38758 2100053 1237083 461545 -188825 -681576 -993361 -1116658 -1063978 -867729 -576550 -248441
38748 -248441 60099 307529 477779 581541 647473 709697 799502 943609 1164542 1477638
38738 1477638 1884683 2370527 2909192 3478765 4075643 4717107 5429463 6229748 7112638
38729 7112638 8048663 8991826 9890930 10699566 11382138 11915861 12290958 12511082 12592712 12559689
38719 12559689 12432056 12214879 11895875 11455743 10886228 10205194 9459436 8712895 8025956
38710 8025956 7436157 6949314 6543910 6184631 5837574 5480831 5108021 4725928 4349039
38701 4349039 3993704 3674097 3401114 3183575 3028882 2940509 2913298 2931079 2969990 3005579
38691 3005579 3018067 2992424 2915126 2772072 2550373 2243194 1854641 1401325 908370 400252
38681 400252 -109947 -627500 -1175098 -1784140 -2482703 -3285572 -4189020 -5169586 -6185808
38672 -6185808 -7183510 -8105140 -8900522 -9534209 -9986708 -10251086 -10328288 -10223284 -9942774 -9495280
38662 -9495280 -8893985 -8160530 -7326319 -6429325 -5508265 -4598768 -3734262 -2948756 -2274492
38653 -2274492 -1730265 -1305233 -949771 -582039 -108431 552189 1450674 2600610 3980854
38644 3980854 5542871 7217919 8922190 10562574 12046927 13298452 14268481 14941765
38636 14941765 15333127 15478519 15424295 15217871 14902989 14521576 14120217 13754582 13484652
38627 13484652 13359274 13397161 13576288 13839518 14113704 14331291 14444161 14427070 14274200 13993268
38617 13993268 13599654 13111627 12546792 11919059 11236024 10498476 9703920 8853081 7955900
38608 7955900 7034432 6122705 5264554 4509459 3906021 3493626 3293796 3303942 3497250 3831268
38598 3831268 4262780 4761697 5316755 5931178 6612045 7359452 8160549 8990060 9814257
38589 9814257 10593583 11283088 11835673 12212852 12400339 12419214 12324886 12193009 12097405 12087692
38579 12087692 12174853 12331124 12504899 12643447 12711607 12696550 12597217 12407220 12104810 11657986
38569 11657986 11040574 10247257 9298313 8233431 7099714 5939597 4783233 3647835
38561 3647835 2542518 1473763 448372 -524497 -1429654 -2242435 -2930678 -3464145 -3827211
38552 -3827211 -4027454 -4094960 -4072389 -4001242 -3912013 -3822407 -3740891 -3669188 -3600855 -3519200 -3399409
38541 -3399409 -3215777 -2950468 -2599467 -2173725 -1695938 -1194098 -692509 -201913 287012
38532 287012 801203 1372525 2021459 2747485 3531335 4345317 5163751 5968448 6749180 7501405
38522 7501405 8223033 8911224 9559979 10159305 10696346 11157842 11532684 11813704 11998868
38513 11998868 12091822 12100486 12032937 11892850 11678694 11388354 11026168 10607547 10158664 9711715
38503 9711715 9297740 8939689 8648728 8425530 8265227 8162331 8111997 8107025 8133767 8172384
38493 8172384 8204748 8226818 8256331 8327999 8476803 8718830 9040989 9405197 9763579 10074875
38483 10074875 10312510 10461690 10511004 10446331 10250335 9905540 9398358 8724164 7894182 6942183
38473 6942183 5926185 4921496 4006024 3243399 2670451 2292842 2089141 2021894 2053060
38464 2053060 2158166 2331145 2575552 2887801 3245253 3608468 3935824 4200153 4396883
38455 4396883 4539248 4643982 4716939 4748400 4719837 4614172 4420377 4132370 3749875 3284708
38445 3284708 2765937 2235529 1735304 1294290 923345 616395 354898 114679 -125340
38436 -125340 -376508 -640557 -915530 -1200983 -1498002 -1806337 -2123739 -2447975 -2776784 -3102660
38426 -3102660 -3406220 -3656375 -3821494 -3886329 -3862814 -3785357 -3691554 -3599475 -3495144 -3337457
38416 -3337457 -3077507 -2681858 -2148457 -1509059 -819153 -140930 474397 999582 1435576
38407 1435576 1805568 2142069 2473679 2816854 3173420 3531721 3869410 4156745 4359276
38398 4359276 4439925 4362514 4098807 3637751 2992609 2202338 1326448 434689 -405678 -1140765
38388 -1140765 -1735289 -2171882 -2447665 -2570814 -2557359 -2427789 -2204145 -1907904 -1557686 -1166756
38378 -1166756 -742598 -290134 183801 668785 1152633 1623954 2073183 2492897 2879243
38369 2879243 3235149 3574002 3920521 4304284 4744330 5230439 5712441 6106300 6316339
38360 6316339 6264603 5915690 5287943 4447404 3487860 2505894 1580440 762409 75337 -474921
38350 -474921 -886036 -1147605 -1238482 -1133979 -817737 -291778 417903 1259566 2157745 3021611
38340 3021611 3761148 4307289 4627217 4727054 4641009 4413030 4079929 3663338 3173451 2620962
38330 2620962 2027722 1426805 851500 323173 -150970 -569274 -925788 -1208712 -1407023
38321 -1407023 -1516738 -1539370 -1473902 -1310907 -1036347 -643889 -147017 417244 993960 1520647
38311 1520647 1938625 2204600 2301120 2241534 2065032 1822307 1558007 1298258 1049233 807456
38301 807456 576053 377114 251838 247007 393892 689758 1091066 1522141 1895571 2135178
38291 2135178 2192698 2054515 1739567 1290996 764127 214570 -309202 -767350 -1127111 -1362731
38281 -1362731 -1459014 -1417164 -1259677 -1030592 -788387 -592046 -484857 -482474 -569756 -706807
38271 -706807 -841498 -924097 -919540 -814206 -616583 -353108 -60760 221957 462933 639801
38261 639801 737403 741967 636702 401723 17653 -529620 -1244856 -2120200 -3132161 -4239187
38251 -4239187 -5382141 -6490558 -7494929 -8340895 -8999438 -9469922 -9777451 -9967216 -10096321
38242 -10096321 -10221920 -10386941 -10608416 -10874095 -11149074 -11389115 -11555102 -11623854 -11592638 -11476798
38232 -11476798 -11302233 -11096487 -10882254 -10674603 -10480484 -10299014 -10122728 -9940346 -9739369
38223 -9739369 -9505572 -9219169 -8851978 -8371181 -7751376 -6990300 -6119559 -5202771 -4319954
38214 -4319954 -3545556 -2931920 -2505394 -2272408 -2227217 -2356217 -2640309 -3058037 -3588223 -4208654
38204 -4208654 -4891066 -5597669 -6284247 -6909496 -7445199 -7881436 -8224508 -8489129 -8688934
38195 -8688934 -8829967 -8910584 -8927560 -8883688 -8790769 -8665826 -8524532 -8377885 -8234153 -8102755
38185 -8102755 -7995588 -7924464 -7897111 -7915811 -7981450 -8101111 -8291852 -8573072 -8948651 -9391372
38175 -9391372 -9843773 -10237487 -10518810 -10664987 -10684937 -10608685 -10473319 -10310821 -10140891 -9971201
38165 -9971201 -9805388 -9653962 -9539576 -9490711 -9526735 -9644521 -9815600 -9994327 -10130267 -10178080
38155 -10178080 -10103117 -9884269 -9514952 -9001853 -8362107 -7621741 -6817438 -5999525 -5230435
38146 -5230435 -4574734 -4084016 -3785804 -3683365 -3764323 -4009316 -4394825 -4892947 -5474904 -6119950
38136 -6119950 -6822724 -7590261 -8426944 -9315651 -10207054 -11024153 -11680132 -12101033 -12243588
38127 -12243588 -12101841 -11701596 -11086836 -10305049 -9397395 -8396316 -7329996 -6230944 -5143606
38118 -5143606 -4124518 -3230918 -2501068 -1936146 -1493569 -1095313 -648089 -69192 688583
38109 688583 1619701 2662387 3711922 4648072 5368182 5814369 5985419 5930602 5729907
38100 5729907 5468832 5215465 5005651 4840252 4695544 4542639 4367080 4179120 4010341
38091 4010341 3900096 3880673 3969846 4174202 4499822 4962216 5586988 6397617 7395729 8546439
38081 8546439 9779501 11005650 12137024 13101032 13846432 14346791 14603599 14645510 14520071
38072 14520071 14280141 13971802 13629166 13275554 12925224 12579898 12220880 11805254 11274992
38063 11274992 10578804 9696244 8651896 7514423 6383019 5366671 4561435 4030778 3794296
38054 3794296 3828478 4079625 4484123 4987521 5553852 6162179 6795132 7428242 8026174 8546419
38044 8546419 8947362 9196962 9278632 9191718 8946571 8557924 8041959 7419678 6723980 6004434
38034 6004434 5325298 4756948 4364187 4194932 4271182 4583595 5091642 5730743 6425609 7106138
38024 7106138 7720546 8240736 8657616 8968982 9166598 9229125 9123440 8812535 8266756 7475532
38014 7475532 6456648 5259305 3958047 2637840 1374879 220308 -806632 -1713695
38006 -1713695 -2522462 -3254586 -3924183 -4537635 -5096290 -5596718 -6027846 -6369394 -6595871
37997 -6595871 -6684809 -6623571 -6410984 -6055765 -5576337 -5003579 -4383564 -3776170 -3247814 -2859684
37987 -2859684 -2655381 -2653064 -2845584 -3207707 -3705633 -4304205 -4970907 -5678727 -6409358 -7155316
37977 -7155316 -7917673 -8697617 -9484620 -10248205 -10939630 -11503843 -11895587 -12091705 -12094654 -11926374
37967 -11926374 -11615488 -11184337 -10643535 -9996930 -9251478 -8422336 -7528299 -6581128 -5576572
37958 -5576572 -4492672 -3296905 -1960806 -478173 1119816 2759945 4336801 5734931
37950 5734931 6855356 7636646 8064101 8167343 8012245 7692824 7322969 7022735 6895395
37941 6895395 6999771 7330290 7816873 8346821 8798801 9074245 9116372 8914985 8499530 7923744
37931 7923744 7246764 6517764 5769777 5022048 4284360 3557332 2829157 2075153 1266474
37922 1266474 387697 -545293 -1478698 -2331317 -3017485 -3471011 -3660024 -3589267 -3292162 -2818057
37912 -2818057 -2220562 -1550464 -852560 -163773 487091 1074400 1565523 1913840 2065658
37903 2065658 1982175 1664077 1162365 568143 -12892 -488678 -800964 -932857 -905180 -766362
37893 -766362 -580137 -412362 -316554 -319811 -414621 -562535 -710034 -809132 -831934 -772532 -637930
37882 -637930 -436032 -169158 163695 559502 1005958 1482522 1965096 2428257 2842892 3174043
37872 3174043 3385455 3451331 3368513 3160943 2873148 2555753 2249488 1974406 1728307 1493968
37862 1493968 1250899 986424 702634 417843 162242 -31341 -138761 -153406 -88459 28922
37852 28922 169266 312836 456033 609084 787258 1001462 1253264 1535282 1834453 2135538
37842 2135538 2423955 2688231 2921831 3123401 3294955 3439037 3556413 3644772 3697746 3704187
37832 3704187 3649158 3517903 3301601 3001928 2632596 2218631 1794621 1401572 1081064 867021
37822 867021 777650 810532 942874 1137728 1354974 1563260 1747701 1910646 2066688 2234653
37812 2234653 2427728 2642708 2851869 3002773 3028609 2866909 2481694 1883054 1136368 353306
37802 353306 -336761 -824451 -1049620 -1009608 -746871 -326629 183800 727727 1263934 1766720
37792 1766720 2223645 2631789 2993242 3311522 3590232 3832970 4042865 4222400 4375677
37783 4375677 4512464 4649565 4806473 4997666 5226752 5485126 5754656 6013643 6245137
37774 6245137 6443943 6617030 6775961 6926762 7064993 7179263 7259722 7304589 7319496 7309781
37764 7309781 7271759 7190574 7047403 6831072 6545561 6208261 5840496 5456561 5058119 4637619
37754 4637619 4188972 3719030 3252987 2830870 2497318 2289270 2226056 2305413 2507051 2802402
37744 2802402 3165992 3582777 4047274 4554329 5086496 5606702 6062969 6403871 6595187
37735 6595187 6627542 6512652 6274373 5942068 5548047 5125439 4703657 4303909 3939857 3624119
37725 3624119 3373974 3207961 3132689 3129047 3149419 3130091 3012808 2764587 2386890 1911194
37715 1911194 1384550 853223 352250 -96706 -482974 -804877 -1069188 -1289628 -1483404
37706 -1483404 -1668211 -1862574 -2089037 -2376182 -2755501 -3252507 -3875658 -4609086 -5414194
37697 -5414194 -6240349 -7038892 -7772112 -8412575 -8935484 -9311712 -9507932 -9494544 -9256673 -8802181
37687 -8802181 -8163342 -7392589 -6554500 -5715580 -4933125 -4245941 -3670963 -3207861 -2849126
37678 -2849126 -2589763 -2431556 -2380230 -2437505 -2592956 -2821640 -3090105 -3366453 -3625918 -3847660
37668 -3847660 -4007751 -4077377 -4029488 -3848258 -3533754 -3100182 -2572443 -1985564 -1386024 -829832
37658 -829832 -373803 -61980 87182 87734 -15653 -159715 -283399 -349974 -357933 -332570 -303649
37647 -303649 -285335 -271549 -246450 -199482 -134998 -73325 -45305 -83636 -214262 -450820 -794008
37636 -794008 -1235426 -1763650 -2369525 -3047999 -3794921 -4599798 -5438764 -6273811 -7061490 -7767540
37626 -7767540 -8378382 -8902229 -9360976 -9780936 -10188993 -10613151 -11081342 -11614934 -12219854
37617 -12219854 -12881897 -13570557 -14249802 -14889425 -15470423 -15982135 -16414119 -16748164 -16955046
37608 -16955046 -16998093 -16842685 -16467682 -15873434 -15082818 -14135389 -13077211 -11950134 -10785187
37599 -10785187 -9603994 -8427646 -7286362 -6222398 -5284055 -4514551 -3940427 -3562102 -3348575
37590 -3348575 -3239217 -3154661 -3015265 -2761655 -2369845 -1855191 -1265119 -666583 -134463 258315
37580 258315 452321 414862 149141 -306975 -893048 -1543910 -2206387 -2848548 -3457296 -4025555
37570 -4025555 -4536495 -4953721 -5221666 -5274854 -5052198 -4511928 -3642485 -2466172 -1035529
37561 -1035529 575505 2284527 4016838 5721127 7377452 8991795 10578105 12136409
37553 12136409 13638740 15030812 16248122 17236832 17968447 18442656 18678823 18700344 18519219
37544 18519219 18130325 17520451 16685745 15643048 14426208 13072639 11613398 10074774
37536 10074774 8488358 6900579 5373998 3978077 2773116 1795040 1048215 508888
37528 508888 136435 -113066 -276753 -382312 -452131 -508752 -575209 -668885 -793489 -934957
37518 -934957 -1064077 -1145507 -1150882 -1071178 -921197 -731826 -533712 -342957 -157740 34244
37508 34244 245462 482671 746368 1031433 1326041 1610078 1855761 2031128 2104919 2051730
37498 2051730 1856893 1519560 1051194 468740 -213716 -988621 -1850884 -2789091 -3778443
37489 -3778443 -4780168 -5747216 -6632271 -7393640 -7997176 -8415606 -8628022 -8621306 -8393199 -7955573
37479 -7955573 -7336643 -6581109 -5747188 -4900168 -4103980 -3413318 -2867027 -2480937 -2239437
37470 -2239437 -2090652 -1953424 -1738880 -1378353 -843074 -146519 668222 1546526 2437675
37461 2437675 3304663 4128094 4904394 5639537 6341092 7011326 7642157 8211565 8682745
37452 8682745 9009340 9148502 9077392 8803320 8359162 7784966 7106624 6324448 5417195 4357411
37442 4357411 3129677 1744834 246514 -1291361 -2775165 -4107001 -5201010 -5997607
37434 -5997607 -6473134 -6642030 -6549503 -6256466 -5822187 -5291123 -4688725 -4027889 -3322601 -2599588
37424 -2599588 -1898299 -1258081 -702603 -233894 161223 500693 802364 1085720 1373210
37415 1373210 1684828 2027062 2383610 2714897 2967730 3090882 3050722 2841774 2488331 2035112
37405 2035112 1529527 1003565 464361 -102623 -721014 -1408528 -2165665 -2971064 -3783071
37396 -3783071 -4544795 -5190210 -5651766 -5871933 -5818472 -5497400 -4954779 -4263235 -3498717 -2719420
37386 -2719420 -1956221 -1214990 -484363 256226 1028140 1843126 2693590 3549126 4361127
37377 4361127 5071139 5617913 5943507 6002433 5774559 5276198 4561747 3713112 2821097 1966538
37367 1966538 1206915 569595 50340 -383087 -780577 -1192715 -1651916 -2158816 -2678453
37358 -2678453 -3146119 -3480514 -3602094 -3453542 -3015835 -2311662 -1392380 -314375 881841
37349 881841 2177564 3563743 5018411 6486804 7875453 9064043 9930100 10375888 10347359
37340 10347359 9840593 8897560 7595423 6032206 4310388 2521338 735871 -995018
37332 -995018 -2630884 -4131569 -5453638 -6555287 -7404784 -7986082 -8299024 -8356198 -8180729
37323 -8180729 -7808233 -7292858 -6712721 -6167354 -5762448 -5585218 -5681666 -6048215 -6642671 -7407424
37313 -7407424 -8289757 -9246991 -10236863 -11205492 -12085930 -12810004 -13325302 -13606417 -13654334 -13484976
37303 -13484976 -13114318 -12550050 -11795309 -10859838 -9767608 -8554233 -7257945 -5913172 -4552049
37294 -4552049 -3212168 -1944724 -816689 96641 726882 1028576 988787 628245 -3311
37285 -3311 -834598 -1781745 -2758088 -3683629 -4493376 -5144113 -5618663 -5926249 -6098410 -6181515
37275 -6181515 -6227781 -6286746 -6398641 -6589692 -6868348 -7222397 -7619077 -8010630 -8345357 -8581795
37265 -8581795 -8702933 -8726625 -8706517 -8718586 -8834791 -9094416 -9487365 -9958426 -10430217 -10832952
37255 -10832952 -11126782 -11308279 -11402016 -11445037 -11472481 -11508732 -11563577 -11630315 -11683906 -11681220 -11567905
37244 -11567905 -11293428 -10829107 -10180097 -9385156 -8504429 -7600563 -6720893 -5888398 -5105226
37235 -5105226 -4365434 -3668488 -3026538 -2464091 -2012486 -1702036 -1554808 -1581179 -1781005 -2146259
37225 -2146259 -2660834 -3296972 -4012291 -4751665 -5455161 -6070013 -6563125 -6929772 -7194028
37216 -7194028 -7398503 -7585909 -7780516 -7979095 -8155956 -8278246 -8322307 -8283126 -8174524 -8022759
37206 -8022759 -7858579 -7711993 -7610289 -7575390 -7617154 -7725995 -7873611 -8025569 -8157377 -8260699
37196 -8260699 -8335565 -8378286 -8377929 -8324485 -8220371 -8084797 -7947747 -7838793 -7778619 -7777087 -7835890
37185 -7835890 -7951439 -8115537 -8314297 -8527386 -8730055 -8899891 -9027385 -9124651 -9224788 -9369193
37175 -9369193 -9588646 -9888291 -10243148 -10603732 -10907208 -11090251 -11102199 -10917405 -10543270 -10018610
37165 -10018610 -9399939 -8740797 -8075468 -7416655 -6767092 -6135717 -5547246 -5040246 -4656635
37156 -4656635 -4429236 -4372578 -4478701 -4718123 -5046475 -5417242 -5798093 -6183766 -6597533 -7078543
37146 -7078543 -7660988 -8356413 -9148357 -10000248 -10869174 -11715697 -12504789 -13200467 -13760758
37137 -13760758 -14138200 -14287233 -14176734 -13802946 -13195544 -12411315 -11518105 -10580337 -9656152
37128 -9656152 -8804258 -8088023 -7566487 -7274911 -7207804 -7316532 -7523810 -7747532 -7922601 -8012899
37118 -8012899 -8012693 -7941974 -7839960 -7757016 -7742904 -7831503 -8026695 -8296690 -8581708 -8813220 -8935779
37107 -8935779 -8920464 -8764742 -8482553 -8092854 -7612295 -7052941 -6423678 -5733485 -4993727 -4216776
37097 -4216776 -3412040 -2584732 -1741796 -902610 -106542 588801 1118401 1424774 1472136 1256437
37087 1256437 808696 189891 -521604 -1246223 -1918870 -2501111 -2986743 -3396611 -3761467
37078 -3761467 -4099867 -4404181 -4643888 -4783382 -4802303 -4706704 -4526599 -4302958 -4072105 -3856596
37068 -3856596 -3667310 -3513162 -3408797 -3373105 -3419846 -3548263 -3741094 -3972164 -4219880 -4479058
37058 -4479058 -4763471 -5096167 -5492142 -5942993 -6411949 -6841392 -7168755 -7344093 -7343355 -7173080
37048 -7173080 -6864175 -6456164 -5979220 -5444724 -4850392 -4194890 -3489244 -2756036 -2018420
37039 -2018420 -1288534 -563467 169348 920735 1688338 2451215 3173904 3818249 4356866
37030 4356866 4781537 5103133 5344677 5532811 5693332 5852646 6041488 6295300 6648921
37021 6648921 7128291 7743347 8483839 9317598 10191585 11037643 11784202 12371765 12767056
37012 12767056 12970517 13014055 12948958 12827268 12683474 12525021 12336960 12098519 11802518 11467308
37002 11467308 11135821 10863067 10698474 10670995 10783019 11014194 11331094 11696336 12072682
36993 12072682 12421992 12702369 12867519 12870644 12672385 12250246 11605640 10764907 9772860 8681446
36983 8681446 7539015 6384473 5246238 4143622 3089489 2094496 1171609 337766 -388793
36974 -388793 -993580 -1470657 -1826145 -2079457 -2259959 -2398584 -2518733 -2632937 -2747516 -2871451
36964 -2871451 -3023441 -3232875 -3533206 -3949312 -4484428 -5114218 -5792198 -6463655 -7079974
36955 -7079974 -7606335 -8020979 -8309255 -8457055 -8446634 -8256206 -7864528 -7260767 -6456623 -5494201
36945 -5494201 -4443970 -3392142 -2421160 -1588440 -909768 -355506 134869 624215 1149450
36936 1149450 1707741 2261036 2752331 3124829 3338550 3382183 3278151 3079207 2856759 2684019
36926 2684019 2618621 2689016 2887289 3169766 3466118 3696200 3790682 3708576 3445373 3029472
36916 3029472 2508994 1933161 1333478 711011 35613 -741648 -1668277 -2771382 -4046541
36907 -4046541 -5455684 -6932243 -8392234 -9750330 -10937428 -11913031 -12666372 -13206248 -13546873
36898 -13546873 -13699630 -13675260 -13491417 -13175212 -12755464 -12250765 -11665682 -11000656 -10268062
36889 -10268062 -9500745 -8746374 -8053208 -7458698 -6987695 -6658022 -6485961 -6486023 -6665541 -7019239
36879 -7019239 -7528794 -8168069 -8910110 -9729719 -10597541 -11468312 -12273729 -12931288 -13370029
36870 -13370029 -13559622 -13524258 -13332502 -13069616 -12807537 -12585928 -12409713 -12259642 -12107197
36861 -12107197 -11926220 -11699536 -11422769 -11105423 -10766042 -10420460 -10069006 -9691678 -9255918
36852 -9255918 -8733291 -8115639 -7421320 -6687808 -5955345 -5251438 -4583966 -3943665 -3311962
36843 -3311962 -2670391 -2009779 -1337467 -679876 -78638 418171 765355 926667 877510 607320
36833 607320 123010 -550212 -1375493 -2316916 -3349115 -4456491 -5624271 -6830513 -8045387
36824 -8045387 -9236356 -10373636 -11431267 -12382768 -13194772 -13825894 -14236676 -14408453 -14360217
36815 -14360217 -14152057 -13871847 -13611192 -13440744 -13393857 -13463627 -13612367 -13787066 -13933265 -14004270
36805 -14004270 -13967551 -13810036 -13540250 -13184236 -12776584 -12352593 -11946607 -11595298 -11339369
36796 -11339369 -11217945 -11256158 -11452547 -11774391 -12164574 -12556980 -12893162 -13133967 -13263439
36787 -13263439 -13285602 -13216075 -13071442 -12860117 -12577999 -12210129 -11737070 -11143150 -10423282 -9585605
36777 -9585605 -8649330 -7639661 -6582297 -5498804 -4404046 -3307898 -2222532 -1171902
36769 -1171902 -196826 648101 1303277 1713948 1839844 1665961 1213535 546015 -235792
36760 -235792 -1011353 -1666618 -2119757 -2336155 -2327282 -2136690 -1822837 -1447125 -1068505 -739995
36750 -739995 -502432 -375821 -352999 -400244 -465395 -490511 -425675 -241585 62131 456989
36740 456989 895856 1329170 1718851 2043522 2294877 2469771 2562978 2563143 2452619 2211959
36730 2211959 1829779 1316175 713522 96750 -440569 -810189 -953752 -858205 -555978 -109664
36720 -109664 411986 955162 1489696 2004187 2493875 2949239 3350610 3670817 3884840 3981830
36710 3981830 3973227 3892874 3789522 3715232 3714448 3818233 4045455 4407855 4913327 5564680 6356139
36699 6356139 7270705 8278577 9336041 10387078 11371079 12235833 12949343 13503532 13907910
36690 13907910 14177213 14319910 14333554 14208889 13939886 13533613 13014493 12420791 11795195
36681 11795195 11174204 10581486 10027745 9515630 9045888 8621896 8251843 7948506 7726405
36672 7726405 7597144 7565653 7630102 7785472 8027794 8355943 8770392 9270507 9852469 10509298
36662 10509298 11233787 12023946 12888839 13851397 14945592 16207777 17664420 19319831 21148108
36653 21148108 23093134 25078453 27025084 28871463 30587629 32177057 33664842 35078916
36645 35078916 36436047 37740795 38994604 40203798 41377794 42519352 43615843 44638240
36637 44638240 45547433 46303415 46873260 47235663 47381825 47314871 47050931 46621514 46071278
36628 46071278 45445574 44770822 44040294 43217138 42255121 41125565 39836182 38433118 36985702
36619 36985702 35560464 34196245 32892975 31619877 30337235 29018214 27659695 26280446
36611 26280446 24913065 23597508 22379543 21311340 20447974 19835997 19497148 19415892 19538470
36602 19538470 19784091 20062316 20289866 20403795 20371369 20196408 19919368 19607856 19338114
36593 19338114 19173294 19146910 19257607 19476527 19763862 20087879 20438259 20827435 21279596
36584 21279596 21813884 22431019 23108913 23806237 24468871 25035463 25442310 25629914 25551841
36575 25551841 25183516 24528014 23618092 22514830 21301781 20072567 18912929 17883385
36567 17883385 17009965 16286239 15684258 15169466 14714616 14308026 13952659 13656484 13419574
36558 13419574 13225326 13040143 12821166 12528142 12134311 11631629 11028673 10344053 9600239
36549 9600239 8819869 8022315 7218269 6404899 5566961 4685908 3752898 2779073 1799184
36540 1799184 868374 53830 -576707 -967374 -1084658 -922717 -501224 142955 964498
36531 964498 1912270 2925166 3928036 4835798 5566894 6059340 6281223 6232529 5940424
36522 5940424 5451776 4824838 4119813 3387923 2661161 1947386 1234341 501400 -266411
36513 -266411 -1068083 -1883448 -2678136 -3415285 -4070122 -4641529 -5155237 -5656388 -6193428 -6798879
36503 -6798879 -7474031 -8183161 -8859060 -9417421 -9774882 -9864621 -9645152 -9101911 -8244400 -7101235
36493 -7101235 -5713279 -4125695 -2383148 -532382 1369427 3247610 5010245 6556315
36485 6556315 7789272 8633636 9051602 9054495 8703588 8097871 7350966 6564070 5805243 5103938
36475 5103938 4461538 3869108 3321050 2819290 2369815 1976115 1633515 1326942 1032742
36466 1032742 722938 369851 -49449 -548768 -1129446 -1779070 -2471383 -3165854 -3807995
36457 -3807995 -4334045 -4682587 -4811334 -4713089 -4423230 -4013655 -3574598 -3191901 -2927670 -2807502
36447 -2807502 -2814869 -2894770 -2968612 -2955846 -2791795 -2434184 -1860747 -1066013 -62268 1117063
36437 1117063 2416615 3764500 5083856 6306616 7383955 8289735 9017001 9569274 9948656
36428 9948656 10144361 10128092 9861449 9313548 8479773 7392064 6117212 4746087 3379020
36419 3379020 2111309 1020746 157915 -460279 -852940 -1072123 -1193741 -1303348 -1479565
36410 -1479565 -1778593 -2222535 -2793030 -3431208 -4045462 -4528295 -4780684 -4737667 -4385915 -3766633
36400 -3766633 -2964422 -2088595 -1253337 -558938 -75026 170307 190194 27415 -261565 -619500
36390 -619500 -996779 -1357564 -1682962 -1967672 -2210559 -2406623 -2548056 -2633370 -2675005 -2696186
36380 -2696186 -2716916 -2738299 -2736270 -2669112 -2494084 -2184367 -1739797 -1189178 -583879 16243
36370 16243 560078 1017739 1381947 1658809 1854930 1968848 1991133 1911932 1729789 1454198
36360 1454198 1098764 670172 162873 -434670 -1125868 -1894002 -2700372 -3493190 -4221794
36351 -4221794 -4849542 -5361137 -5762937 -6076534 -6327776 -6535463 -6704793 -6828451 -6894190 -6894598
36341 -6894598 -6834086 -6729350 -6601916 -6465159 -6312313 -6113553 -5826597 -5417412 -4880742 -4249489
36331 -4249489 -3588305 -2975352 -2481150 -2152652 -2006559 -2032033 -2199927 -2474009 -2819610 -3207283
36321 -3207283 -3611954 -4009912 -4376856 -4689826 -4933527 -5107758 -5230590 -5333977 -5452868
36312 -5452868 -5612219 -5817672 -6055206 -6300740 -6533083 -6739459 -6909225 -7023449 -7052383 -6964051
36302 -6964051 -6735896 -6360665 -5846127 -5213666 -4497908 -3744281 -3001777 -2312903 -1705778
36293 -1705778 -1191230 -763864 -404615 -84385 229586 564409 932749 1328981 1731140
36284 1731140 2105544 2411891 2610298 2672052 2591478 2392768 2127325 1862172 1663703 1582178
36274 1582178 1641953 1839732 2148622 2523150 2903303 3220885 3411905 3432716 3271903 2951255
36264 2951255 2516312 2023327 1529970 1092212 763913 593433 615196 840425 1253127 1812974
36254 1812974 2461295 3126402 3728689 4188313 4436465 4428257 4153553 3640773 2949160 2150065
36244 2150065 1305951 458832 -366897 -1152726 -1875643 -2506209 -3015886 -3389094 -3632183
36235 -3632183 -3772402 -3845981 -3882253 -3893123 -3872943 -3807794 -3689231 -3525415 -3342401 -3173076
36225 -3173076 -3039577 -2940371 -2849733 -2728756 -2541216 -2267826 -1915334 -1519009 -1137842 -842364
36215 -842364 -696645 -739089 -969691 -1350429 -1819416 -2312119 -2780510 -3203761 -3588224 -3957154
36205 -3957154 -4333491 -4722553 -5102857 -5429663 -5649066 -5715527 -5605006 -5318833 -4877753 -4309972
36195 -4309972 -3639978 -2884035 -2053742 -1163475 -235426 701045 1614378 2476355 3266074
36186 3266074 3972165 4592959 5133220 5597023 5979810 6264640 6425430 6435135 6274010 5934696
36176 5934696 5424369 4765626 3996056 3164466 2322908 1516812 777073 115842 -474526
36167 -474526 -1019578 -1556372 -2122469 -2744348 -3431233 -4176233 -4960844 -5757707 -6530686 -7235018
36157 -7235018 -7819878 -8233438 -8429760 -8376829 -8063529 -7502021 -6723790 -5771925 -4693916
36148 -4693916 -3536859 -2344013 -1151778 11912 1126469 2175301 3142507 4011811
36140 4011811 4768201 5400332 5900478 6260764 6468785 6508168 6366380 6045943 5571764 4989535
36130 4989535 4355515 3722773 3130900 2603683 2153372 1785375 1498401 1281242 1111826
36121 1111826 962659 811662 653574 506012 406155 398677 521124 794353 1220874 1787740
36111 1787740 2469558 3231008 4030580 4825293 5573670 6235521 6770932 7142186 7319380
36102 7319380 7286163 7040651 6590128 5943311 5105963 4082819 2884044 1532206 66220
36093 66220 -1459888 -2984333 -4448946 -5809167 -7037142 -8117322 -9039759 -9797110 -10386773
36084 -10386773 -10814497 -11094819 -11246950 -11288738 -11233141 -11090083 -10872433 -10601036 -10303499 -10006303
36074 -10006303 -9726205 -9468531 -9233994 -9027129 -8857306 -8730100 -8635904 -8544657 -8410078 -8180304
36064 -8180304 -7810560 -7275224 -6577010 -5749749 -4851940 -3952306 -3112898 -2376476 -1762687
36055 -1762687 -1273531 -904142 -651670 -516025 -492270 -561636 -689578 -833417 -954395 -1026644
36045 -1026644 -1039489 -994776 -902807 -779221 -643226 -516839 -424424 -391907 -445210 -607874
36035 -607874 -897800 -1322830 -1875240 -2526937 -3229139 -3919700 -4536487 -5029738 -5366139 -5524185
36025 -5524185 -5488218 -5249072 -4811946 -4204611 -3478512 -2700817 -1941325 -1259913 -698101 -274639
36015 -274639 16638 206850 347147 496464 704742 999494 1382512 1836989 2339315 2868774
36005 2868774 3411109 3955633 4488990 4991125 5438425 5813845 6117169 6366150 6584840
35996 6584840 6785282 6955094 7060146 7061149 6933921 6682223 6338210 5952733 5581504 5273048
35986 5273048 5061928 4967324 4994299 5134513 5365452 5650336 5942441 6195545 6377379 6478824
35976 6478824 6512791 6503191 6470737 6422712 6349465 6226566 6021012 5700038 5240094 4632966
35966 4632966 3887602 3028603 2093108 1127112 181612 -691684 -1445839 -2045727 -2474897
35957 -2474897 -2738783 -2861923 -2880012 -2830297 -2743684 -2640115 -2526518 -2395579 -2225041 -1980042
35947 -1980042 -1621925 -1122963 -480500 277659 1099805 1924470 2693956 3361278 3889848
35938 3889848 4249614 4414593 4364865 4092955 3612326 2964785 2222924 1483070 845918 388388
35928 388388 138108 64522 93228 137127 128742 38952 -123675 -329023 -547451 -767635 -1003193
35917 -1003193 -1286308 -1652237 -2122019 -2690500 -3323908 -3967669 -4561870 -5058822 -5435628
35908 -5435628 -5696555 -5865273 -5972040 -6041937 -6087622 -6107447 -6089392 -6021083 -5903318 -5760211
35898 -5760211 -5638142 -5590949 -5657549 -5843840 -6118828 -6426325 -6704333 -6901236 -6982727 -6930815
35888 -6930815 -6739844 -6413254 -5962973 -5412730 -4804554 -4202937 -3688924 -3341893 -3216679
35879 -3216679 -3328021 -3648712 -4118654 -4658141 -5181569 -5611033 -5888632 -5983520 -5890614 -5623131
35869 -5623131 -5205669 -4673009 -4073329 -3469844 -2935781 -2542167 -2341557 -2353466 -2558653 -2907098
35859 -2907098 -3337069 -3795226 -4247653 -4678976 -5083919 -5457678 -5789990 -6065310 -6267990
35850 -6267990 -6387989 -6423166 -6378660 -6265992 -6101476 -5901167 -5673067 -5412561 -5105758 -4738429
35840 -4738429 -4303935 -3805669 -3254061 -2660954 -2035182 -1382665 -710860 -33150 631541
35831 631541 1264230 1853138 2399804 2922454 3454399 4035057 4694879 5440379 6247079 7065244
35821 7065244 7837579 8521218 9101638 9589286 10001801 10346252 10615300 10798358 10896716 10930086
35811 10930086 10930217 10926296 10931236 10936267 10915475 10836064 10668607 10394716 10012538 9540087 9014645
35800 9014645 8487344 8014316 7646291 7417873 7339197 7394955 7553259 7779545 8046311 8334254
35790 8334254 8628668 8917506 9192595 9451027 9694725 9929089 10161543 10398660 10641260
35781 10641260 10880132 11096649 11269523 11383966 11437180 11436578 11392753 11313309 11202508 11065965
35771 11065965 10914895 10765538 10634635 10534619 10470202 10435158 10409336 10359763 10250311 10059249
35761 10059249 9796703 9511224 9279162 9179662 9265977 9545978 9979872 10494452 11005666 11439285
35751 11439285 11743710 11895275 11899657 11791153 11628294 11483572 11427609 11511350 11751573 12124897
35741 12124897 12572830 13015975 13371976 13571852 13571614 13357334 12942058 12355742 11633902 10811124
35731 10811124 9919985 8990548 8047715 7109380 6188530 5296222 4439724 3616343 2811031
35722 2811031 2003907 1183784 357658 -449837 -1204189 -1869624 -2415237 -2819603 -3075328
35713 -3075328 -3192748 -3200524 -3142059 -3069162 -3034926 -3085637 -3249890 -3526191 -3876359 -4233478
35703 -4233478 -4525017 -4699995 -4745248 -4683835 -4560581 -4425598 -4324252 -4295507 -4374280 -4590237
35693 -4590237 -4958877 -5469933 -6084701 -6748968 -7414716 -8055242 -8663984 -9240798 -9777638
35684 -9777638 -10253068 -10636973 -10900882 -11028059 -11019471 -10894452 -10687034 -10439808 -10197313 -9999957
35674 -9999957 -9877456 -9840059 -9869386 -9916296 -9913422 -9800568 -9549303 -9171180 -8705188 -8194311
35664 -8194311 -7666476 -7129343 -6578200 -6009038 -5427894 -4851782 -4302465 -3798276 -3349188
35655 -3349188 -2957533 -2623461 -2351456 -2153429 -2045998 -2043789 -2153408 -2371503 -2686503 -3081436
35645 -3081436 -3536243 -4030241 -4545386 -5068624 -5589509 -6091411 -6540803 -6884537 -7062571
35636 -7062571 -7032723 -6793079 -6386870 -5885685 -5360976 -4860213 -4399130 -3970114 -3557532 -3149148
35626 -3149148 -2739001 -2325305 -1910133 -1503899 -1131012 -830612 -649462 -629842 -798341 -1160403
35616 -1160403 -1701545 -2392196 -3191168 -4044618 -4882131 -5615947 -6149048 -6392375 -6285125
35607 -6285125 -5809814 -4996367 -3914432 -2657624 -1326184 -14100 1197408 2242772
35599 2242772 3074558 3664606 4000448 4077467 3893338 3450824 2767291 1882815 860603
35590 860603 -219680 -1271514 -2211416 -2968613 -3493412 -3762169 -3778004 -3568167 -3178947
35581 -3178947 -2668107 -2095333 -1512947 -960023 -461930 -35207 304562 536578 635687 582725
35571 582725 380559 66415 -289525 -602959 -804853 -866105 -802920 -659838 -481754 -292152
35561 -292152 -88066 150040 442674 798964 1212162 1663187 2128470 2585966 3014806 3389738
35551 3389738 3676441 3833109 3818422 3601611 3170076 2532524 1717524 768388 -263990
35542 -263990 -1327838 -2374642 -3360369 -4245376 -4995224 -5583896 -5999191 -6248192 -6359532
35533 -6359532 -6379566 -6362177 -6355488 -6391347 -6483140 -6633079 -6843283 -7120664 -7469476 -7876278
35523 -7876278 -8300831 -8683403 -8965794 -9112200 -9116823 -8995846 -8771712 -8460491 -8068823 -7600186
35513 -7600186 -7064716 -6485182 -5894780 -5328238 -4812168 -4360079 -3972908 -3641290 -3345532
35504 -3345532 -3053686 -2722472 -2305023 -1763831 -1082780 -272772 630550 1575678 2507787
35495 2507787 3380469 4161786 4833546 5388100 5827730 6166453 6429172 6644545 6833952
35486 6833952 7002972 7140732 7227927 7249342 7204209 7109461 6995943 6901517 6864556 6918254 7084649
35475 7084649 7368568 7753587 8203036 8668227 9103198 9480658 9800571 10085049 10360866
35466 10360866 10638943 10902533 11110878 11215711 11180277 10989963 10650615 10179379 9596147
35457 9596147 8920428 8173248 7381176 6579545 5812469 5128083 4569784 4167176 3931484
35448 3931484 3857684 3931596 4137928 4466335 4914752 5489794 6202820 7060445 8051384 9134805
35438 9134805 10235704 11250333 12061760 12562763 12680093 12392769 11739826 10818044 9771926
35429 9771926 8775795 8006596 7610486 7672651 8200892 9128248 10332646 11666710 12988532
35420 12988532 14184285 15177149 15923633 16404169 16615643 16568965 16289131 15812754 15180571
35411 15180571 14427039 13572211 12620070 11563980 10396556 9119661 7750661 6323246
35403 6323246 4884243 3489482 2200039 1077331 175580 -465704 -823930 -888489 -653982
35394 -653982 -119361 704709 1785721 3063763 4453761 5854440 7162152 8287536 9170406
35385 9170406 9786171 10140363 10255599 10160304 9885907 9471648 8970620 8450990 7990615 7666983
35375 7666983 7545275 7666613 8038718 8632525 9387646 10225622 11065676 11837657 12490815
35366 12490815 12999908 13368999 13630691 13838668 14053985 14328121 14687530 15125217 15603587
35357 15603587 16067734 16462292 16743216 16880725 16856753 16663399 16305802 15806796 15207255
35348 15207255 14558360 13908289 13290281 12717494 12184379 11670595 11145295 10573584 9927461
35339 9927461 9198937 8408079 7599424 6827413 6139623 5568263 5133619 4853392 4747476
35330 4747476 4832201 5107617 5547582 6100427 6699573 7276553 7769534 8127086 8311842 8306643
35320 8306643 8120084 7786088 7355863 6885487 6423796 6003593 5637202 5316578 5017600
35311 5017600 4707775 4356602 3946971 3483741 2994331 2519088 2095831 1747395 1478371
35302 1478371 1280478 1141113 1050298 1004052 1003695 1051238 1143107 1266593 1401944 1528359 1629310
35291 1629310 1694886 1722581 1717971 1693817 1665533 1644249 1631616 1619275 1592625 1536865 1443665
35280 1443665 1316999 1176078 1054070 993250 1038138 1227192 1582996 2102953 2755501 3486546
35270 3486546 4235515 4954029 5617857 6226566 6792149 7323425 7814856 8246105 8592789
35261 8592789 8841199 8995403 9069421 9069057 8977724 8758519 8372014 7797866 7047943 6166768
35251 6166768 5222030 4289526 3437142 2713867 2148840 1758961 1556661 1549924 1734876 2087842
35241 2087842 2562902 3095924 3613242 4043388 4330016 4442770 4382623 4179649 3882680 3541843
35231 3541843 3188535 2821479 2406893 1893911 1237800 419874 -544157 -1609529 -2717427
35222 -2717427 -3812110 -4853169 -5820066 -6710488 -7535335 -8312026 -9056536 -9774728 -10454851
35213 -10454851 -11064566 -11556158 -11880265 -12002307 -11912288 -11622906 -11160011 -10554678 -9842527
35204 -9842527 -9067692 -8284190 -7549917 -6915197 -6412957 -6056803 -5846820 -5776536 -5834785 -6002814
35194 -6002814 -6252329 -6548458 -6856184 -7146788 -7403219 -7624442 -7826464 -8036784 -8283014
35185 -8283014 -8581883 -8934725 -9329892 -9747440 -10162035 -10543966 -10861006 -11083212 -11190189
35176 -11190189 -11178224 -11064048 -10882955 -10680970 -10502608 -10377542 -10310708 -10280261 -10245231 -10160283
35166 -10160283 -9991785 -9729537 -9391255 -9019275 -8669945 -8397244 -8234750 -8182623 -8205657 -8243946
35156 -8243946 -8231524 -8115180 -7866941 -7487899 -7005105 -6464835 -5924955 -5447370 -5089992 -4897709
35146 -4897709 -4893791 -5075342 -5416117 -5876158 -6413079 -6988709 -7568639 -8117490 -8595248 -8958437
35136 -8958437 -9166911 -9194736 -9041306 -8736168 -8331398 -7882076 -7425422 -6972429 -6517365 -6057313
35126 -6057313 -5608266 -5208918 -4911258 -4761752 -4779904 -4943961 -5192316 -5440896 -5607030 -5628740
35116 -5628740 -5474703 -5146062 -4671926 -4099819 -3484351 -2878407 -2327771 -1866203 -1509363
35107 -1509363 -1250938 -1065292 -916226 -767038 -588215 -362681 -89117 218738 539535
35098 539535 857023 1170885 1497520 1858768 2265623 2708532 3161291 3595039 3991253 4344191
35088 4344191 4652564 4908956 5096348 5194301 5189565 5083335 4891070 4636655 4346135 4045716
35078 4045716 3764667 3538880 3409202 3412467 3569992 3881133 4324946 4865892 5457889 6046084
35068 6046084 6570753 6976151 7221477 7288096 7179700 6916726 6528786 6048721 5510185 4947847
35058 4947847 4396375 3884362 3423924 3002334 2583071 2118268 1567341 912949 167111
35049 167111 -634163 -1443482 -2214453 -2908698 -3497766 -3963866 -4301931 -4521896 -4648680 -4718929
35039 -4718929 -4775406 -4860568 -5010721 -5251231 -5591927 -6021941 -6506316 -6989349 -7407117 -7704653
35029 -7704653 -7849071 -7833161 -7670931 -7390356 -7027335 -6621383 -6211362 -5829359 -5492784 -5197681
35019 -5197681 -4917504 -4609798 -4229219 -3742150 -3137380 -2429224 -1653018 -856225 -89294
35010 -89294 601014 1175024 1600818 1854202 1920903 1802064 1520051 1119739 662966 217611
35000 217611 -156046 -419131 -564495 -619470 -639824 -697189 -862377 -1186073 -1681430 -2317682
34990 -2317682 -3031101 -3748525 -4409941 -4979133 -5441110 -5791777 -6025930 -6128585 -6073687 -5831685
34980 -5831685 -5382961 -4730804 -3907927 -2973285 -2000216 -1061022 -214880 497026 1050639
34971 1050639 1436693 1659542 1736610 1696895 1577486 1417679 1251097 1097909 960370 824049
34961 824049 664300 455266 177846 -176009 -603289 -1092060 -1622511 -2165854 -2683967 -3134109
34951 -3134109 -3479448 -3700433 -3799756 -3797392 -3718911 -3584159 -3401619 -3168417 -2872145 -2491990
34941 -2491990 -2000863 -1372391 -593197 324733 1338934 2381792 3373378 4235796 4904540
34932 4904540 5335391 5507555 5424208 5110625 4608382 3964532 3218151 2390786 1486826 503863
34922 503863 -552942 -1659515 -2768534 -3813347 -4720151 -5426471 -5900200 -6150821 -6226646
34913 -6226646 -6198511 -6136854 -6091475 -6080676 -6091535 -6088876 -6028689 -5871909 -5595421 -5198201 -4701576
34902 -4701576 -4144279 -3574923 -3045510 -2607740 -2310409 -2194598 -2285787 -2586370 -3073485 -3704236
34892 -3704236 -4426084 -5187630 -5944831 -6660005 -7295592 -7809275 -8157012 -8304112 -8237275 -7969659
34882 -7969659 -7537271 -6990613 -6385419 -5773182 -5192542 -4666201 -4207990 -3837583 -3592388
34873 -3592388 -3526678 -3697399 -4145126 -4879580 -5874397 -7071328 -8391710 -9750408 -11065490
34864 -11065490 -12260125 -13260671 -13999518 -14427118 -14528394 -14333003 -13911313 -13355963 -12756733
34855 -12756733 -12179393 -11655987 -11187961 -10758998 -10352644 -9967891 -9624228 -9351049 -9166686
34846 -9166686 -9061338 -8995972 -8916699 -8773715 -8534141 -8185795 -7735152 -7203601 -6623974 -6036925
34836 -6036925 -5485616 -5008112 -4629769 -4359638 -4192963 -4117578 -4119778 -4186855 -4306457 -4464419
34826 -4464419 -4642835 -4820289 -4975560 -5093566 -5169473 -5207431 -5214978 -5198153 -5161231 -5109922 -5053695
34815 -5053695 -5004475 -4972833 -4964638 -4979999 -5014095 -5057986 -5097357 -5109101 -5058597 -4902309 -4598209
34804 -4598209 -4121463 -3478126 -2709111 -1881031 -1067446 -328819 301029 818725 1246130
34795 1246130 1618218 1967299 2309590 2641067 2944353 3200084 3393258 3511157 3538470 3457828
34785 3457828 3258129 2945277 2547511 2111627 1692327 1339840 1089974 958312 938641 1004881
34775 1004881 1115460 1219290 1263136 1199929 996667 640485 142400 -461819 -1115761 -1752957
34765 -1752957 -2311205 -2744342 -3027518 -3157564 -3151749 -3044896 -2882803 -2712638 -2574228 -2495101
34755 -2495101 -2489140 -2557682 -2692497 -2879204 -3098788 -3326826 -3533879 -3690833 -3778167 -3792931
34745 -3792931 -3747018 -3655783 -3522714 -3329094 -3035211 -2593561 -1968120 -1150720 -167308 927625
34735 927625 2064327 3172410 4192941 5087290 5842176 6468761 6995146 7455632 7881584
34726 7881584 8295354 8705872 9106050 9474527 9782554 10003390 10121256 10138534 10078583 9979330
34716 9979330 9876743 9786739 9698201 9581897 9407270 9154259 8813922 8382133 7856138 7240760
34706 7240760 6561768 5875431 5262768 4807135 4566617 4556935 4752386 5099367 5530486 5971848
34696 5971848 6345940 6578078 6610897 6422481 6038259 5528553 4990767 4522481 4196188 4046215
34686 4046215 4071933 4251294 4553199 4942045 5378090 5821447 6241475 6625481 6980610 7328677
34676 7328677 7697382 8110083 8575348 9079687 9588101 10053372 10429615 10684276 10805547
34667 10805547 10804276 10709400 10557147 10377989 10188143 9990200 9781751 9566016 9357654 9179761
34657 9179761 9053728 8988719 8978376 9007332 9063100 9145949 9271590 9465882 9754238 10150630
34647 10150630 10651389 11236495 11876480 12540251 13200436 13835881 14432704 14985096 15496655
34638 15496655 15982287 16469037 16992416 17585437 18261585 18998141 19729264 20355957 20772440
34629 20772440 20898710 20704441 20213774 19491253 18617929 17668222 16694658 15723255 14758747
34620 14758747 13795604 12829185 11863410 10914919 10014658 9205478 8533587 8036033 7731321
34611 7731321 7618758 7684299 7905168 8248962 8671338 9119878 9546353 9921481 10243660 10537516
34601 10537516 10843744 11204423 11648049 12178888 12774971 13396071 13997936 14545973 15022948
34592 15022948 15429093 15776004 16077531 16341893 16568727 16751849 16884997 16967486 17008575 17030303
34582 17030303 17067350 17162082 17355186 17675148 18130625 18708665 19379834 20108080 20859845 21606794
34572 21606794 22321453 22970530 23511537 23895147 24073557 24014461 23717687 23226226 22621998
34563 22621998 22004070 21459270 21041655 20771368 20649624 20675762 20853111 21180886 21640490
34554 21640490 22188014 22760000 23291498 23738237 24091642 24378800 24649059 24957149 25352190
34545 25352190 25873825 26551011 27400474 28425480 29615654 30947159 32384565 33888024
34537 33888024 35425798 36984865 38570739 40195375 41861216 43550644 45224080 46824544
34529 46824544 48285461 49539935 50530192 51216193 51583059 51646857 51456319 51086563 50623785
34520 50623785 50146326 49711134 49350874 49079061 48896795 48797488 48770199 48802660 48883189 49000852
34510 49000852 49145309 49308113 49485290 49679946 49904983 50187009 50570817 51120817 51914953
34501 51914953 53029328 54516943 56388968 58608013 61097996 63766856 66532632 69343390
34493 69343390 72185344 75077598 78056121 81154097 84388112 87756313 91246811 94848696
34485 94848696 98558595 102381179 106326631 110408217 114640258 119035023 123598604 128328812
34477 128328812 133218875 138267423 143490577 148929715 154650565 160734053 167263648 174315318
34469 174315318 181953919 190235262 199209089 208917764 219388979 230625993 242602146
34462 242602146 255265069 268550840 282402222 296782379 311677877 327090387 343021094
34455 343021094 359452773 376333475 393565278 411001854 428456146 445713377 462539675
34448 462539675 478679681 493846958 507719534 519950865 530195725 538141126 543531648
34441 543531648 546184720 545998004 542953369 537120034 528655470 517800411 504865339 490208982
34433 490208982 474211557 457246457 439655458 421733504 403726396 385838281 368241665
34426 368241665 351085331 334500126 318602374 303491115 289236451 275864161 263347689
34419 263347689 251614978 240567770 230104423 220138373 210609028 201485121 192760977
34412 192760977 184445985 176548790 169061437 161951707 155169380 148663506 142399851 136368271
34404 136368271 130577901 125045071 119780017 114776713 110009542 105438941 101022885 96726157
34396 96726157 92521508 88385226 84295279 80236954 76213287 72253702 68416473 64784076
34388 64784076 61451793 58510241 56024778 54018051 52462324 51284098 50377844 49623109
34380 49623109 48901311 48111148 47181323 46077240 44799064 43373325 41843910 40266632
34372 40266632 38705998 37230129 35902168 34770796 33864126 33189663 32739900 32499627 32449443
34363 32449443 32562462 32797300 33094129 33378060 33568510 33591246 33392032 32951116 32293577
34354 32293577 31487781 30629075 29814941 29122153 28592674 28228953 27997003 27836484 27677001
34345 27677001 27457252 27141193 26725546 26235908 25713714 25200584 24727199 24309752 23951397
34336 23951397 23643895 23367508 23091454 22778296 22392851 21912516 21334757 20679264 19984965
34327 19984965 19303646 18691957 18202818 17876734 17733929 17769505 17954762 18246112 18598333
34318 18598333 18975282 19353050 19716940 20057538 20368218 20641497 20861989 20999626 21010254
34309 21010254 20847086 20479109 19908233 19177196 18363689 17561981 16860059 16322595 15984438
34300 15984438 15850562 15896424 16069005 16294718 16497212 16619563 16640918 16581110 16492663 16443014
34290 16443014 16491701 16669665 16969220 17349800 17757048 18146204 18499256 18829293 19172221
34281 19172221 19571745 20065023 20673205 21396764 22214704 23089116 23976997 24846718 25691061
34272 25691061 26528903 27394006 28316355 29303746 30330142 31335194 32236597 32952272 33424166
34263 33424166 33633803 33603198 33381638 33025229 32579187 32070931 31515827 30930261 30343158
34254 30343158 29798778 29348994 29038733 28891713 28903343 29043476 29265721 29517012 29743480
34245 29743480 29893923 29924387 29804447 29521783 29081716 28502852 27813275 27050082 26260466
34236 26260466 25500323 24827624 24290329 23910980 23673691 23522074 23373504 23144714 22775120
34227 22775120 22237066 21533615 20691685 19755170 18776476 17805163 16877176 16009735 15203020
34218 15203020 14445940 13723049 13021143 12334593 11668394 11038370 10468301 9983951 9605110
34209 9605110 9338549 9174782 9089306 9047187 9010068 8944646 8829819 8658515 8433390 8160965
34199 8160965 7850040 7515038 7179010 6871377 6621695 6455024 6391479 6446222 6624937 6916103
34189 6916103 7287382 7691263 8076815 8399565 8625203 8729781 8701039 8541367 8269122 7915860
34179 7915860 7520832 7125856 6771781 6495213 6323887 6271387 6333834 6490895 6711251 6960516
34169 6960516 7208589 7433921 7624169 7775471 7893514 7997052 8120450 8310579 8616309
34160 8616309 9073158 9688207 10430925 11234714 12010594 12668320 13135722 13368747 13351537 13090966
34150 13090966 12609762 11939700 11116160 10177016 9167290 8145376 7182370 6349225 5695912
34141 5695912 5234681 4938682 4758109 4645564 4577433 4560770 4623015 4790638 5068252 5428901
34131 5428901 5819420 6176613 6445272 6589848 6595630 6460328 6181675 5749522 5149167 4375710
34121 4375710 3451221 2433395 1408864 472990 -295151 -852516 -1199857 -1376262 -1444079
34112 -1444079 -1470817 -1514336 -1614349 -1789053 -2034403 -2326094 -2627218 -2902700 -3135384 -3334209
34102 -3334209 -3528326 -3750488 -4020225 -4336263 -4679960 -5024977 -5347209 -5631991 -5877706
34093 -5877706 -6095027 -6301165 -6510681 -6727311 -6941121 -7131474 -7271912 -7332645 -7280356 -7078935
34083 -7078935 -6694226 -6101721 -5293616 -4283761 -3112453 -1852087 -609279 484190 1294954
34074 1294954 1719608 1710830 1286940 523409 -466145 -1550121 -2595679 -3482844 -4117737
34065 -4117737 -4444151 -4450668 -4170887 -3675770 -3058762 -2416612 -1830901 -1355173 -1009722 -783675
34055 -783675 -643244 -544308 -445146 -314101 -130322 118965 439616 828414 1269901 1735675
34045 1735675 2188401 2590534 2914785 3151216 3307516 3404124 3469014 3534470 3633393 3791718
34035 3791718 4017494 4291849 4568057 4782120 4873055 4805294 4582945 4249167 3872368 3527765
34025 3527765 3282342 3185394 3262141 3508710 3890197 4344281 4790583 5143862 5329361 5298447
34015 5298447 5040013 4581282 3975753 3284488 2561588 1850042 1185073 597412 111834
34006 111834 -257868 -513073 -669659 -750732 -774016 -738602 -618031 -365605 67367 706715
33996 706715 1535072 2486332 3458793 4342464 5049580 5535851 5804415 5893320 5855374 5740721
33986 5740721 5587115 5417009 5239485 5056798 4874412 4709543 4592259 4557362 4630895 4816878
33976 4816878 5088815 5389020 5637300 5747433 5647087 5296886 4706121 3942094 3127310
33967 3127310 2418870 1971429 1895253 2226242 2920803 3876866 4970340 6090646 7162722
33958 7162722 8152541 9060959 9911695 10736272 11557852 12378764 13177604 13916725 14553356
33949 14553356 15045631 15351194 15424210 15218477 14699037 13858014 12727128 11379562 9916744
33940 9916744 8441827 7030210 5712012 4476000 3291385 2134005 1003997 -70130
33932 -70130 -1039695 -1852648 -2473675 -2899448 -3160878 -3310328 -3400377 -3464862 -3510003 -3517397 -3456182
33921 -3456182 -3299658 -3040612 -2699070 -2318017 -1948178 -1629695 -1380999 -1200101 -1074542
33912 -1074542 -991607 -943356 -927116 -944257 -998074 -1090008 -1214953 -1358392 -1497374 -1604726
33902 -1604726 -1653831 -1621450 -1488214 -1238848 -864515 -366782 240340 932804 1681437 2455172
33892 2455172 3221060 3943404 4584555 5107856 5481954 5685863 5713190 5572819 5285087 4875837
33882 4875837 4371251 3793449 3155786 2459819 1698691 868157 -20693 -935513 -1826611
33873 -1826611 -2636157 -3306231 -3783912 -4026016 -4005146 -3714895 -3171445 -2412718 -1498431 -510648
33863 -510648 451354 1287385 1920800 2319771 2503904 2532554 2480602 2413133 2370286 2367989 2411281
33852 2411281 2509792 2685031 2966095 3378222 3931193 4612141 5383984 6189309 6959246 7625876
33842 7625876 8135063 8455995 8584677 8540719 8359173 8081008 7746050 7389956 7043429 6730254
33832 6730254 6462734 6236923 6032109 5817012 5560478 5240906 4849619 4387849 3861257
33823 3861257 3275955 2637461 1952658 1235450 515532 -154792 -703909 -1058346 -1168782
33814 -1168782 -1031793 -696025 -249976 201695 561901 756585 741629 506319 76070 -489330
33804 -489330 -1107128 -1691317 -2172130 -2507404 -2685096 -2721366 -2656802 -2548669 -2456520 -2423743
33794 -2423743 -2463384 -2556194 -2662323 -2740601 -2767025 -2745977 -2710493 -2710167 -2789798 -2968417 -3230650
33783 -3230650 -3535821 -3838734 -4109445 -4342292 -4552564 -4765073 -5000198 -5262503 -5536587
33774 -5536587 -5792975 -6002014 -6148652 -6240173 -6303297 -6372724 -6476173 -6621823 -6793813 -6958988
33764 -6958988 -7081934 -7139798 -7129616 -7067619 -6984340 -6917373 -6900583 -6950792 -7058099 -7186697 -7287239
33753 -7287239 -7314750 -7243209 -7070461 -6813271 -6498168 -6154988 -5815241 -5511684 -5274904 -5127345
33743 -5127345 -5078708 -5125235 -5251624 -5433023 -5636529 -5824109 -5959170 -6016348 -5990316 -5898221
33733 -5898221 -5773903 -5657397 -5585237 -5583750 -5663542 -5813348 -5995598 -6149074 -6202119 -6093155
33723 -6093155 -5789009 -5291718 -4631764 -3854001 -3004450 -2121811 -1233516 -356121 499518
33714 499518 1320571 2087701 2777696 3371045 3857895 4237923 4515363 4694176 4777395 4770616
33704 4770616 4685815 4541016 4354897 4140253 3901950 3641449 3364803 3089208 2845122 2673242
33694 2673242 2615867 2703139 2937979 3287022 3683794 4045198 4296279 4394376 4342624 4185560
33684 4185560 3987997 3808047 3678048 3600373 3555581 3516657 3464562 3400583 3349457 3349248 3431669
33673 3431669 3603511 3839382 4088882 4293571 4405274 4398300 4272834 4051564 3773008 3483193
33663 3483193 3226527 3039116 2948947 2982875 3173138 3554438 4149683 4951906 5913278 6947632
33653 6947632 7945352 8794365 9400026 9698554 9661982 9295580 8630623 7715174 6604643
33644 6604643 5353741 4011733 2621635 1221014 -159040 -1496927 -2781633 -4008624
33636 -4008624 -5172193 -6258706 -7243130 -8088522 -8748951 -9177919 -9341687 -9231923 -8870996
33627 -8870996 -8307842 -7607249 -6836712 -6054045 -5298836 -4590356 -3931627 -3315867 -2731465
33618 -2731465 -2165433 -1608171 -1060692 -540781 -82215 275880 506053 607490 610762 569129
33608 569129 540146 565943 661002 812050 988105 1153642 1277607 1336108 1312590 1200508
33598 1200508 1008708 764120 506629 277141 105562 4848 -27999 -7347 45737 106952
33588 106952 151470 156639 105173 -11456 -190566 -418406 -673901 -934915 -1183556 -1406356
33578 -1406356 -1587926 -1702148 -1708474 -1559214 -1217073 -675368 29771 823166 1610100 2302392
33568 2302392 2838362 3189349 3354386 3350099 3202410 2943158 2610006 2243656 1876665 1516466
33558 1516466 1135340 679446 95476 -640504 -1508615 -2451174 -3393631 -4269336 -5037602
33549 -5037602 -5689693 -6244718 -6741316 -7228490 -7754715 -8355313 -9042333 -9801777 -10598158
33540 -10598158 -11382628 -12102287 -12710965 -13181116 -13513141 -13736900 -13902489 -14062945 -14256639
33531 -14256639 -14497542 -14775533 -15061942 -15314566 -15481849 -15510309 -15357307 -15005450 -14471312
33522 -14471312 -13802477 -13062687 -12311673 -11589614 -10912893 -10280444 -9685165 -9124490 -8605840
33513 -8605840 -8144208 -7752869 -7433457 -7173015 -6950246 -6746093 -6551302 -6366042 -6191083
33504 -6191083 -6015213 -5808483 -5530383 -5152780 -4685110 -4184809 -3743943 -3457246 -3387335 -3543731
33494 -3543731 -3883934 -4332776 -4808295 -5242760 -5593876 -5847304 -6014009 -6124661 -6221096 -6344394
33484 -6344394 -6521950 -6759172 -7039942 -7333521 -7601293 -7800070 -7885124 -7817113 -7572015 -7149266
33474 -7149266 -6574400 -5895098 -5170786 -4457450 -3792565 -3187081 -2628780 -2095174 -1568648
33465 -1568648 -1045064 -530976 -32916 451333 931322 1413828 1893822 2355039 2779997
33456 2779997 3161882 3510266 3847765 4200237 4585461 5004551 5438656 5852238 6202570
33447 6202570 6451870 6576529 6570215 6442496 6216433 5925840 5610501 5309763 5058242 4886616
33437 4886616 4825515 4906520 5155472 5578876 6150595 6807805 7460001 8006612 8355530 8438878
33427 8438878 8226487 7735686 7031506 6212865 5387971 4648525 4051907 3615701 3323961
33418 3323961 3140539 3022757 2930290 2828503 2688453 2485796 2200132 1816154 1326707 734884
33408 734884 51683 -710127 -1540770 -2432447 -3373637 -4344265 -5316607 -6262124 -7159376 -7996771
33398 -7996771 -8767990 -9464440 -10071386 -10569929 -10941018 -11167557 -11235359 -11136298 -10874120 -10469249
33388 -10469249 -9958260 -9386653 -8797305 -8219971 -7667545 -7141057 -6639315 -6165866 -5728526
33379 -5728526 -5332137 -4969295 -4615235 -4231943 -3781953 -3245553 -2631847 -1978815 -1345257
33370 -1345257 -799829 -408230 -217428 -240320 -449249 -783760 -1168779 -1533980 -1827848 -2025216
33360 -2025216 -2128336 -2160593 -2154102 -2137030 -2127297 -2133761 -2160075 -2206581 -2270900 -2350590 -2448013 -2573074
33348 -2573074 -2740134 -2960806 -3238210 -3566568 -3934933 -4331058 -4742922 -5158651 -5566380
33339 -5566380 -5953477 -6303050 -6588004 -6767519 -6791790 -6615397 -6212620 -5586632 -4770071 -3820041
33329 -3820041 -2810697 -1823454 -934253 -200359 348526 711616 911126 981848 959595 871972
33319 871972 734489 553390 333605 87328 -162439 -386838 -562781 -684319 -766123 -836277
33309 -836277 -922208 -1037119 -1173125 -1303268 -1390215 -1396565 -1291931 -1055032 -672519 -137365
33299 -137365 551356 1386570 2349375 3405354 4505283 5593643 6623478 7570836 8440974
33290 8440974 9262548 10071924 10894603 11732361 12561948 13344509 14038605 14608700 15026306
33281 15026306 15267575 15313072 15151612 14784651 14226230 13497224 12617976 11605001 10474119
33272 10474119 9247605 7960844 6665002 5424462 4309984 3390299 2724649 2356370
33264 2356370 2305535 2560644 3073594 3762937 4525688 5252980 5844688 6221297 6332420 6160143
33254 6160143 5715125 5026459 4129698 3058477 1843311 517229 -876519 -2281391 -3632464
33245 -3632464 -4866062 -5927764 -6776087 -7385038 -7749282 -7890174 -7855811 -7710304 -7515311
33236 -7515311 -7313572 -7123160 -6943516 -6766920 -6587923 -6407695 -6234426 -6081736 -5966194
33227 -5966194 -5904790 -5912694 -6000176 -6166872 -6394327 -6641358 -6847202 -6943626 -6872885 -6606188
33217 -6606188 -6156409 -5578909 -4957398 -4378256 -3903275 -3552521 -3304914 -3116115 -2944851
33208 -2944851 -2773521 -2611295 -2478427 -2383072 -2306784 -2208170 -2041177 -1775148 -1404460 -944290
33198 -944290 -418715 149372 741219 1339616 1926253 2483398 3000177 3479261 3937353 4395515
33188 4395515 4862720 5322891 5734749 6044924 6205951 6189360 5989362 5618472 5099519 4458872
33178 4458872 3723960 2924144 2090894 1254903 443086 -319421 -1002197 -1564831 -1963321
33169 -1963321 -2168037 -2182680 -2049819 -1836237 -1605410 -1393725 -1204092 -1017728 -812606 -574436
33159 -574436 -294218 41757 457297 979086 1619657 2361591 3152484 3912096 4547201 4970091
33149 4970091 5118394 4971884 4558700 3945717 3216055 2444290 1680740 950201 261821
33140 261821 -379090 -966018 -1494746 -1969449 -2403887 -2815396 -3215822 -3605539 -3974189 -4307611
33130 -4307611 -4596663 -4842290 -5053882 -5243519 -5421770 -5598032 -5782831 -5987792 -6222323
33121 -6222323 -6490374 -6790902 -7122211 -7486603 -7891054 -8342632 -8841611 -9376931 -9926358
33112 -9926358 -10459898 -10944256 -11348303 -11650636 -11847734 -11958202 -12019769 -12080551 -12188595 -12381541
33102 -12381541 -12675623 -13055580 -13471916 -13851616 -14120254 -14224705 -14145327 -13894592 -13507629
33093 -13507629 -13032329 -12522820 -12035174 -11622092 -11325242 -11167476 -11148799 -11247596 -11425262 -11632258
33083 -11632258 -11816165 -11932923 -11958811 -11897265 -11776088 -11635988 -11515898 -11441128 -11417906 -11434027
33073 -11434027 -11462564 -11465852 -11400309 -11224347 -10909018 -10446529 -9851540 -9154717 -8392243 -7595847
33063 -7595847 -6787077 -5979203 -5187735 -4444709 -3806603 -3347471 -3137494 -3215888 -3570206 -4131170
33053 -4131170 -4786383 -5409102 -5892105 -6174667 -6254576 -6183989 -6052693 -5963309 -6003616 -6222906
33043 -6222906 -6619784 -7145089 -7717304 -8243651 -8639977 -8844698 -8824679 -8573789 -8107600 -7458130
33033 -7458130 -6670288 -5798968 -4904604 -4045613 -3267800 -2593744 -2017684 -1510312 -1032337
33024 -1032337 -550488 -49331 464303 964944 1419409 1801817 2105955 2348119 2558091
33015 2558091 2761992 2965041 3143978 3256260 3264038 3159112 2971268 2752979 2550483 2379625
33005 2379625 2218863 2019621 1726397 1298042 723420 26675 -739527 -1509519 -2221316
32996 -2221316 -2826852 -3293230 -3599373 -3734870 -3703374 -3525895 -3237558 -2877112 -2475566 -2051126
32986 -2051126 -1611576 -1159068 -691908 -203132 319046 883568 1482267 2077289 2600333
32977 2600333 2966728 3096802 2933495 2451826 1664171 624938 -569688 -1795501 -2929121
32968 -2929121 -3881222 -4617624 -5157623 -5551250 -5847767 -6070867 -6211127 -6236288 -6111209 -5816838
32958 -5816838 -5360926 -4777844 -4118407 -3434340 -2765496 -2136885 -1564859 -1063618 -643340
32949 -643340 -300696 -11460 265553 573160 937932 1360168 1816326 2270834 2689967 3051618
32939 3051618 3348805 3588284 3786946 3968751 4164655 4415299 4771529 5285432 5989833
32930 5989833 6874831 7875987 8883493 9769096 10418291 10755007 10751794 10425014 9819291
32921 9819291 8988387 7980397 6832827 5578135 4254819 2915975 1628486 461425
32913 461425 -531293 -1325080 -1927263 -2365407 -2667589 -2847885 -2907941 -2853088 -2709146 -2525987
32903 -2525987 -2365316 -2280678 -2299363 -2412564 -2577982 -2736153 -2834673 -2848099 -2783836 -2674216
32893 -2674216 -2562158 -2487163 -2474640 -2530191 -2640417 -2780079 -2922849 -3051668 -3164752 -3274475
32883 -3274475 -3399496 -3555137 -3748907 -3984097 -4267548 -4613986 -5041632 -5560261 -6158783
32874 -6158783 -6800926 -7432581 -7996399 -8444812 -8745704 -8881631 -8847610 -8650909 -8312127 -7864107
32864 -7864107 -7346056 -6794186 -6234335 -5682296 -5152521 -4668793 -4267767 -3990682 -3867079
32855 -3867079 -3900165 -4061891 -4299205 -4547125 -4743648 -4843293 -4826297 -4699448 -4486922 -4215549
32845 -4215549 -3903077 -3555396 -3171969 -2753930 -2308955 -1850019 -1389444 -933322 -481162
32836 -481162 -30651 417840 861921 1301755 1742135 2187342 2631297 3051267 3411919 3678572
32826 3678572 3831196 3870636 3815355 3693693 3536944 3374735 3231939 3127508 3076037 3090238
32816 3090238 3179631 3342954 3558198 3779002 3943615 3994150 3896593 3652193 3296807 2890683
32806 2890683 2503025 2195476 2008591 1954507 2016292 2151796 2299973 2389467 2349708 2123553
32796 2123553 1679200 1018424 177765 -779361 -1777054 -2740659 -3603555 -4307373 -4801829
32787 -4801829 -5049445 -5034043 -4766988 -4285932 -3646114 -2909071 -2133822 -1371775 -663443 -35911
32777 -35911 496686 927010 1244305 1426701 1442976 1265346 887666 339369 -312689 -975789
32767 -975789 -1551071 -1953594 -2126975 -2050795 -1742056 -1252780 -664346 -77146 405996 700629
32757 700629 759414 581505 208720 -290462 -843843 -1397265 -1926624 -2435265 -2939305 -3449540
32747 -3449540 -3958628 -4437235 -4837281 -5098554 -5156725 -4953609 -4450670 -3643422 -2570583
32738 -2570583 -1312085 24538 1324001 2482248 3420279 4091961 4485861 4620780 4535507
32729 4535507 4276101 3885914 3401837 2855601 2275976 1688604 1113306 560615 29758
32720 29758 -489596 -1010492 -1538833 -2066323 -2571683 -3030472 -3428410 -3771052 -4084580 -4406396
32710 -4406396 -4769109 -5185202 -5639245 -6089726 -6477390 -6735599 -6800063 -6617640 -6154351 -5401788
32700 -5401788 -4379654 -3132129 -1718337 -200946 1361498 2915501 4408835 5788063
32692 5788063 7003557 8022995 8845987 9507974 10067515 10584045 11100734 11640923 12213912
32683 12213912 12820364 13453159 14097424 14734323 15347732 15928368 16471244 16967709 17397913
32674 17397913 17729503 17924345 17950024 17790447 17450388 16952098 16326765 15607168 14826569
32665 14826569 14022623 13239534 12522983 11909348 11416175 11039798 10760891 10554953 10403416
32656 10403416 10300831 10253563 10268313 10335499 10418896 10462189 10412682 10249380 9997696 9721104
32646 9721104 9494822 9376615 9388838 9516857 9719791 9945733 10145125 10279159 10321914 10256687
32636 10256687 10070230 9751201 9296869 8724523 8078474 7425647 6840651 6387117 6102283
32627 6102283 5989169 6018335 6138835 6294614 6439728 6546422 6604433 6614683 6582635 6514533
32617 6514533 6415747 6287981 6123693 5900423 5580429 5119153 4480507 3652351 2655419 1542686
32607 1542686 390506 -715440 -1695953 -2491946 -3071814 -3430532 -3582144 -3549417 -3353877
32598 -3353877 -3008473 -2515054 -1867869 -1061594 -100012 997938 2196277 3444734 4685666
32589 4685666 5862424 6925371 7834040 8557712 9077027 9386093 9492612 9415701 9183942
32580 9183942 8835680 8419443 7989275 7591833 7249423 6949889 6652903 6311431 5895886
32571 5895886 5406951 4872263 4333207 3832020 3405937 3088450 2912703 2910868 3106771 3504559
32561 3504559 4079567 4776638 5517427 6214214 6784910 7163460 7302790 7172280 6754969
32552 6754969 6048812 5072107 3868793 2507974 1075590 -338101 -1649201 -2786587
32544 -2786587 -3696182 -4344168 -4716383 -4812244 -4638007 -4206694 -3545161 -2700774 -1740924 -746278
32534 -746278 197133 1005371 1606188 1951981 2031849 1875585 1545471 1118569 667771 250025
32524 250025 -95140 -340364 -465158 -455437 -308501 -40197 310608 684033 1008659 1216571
32514 1216571 1260274 1126530 841276 461801 58077 -308520 -599336 -800185 -912525 -940326
32504 -940326 -879489 -714495 -423746 8381 577770 1251548 1968532 2648860 3207955 3569709
32494 3569709 3677382 3502810 3052561 2367210 1511692 559544 -423103 -1388376 -2309380
32485 -2309380 -3174950 -3980476 -4721115 -5391266 -5988246 -6514668 -6976026 -7374438 -7702022
32476 -7702022 -7937452 -8047542 -7993033 -7735260 -7241381 -6490145 -5481526 -4248052 -2858967
32467 -2858967 -1410252 -4466 1267281 2332795 3138711 3651999 3866914 3811691 3545923
32458 3545923 3145364 2679887 2195222 1706766 1206638 678161 109357 -499919 -1137301
32449 -1137301 -1780335 -2399040 -2958109 -3420090 -3750820 -3926626 -3940599 -3804316 -3543102 -3186671
32439 -3186671 -2760346 -2282275 -1768468 -1242074 -739951 -310820 -4425 143418 122576 -49187
32429 -49187 -335747 -699737 -1117379 -1581369 -2090599 -2635993 -3194303 -3734117 -4228368 -4664204
32419 -4664204 -5044817 -5383438 -5693388 -5979136 -6232224 -6433340 -6559392 -6592695 -6528133 -6373775
32409 -6373775 -6144097 -5851716 -5506677 -5125793 -4743547 -4412192 -4186852 -4103538 -4163092 -4329880
32399 -4329880 -4545768 -4753006 -4916185 -5034239 -5138546 -5279598 -5508741 -5861439 -6346620
32390 -6346620 -6944867 -7616057 -8313516 -8998136 -9646023 -10247840 -10803618 -11318317 -11800003
32381 -11800003 -12258176 -12698964 -13116800 -13485960 -13756812 -13860053 -13718970 -13267009 -12466773
32372 -12466773 -11325733 -9902545 -8298302 -6632548 -5013072 -3513554 -2168350 -982811
32364 -982811 50456 938877 1685045 2288832 2752700 3085883 3304465 3427464 3471694 3449067
32354 3449067 3368244 3239144 3076099 2896104 2712808 2530905 2345258 2144930 1918947 1661228
32344 1661228 1374686 1075300 794700 577601 471532 511151 704137 1025565 1422838 1828355
32334 1828355 2175630 2414979 2524031 2507794 2387261 2182781 1902030 1538433 1078910 515721
32324 515721 -143377 -871401 -1626846 -2363676 -3039416 -3616448 -4058881 -4331582 -4404251 -4256676
32314 -4256676 -3880251 -3276705 -2459676 -1461426 -339007 829006 1957914 2977441 3846319
32305 3846319 4553702 5108359 5523062 5803588 5948145 5956163 5839657 5629904 5375950 5135737
32295 5135737 4963149 4895416 4944873 5096647 5311277 5531661 5695462 5752287 5679256 5485743
32285 5485743 5203526 4868028 4501513 4106501 3671054 3181146 2631979 2031123 1392409
32276 1392409 726258 34686 -684586 -1426992 -2169856 -2868592 -3463902 -3896803 -4123374
32267 -4123374 -4122295 -3894286 -3457477 -2842725 -2090114 -1246564 -364847 496458 1274803 1910447
32257 1910447 2357578 2594231 2624849 2474472 2179501 1780787 1320276 838390 369968 -59857
32247 -59857 -437075 -756807 -1019828 -1229789 -1392303 -1516230 -1616934 -1719454 -1858031 -2069837
32237 -2069837 -2384877 -2817026 -3359795 -3987083 -4657943 -5324805 -5943180 -6478082 -6903114
32228 -6903114 -7194964 -7331804 -7301165 -7113075 -6808043 -6452975 -6126805 -5903186 -5837043 -5957844
32218 -5957844 -6268771 -6749474 -7360606 -8049804 -8759261 -9434476 -10033239 -10533129 -10934530
32209 -10934530 -11256356 -11525161 -11762752 -11977766 -12162605 -12294266 -12338696 -12258915 -12023956 -11613025
32199 -11613025 -11013006 -10214371 -9212548 -8016697 -6661501 -5215028 -3777089 -2466149
32191 -2466149 -1398079 -664171 -315345 -354925 -738604 -1380505 -2165835 -2969658 -3678062
32182 -3678062 -4205533 -4503269 -4557364 -4380552 -4002642 -3462107 -2798516 -2046551 -1234809 -390664
32172 -390664 453142 1257055 1980557 2590843 3068071 3404592 3600579 3661323 3600503 3448403
32162 3448403 3257590 3097622 3037589 3124452 3367655 3735929 4166394 4582612 4915769 5121565
32152 5121565 5187077 5127267 4975517 4773174 4560531 4369718 4219423 4111870 4033164 3958339
32142 3958339 3860611 3721060 3533748 3304146 3043286 2761830 2466794 2161550 1848424 1532041
32132 1532041 1220818 925500 656344 421065 223059 58407 -86340 -230388 -387662
32123 -387662 -556301 -719387 -859031 -973624 -1084751 -1228481 -1436658 -1718782 -2052785 -2387768
32113 -2387768 -2656913 -2795752 -2759938 -2536878 -2146904 -1632635 -1040557 -403479 267434 977935
32103 977935 1737031 2541822 3367820 4168732 4885729 5462651 5861591 6073310 6118411 6038047
32093 6038047 5877643 5671423 5435131 5168079 4859325 4492593 4049864 3517192 2893698
32084 2893698 2199300 1475224 775578 154394 -345411 -697723 -894884 -948592 -891277 -775797
32074 -775797 -670148 -646180 -765353 -1066820 -1561356 -2230621 -3029403 -3891012 -4738888 -5504472
32064 -5504472 -6143590 -6640124 -6993523 -7200317 -7245185 -7107966 -6778336 -6264513 -5590322 -4786312
32054 -4786312 -3883330 -2910793 -1896151 -862709 173227 1203572 2226871 3243366
32046 3243366 4246574 5213868 6101775 6850721 7398667 7698259 7731389 7516841 7108845
32037 7108845 6587125 6041778 5556922 5195405 4986505 4920220 4951794 5016463 5050740 5015154
32027 5015154 4911569 4785610 4708266 4743716 4922057 5232300 5634533 6077890 6513443 6901339
32017 6901339 7216940 7457977 7649323 7839390 8084935 8428565 8880106 9411870 9968591
32008 9968591 10484080 10895903 11154537 11227761 11102403 10785610 10306171 9713173 9068183 8431853
31998 8431853 7852105 7361014 6980340 6729448 6629675 6703432 6969015 7432310 8077175 8857759
31988 8857759 9697123 10495573 11148749 11570640 11713086 11574190 11193760 10639821 9991722
31979 9991722 9322838 8684175 8092368 7528293 6950043 6315439 5601835 4813001 3973460
31970 3973460 3119549 2295040 1550454 939801 511365 295382 294316 479634 796022 1171408
31960 1171408 1529356 1800542 1932924 1902674 1725386 1460953 1203507 1055216 1094333 1352847
31950 1352847 1812959 2420341 3104866 3799251 4449964 5019656 5484529 5831077 6053726
31941 6053726 6150979 6118514 5942956 5602638 5076533 4355334 3447604 2379520 1190942
31932 1190942 -70191 -1354532 -2616907 -3817914 -4922371 -5899268 -6725738 -7391399 -7898017
31923 -7898017 -8254967 -8475982 -8580477 -8596828 -8562855 -8521474 -8512213 -8559575 -8660430 -8776260
31913 -8776260 -8837832 -8764682 -8492114 -7992842 -7284113 -6420449 -5478654 -4541588 -3683222 -2955627
31903 -2955627 -2380159 -1947160 -1626648 -1386459 -1208537 -1094002 -1054480 -1095938 -1205519 -1348838
31893 -1348838 -1478007 -1544718 -1511279 -1355446 -1069648 -658389 -136897 469375 1127100 1800382
31883 1800382 2456659 3069899 3620655 4095368 4486782 4794352 5022504 5176742 5260214 5273407
31873 5273407 5216914 5094878 4916366 4693567 4437662 4154342 3841333 3489604 3088505 2633130
31863 2633130 2130829 1603776 1085980 615542 225463 -62309 -236270 -288778 -208384 23344
31853 23344 428005 1021052 1800911 2741023 3789005 4874451 5921881 6861872 7636058
31844 7636058 8198252 8516962 8580463 8400006 8006932 7444889 6761683 6003409 5210051 4411788
31834 4411788 3627878 2870217 2150075 1482902 887326 379679 -30740 -342200 -558429
31825 -558429 -687598 -743342 -745491 -718352 -687100 -673591 -692095 -745777 -826460 -919642 -1013293
31814 -1013293 -1106287 -1213484 -1366814 -1612513 -2004545 -2595191 -3424538 -4509876 -5835818
31805 -5835818 -7348126 -8956015 -10544556 -11992962 -13192554 -14061385 -14555610 -14676529 -14470457
31796 -14470457 -14020071 -13429468 -12806769 -12247488 -11821461 -11565928 -11485646 -11558064 -11740460 -11977046
31786 -11977046 -12205813 -12365749 -12405337 -12292512 -12023510 -11625449 -11148385 -10648129 -10166821
31777 -10166821 -9719812 -9294316 -8860186 -8388112 -7866906 -7311392 -6757337 -6247254 -5815677
31768 -5815677 -5480811 -5243559 -5090154 -4994765 -4921938 -4830933 -4682715 -4447482 -4110018 -3671944
31758 -3671944 -3151523 -2580754 -1998326 -1438367 -918622 -433861 41734 544346 1107342
31749 1107342 1749851 2469226 3237319 4000394 4683765 5203079 5482937 5479996 5202819 4718432
31739 4718432 4139482 3595514 3200336 3028217 3104732 3410085 3889307 4464911 5050147 5562458
31729 5562458 5936324 6133205 6145313 5991634 5708239 5337165 4916878 4474670 4020752 3545843
31719 3545843 3025333 2431420 1749750 992393 198397 -580484 -1301020 -1942762 -2506072
31710 -2506072 -2996579 -3407926 -3714188 -3875773 -3854651 -3630744 -3211679 -2631995 -1943387 -1201524
31700 -1201524 -454952 261123 925692 1527782 2058784 2505198 2846907 3063389 3144621 3099679
31690 3099679 2957524 2759588 2548371 2357399 2206238 2100918 2036745 1999512 1964338 1896238
31680 1896238 1757239 1518968 1173323 734485 232673 -294104 -805054 -1258313 -1613098
31671 -1613098 -1835652 -1908931 -1841930 -1672677 -1461689 -1278290 -1185793 -1230452 -1435684 -1800709
31661 -1800709 -2302192 -2897939 -3533003 -4149729 -4701138 -5162116 -5531054 -5820584 -6044684
31652 -6044684 -6211268 -6322416 -6377112 -6370922 -6292436 -6121024 -5830493 -5399139 -4821404 -4113872
31642 -4113872 -3311607 -2457561 -1592136 -748277 47769 773553 1408778 1935666 2339474
31633 2339474 2606901 2723216 2672645 2445573 2049561 1515422 892444 236253 -401324 -975009
31623 -975009 -1444845 -1778243 -1957813 -1990467 -1911104 -1777572 -1658033 -1613941 -1682662 -1865069
31613 -1865069 -2123949 -2395974 -2613179 -2723921 -2702983 -2547173 -2262237 -1852194 -1318883 -670440
31603 -670440 69771 861586 1654984 2400988 3060853 3610195 4038204 4344858 4539522 4641453
31593 4641453 4679346 4687632 4701582 4755291 4882556 5115328 5475258 5961125 6541208 7158298
31583 7158298 7746959 8254177 8652755 8943158 9147933 9305133 9462028 9665348 9946272
31574 9946272 10305225 10704835 11076175 11337046 11416134 11274406 10916260 10387436 9762207 9124599
31564 9124599 8547686 8075235 7711849 7426478 7167912 6884317 6538022 6110973 5601438
31555 5601438 5016090 4363258 3651876 2896169 2122004 1370455 696421 161382 -180084
31546 -180084 -297401 -196865 78686 465916 904894 1357683 1812714 2275916 2757355 3262186
31536 3262186 3788762 4331137 4881876 5433491 5978435 6508000 7011103 7475053 7889704
31527 7889704 8252667 8570510 8852904 9102927 9310926 9457130 9521305 9492451 9372162 9170177
31517 9170177 8895240 8546150 8107881 7556471 6872612 6057787 5142893 4182914 3240800
31508 3240800 2371210 1613543 995408 540221 271330 208910 360526 709634 1208680 1783874
31498 1783874 2353920 2855173 3258667 3568922 3808589 4003327 4177392 4357208 4571897
31489 4571897 4843834 5172820 5524498 5832666 6017601 6012895 5787797 5355287 4765929 4095009
31479 4095009 3429531 2855846 2446102 2244796 2260432 2466266 2809193 3221459 3630117 3963645
31469 3963645 4158649 4168292 3968904 3559612 2954891 2176469 1251093 214374 -884640
31460 -884640 -1983483 -3012912 -3909092 -4627740 -5154855 -5509287 -5736441 -5896451 -6051326
31451 -6051326 -6254689 -6546849 -6956197 -7503590 -8202957 -9054226 -10032895 -11085729 -12138441
31442 -12138441 -13112237 -13940842 -14581257 -15016517 -15252148 -15309019 -15214859 -14995740 -14667892 -14231509
31432 -14231509 -13670914 -12965254 -12107366 -11120295 -10059994 -9001755 -8018819 -7164795 -6466706
31423 -6466706 -5928889 -5543852 -5304125 -5208879 -5262387 -5466832 -5814850 -6285226 -6842200 -7438341
31413 -7438341 -8021603 -8545354 -8977158 -9301754 -9517289 -9628028 -9637844 -9546703 -9349196 -9032746
31403 -9032746 -8575509 -7948012 -7123522 -6096582 -4900761 -3613494 -2342071 -1196131 -260082
31394 -260082 421993 845193 1032589 1023580 866327 611740 305555 -19305 -343892 -655572
31384 -655572 -937183 -1162192 -1300052 -1327930 -1241125 -1057131 -812900 -556785 -336132 -182594
31374 -182594 -101138 -70272 -55244 -26294 29776 109984 202867 295771 378187 441970 479136
31363 479136 476797 410996 244409 -67915 -565713 -1268547 -2164254 -3205309 -4316859 -5416780
31353 -5416780 -6440529 -7357479 -8168978 -8890454 -9530100 -10076381 -10498939 -10760564 -10834680
31344 -10834680 -10720848 -10450024 -10075141 -9650680 -9211281 -8759382 -8266958 -7691026 -6997415
31335 -6997415 -6182824 -5284603 -4373928 -3537566 -2858224 -2400260 -2201666 -2271036 -2589853 -3120445
31325 -3120445 -3816644 -4631338 -5517286 -6423467 -7292846 -8065422 -8685770 -9111632 -9320655
31316 -9320655 -9313836 -9114890 -8765056 -8313729 -7806615 -7275155 -6732226 -6177242 -5607404 -5026425
31306 -5026425 -4444244 -3870344 -3309666 -2766634 -2253590 -1795094 -1422864 -1163229 -1023738
31297 -1023738 -986252 -1010878 -1049769 -1064897 -1041885 -994527 -959651 -986689 -1127533 -1429192 -1926980
31286 -1926980 -2634971 -3535248 -4572975 -5663989 -6714990 -7648624 -8422151 -9030454 -9491888
31277 -9491888 -9825929 -10037460 -10117572 -10057894 -9866516 -9575456 -9237833 -8918594 -8683300 -8588066
31267 -8588066 -8672410 -8955196 -9432866 -10079747 -10851503 -11691999 -12541650 -13344564 -14053481 -14633355
31257 -14633355 -15064425 -15344384 -15488190 -15524069 -15485594 -15402213 -15292619 -15164537 -15020518 -14865046
31247 -14865046 -14707072 -14555479 -14410321 -14256202 -14062743 -13792309 -13410951 -12897673 -12248696
31238 -12248696 -11475515 -10597669 -9633701 -8595070 -7486130 -6309898 -5076950 -3813917
31230 -3813917 -2567255 -1397639 -363328 502030 1205618 1795106 2340293 2906443 3534355
31221 3534355 4237262 5012640 5856460 6766866 7734588 8729727 9698160 10572630 11291440
31212 11291440 11812757 12118114 12208300 12098638 11816642 11399610 10889481 10326248 9743395
31203 9743395 9166479 8612891 8091248 7601580 7138383 6696578 6277840 5894269 5567297
31194 5567297 5321113 5171824 5116489 5127813 5158479 5154420 5072287 4895617 4645097 4378686
31184 4378686 4178355 4125094 4271557 4625403 5150612 5782927 6449099 7082052 7630214 8061626
31174 8061626 8362717 8532600 8576866 8505036 8331202 8073336 7748705 7368439 6936726 6456299
31164 6456299 5936116 5394401 4852746 4323352 3798072 3249208 2644938 1971308 1247463
31155 1247463 525424 -124944 -638933 -979266 -1149263 -1190853 -1168337 -1147072 -1178555 -1296990
31145 -1296990 -1523471 -1870388 -2341382 -2927131 -3600803 -4318015 -5024212 -5668164 -6216264
31136 -6216264 -6661616 -7024884 -7347533 -7680582 -8072273 -8557270 -9149313 -9839008 -10597928
31127 -10597928 -11387648 -12169055 -12906897 -13568848 -14123331 -14541154 -14802073 -14903119 -14863888
31118 -14863888 -14724994 -14538904 -14356496 -14215589 -14136220 -14122208 -14164546 -14243363 -14329189 -14386183
31108 -14386183 -14377519 -14270004 -14035238 -13648462 -13089801 -12351144 -11446359 -10417425 -9330064
31099 -9330064 -8258826 -7268553 -6401331 -5674196 -5085748 -4624790 -4274827 -4014204 -3816632
31090 -3816632 -3655441 -3508870 -3361022 -3197605 -3002170 -2758743 -2459671 -2110863 -1728100
31081 -1728100 -1326633 -912920 -485000 -39237 424197 901106 1385271 1868318 2338606
31072 2338606 2783651 3196503 3580276 3945991 4305681 4666659 5029838 5390564 5740457
31063 5740457 6070695 6375552 6651736 6890997 7071821 7161029 7129320 6970618 6708331 6381040
31053 6381040 6017653 5620872 5169998 4638455 4012232 3298586 2523073 1719007 914939
31044 914939 125680 -648324 -1412128 -2162923 -2881259 -3533073 -4080922 -4496782 -4769187 -4902926
31034 -4902926 -4914747 -4829664 -4679747 -4503421 -4341583 -4229056 -4184163 -4202053 -4255918 -4305902
31024 -4305902 -4311638 -4243456 -4088985 -3854695 -3564241 -3255767 -2978382 -2785787 -2725953 -2829523
31014 -2829523 -3102599 -3527976 -4073642 -4703255 -5383255 -6084633 -6780348 -7441049 -8032439
31005 -8032439 -8517821 -8867211 -9069187 -9137220 -9104483 -9009588 -8882330 -8736596 -8570246 -8368232
30995 -8368232 -8107831 -7767364 -7336794 -6824637 -6257010 -5670333 -5102345 -4584211 -4134026
30986 -4134026 -3752587 -3423718 -3120273 -2813787 -2483631 -2122053 -1733755 -1331790 -933741
30977 -933741 -561133 -240333 396 140646 180133 144898 82106 45723 79532 202973
30967 202973 403220 636899 843825 970323 993279 934146 856190 845249 980068 1301824
30957 1301824 1793743 2379120 2939823 3349375 3508583 3369935 2941654 2272512 1428902
30948 1428902 478465 -513141 -1477169 -2339440 -3028219 -3490472 -3706813 -3695030 -3499665 -3174893
30938 -3174893 -2771468 -2332776 -1896479 -1494976 -1151690 -875661 -659130 -480965 -314758
30929 -314758 -136784 71157 324960 643663 1052083 1578463 2248389 3077874 4068438 5204874
30919 5204874 6453542 7758876 9040805 10200846 11141396 11792133 12130490 12187344 12038693
30910 12038693 11788966 11550229 11420280 11464191 11704632 12123283 12670825 13280302 13879332
30901 13879332 14399544 14784388 14996623 15024094 14879911 14594184 14198744 13710630 13122289
30892 13122289 12405113 11527270 10478092 9285558 8016220 6756821 5586158 4548955
30884 4548955 3641787 2816959 2003793 1138983 192526 -822023 -1855363 -2841546 -3718348
30875 -3718348 -4442313 -4997822 -5401677 -5702259 -5969933 -6278156 -6681307 -7198713 -7810893
30866 -7810893 -8466918 -9097362 -9628049 -9993318 -10148971 -10082688 -9816661 -9398798 -8886124 -8329722
30856 -8329722 -7767976 -7226935 -6722199 -6259539 -5835418 -5438607 -5052640 -4659399 -4244901
30847 -4244901 -3806047 -3353804 -2908866 -2490360 -2102991 -1730257 -1340043 -902136 -407873
30838 -407873 121485 642787 1107431 1473752 1710610 1797244 1726052 1508950 1181874 801125
30828 801125 430229 123372 -85037 -180198 -160798 -35068 178286 447649 727946 962848
30818 962848 1091048 1058958 837764 436580 -95687 -679292 -1217811 -1614735 -1793380 -1717749
30808 -1717749 -1405143 -920745 -353759 213353 726072 1159140 1500663 1731891 1816469 1705178
30798 1705178 1352933 739210 -117873 -1160803 -2305963 -3464287 -4559566 -5538493 -6372843
30789 -6372843 -7056773 -7600927 -8024207 -8345419 -8578126 -8730643 -8810284 -8828267 -8800560 -8741749
30779 -8741749 -8654126 -8519190 -8298129 -7941424 -7402052 -6646797 -5664006 -4468120 -3100614
30770 -3100614 -1626669 -128281 1304749 2585364 3641022 4424770 4922341 5153193 5165567
30761 5165567 5026200 4805209 4558330 4312075 4057893 3757543 3357232 2806762 2080323
30752 2080323 1193396 206742 -789187 -1704664 -2479498 -3093960 -3558637 -3893941 -4113088
30743 -4113088 -4215600 -4190802 -4027605 -3726230 -3307220 -2814593 -2312969 -1880205 -1595715 -1524439
30733 -1524439 -1700282 -2117020 -2732195 -3480952 -4290458 -5087888 -5802803 -6369815 -6735430
30724 -6735430 -6866989 -6758259 -6428181 -5914384 -5265506 -4534278 -3770261 -3011515 -2277878
30715 -2277878 -1570044 -876180 -184105 504983 1166060 1748150 2183394 2405167 2368445 2065063
30705 2065063 1529114 830881 61093 -688534 -1340615 -1839000 -2149642 -2259955 -2177663 -1927374
30695 -1927374 -1545095 -1073718 -560232 -51229 415689 820403 1161055 1444588 1673177
30686 1673177 1835708 1908925 1866414 1690456 1381848 963867 478659 -22167 -487824 -874909
30676 -874909 -1149254 -1285370 -1266099 -1083114 -737510 -239789 390602 1125533 1928073 2753129
30666 2753129 3550797 4273243 4883277 5361023 5705896 5933275 6067153 6131670 6145732 6123943
30656 6123943 6082426 6043416 6033026 6072528 6169146 6312765 6480775 6648262 6798112 6926292
30646 6926292 7041083 7158450 7296537 7470487 7687848 7945418 8228471 8512189 8764599
30637 8764599 8951711 9045242 9029857 8904092 8672767 8336629 7888851 7322977 6646988 5892362
30627 5892362 5110441 4358000 3681279 3106837 2640685 2272003 1978377 1731889 1504962
30618 1504962 1273695 1018644 726508 394808 36152 -323546 -653535 -928282 -1133966
30609 -1133966 -1270520 -1350639 -1396565 -1435147 -1492625 -1590755 -1744473 -1960479 -2236652 -2562342
30599 -2562342 -2918776 -3278937 -3607723 -3864142 -4006301 -3998614 -3820405 -3474543 -2992577 -2431368
30589 -2431368 -1859341 -1337510 -905268 -578282 -357721 -243335 -242308 -370265 -645733 -1082275
30579 -1082275 -1682732 -2437932 -3329076 -4330691 -5411672 -6534888 -7657442 -8732628 -9712414
30570 -9712414 -10549254 -11198249 -11622163 -11800069 -11736328 -11463332 -11032749 -10496540 -9887375 -9210899
30560 -9210899 -8455384 -7611955 -6691520 -5728971 -4775758 -3888191 -3117103 -2500570 -2060400
30551 -2060400 -1803189 -1724300 -1810221 -2036546 -2364295 -2740127 -3102723 -3392904 -3563904 -3589642
30541 -3589642 -3469491 -3227821 -2907750 -2560853 -2235727 -1968485 -1778445 -1671055 -1645914 -1703540
30531 -1703540 -1846101 -2073802 -2382403 -2763475 -3203091 -3675369 -4134653 -4515221 -4743536
30522 -4743536 -4758181 -4526386 -4048743 -3352481 -2480417 -1482605 -412695 673445 1719959
30513 1719959 2675610 3500509 4173424 4696932 5097377 5417856 5705245 5995047 6299448
30504 6299448 6603213 6868788 7048157 7096983 6987023 6713554 6295508 5768450 5174754 4556913
30494 4556913 3956411 3414979 2973177 2664164 2504373 2485098 2570033 2703216 2827448 2905891
30484 2905891 2935782 2947314 2990064 3115117 3360198 3740574 4245485 4839227 5466598 6062617
30474 6062617 6565611 6930764 7139327 7199684 7140780 7002491 6827039 6651654 6500637 6377358
30464 6377358 6260404 6107869 5869442 5501862 4982604 4318118 3543952 2714799 1885832
30455 1885832 1092763 342178 -380257 -1087851 -1771888 -2396416 -2912459 -3282243 -3498557
30446 -3498557 -3588811 -3602786 -3591854 -3590951 -3611153 -3642762 -3663129 -3644194 -3559143 -3389397 -3131226
30435 -3131226 -2799361 -2425573 -2051609 -1717306 -1447465 -1244505 -1092897 -974076 -882487 -832662
30425 -832662 -854082 -978280 -1224986 -1591907 -2050206 -2547412 -3019117 -3407756 -3681397 -3843564
30415 -3843564 -3929972 -3996646 -4107629 -4326505 -4709996 -5300238 -6115546 -7143119 -8338125
30406 -8338125 -9631630 -10945148 -12204856 -13348810 -14327094 -15101343 -15648805 -15968347 -16080593
30397 -16080593 -16018079 -15810014 -15471945 -15007803 -14422388 -13733381 -12971807 -12169899 -11346814
30388 -11346814 -10504478 -9636832 -8745439 -7851467 -6998043 -6242341 -5640241 -5228624 -5011542
30379 -5011542 -4955831 -4998702 -5064964 -5086960 -5019288 -4844246 -4569597 -4222436 -3840778 -3462506
30369 -3462506 -3112997 -2795885 -2492008 -2168412 -1794151 -1355195 -860346 -335543 187876
30360 187876 681832 1122453 1485972 1744872 1867127 1819147 1572800 1116099 463935 -337179
30350 -337179 -1214576 -2083997 -2867426 -3507355 -3973424 -4261213 -4385735 -4372998 -4252929 -4055794
30340 -4055794 -3811395 -3547099 -3281598 -3017023 -2737016 -2415446 -2031299 -1579947 -1075389
30331 -1075389 -546495 -32588 421408 774176 1001839 1109184 1129147 1109067 1092083 1105126
30321 1105126 1158738 1255340 1398532 1598165 1870494 2235650 2714604 3325868 4080769 4976863
30311 4976863 5991332 7077817 8169466 9188386 10058672 10718443 11126911 11265693 11136860
30302 11136860 10760771 10174382 9428222 8580520 7688797 6800983 5949117 5148913 4406683
30293 4406683 3730489 3138711 2660162 2325556 2155326 2150098 2287642 2526954 2817441 3109706
30283 3109706 3364298 3555856 3672004 3708741 3666173 3547906 3364044 3133916 2884551 2644587
30273 2644587 2437075 2275209 2162944 2099650 2085642 2124401 2219150 2365933 2549129 2744177
30263 2744177 2926507 3080132 3199338 3282695 3325321 3316671 3246061 3111250 2922794 2699788
30253 2699788 2458085 2196767 1890970 1497584 973839 300133 -505686 -1390371 -2280851
30244 -2280851 -3102739 -3791898 -4296520 -4574676 -4594328 -4338524 -3812225 -3044679 -2084881 -993642
30234 -993642 161484 1305596 2353778 3213774 3798913 4048785 3948248 3534520 2888133
30225 2888133 2111897 1306890 553964 -94608 -613220 -994284 -1238429 -1348680 -1330670 -1197006
30215 -1197006 -971553 -689967 -395318 -129645 77039 217981 316181 419330 580336 830517
30205 830517 1160489 1520522 1839310 2049037 2104040 1987763 1709804 1297253 784576 205607
30195 205607 -410508 -1040216 -1665630 -2275440 -2867052 -3448942 -4040532 -4665915 -5341220 -6062367
30185 -6062367 -6802672 -7522788 -8184701 -8759391 -9226677 -9574611 -9803817 -9932715 -9995291 -10028815
30175 -10028815 -10058060 -10085368 -10091272 -10043651 -9909711 -9665321 -9298993 -8810811 -8208210 -7500224
30165 -7500224 -6691497 -5778263 -4749369 -3593937 -2313049 -929637 508778 1936232
30157 1936232 3280885 4478896 5483846 6268476 6820474 7138013 7229222 7113831 6821987
30148 6821987 6388768 5848624 5234184 4578500 3916302 3281840 2704517 2203902 1784814
30139 1784814 1434374 1124708 822965 504863 164708 -183263 -512771 -798867 -1030263
30130 -1030263 -1213725 -1367699 -1509636 -1646076 -1771978 -1878020 -1958917 -2016876 -2060216 -2101841
30120 -2101841 -2161101 -2267191 -2458576 -2775667 -3250546 -3900650 -4729033 -5726723 -6870584
30111 -6870584 -8116032 -9392019 -10607777 -11673581 -12526708 -13148321 -13562171 -13817764 -13969687
30102 -13969687 -14064817 -14141472 -14235301 -14382564 -14614814 -14947199 -15368647 -15841241 -16309475 -16714030
30092 -16714030 -17003649 -17141750 -17108617 -16901896 -16536772 -16043816 -15461451 -14824120 -14152707
30083 -14152707 -13453912 -12728538 -11982065 -11230558 -10499530 -9817511 -9207348 -8677868 -8217936
30074 -8217936 -7794610 -7357280 -6848704 -6220127 -5443008 -4511070 -3434329 -2233846 -943217
30065 -943217 386411 1686125 2878293 3892324 4680837 5230119 5560874 5719065 5761143
30056 5761143 5739951 5695852 5654496 5630172 5631676 5666397 5740178 5854756 6006441 6187581 6389702
30045 6389702 6607679 6844533 7113758 7434389 7818638 8259483 8726439 9170378 9531377
30036 9531377 9745119 9749415 9494211 8953623 8133616 7070077 5818330 4440459 2996610
30027 2996610 1541944 127208 -1199437 -2390613 -3399550 -4184014 -4714669 -4983694 -5007697
30018 -5007697 -4823045 -4477881 -4026894 -3530682 -3055839 -2670165 -2430961 -2370708 -2488268 -2751757
30008 -2751757 -3111842 -3517657 -3927414 -4311623 -4651588 -4935396 -5151361 -5280487 -5293796 -5160014
29998 -5160014 -4861444 -4407977 -3839672 -3217180 -2607344 -2071674 -1659564 -1403179 -1311467 -1365395
29988 -1365395 -1519977 -1716214 -1898928 -2031025 -2097151 -2097891 -2041676 -1940005 -1806276 -1655693
29978 -1655693 -1505170 -1373903 -1284665 -1263905 -1338528 -1529192 -1843185 -2271083 -2789099 -3364905
29968 -3364905 -3963316 -4551063 -5102529 -5606302 -6068000 -6505232 -6936954 -7375017 -7823628
29959 -7823628 -8284671 -8761558 -9256499 -9763295 -10262887 -10726826 -11126188 -11437835 -11642862
29950 -11642862 -11721037 -11650049 -11413390 -11011200 -10464921 -9812379 -9098228 -8367220 -7662924 -7028191
29940 -7028191 -6501981 -6111868 -5867330 -5759795 -5770202 -5879625 -6078151 -6370070 -6774455 -7319123
29930 -7319123 -8027439 -8902751 -9919613 -11028578 -12173090 -13309188 -14416888 -15497521
29922 -15497521 -16560383 -17608338 -18630640 -19603682 -20494328 -21261563 -21858089 -22236528 -22361407
29913 -22361407 -22221988 -21838567 -21258176 -20541499 -19746718 -18916259 -18070099 -17206502 -16308128
29904 -16308128 -15349122 -14298860 -13121848 -11778397 -10231449 -8459683 -6470672 -4307177
29896 -4307177 -2044817 215835 2359748 4269979 5841899 6995964 7685175 7896694
29888 7896694 7651288 7003663 6041635 4878962 3640125 2441497 1375087 497472 -176751
29879 -176751 -676105 -1064466 -1422682 -1823709 -2310278 -2883539 -3506205 -4117015 -4648568 -5040852
29869 -5040852 -5247899 -5240681 -5009978 -4569144 -3953447 -3213958 -2407675 -1587873 -798007 -69922
29859 -69922 575433 1127175 1584095 1953152 2245586 2471840 2637597 2742059 2778021 2733564
29849 2733564 2595749 2356128 2017000 1596824 1132524 675550 280631 -8724 -170084
29840 -170084 -201861 -114384 81505 381959 789866 1306802 1921774 2604806 3311018 3993165
29830 3993165 4614359 5153978 5606338 5976282 6274835 6514597 6703481 6837991 6899969 6860004
29820 6860004 6686592 6356706 5863627 5220607 4460600 3631870 2789334 1983557 1251448
29811 1251448 612577 72298 -370541 -716169 -961952 -1108114 -1167871 -1174951 -1182208 -1249717
29801 -1249717 -1426013 -1729917 -2141193 -2604846 -3046624 -3390987 -3572878 -3541194 -3258637 -2703885
29791 -2703885 -1878076 -812779 425737 1741078 3022876 4172139 5126402 5871538 6431734
29782 6431734 6842179 7121043 7257904 7223284 6989219 6546306 5910220 5120488 4236716 3333239
$$ [...]
##END NTUPLES=NMR SPECTRUM
##END=
