##TITLE=31Pdec_DE-27W
 D2O
  24 sc
 22.11.2023
##JCAMPDX= 6.0         $$ Bruker NMR JCAMP-DX V2.0
##DATA TYPE= NMR SPECTRUM
##DATA CLASS= NTUPLES
##ORIGIN= UXNMR, Bruker Analytische Messtechnik GmbH
##OWNER= root
$$ XWIN-NMR		Version 3.5
$$ Wed Nov 22 12:58:23 2023 Russian Standard Time (UT+4h)  she@DPX200
##.OBSERVE FREQUENCY= 81.013821
##.OBSERVE NUCLEUS= ^31P
##.ACQUISITION MODE= SIMULTANEOUS
##.ACQUISITION SCHEME= undefined
##.AVERAGES= 24
##.DIGITISER RES= 16
##SPECTROMETER/DATA SYSTEM= spect
##.PULSE SEQUENCE= zgpg30
##.SOLVENT NAME= D2O
##.SHIFT REFERENCE= (INTERNAL, D2O, 0, 248.564)
##AUDIT TRAIL= $$ (NUMBER, WHEN, WHO, WHERE, WHAT)
$$ ##TITLE= Audit trail, XWIN-NMR		Version 3.5
$$ ##JCAMPDX= 5.01
$$ ##ORIGIN= Bruker BioSpin GmbH
$$ ##OWNER= she
$$ F:/spectra/data/she/nmr/P31/1/pdata/1/auditp.txt
$$ ##AUDIT TRAIL=  $$ (NUMBER, WHEN, WHO, WHERE, WHAT)
(   1,<2023-11-22 12:57:26.73 +0400>,<she>,<DPX200>,
      <created by zg, POWCHK disabled, PULCHK disabled
       configuration hash MD5:
       00 E9 B6 7A A2 85 ED C7 34 08 36 98 17 FE 4E 26
       data hash MD5: 32K
       9D 41 74 10 3F FB 0A C2 37 DA D3 E6 02 AE 3C DC>)
(   2,<2023-11-22 12:57:29.09 +0400>,<she>,<DPX200>,
      <Start of raw data processing
       efp BC_mod = 2 LB = 10 FT_mod = 6 PKNL = 1 PHC0 = -11375.98 PHC1 = 39.89372 SI = 64K 
       data hash MD5: 64K
       79 4E FC 30 6E 7B 8B 7F 74 13 FB 41 0B CB EE ED>)
(   3,<2023-11-22 12:57:54.37 +0400>,<she>,<DPX200>,
      <pk PHC0 = 31.90735 PHC1 = -63.40032 
       data hash MD5: 64K
       B9 A0 12 F8 3B 41 A6 74 BD 5B 41 BC D9 CB E2 60>)
(   4,<2023-11-22 12:57:57.82 +0400>,<she>,<DPX200>,
      <abs ABSG = 5 
       data hash MD5: 64K
       F9 B4 F2 E9 1B B5 98 49 F8 78 B4 AE 2A 77 36 66>)
$$ ##END=
$$ 
$$ hash MD5
$$ FB DE 9F AD BE 3C 90 FD 8C 44 62 3D 60 19 8A 19
##$RELAX= 
##$RELAX= 
##$RELAX= 
##$RELAX= 
##$RELAX= 
##$RELAX= 
##$RELAX= 
##$RELAX= 
##$RELAX= 
$$ Bruker specific parameters
$$ --------------------------
##$DU= <F:/spectra>
##$EXPNO= 1
##$NAME= <P31>
##$PROCNO= 1
##$TYPE= <nmr>
##$USER= <she>
##$AMP= (0..31)
100 100 100 100 100 100 100 100 100 100 100 100 100 100 100 100 100 100 
100 100 100 100 100 100 100 100 100 100 100 100 100 100 
##$AQSEQ= 0
##$AQ_mod= 1
##$AUNM= <au_zg>
##$AUTOPOS= <>
##$BF1= 81.014009
##$BF2= 200.13
##$BF3= 200.13
##$BF4= 200.13
##$BF5= 200.13
##$BF6= 200.13
##$BF7= 200.13
##$BF8= 200.13
##$BYTORDA= 1
##$CFDGTYP= 0
##$CFRGTYP= 5
##$CHEMSTR= <none>
##$CNST= (0..31)
1 1 145 1 1 1 1 1 1 1 1 1 1 1 1 1 1 1 1 1 1 1 1 1 1 1 1 1 1 1 1 1 
##$CPDPRG= <waltz16>
##$CPDPRG1= <>
##$CPDPRG2= <waltz16>
##$CPDPRG3= <>
##$CPDPRG4= <mlev>
##$CPDPRG5= <mlev>
##$CPDPRG6= <mlev>
##$CPDPRG7= <mlev>
##$CPDPRG8= <mlev>
##$CPDPRGB= <>
##$CPDPRGT= <>
##$D= (0..31)
0 1 0 0 0 0 0 0 0 0 0 0.03 2e-05 3e-06 0 0 0 0 0 0 0 0 0 0 0 0 0 0 0 0 
0 0 
##$DATE= 1700643446
##$DBL= (0..7)
120 120 120 11 120 120 24 19 
##$DBP= (0..7)
150 150 150 150 150 150 150 150 
##$DBP07= 0
##$DBPNAM0= <>
##$DBPNAM1= <>
$$ [...]
##$SUBNAM3= <"">
##$SUBNAM4= <"">
##$SUBNAM5= <"">
##$SUBNAM6= <"">
##$SUBNAM7= <"">
##$SUBNAM8= <"">
##$SUBNAM9= <"">
##$SW= 501.771253377433
##$SWIBOX= (0..15)
0 1 3 0 0 0 0 0 0 0 0 0 0 0 0 0 
##$SW_h= 40650.406504065
##$TD= 32768
##$TD0= 1
##$TE= 0
##$TE2= 300
##$TE3= 300
##$TEG= 300
##$TL= (0..7)
0 120 53 12 22 120 120 120 
##$TP= (0..7)
150 150 150 150 150 150 150 150 
##$TP07= 0
##$TPNAME0= <>
##$TPNAME1= <>
##$TPNAME2= <>
##$TPNAME3= <>
##$TPNAME4= <>
##$TPNAME5= <>
##$TPNAME6= <>
##$TPNAME7= <>
##$TPOAL= (0..7)
0.5 0.5 0.5 0.5 0.5 0.5 0.5 0.5 
##$TPOFFS= (0..7)
0 0 0 0 0 0 0 0 
##$TUNHIN= 0
##$TUNHOUT= 0
##$TUNXOUT= 0
##$USERA1= <user>
##$USERA2= <user>
##$USERA3= <user>
##$USERA4= <user>
##$USERA5= <user>
##$V9= 5
##$VALIST= <valist>
##$VCLIST= <CCCCCCCCCCCCCCC>
##$VD= 0
##$VDLIST= <DDDDDDDDDDDDDDD>
##$VPLIST= <PPPPPPPPPPPPPPP>
##$VTLIST= <TTTTTTTTTTTTTTT>
##$WBST= 1024
##$WBSW= 4
##$XGAIN= (0..3)
0 0 0 0 
##$XL= 0
##$YL= 0
##$YMAX_a= 6026
##$YMIN_a= -4552
##$ZGOPTNS= <>
##$ZL1= 120
##$ZL2= 120
##$ZL3= 120
##$ZL4= 120
##$ABSF1= 248.5645
##$ABSF2= -253.2056
##$ABSG= 5
##$ABSL= 3
##$ALPHA= 0
##$AQORDER= 0
##$ASSFAC= 0
##$ASSFACI= 0
##$ASSFACX= 0
##$ASSWID= 0
##$AUNMP= <proc_1d>
##$AZFE= 0.1
##$AZFW= 0.5
##$BCFW= 0
##$BC_mod= 2
##$BYTORDP= 0
##$COROFFS= 0
##$CY= -3
##$DATMOD= 1
##$DC= 0
##$DFILT= <>
##$DTYPP= 0
##$F1P= 0
##$F2P= 0
##$FCOR= 1
##$FTSIZE= 65536
##$FT_mod= 6
##$GAMMA= 0
##$GB= 0
##$INTBC= 1
##$INTSCL= 6.047779e-11
##$ISEN= 30
##$LB= 10
##$LEV0= 0
##$LPBIN= 0
##$MAXI= 10000
##$MC2= 0
##$MEAN= 0
##$ME_mod= 0
##$MI= 50
##$NCOEF= 0
##$NC_proc= -9
##$NLEV= 6
##$NOISF1= 182.463
##$NOISF2= 159.3651
##$NSP= 0
##$NTH_PI= 0
##$NZP= 0
##$OFFSET= 248.5645
##$PC= 4
##$PHC0= -11344.07
##$PHC1= -23.5066
##$PH_mod= 1
##$PKNL= yes
##$PPARMOD= 0
##$PSCAL= 0
##$PSIGN= 0
##$REVERSE= no
##$SF= 81.0140089999694
##$SI= 65536
##$SIGF1= 159.3651
##$SIGF2= -187.1042
##$SINO= 113.3802
##$SIOLD= 16384
##$SREGLST= <1H.CDCl3>
##$SSB= 0
##$STSI= 65536
##$STSR= 0
##$SW_p= 40650.406504065
##$SYMM= 0
##$S_DEV= 0
##$TDeff= 32768
##$TDoff= 0
##$TI= <>
##$TILT= no
##$TM1= 0
##$TM2= 0
##$TOPLEV= 0
##$USERP1= <user>
##$USERP2= <user>
##$USERP3= <user>
##$USERP4= <user>
##$USERP5= <user>
##$WDW= 1
##$XDIM= 65536
##$YMAX_p= 456270293
##$YMIN_p= -99213961
$$ End of Bruker specific parameters
$$ ---------------------------------
##NTUPLES= NMR SPECTRUM
##VAR_NAME=  FREQUENCY,     SPECTRUM/REAL,   SPECTRUM/IMAG
##SYMBOL=    X,             R,               I
##VAR_TYPE=  INDEPENDENT,   DEPENDENT,       DEPENDENT
##VAR_FORM=  AFFN,          ASDF,            ASDF
##VAR_DIM=   65536,         65536,           65536
##UNITS=     HZ,            ARBITRARY UNITS, ARBITRARY UNITS
##FACTOR=    0.620285442955139, 1,           1
##FIRST=     20137.2065510682, 0,            0
##LAST=      -20513.1999529968, 0,           0
##MIN=       -20513.1999529968, -99213961,   0
##MAX=       20137.2065510682, 456270293,    0
$$ Real data points
##PAGE= N=1
##DATA TABLE= (X++(R..R)), XYDATA
$$ [...]
$$ plain form
36972 6794600 6695326 6560892 6401374 6231856 6066676 5913527 5768767 5616828 5435325 5203065
36962 5203065 4905566 4535558 4091436 3577966 3009156 2408754 1805460 1225542 688467
36953 688467 207777 -205418 -540429 -788254 -945206 -1016780 -1019496 -979170 -925795 -887074 -882774
36942 -882774 -920838 -995153 -1085378 -1159805 -1182049 -1121031 -961703 -712182 -403335 -80347 209804
36931 209804 429728 559038 597706 565552 497607 436034 420915 482634 637703 888926 1229473
36920 1229473 1648256 2132996 2669437 3238961 3818196 4382348 4911031 5393885 5833042
36911 5833042 6240678 6632760 7022729 7418570 7823271 8236063 8652454 9063211 9453651
36902 9453651 9804680 10096825 10317033 10465261 10556650 10617616 10678258 10764817 10894198 11070894
$$ packed form
36972F794600r9274j34434j59518j69518j65180j53149j44760j51939j81503k32260
36962E203065k97499l70008m44122n13470n68810o00402o03294n79918n37075
36953F88467m80690m13195l35011k47825j56952p1574k716M0326N3375L8721M300
36942h82774l8064p4315r0225p4427k2244O1018J59328K49521L08847L22988K90151
36931B09804K19924J29310L8668l2154o7945o1573j5119O1719J55069K51223L40547
36920A229473M18783M84740N36441N69524N79235N64152N28683M82854M39157
36911E833042M07636L92082L89969L95841M04701M12792M16391M10757L90440
36902I453651L51029K92145K20208J48228R1389O0966O0642Q6559J29381J76696
$$ plain form
36892 11070894 11286457 11521408 11748688 11937887 12060853 12099139 12051158 11934514 11780428 11621818
36882 11621818 11480473 11359033 11240708 11095972 10892851 10606584 10225450 9751636 9198313
36873 9198313 8585428 7936214 7274802 6624331 6005756 5438529 4943299 4543956 4265490
36864 4265490 4126965 4133281 4270879 4510036 4812391 5139963 5462178 5759495 6024008 6258248
36854 6258248 6472852 6683270 6905793 7153636 7433719 7744304 8073583 8399965 8695236
36845 8695236 8931091 9087638 9160710 9164752 9129764 9093343 9090499 9144229 9259284 9420747 9597927
36834 9597927 9752779 9850720 9870722 9811092 9688812 9533281 9378024 9253748 9183568 9179518
36824 9179518 9240069 9349498 9479611 9593754 9653122 9625069 9491084 9250799 8920433 8527811
$$ packed form
36892A1070894K15563K34951K27280J89199J22966L8286m7981j16644j54086j58610
36882A1621818j41345j21440j18325j44736k03121k86267l81134m73814n53323
36873I198313o12885o49214o61412o50471o18575n67227m95230l99343k78466
36864D265490j38525O316J37598K39157L02355L27572L22215K97317K64513K34240
36854F258248K14604K10418K22523K47843K80083L10585L29279L26382K95271
36845H695236K35855J56547P3072M042l4988l6421k844N3730J15055J61463J77180
36834I597927J54852R7941K0002n9630j22280j55531j55257j24276p0180m050
36824I179518O0551J09429J30113J14143N9368k8053j33985k40285l30366l92622
$$ plain form
36814 8527811 8106881 7692431 7314405 6992953 6736771 6545455 6413741 6335207 6304816 6320564
36804 6320564 6383618 6496153 6657431 6860148 7089036 7322588 7537328 7712865 7835642 7900321
36794 7900321 7909220 7870956 7799162 7711514 7628798 7573030 7563926 7614534 7728355 7899415 8114464
36783 8114464 8355370 8600990 8829114 9018795 9152702 9219103 9213116 9136444 8994957 8794963
36773 8794963 8540259 8231314 7866211 7442470 6959606 6422460 5844634 5251007 4678289
36764 4678289 4172104 3779248 3536298 3459571 3542475 3761597 4086555 4486719 4932189 5392060
36754 5392060 5834257 6227737 6544398 6758863 6847726 6791231 6577678 6207536 5694218 5061572
36744 5061572 4340531 3566992 2781223 2027494 1351918 797106 394525 158063 82205 145078
$$ packed form
36814H527811m20930m14450l78026l21452k56182j91316j31714p8534l0391J5748
36804F320564O3054J12535J61278K02717K28888K33552K14740J75537J22777O4679
36794G900321Q899l8264p1794q7648q2716n5768r104N0608J13821J71060K15049
36783H114464K40906K45620K28124J89681J33907O6401n987p6672j41487j99994
36773H794963k54704l08945l65103m23741m82864n37146n77826n93627n72718
36764D678289n06185l92856k42950p6727Q2904K19122L24958M00164M45470M59871
36754E392060M42197L93480L16661K14465Q8863n6495k13553l70142n13318o32646
36744E061572p21041p73539p85769p53729o75576n54812m02581k36462p5858O2873
$$ plain form
36734 145078 313782 550060 816830 1086252 1347345 1608660 1892766 2223666 2612674 3049906
36724 3049906 3505657 3940391 4317541 4613335 4821475 4953416 5035238 5101247 5185095 5310959
36714 5310959 5487642 5706938 5945705 6170316 6342226 6423982 6385382 6209266 5895264 5459604
36704 5459604 4931129 4346711 3749183 3186750 2709358 2359408 2160634 2112600 2195083 2379384
36694 2379384 2639119 2954572 3309849 3686623 4059808 4398742 4674072 4867265 4978199
36685 4978199 5027163 5050089 5088809 5180167 5347734 5597904 5920134 6290139 6674771 7036971
36675 7036971 7339487 7547489 7632005 7575304 7376290 7052272 6635227 6163998 5675131 5194357
36665 5194357 4730545 4274799 3806514 3304719 2759328 2176928 1579089 995341 454877
$$ packed form
36734A45078J68704K36278K66770K69422K61093K61315K84106L30900L89008M37232
36724C049906M55751M34734L77150K95794K08140J31941Q1822O6009Q3848J25864
36714E310959J76683K19296K38767K24611J71910Q1756l8600j76116l14002m35660
36704E459604n28475n84418n97528n62433m77392l49950j98774m8034Q2483J84301
36694B379384K59735L15453L55277L76774L73185L38934K75330J93193J10934
36685D978199M8964K2926L8720R1358J67567K50170L22230L70005L84632L62200
36675G036971L02516K08002Q4516n6701j99014l24018m17045m71229m88867m80774
36665E194357m63812m55746m68285n01795n45391n82400n97839n83748n40464
$$ plain form
36656 454877 -19074 -410297 -706973 -898908 -978023 -942469 -800919 -572943 -284385 39745
36646 39745 381299 731714 1090783 1461962 1846367 2239215 2631384 3014673 3386218 3748960
36636 3748960 4109483 4476751 4863332 5287274 5771524 6339046 7004456 7765817 8601362
36627 8601362 9473405 10336731 11146157 11860772 12447219 12885144 13173512 13332330 13395747 13398310
36617 13398310 13361460 13287581 13164473 12976661 12716271 12387666 12005530 11590084 11162849 10743473
36607 10743473 10346715 9979839 9641637 9323588 9012368 8692779 8350892 7977482 7571550
36598 7571550 7142942 6712500 6308459 5959782 5689705 5512615 5434394 5453362 5559693 5734478
36588 5734478 5951183 6180467 6396418 6581091 6725323 6825889 6880988 6886886 6837575 6727495
$$ packed form
36656D54877m73951l91223k96676j91935p9115L5554J41550K27976K88558L24130
36646C9745L41554L50415L59069L71179L84405L92848L92169L83289L71545L62742
36636C748960L60523L67268L86581M23942M84250N67522O65410P61361Q35545
36627H601362Q72043Q63326Q09426P14615N86447M37925K88368J58818O3417K563
36617A3398310l6850p3879j23108j87812k60390l28605l82136m15446m27235m19376
36607A0743473l96758l66876l38202l18049l11220l19589l41887l73410m05932
36598G571550m28608m30442m04041l48677k70077j77090p8221J8968J06331J74785
36588E734478K16705K29284K15951J84673J44232J00566N5099N898m9311j10080
$$ plain form
36578 6727495 6556006 6331948 6076258 5820565 5601362 5452009 5396119 5444373 5594684 5834900
36568 5834900 6147239 6512822 6914260 7335722 7762285 8180543 8580499 8957205 9310860
36559 9310860 9644991 9962901 10263664 10540313 10782219 10980449 11132253 11241714 11317293 11369143
36549 11369143 11407854 11443978 11487045 11543955 11617653 11706654 11805114 11903190 11987824 12044117 12057008
36538 12057008 12013017 11902426 11722185 11478461 11186759 10868474 10545055 10232514 9938877
36529 9938877 9665762 9413112 9183968 8985715 8826733 8711022 8634487 8584646 8543141 8489986
36519 8489986 8408809 8291722 8141502 7969615 7791064 7619205 7463458 7330703 7228473 7166986
36509 7166986 7158225 7212721 7336171 7527573 7779569 8081181 8422585 8800154 9218909 9690503
$$ packed form
36578F727495j71489k24058k55690k55693k19203j49353n5890M8254J50311K40216
36568E834900L12339L65583M01438M21462M26563M18258L99956L76706L53655
36559I310860L34131L17910L00763K76649K41906J98230J51804J09461P5579N1850
36549A1369143L8711L6124M3067N6910P3698Q9001R8460R8076Q4634N6293J2891
36538A2057008m3991j10591j80241k43724k91702l18285l23419l12541k93637
36529I938877k73115k52650k29144j98253j58982j15711p6535m9841m1505n3155
36519H489986q1177j17087j50220j71887j78551j71859j55747j32755j02230o1487
36509G166986q761N4496J23450J91402K51996L01612L41404L77569M18755M71594
$$ plain form
36499 9690503 10227224 10834553 11505383 12218362 12941066 13636343 14268820 14809562 15238967
36490 15238967 15548790 15743397 15839324 15862342 15841777 15802987 15760512 15715534 15659424 15581253 15474639
36479 15474639 15340615 15186309 15021062 14852126 14682317 14511401 14340711 14177751 14037257
36470 14037257 13937627 13894266 13912864 13986042 14096209 14224330 14359740 14504626 14670558 14870089
36460 14870089 15108633 15379906 15665825 15941007 16181005 16371259 16512477 16620117 16718964
36451 16718964 16835548 16990847 17195409 17448801 17743880 18073692 18437186 18840861 19295972
36442 19295972 19813341 20399271 21055545 21783531 22588303 23477818 24455799 25512422 26618933
36433 26618933 27729782 28791398 29753439 30577694 31241604 31737110 32068330 32251092 32313714
$$ packed form
36499I690503N36721O07329O70830P12979P22704O95277O32477N40742M29405
36490A5238967L09823J94607R5927K3018k0565l8790m2475m4978n6110p8171j06614
36479A5474639j34024j54306j65247j68936j69809j70916j70690j62960j40494
36470A4037257r9630m3361J8598P3178J10167J28121J35410J44886J65932J99531
36460A4870089K38544K71273K85919K75182K39998J90254J41218J07640R8847
36451A6718964J16584J55299K04562K53392K95079L29812L63494M03675M55111
36442A9295972N17369N85930O56274P27986Q04772Q89515R77981J056623J106511
36433B6618933J110849J061616R62041Q24255O63910M95506L31220J82762O2622
$$ plain form
36424 32313714 32295670 32241828 32193599 32181025 32219526 32312627 32459077 32660344 32923877 33260016
36414 33260016 33675082 34166126 34721065 35322799 35952842 36592042 37220351 37819282 38377751
36405 38377751 38898070 39397923 39906483 40455904 41071232 41762297 42520798 43324193 44145265
36396 44145265 44963503 45773463 46586755 47427286 48322394 49294012 50353525 51501913 52734191
36387 52734191 54045259 55433660 56900881 58446341 60061193 61725533 63411740 65092300
36379 65092300 66746814 68363949 69938820 71470117 72960087 74416349 75852324 77284984
36371 77284984 78731660 80208303 81729869 83311663 84970019 86721518 88581243 90561356
36363 90561356 92670788 94915719 97300339 99828203 102504357 105336470 108332339 111493981
$$ packed form
36424C2313714j8044n3842m8229j2574L8501R3101J46450K01267K63533L36139
36414C3260016M15066M91044N54939O01734O30043O39200O28309N98931N58469
36405C8377751N20319M99853N08560N49421O15328O91065P58501Q03395Q21072
36396D4145265Q18238Q09960Q13292Q40531Q95108R71618J059513J148388J232278
36387E2734191J311068J388401J467221J545460J614852J664340J686207J680560
36379F5092300J654514J617135J574871J531297J489970J456262J435975J432660
36371G7284984J446676J476643J521566J581794J658356J751499J859725J980113
36363I0561356K109432K244931K384620K527864K676154K832113K995869L161642
$$ plain form
36355 111493981 114812948 118271954 121853064 125547114 129358059 133299598 137386186 141623372
36347 141623372 146002419 150501719 155093745 159753440 164464339 169221473 174032048 178914098
36339 178914098 183891727 188986354 194206858 199544188 204974399 210468878 216005857 221576710
36331 221576710 227184134 232834363 238528973 244261394 250019221 255788643 261555822 267303124
36323 267303124 273002696 278612015 284074631 289326384 294304585 298956134 303241202 307132271
36315 307132271 310611874 313672424 316317767 318562358 320424845 321917418 323036206 323757906
36307 323757906 324044568 323854588 323155400 321932552 320191498 317952029 315239255 312076519
36299 312076519 308483740 304480941 300094022 295359119 290322806 285037528 279554508 273918233
$$ packed form
36355A11493981L318967L459006L581110L694050L810945L941539M086588M237186
36347A41623372M379047M499300M592026M659695M710899M757134M810575M882050
36339A78914098M977629N094627N220504N337330N430211N494479N536979N570853
36331B21576710N607424N650229N694610N732421N757827N769422N767179N747302
36323B67303124N699572N609319N462616N251753M978201M651549M285068L891069
36315C07132271L479603L060550K645343K244591J862487J492573J118788P21700
36307C23757906K86662j89980o99188j222848j741054k239469k712774l162736
36299C12076519l592779m002799m386919m734903n036313n285278n483020n636275
$$ plain form
36291 273918233 268165228 262326174 256428375 250497331 244558677 238641116 232778198 227006098
36283 227006098 221357605 215855879 210511618 205324581 200287519 195389610 190617886 185957738
36275 185957738 181395132 176921301 172536959 168251905 164078962 160025865 156090045 152258999
36267 152258999 148515551 144845037 141240776 137705540 134249349 130885957 127629848 124493888
36259 124493888 121487405 118615682 115881385 113285898 110827200 108494176 106262422 104097299
36251 104097299 101964189 99839168 97712888 95586495 93464349 91348747 89238371 87129496
36243 87129496 85018393 82903357 80784808 78663535 76539392 74412509 72285882 70166644
36235 70166644 68065469 65996111 63975614 62022550 60151357 58365668 56656238 55005831
$$ packed form
36291B73918233n753005n839054n897799n931044n938654n917561n862918n772100
36283B27006098n648493n501726n344261n187037n037062m897909m771724m660148
36275A85957738m562606m473831m384342m285054m172943m053097l935820l831046
36267A52258999l743448l670514l604261l535236l456191l363392l256109l135960
36259A24493888l006483k871723k734297k595487k458698k333024k231754k165123
36251A04097299k133110k125021k126280k126393k122146k115602k110376k108875
36243H7129496k111103k115036k118549k121273k124143k126883k126627k119238
36235G0166644k101175k069358k020497j953064j871193j785689j709430j650407
$$ plain form
36227 55005831 53397921 51823986 50286525 48798185 47378637 46050486 44834778 43746569
36219 43746569 42791706 41966510 41261188 40665019 40169447 39766710 39445890 39190813 38982468
36210 38982468 38804312 38646543 38506575 38385702 38283767 38194445 38103858 37994022 37849970 37666584
36200 37666584 37450991 37218970 36987075 36764197 36546411 36317273 36052744 35727516 35319758
36191 35319758 34814315 34206157 33504226 32732643 31926295 31121788 30348590 29624578 28955956
36182 28955956 28338381 27757496 27190820 26614168 26012035 25386263 24756532 24151302 23594393
36173 23594393 23094930 22645754 22229998 21831022 21439586 21054725 20679637 20317061 19967504
36164 19967504 19630180 19304638 18992215 18698149 18434692 18223259 18092030 18067022 18159227 18354770
$$ packed form
36227E5005831j607910j573935j537461j488340j419548j328151j215708j088209
36219D3746569r54863q25196p05322n96169m95572m02737l20820k55077k08345
36210C8982468j78156j57769j39968j20873j01935q9322r0587j09836j44052j83386
36200C7666584k15593k32021k31895k22878k17786k29138k64529l25228m07758
36191C5319758n05443o08158p01931p71583q06348q04507p73198p24012o68622
36182B8955956o17575n80885n66676n76652o02133o25772o29731o05230n56909
36173B3594393m99463m49176m15756l98976l91436l84861l75088l62576l49557
36164A9967504l37324l25542l12423k94066k63457k11433j31229k5008R2205J95543
$$ plain form
36154 18354770 18614842 18886491 19118326 19272759 19329914 19284062 19136905 18892356 18555592 18136156
36144 18136156 17652224 17132219 16611777 16126983 15706951 15369044 15118658 14952941 14865279
36135 14865279 14847329 14888018 14972374 15083477 15207423 15337331 15472244 15611318 15748460 15872801
36125 15872801 15975456 16057804 16135749 16237539 16396247 16639732 16981519 17416193 17921005 18462055
36115 18462055 19000938 19498682 19916629 20216129 20359483 20313843 20058054 19589946 18930151
36106 18930151 18119874 17213431 16269102 15341703 14478265 13716087 13081685 12589895 12243348
36097 12243348 12032871 11939062 11935072 11990726 12077789 12175021 12271196 12365217 12463914 12578280 12718182
36086 12718182 12885780 13069590 13242327 13364641 13394091 13296102 13052592 12664756 12149134 11529555
$$ packed form
36154A8354770K60072K71649K31835J54433N7155m5852j47157k44549l36764m19436
36144A8136156m83932n20005n20442m84794m20032l37907k50386j65717q7662
36135A4865279j7950M0689Q4356J11103J23946J29908J34913J39074J37142J24341
36125A5872801J02655Q2348P7945J01790J58708K43485L41787M34674N04812N41050
36115A8462055N38883M97744M17947K99500J43354m5640k55789m68108o59795
36106A8930151q10277r06443r44329r27399q63438p62178o34402m91790l46547
36097A2243348k10477r3809l990N5654Q7063R7232R6175R4021R8697J14366J39902
36086A2718182J67598J83810J72737J22314K9450r7989k43510l87836n15622o19579
$$ plain form
36076 11529555 10830132 10073585 9285167 8497952 7753939 7098352 6569389 6188642 5956884
36067 5956884 5856503 5858264 5928334 6032646 6138640 6216568 6242241 6200701 6088567 5913406
36057 5913406 5690414 5438077 5174555 4915702 4674778 4463041 4290007 4162516 4082694 4046063
36047 4046063 4041386 4052983 4064539 4062370 4036822 3982216 3896721 3782417 3644720 3490695 3327257
36036 3327257 3160904 2999136 2851896 2730855 2645869 2600098 2586517 2588276 2583590 2553605 2489598
36025 2489598 2395488 2283840 2167932 2055645 1949469 1851498 1768086 1710109 1689696 1717402
36015 1717402 1801939 1951141 2171604 2466425 2832462 3258330 3723417 4198216 4647309 5035846
36005 5035846 5337938 5543243 5659092 5708254 5723953 5742631 5794491 5893871 6034176 6191147
$$ packed form
36076A1529555o99423p56547p88418p87215p44013o55587n28963l80747k31758
36067E956884j00381J761P0070J04312J05994P7928K5673m1540j12134j75161
36057E913406k22992k52337k63522k58853k40924k11737j73034j27491p9822l6631
36047D046063m677J1597J1556k169k5548n4606q5495j14304j37697j54025j63438
36036C327257j66353j61768j47240j21041q4986m5771j3581J759m686k9985o4007
36025B489598r4110j11648j15908j12287j06176r7971q3412n7977k0413K7706
36015A717402Q4537J49202K20463K94821L66037M25868M65087M74799M49093L88537
36005E035846L02092K05305J15849M9162J5699J8678N1860R9380J40305J56971
$$ plain form
35995 6191147 6333334 6433768 6476390 6455032 6368300 6216197 6001959 5737327 5446048 5161522
35985 5161522 4918800 4744377 4647736 4617446 4623456 4625199 4582679 4466151 4261449 3970621 3609177
35974 3609177 3201227 2774095 2354799 1969995 1647891 1417916 1305173 1321397 1458040 1686552
35964 1686552 1966636 2258653 2534429 2782044 3003705 3209370 3410417 3616420 3835128
35955 3835128 4073417 4336628 4625336 4930977 5233769 5506327 5723387 5873859 5968960 6041900
35945 6041900 6138919 6305401 6572499 6949090 7421791 7962041 8535821 9110518 9656599 10146807
35935 10146807 10557776 10875660 11101410 11249484 11338770 11381716 11379216 11322879 11199919 10995729
35925 10995729 10694468 10281444 9749098 9103857 8369346 7583549 6791171 6034891 5349437
$$ packed form
35995F191147J42187J00434M2622k1358q6732j52103k14238k64632k91279k84526
35985E161522k42722j74423r6641l0290O010J743m2520j16528k04702k90828l61444
35974C609177m07950m27132m19296l84804l22104k29975j12743J6224J36643K28512
35964A686552K80084K92017K75776K47615K21661K05665K01047K06003K18708
35955C835128K38289K63211K88708L05641L02792K72558K17060J50472R5101P2940
35945F041900R7019J66482K67098L76591M72701N40250N73780N74697N46081M90208
35935A0146807M10969L17884K25750J48074Q9286M2946k500n6337j22960k04190
35925A0995729l01261m13024n32346o45241p34511p85797p92378p56280o85454
$$ plain form
35916 5349437 4760466 4287162 3945288 3747838 3702721 3809371 4056737 4424084 4884145 5406784
35906 5406784 5961481 6518191 7047518 7521416 7915146 8210603 8400642 8492852 8510234 8486763
35896 8486763 8458741 8455908 8496359 8586029 8720222 8884597 9055932 9205015 9302344 9324186 9255709
35885 9255709 9090455 8828591 8476567 8048250 7565201 7053953 6540464 6044358 5576370
35876 5576370 5140918 4742674 4393024 4111500 3920092 3833144 3848674 3945917 4089712 4238578
35866 4238578 4352498 4398181 4351761 4199932 3940288 3580855 3138217 2634124 2091521 1531470
35856 1531470 972059 429376 -80452 -539833 -930790 -1239138 -1459934 -1600610 -1679396 -1720126
35846 -1720126 -1747029 -1782234 -1845404 -1952949 -2115408 -2334267 -2600654 -2896739 -3198559 -3478771
$$ packed form
35916E349437n88971m73304l41874j97450m5117J06650K47366L67347M60061N22639
35906E406784N54697N56710N29327M73898L93730K95457J90039R2210J7382k3471
35896H486763k8022k833M0451Q9670J34193J64375J71335J49083R7329K1842o8477
35885I255709j65254k61864l52024m28317m83049n11248n13489m96106m67988
35876E576370m35452l98244l49650k81524j91408q6948J5530R7243J43795J48866
35866D238578J13920M5683m6420j51829k59644l59433m42638n04093n42603n60051
35856A531470n59411n42683n09828m59381l90957l08348k20796j40676p8786m0730
35846a720126k6903l5205o3170j07545j62459k18859k66387k96085l01820k80212
$$ plain form
35836 -3478771 -3709328 -3864754 -3925677 -3881022 -3727885 -3469853 -3115552 -2678432 -2177188 -1634965
35826 -1634965 -1075882 -519392 24500 555729 1079492 1599290 2111945 2607100 3070538
35817 3070538 3488395 3849315 4143558 4360830 4489603 4518874 4440661 4251533 3953946 3559406
35807 3559406 3092653 2592322 2104063 1667926 1307457 1027460 820664 676867 587860 546812
35797 546812 545913 575928 627628 692979 764919 836567 901031 952159 985790 1000777 999269 986383
35785 986383 969749 958807 962989 988912 1038599 1110707 1204059 1320760 1467240 1653774 1893149
35774 1893149 2197905 2575828 3025366 3533628 4078281 4632427 5170178 5670542 6117977
35765 6117977 6499925 6803735 7015697 7123261 7119316 7006337 6798090 6517483 6190896 5841472
$$ packed form
35836c478771k30557j55426o0923M4655J53137K58032L54301M37120N01244N42223
35826a634965N59083N56490N43892N31229N23763N19798N12655M95155M63438
35817C070538M17857L60920K94243K17272J28773K9271p8213j89128k97587l94540
35807C559406m66753n00331m88259m36137l60469k79997k06796j43797q9007m1048
35797E46812q99L0015N1700O5351P1940P1648O4464N1128L3631J4987j508j2886
35785I86383j6634j0942M182K5923M9687P2108R3352J16701J46480J86534K39375
35774A893149L04756L77923M49538N08262N44653N54146N37751N00364M47435
35765F117977L81948L03810K11962J07564l945j12979k08247k80607l26587l49424
$$ plain form
35755 5841472 5484631 5127697 4772902 4421157 4074058 3733421 3400008 3073701 2755649
35746 2755649 2450555 2167113 1916440 1709988 1558248 1470580 1455706 1521669 1673758 1910258
35736 1910258 2218451 2574228 2946388 3303539 3620770 3884496 4094848 4264605 4414008
35727 4414008 4562671 4721630 4888901 5050450 5186336 5279505 5323329 5324705 5302167 5280738
35717 5280738 5285645 5336173 5440601 5593547 5777160 5966508 6137820 6276686 6382701 6468108
35707 6468108 6550910 6646090 6759594 6887419 7018631 7139383 7236090 7297846 7318872 7300764
35697 7300764 7253394 7193326 7139664 7108381 7107021 7131524 7166207 7186817 7165782 7078350 6908062
35686 6908062 6650157 6312282 5912726 5476550 5029825 4592948 4175599 3776166 3386019
$$ packed form
35755E841472l56841l56934l54795l51745l47099l40637l33413l26307l18052
35746B755649l05094k83442k50673k06452j51740q7668j4874O5963J52089K36500
35736A910258L08193L55777L72160L57151L17231K63726K10352J69757J49403
35727D414008J48663J58959J67271J61549J35886R3169M3824J376k2538k1429
35717E280738M907N0528J04428J52946J83613J89348J71312J38866J06015Q5407
35707F468108Q2802R5180J13504J27825J31212J20752R6707O1756K1026j8108
35697G300764m7370o0068n3662l1283j360K4503L4683K0610k1035q7432j70288
35686F908062k57905l37875l99556m36176m46725m36877m17349l99433l90147
$$ plain form
35677 3386019 2995574 2598259 2191071 1773589 1347924 920040 501024 106915 -242863
35668 -242863 -527722 -728690 -832486 -836789 -754587 -614238 -453463 -309067 -206852 -155695
35658 -155695 -146758 -156383 -151069 -94223 45394 285059 622415 1035260 1486983 1935512 2342737
35647 2342737 2681823 2940931 3123236 3244325 3328168 3402145 3491317 3612888 3772606 3964533
35637 3964533 4174049 4382551 4571732 4725645 4830192 4871825 4838271 4722404 4527045 4266896
35627 4266896 3965691 3650229 3344714 3067683 2831327 2641605 2498206 2395085 2323005 2273700
35617 2273700 2242977 2229965 2232886 2245032 2254625 2248833 2219103 2164629 2092858 2018059 1959400 1939210
35605 1939210 1980785 2104761 2324179 2639838 3038083 3492154 3966719 4424108 4830431 5159768
$$ packed form
35677C386019l90445l97315m07188m17482m25665m27884m19016l94109l49778
35668b42863k84859k00968j03796m303Q2202J40349J60775J44396J02215N1157
35658a55695Q937r625N314N6846J39617K39665L37356M12845M51723M48529M07225
35647B342737L39086K59108J82305J21089Q3843P3977Q9172J21571J59718J91927
35637C964533K09516K08502J89181J53913J04547M1633l3554j15867j95359k60149
35627D266896l01205l15462l05515k77031k36356j89722j43399j03121p2080m9305
35617B273700l0723j3012K921J2146R593n792k9730n4474p1771p4799n8659k0190
35605A939210M1575J23976K19418L15659L98245M54071M74565M57389M06323L29337
$$ plain form
35595 5159768 5395602 5530259 5564200 5506172 5373263 5189181 4980436 4771858 4583180 4427164
35585 4427164 4309077 4227401 4175610 4143874 4119194 4084311 4017913 3898505 3710814 3450682
35575 3450682 3124965 2746833 2329707 1883055 1411356 916178 400543 -126116 -645302
35566 -645302 -1131552 -1559278 -1911254 -2184390 -2390097 -2549566 -2686787 -2822657 -2972106 -3143922
35556 -3143922 -3341169 -3560278 -3788853 -4004550 -4177704 -4278279 -4284946 -4192641 -4015374 -3782847
35546 -3782847 -3531578 -3293705 -3088119 -2917881 -2774695 -2647539 -2530523 -2425985 -2341539 -2282903
35536 -2282903 -2246394 -2215482 -2164286 -2067283 -1910276 -1696065 -1441497 -1168674 -896572 -637039
35526 -637039 -394355 -165630 58628 292294 549023 836698 1152939 1483044 1801202 2075829
$$ packed form
35595E159768K35834J34657L3941n8028j32909j84082k08745k08578j88678j56016
35585D427164j18087q1676n1791l1736k4680l4883o6398j19408j87691k60132
35575C450682l25717l78132m17126m46652m71699m95178n15635n26659n19186
35566f45302m86250m27726l51976k73136k05707j59469j37221j35870j49449j71816
35556c143922j97247k19109k28575k15697j73154j00575o667R2305J77267K32527
35546c782847K51269K37873K05586J70238J43186J27156J17016J04538Q4446N8636
35536b282903L6509L0912N1196R7003J57007K14211K54568K72823K72102K59533
35526f37039K42684K28725K24258K33666K56729K87675L16241L30105L18158K74627
$$ plain form
35516 2075829 2278324 2392071 2417185 2368489 2268103 2137170 1991158 1840140 1691919 1554407
35506 1554407 1435083 1337834 1259247 1186910 1101611 983570 820301 612106 372020 119871
35496 119871 -126817 -360492 -585591 -813747 -1055257 -1312072 -1576003 -1832072 -2064540 -2262714
35486 -2262714 -2424041 -2552950 -2656054 -2736542 -2790730 -2807677 -2771169 -2663288 -2468928 -2180014
35476 -2180014 -1798248 -1336459 -819067 -280783 238018 698890 1072804 1344521 1513214
35467 1513214 1590429 1596304 1554577 1486950 1407652 1319347 1212687 1071749 884223 650634 386166
35456 386166 114121 -143421 -370879 -557870 -694228 -766159 -756668 -650141 -438347 -124641
35446 -124641 275278 735676 1224909 1710265 2162602 2559828 2888617 3144338 3329580 3451644
$$ packed form
35516B075829K02495J13747K5114m8696j00386j30933j46012j51018j48221j37512
35506A554407j19324r7249p8587p2337q5299j18041j63269k08195k40086k52149
35496A19871k46688k33675k25099k28156k41510k56815k63931k56069k32468j98174
35486b262714j61327j28909j03104q0488n4188j6947L6508J07881J94360K88914
35476b180014L81766M61789N17392N38284N18801M60872L73914K71717J68693
35467A513214P7215N875m1727o7627p9298q8305j06660j40938j87526k33589k64468
35456C86166k72045k57542k27458j86991j36358p1931R491J06527K11794L13706
35446a24641L99919M60398M89233M85356M52337L97226L28789K55721J85242J22064
$$ plain form
35436 3451644 3519614 3542152 3527010 3481979 3416081 3339925 3265032 3202427 3160847 3145300 3157214
35425 3157214 3196637 3264548 3362437 3488678 3635413 3790259 3942550 4088849 4233208 4383297
35415 4383297 4547137 4732429 4945546 5187167 5446388 5698744 5911095 6050945 6095248 6035495
35405 6035495 5878461 5642987 5353374 5031235 4688945 4327140 3936525 3502605 3011859
35396 3011859 2458122 1847514 1200021 547049 -73930 -625475 -1075413 -1400677 -1589721
35387 -1589721 -1643847 -1577565 -1417707 -1200122 -962953 -737597 -541114 -374632 -229263 -96101
35377 -96101 25878 128596 200090 232186 225998 192643 149120 111571 89658 85225 95300 115901
35365 115901 142884 169581 184436 171644 114664 569 -176226 -411121 -688119 -982076
$$ packed form
35436C451644O7970K2538j5142m5031o5898p6156p4893o2605m1580j5547J1914
35425C157214L9423O7911R7889J26241J46735J54846J52291J46299J44359J50089
35415D383297J63840J85292K13117K41621K59221K52356K12351J39850M4303n9753
35405F035495j57034k35474k89613l22139l42290l61805l90615m33920m90746
35396C011859n53737o10608o47493o52972o20979n51545m49938l25264j89044
35387a589721n4126O6282J59858K17585K37169K25356J96483J66482J45369J33162
35377i6101J21979J02718P1494L2096o188l3355m3523l7549k1913m433J0075K0601
35365A15901K6983K6697J4855j2792n6980j14095j76795k34895k76998k93957
$$ plain form
35355 -982076 -1265172 -1515530 -1723677 -1893441 -2037122 -2167902 -2293299 -2412040 -2514552 -2585869
35345 -2585869 -2609659 -2572262 -2465696 -2288768 -2046264 -1747210 -1403375 -1028251 -636210 -241653
35335 -241653 141613 500872 825289 1106987 1341477 1526942 1663290 1752743 1802306 1826366
35325 1826366 1847065 1891587 1987176 2155261 2405994 2734804 3122878 3542435 3965263 4370964
35315 4370964 4751499 5110563 5458301 5803481 6146363 6476033 6773930 7021332 7205480
35306 7205480 7320638 7365222 7339496 7246654 7095878 6903469 6689991 6474731 6270971 6084528
35296 6084528 5915448 5760453 5613968 5467559 5309504 5125916 4903097 4629968 4299989
35287 4299989 3912995 3477163 3010534 2540786 2102262 1730276 1454078 1291121 1245098 1308404
$$ packed form
35355i82076k83096k50358k08147j69764j43681j30780j25397j18741j02512p1317
35345b585869k3790L7397J06566J76928K42504K99054L43835L75124L92041L94557
35335b41653L83266L59259L24417K81698K34490J85465J36348Q9453M9563K4060
35325A826366K0699M4522R5589J68085K50733L28810L88074M19557M22828M05701
35315D370964L80535L59064L47738L45180L42882L29670K97897K47402J84148
35306G205480J15158M4584k5726r2842j50776j92409k13478k15260k03760j86443
35296F084528j69080j54995j46485j46409j58055j83588k22819k73129l29979
35287D299989l86994m35832m66629m69748m38524l71986k76198j62957m6023O3306
$$ plain form
35277 1308404 1467001 1704552 2003740 2345312 2707334 3066891 3404315 3707631 3974456
35268 3974456 4210257 4424355 4626359 4824750 5027167 5240169 5466665 5701637 5929212
35259 5929212 6124251 6258830 6310588 6268725 6135240 5922190 5647399 5330753 4991706 4648041
35249 4648041 4315950 4010995 3748402 3540888 3394252 3303895 3255790 3232343 3219695 3212417
35239 3212417 3214422 3237774 3300806 3424893 3628729 3921211 4296360 4732887 5198149 5654032
35229 5654032 6062745 6391923 6619003 6734553 6744039 6667572 6537236 6391526 6267273 6191000
35219 6191000 6172959 6206781 6275286 6359676 6447398 6535329 6628142 6734263 6861708 7014836 7192486
35208 7192486 7387914 7590354 7787130 7965263 8112416 8217509 8271074 8265101 8192388 8045728
$$ packed form
35277A308404J58597K37551K99188L41572L62022L59557L37424L03316K66825
35268C974456K35801K14098K02004J98391K02417K13002K26496K34972K27575
35259E929212J95039J34579N1758m1863j33485k13050k74791l16646l39047l43665
35249D648041l32091l04955k62593k07514j46636r0357m8105k3447j2648p278
35239C212417K005K3352O3032J24087K03836K92482L75149M36527M65262M55883
35229E654032M08713L29178K27080J15550R486p6467j30336j45710j24253p6273
35219F191000j8041L3822O8505Q4390Q7722Q7931R2813J06121J27445J53128J77650
35208G192486J95428K02440J96776J78133J47153J05093N3565n973p2713j46660
$$ plain form
35198 8045728 7817649 7501501 7094205 6599377 6028601 5399923 4734978 4056799 3388855
35189 3388855 2754622 2177671 1682670 1296465 1046972 958905 1048171 1317929 1757688 2344582
35179 2344582 3045343 3818363 4616519 5391630 6100523 6710948 7204767 7577046 7832169
35170 7832169 7979582 8031054 7999670 7899848 7747867 7562790 7367213 7186519 7045203 6960700
35160 6960700 6937428 6964349 7017375 7065473 7078491 7034993 6927988 6765699 6565724 6344639
35150 6344639 6108442 5849104 5548833 5189446 4762008 4272738 3743810 3210145 2713905
35141 2713905 2297628 1996396 1829854 1795872 1867970 1998401 2127691 2199075 2173216 2037037
35131 2037037 1802894 1499604 1161128 818724 498479 222118 7582 -132579 -194425 -185205
$$ packed form
35198H045728k28079l16148m07296m94828n70776o28678o64945o78179o67944
35189C388855o34233n76951m95001l86205k49493q8067Q9266K69758M39759N86894
35179B344582P00761P73020P98156P75111P08893O10425M93819L72279K55123
35170G832169J47413N1472l1384r9822j51981j85077j95577j80694j41316q4503
35160F960700k3272K6921N3026M8098J3018m3498j07005j62289j99975k21085
35150F344639k36197k59338l00271l59387m27438m89270n28928n33665m96240
35141B713905m16277l01232j66542l3982P2098J30431J29290P1384k5859j36179
35131B037037k34143l03290l38476l42404l20245k76361k14536j40161o1846R220
$$ plain form
35121 -185205 -122973 -32272 62934 146277 213124 270205 330752 406736 501247 604928 699055
35110 699055 763998 788251 773020 730952 681242 644459 639009 679718 778333 945240 1190765
35099 1190765 1524006 1948414 2455732 3021710 3606591 4160954 4634801 4986774 5191076
35090 5191076 5241209 5150529 4949683 4681049 4390633 4118871 3892824 3722411 3601975 3516011
35080 3516011 3445904 3374540 3287871 3174852 3027516 2841313 2614393 2345305 2030956 1667391
35070 1667391 1253681 795767 306461 -199173 -709864 -1221042 -1732336 -2241091 -2736152
35061 -2736152 -3196177 -3594283 -3906971 -4122331 -4242571 -4279598 -4247190 -4155619 -4012366 -3827595
35051 -3827595 -3619353 -3413899 -3240537 -3124363 -3081213 -3116539 -3226650 -3400023 -3618339 -3858525
$$ packed form
35121a85205O2232R0701R5206Q3343O6847N7081O0547P5984R4511J03681R4127
35110F99055O4943K4253j5231m2068m9710l6783n450M0709R8615J66907K45525
35099A190765L33241M24408N07318N65978N84881N54363M73847L51973K04302
35090E191076N0133r0680k00846k68634k90416k71762k26047j70413j20436q5964
35080C516011p0107p1364q6669j13019j47336j86203k26920k69088l14349l63565
35070A667391m13710m57914m89306n05634n10691n11178n11294n08755m95061
35061b736152m60025l98106l12688k15360j20240l7027L2408R1571J43253J84771
35051c827595K08242K05454J73362J16174M3150l5326j10111j73373k18316k40186
$$ plain form
35041 -3858525 -4096350 -4310243 -4484045 -4608921 -4684997 -4721299 -4731700 -4727168 -4708461 -4664142 -4575286
35030 -4575286 -4423917 -4200592 -3907729 -3557621 -3166448 -2747276 -2305392 -1837839 -1336768
35021 -1336768 -794616 -208862 414990 1062640 1712523 2339729 2921544 3442333 3895025
35012 3895025 4278385 4592426 4835380 5003731 5094170 5105720 5041419 4910038 4727865 4519428
35002 4519428 4315489 4147686 4041064 4007040 4039163 4112964 4190479 4229214 4193613 4065132
34992 4065132 3847287 3565129 3261294 2990555 2812531 2781619 2935345 3284561 3809237 4461944
34982 4461944 5178802 5894860 6558540 7139669 7629145 8032660 8362994 8634009 8857317
34973 8857317 9041664 9194790 9326619 9451679 9589227 9761053 9987745 10283757 10651842
$$ packed form
35041c858525k37825k13893j73802j24876p6076l6302j0401M532J8707M4319Q8856
35030d575286J51369K23325K92863L50108L91173M19172M41884M67553N01071
35021a336768N42152N85754O23852O47650O49883O27206N81815N20789M52692
35012C895025L83360L14041K42954J68351R0439J1550o4301j31381j82173k08437
35002D519428k03939j67803j06622l4024L2123P3801P7515L8735l5601j28481
34992D065132k17845k82158l03835k70739j78024l0912J53726L49216N24676O52707
34982D461944P16858P16058O63680N81129M89476M03515L30334K71015K23308
34973H857317J84347J53126J31829J25060J37548J71826K26692K96012L68085
$$ plain form
34964 10651842 11078900 11536178 11985123 12386768 12710164 12935938 13054304 13060864 12955275 12745171
34954 12745171 12452045 12112577 11771777 11470803 11236006 11074012 10973580 10912383 10865972 10815558
34944 10815558 10751608 10672201 10577914 10466302 10328643 10150388 9915310 9611615 9237423 8803542
34934 8803542 8332846 7856615 7408753 7019790 6712910 6502744 6395427 6388119 6468446 6616078
34924 6616078 6807393 7021281 7242954 7464332 7682126 7895722 8106044 8315321 8527300
34915 8527300 8747688 8984230 9245006 9533901 9844757 10158391 10445914 10677316 10829958
34906 10829958 10891888 10859402 10732756 10514350 10210371 9833242 9401458 8935807 8454109 7967823
34896 7967823 7482298 6999724 6522307 6053675 5598379 5160929 4745972 4359988 4013107
$$ packed form
34964A0651842M27058M57278M48945M01645L23396K25774J18366O560j05589k10104
34954A2745171k93126l39468l40800l00974k34797j61994j00432o1197m6411n0414
34944A0815558o3950p9407r4287j11612j37659j78255k35078l03695l74192m33881
34934H803542m70696m76231m47862l88963l06880k10166j07317p308Q0327J47632
34924F616078J91315K13888K21673K21378K17794K13596K10322K09277K11979
34915H527300K20388K36542K60776K88895L10856L13634K87523K31402J52642
34906A0829958O1930l2486j26646k18406l03979l77129m31784m65651m81698m86286
34896G967823m85525m82574m77417m68632m55296m37450m14957l85984l46881
$$ plain form
34887 4013107 3718754 3489805 3332553 3242418 3205309 3205148 3232973 3291127 3389312 3535618 3729007
34876 3729007 3957522 4201395 4437525 4642996 4797874 4888191 4908875 4865230 4771735 4648197
34866 4648197 4514612 4386909 4275210 4184669 4117512 4074968 4058787 4072579 4122622 4217321 4364965
34855 4364965 4570374 4831401 5136179 5462286 5778920 6052052 6250885 6353259 6348607 6238262
34845 6238262 6033777 5754008 5421697 5059648 4686318 4311438 3933688 3542481 3123560
34836 3123560 2665794 2166329 1632826 1082715 539907 30051 -423816 -804058 -1100227
34827 -1100227 -1310942 -1445214 -1520859 -1558904 -1576370 -1581701 -1574827 -1550010 -1498130 -1407371 -1264155
34816 -1264155 -1056176 -776789 -428126 -21190 426595 894767 1362864 1812640 2229363
$$ packed form
34887D013107k94353k28949j57252r0135l7109j61K7825N8154R8185J46306J93389
34876C729007K28515K43873K36130K05471J54878R0317K0684m3645r3495j23538
34866D648197j33585j27703j11699r0541o7157m2544j6181J3792N0043R4699J47644
34855D364965K05409K61027L04778L26107L16634K73132J98833J02374m652j10345
34845F238262k04485k79769l32311l62049l73330l74880l77750l91207m18921
34836C123560m57766m99465n33503n50111n42808n09856m53867l80242k96169
34827a100227k10715j34272p5645l8045j7466n331O874K4817N1880R0759J43216
34816a264155K07979K79387L48663M06936M47785M68172M68097M49776M16723
$$ plain form
34807 2229363 2602416 2925726 3198332 3424877 3615698 3785991 3953388 4133583 4335208
34798 4335208 4556583 4786278 5006705 5198297 5342894 5426922 5444804 5401129 5309536 5188392
34788 5188392 5055909 4927240 4813396 4719959 4644758 4576522 4497217 4388228 4237529 4044669
34778 4044669 3822323 3594483 3391408 3242155 3167533 3177043 3270655 3442503 3683086 3979604
34768 3979604 4316576 4677544 5045892 5402913 5724728 5982459 6148462 6206388 6159082 6029046
34758 6029046 5850811 5659376 5480684 5327918 5203494 5103798 5023550 4958178 4903806 4855325
34748 4855325 4803994 4736760 4638445 4495556 4299292 4046537 3739559 3385351 2994790 2581699
34738 2581699 2162260 1754394 1375777 1040317 755579 523640 344566 218867 146427 123096
$$ packed form
34807B229363L73053L23310K72606K26545J90821J70293J67397J80195K01625
34798D335208K21375K29695K20427J91592J44597Q4028J7882m3675r1593j21144
34788E188392j32483j28669j13844r3437p5201o8236p9305j08989j50699j92860
34778D044669k22346k27840k03075j49253p4622R510R3612J71848K40583K96518
34768C979604L36972L60968L68348L57021L21815K57731J66003N7926m7306j30036
34758F029046j78235j91435j78692j52766j24424r9696q0248o5372n4372m8481
34748D855325n1331o7234r8315j42889j96264k52755l06978l54208l90561m13091
34738B581699m19439m07866l78617l35460k84738k31939j79074j25699p2440k3331
$$ plain form
34728 123096 138259 175842 219220 257891 291901 330536 385532 463119 559487 661257 749986
34717 749986 809095 830822 819616 789242 754911 725325 699003 665633 610646 521029 390754
34706 390754 224139 35690 -153541 -321278 -448557 -521739 -532047 -474290 -346588 -151328
34696 -151328 104039 407443 743535 1094986 1443712 1772729 2068628 2323751 2537279 2715214
34686 2715214 2869632 3017460 3178884 3375394 3626761 3946238 4334965 4778838 5250993
34677 5250993 5719549 6156359 6541984 6865639 7122825 7314184 7446683 7535069 7600848 7667830
34667 7667830 7755731 7874371 8020254 8176624 8317709 8417057 8457590 8438794 8376976 8298288
34657 8298288 8228805 8187182 8183073 8220322 8301518 8430429 8610588 8840796 9110404 9397908
$$ packed form
34728A23096J5163L7583M3378L8671L4010L8635N4996P7587R6368J01770Q8729
34717G49986N9109K1727j1206l0374l4331k9586k6322l3370n4987q9617j30275
34706C90754j66615j88449j89231j67737j27279p3182j0308N7757J27702J95260
34696a51328K55367L03404L36092L51451L48726L29017K95899K55123K13528J77935
34686B715214J54418J47828J61424J96510K51367L19477L88727M43873M72155
34677E250993M68556M36810L85625L23655K57186J91359J32499Q8386O5779O6982
34667G667830Q7901J18640J45883J56370J41085R9348M0533j8796o1818p8688
34657H298288o9483m1623m109L7249Q1196J28911J80159K30208K69608K87504
$$ plain form
34647 9397908 9674686 9912539 10091207 10202210 10247859 10236756 10178342 10078837 9939948 9760304
34637 9760304 9538369 9275187 8976148 8651470 8315109 7981705 7662502 7362395 7079716
34628 7079716 6808178 6538992 6262025 5966482 5642221 5282262 4886148 4462637 4029420
34619 4029420 3608650 3220299 2877543 2586534 2348540 2160953 2016601 1904587 1815372 1748639
34609 1748639 1718766 1753215 1883232 2131106 2500400 2973697 3517719 4092108 4657978 5184690
34599 5184690 5654583 6064997 6426310 6756083 7071489 7382899 7690402 7983414 8243092
34590 8243092 8447034 8575125 8614394 8561086 8419967 8202638 7926316 7612748 7285917 6968201
34580 6968201 6676437 6419754 6199822 6012634 5850384 5702612 5556950 5400274 5220544
$$ packed form
34647I397908K76778K37853J78668J11003M5649j1103n8414r9505j38889j79644
34637I760304k21935k63182k99039l24678l36361l33404l19203l00107k82679
34628G079716k71538k69186k76967k95543l24261l59959l96114m23511m33217
34619D029420m20770l88351l42756k91009k37994j87587j44352j12014q9215o6733
34609A748639k9873L4449J30017K47874L69294M73297N44022N74389N65870N26712
34599E184690M69893M10414L61313L29773L15406L11410L07503K93012K59678
34590H243092K03942J28091L9269n3308j41119k17329k76322l13568l26831l17716
34580F968201k91764k56683k19932j87188j62250j47772j45662j56676j79730
$$ plain form
34571 5220544 5008314 4756914 4461646 4119846 3732872 3308679 2862231 2412214 1975483
34562 1975483 1562785 1178853 827244 516709 264558 94462 30056 88054 273904 580964
34552 580964 992766 1487470 2042882 2640052 3263959 3901188 4536012 5147068 5707151 6187511
34542 6187511 6565358 6830853 6989831 7061277 7071394 7046974 7010141 6975675 6951528 6942214 6953634
34531 6953634 6997113 7090233 7253075 7500885 7836890 8249675 8716577 9210163 9703186 10169857
34521 10169857 10585376 10927000 11177808 11331119 11392422 11377222 11305819 11197250 11064423 10911395
34511 10911395 10733290 10519029 10256462 9938447 9567946 9160742 8745224 8359015 8042203
34502 8042203 7828329 7736398 7767759 7909014 8138122 8429770 8758675 9102128 9442973 9772100
$$ packed form
34571E220544k12230k51400k95268l41800l86974m24193m46448m50017m36731
34562A975483m12698l83932l51609l10535k52151j70096o4406N7998J85850L07060
34552E80964M11802M94704N55412N97170O23907O37229O34824O11056N60083M80360
34542F187511L77847K65495J58978P1446J0117k4420l6833l4466k4147r314J1420
34531F953634M3479R3120J62842K47810L36005M12785M66902M93586M93023M66671
34521A0169857M15519L41624K50808J53311O1303j5200p1403j08569j32827j53028
34511A0911395j78105k14261k62567l18015l70501m07204m15518l86209l16812
34502H042203k13874r1931L1361J41255K29108K91648L28905L43453L40845L29127
$$ plain form
34492 9772100 10088847 10398965 10711095 11032857 11367548 11712603 12060396 12400533 12722232
34483 12722232 13016315 13276970 13502604 13694461 13853493 13978554 14068393 14125842 14159991 14184017
34473 14184017 14210802 14250264 14310078 14398173 14524155 14697801 14924684 15200778 15509435 15823707
34463 15823707 16114155 16358494 16547723 16685323 16780179 16837266 16851559 16809311 16697006 16512968
34453 16512968 16273924 16011647 15761635 15550759 15390342 15276839 15198325 15143167 15106740 15092724
34443 15092724 15108186 15155643 15227543 15307110 15374934 15416735 15426989 15406440 15356502 15275755 15161370
34432 15161370 15013444 14838265 14648652 14462490 14300719 14184404 14130012 14143977 14219333 14336851
34422 14336851 14470774 14597025 14700541 14778759 14839782 14896144 14957142 15023527 15087070 15134791
$$ packed form
34492I772100L16747L10118L12130L21762L34691L45055L47793L40137L21699
34483A2722232K94083K60655K25634J91857J59032J25061Q9839N7449L4149K4026
34473A4184017K6785L9462N9814Q8095J25982J73646K26883K76094L08657L14272
34463A5823707K90448K44339J89229J37600R4856N7087J4293m2248j12305j84038
34453A6512968k39044k62277k50012k10876j60417j13503p8514n5158l6427j4016
34443A5092724J5462M7457P1900P9567O7824M1801J0254k0549m9938q0747j14385
34432A5161370j47926j75179j89613j86162j61771j16315n4392J3965P5356J17518
34422A4336851J33923J26251J03516P8218O1023N6362O0998O6385O3543M7721
$$ plain form
34412 15134791 15155350 15144856 15110635 15072202 15058175 15098206 15211722 15398698 15638134 15895792
34402 15895792 16137237 16339328 16494842 16609436 16694187 16758508 16806928 16840566 16861773 16878960
34392 16878960 16908367 16971071 17086379 17265104 17506084 17797221 18120231 18457138 18795977 19133297
34382 19133297 19472906 19822683 20191845 20588737 21017506 21473590 21941262 22396655 22815809
34373 22815809 23183106 23495234 23759295 23987350 24190981 24378336 24553998 24720442 24879557
34364 24879557 25033762 25187104 25346483 25522135 25726245 25969760 26259000 26594248 26971566
34355 26971566 27387263 27842805 28347586 28918244 29574927 30335883 31211625 32199989 33283970
34346 33283970 34434140 35615456 36795333 37948559 39056368 40100915 41059963 41907092
$$ packed form
34412A5134791K0559j0494l4221l8433j4027M0031J13516J86976K39436K57658
34402A5895792K41445K02091J55514J14594Q4751O4321M8420L3638K1207J7187
34392A6878960K9407O2704J15308J78725K40980K91137L23010L36907L38839L37320
34382A9133297L39609L49777L69162L96892M28769M56084M67672M55393M19154
34373B2815809L67297L12128K64061K28055K03631J87355J75662J66444J59115
34364B4879557J54205J53342J59379J75652K04110K43515K89240L35248L77318
34355B6971566M15697M55542N04781N70658O56683P60956Q75742R88364J083981
34346C3283970J150170J181316J179877J153226J107809J044547R59048Q47129
$$ plain form
34338 41907092 42619260 43188048 43627610 43974238 44277834 44589850 44952631 45392635 45917978
34329 45917978 46519896 47177561 47865304 48560705 49251465 49938768 50635789 51361924 52135044
34320 52135044 52964787 53849439 54777848 55735691 56712781 57707262 58724956 59775886 60871176
34311 60871176 62021556 63236722 64525062 65894258 67352481 68908195 70566750 72324612
34303 72324612 74164699 76056224 77960040 79837729 81661164 83419244 85119782 86786295
34295 86786295 88451187 90147825 91904048 93738965 95663243 97681466 99794239 101998703
34287 101998703 104288242 106653541 109086202 111583588 114151725 116803980 119556144 122421112
34279 122421112 125406545 128516674 131756566 135135636 138668072 142370270 146257262 150340343
$$ packed form
34338D1907092P12168N68788M39562L46628L03596L12016L62781M40004N25343
34329D5917978O01918O57665O87743O95401O90760O87303O97021P26135P73120
34320E2135044Q29743Q84652R28409R57843R77090R94481J017694J050930J095290
34311F0871176J150380J215166J288340J369196J458223J555714J658555J757862
34303G2324612J840087J891525J903816J877689J823435J758080J700538J666513
34295H6786295J664892J696638J756223J834917J924278K018223K112773K204464
34287A01998703K289539K365299K432661K497386K568137K652255K752164K864968
34279A22421112K985433L110129L239892L379070L532436L702198L886992M083081
$$ plain form
34271 150340343 154626919 159122295 163832297 168765407 173933729 179353122 185043136 191026018
34263 191026018 197322905 203946646 210894230 218143804 225659397 233401983 241342107 249468714
34255 249468714 257790458 266328651 275104174 284123286 293367759 302793235 312336591 321929731
34247 321929731 331514532 341053289 350531045 359949236 369312295 378610592 387805275 396821746
34239 396821746 405555692 413888694 421704850 428900590 435386312 441084611 445930531 449874944
34231 449874944 452887650 454956353 456081429 456270293 455535026 453892946 451366540 447980652
34223 447980652 443759165 438725233 432905779 426336360 419062153 411135276 402612711 393558074
34215 393558074 384045672 374162285 364004019 353669768 343254573 332844385 322512094
$$ packed form
34271A50340343M286576M495376M710002M933110N168322N419393N690014N982882
34263A91026018O296887O623741O947584P249574P515593P742586P940124Q126607
34255B49468714Q321744Q538193Q775523R019112R244473R425476R543356R593140
34247C21929731R584801R538757R477756R418191R363059R298297R194683R016471
34239C96821746Q733946Q333002P816156P195740O485722N698299M845920L944413
34231D49874944L012706K068703J125076J88864p35267j642080k526406l385888
34223D47980652m221487n033932n819454o569419p274207p926877q522565r054637
34215C93558074r512402r883387j0158266j0334251j0415195j0410188j0332291
$$ plain form
34208 322512094 312315430 302298434 292496383 282940512 273658405 264670149 255984619 247599832
34200 247599832 239506973 231694898 224153069 216873460 209852588 203093240 196604231 190396910
34192 190396910 184478844 178847204 173485213 168363532 163445355 158691718 154064696 149529223
34184 149529223 145056017 140626697 136239015 131908009 127659785 123518729 119494043 115573866
34176 115573866 111731560 107941073 104192083 100496207 96881879 93382600 90026071 86829264
34168 86829264 83799405 80937231 78239108 75697462 73301172 71036905 68890764 66849331
34160 66849331 64900444 63034400 61244942 59528528 57881843 56300033 54777872 53312802
34152 53312802 51905954 50558857 49268228 48023827 46811852 45621336 44448878 43299170
$$ packed form
34208C22512094j0196664j0016996r802051r555871r282107q988256q685530q384787
34200B47599832q092859p812075p541829p279609p020872o759348o489009o207321
34192A90396910n918066n631640n361991n121681m918177m753637m627022m535473
34184A49529223m473206m429320m387682m331006m248224m141056m024686l920177
34176A15573866l842306l790487l748990l695876l614328l499279l356529l196807
34168H6829264l029859k862174k698123k541646k396290k264267k146141k041433
34160F6849331j948887j866044j789458j716414j646685j581810j522161j465070
34152E3312802j406848j347097j290629j244401j211975j190516j172458j149708
$$ plain form
34144 43299170 42182506 41112027 40102389 39169381 38328628 37591817 36961391 36427212 35968450
34135 35968450 35560280 35181048 34815587 34453732 34086490 33702986 33290139 32835377 32331083
34126 32331083 31778158 31186521 30572743 29957580 29366072 28829706 28386666 28075863 27924652
34117 27924652 27936102 28084080 28320013 28587232 28834507 29023417 29130292 29146179 29075741 28933361
34107 28933361 28736054 28496963 28224611 27929074 27629682 27356028 27138342 26992058 26906879
34098 26906879 26848368 26771571 26638695 26431418 26152845 25820546 25456346 25078894 24701543 24333698
34088 24333698 23981840 23648585 23331457 23023960 22719133 22413096 22106024 21800354 21498037
34079 21498037 21198715 20899444 20595263 20279715 19945053 19582841 19185860 18751328 18283840
$$ packed form
34144D3299170j116664j070479j009638r33008q40753p36811o30426n34179m58762
34135C5968450m08170l79232l65461l61855l67242l83504m12847m54762n04294
34126C2331083n52925n91637o13778o15163n91508n36366m43040l10803j51211
34117B7924652J1450J47978K35933K67219K47275J88910J06875J5887p0438j42380
34107B8933361j97307k39091k72352k95537k99392k73654k17686j46284q5179
34098B6906879n8511p6797j32876k07277k78573l32299l64200l77452l77351l67845
34088B4333698l51858l33255l17128l07497l04827l06037l07072l05670l02317
34079B1498037k99322k99271l04181l15548l34662l62212l96981m34532m67488
$$ plain form
34070 18283840 17795880 17305120 16830328 16388837 15997096 15672746 15434997 15301171 15280459
34061 15280459 15368398 15545766 15783321 16050334 16322396 16584210 16826376 17039189 17208096
34052 17208096 17313514 17334391 17253058 17059351 16752790 16341699 15838708 15253883 14589153 13837974
34042 13837974 12991531 12048948 11026694 9962672 8912666 7939970 7101884 6438082 5964468
34033 5964468 5672976 5535529 5510631 5552383 5621154 5692791 5761978 5837833 5934440 6061526 6219234
34022 6219234 6397744 6580192 6746667 6877647 6956265 6970101 6913277 6788393 6606848 6386976
34012 6386976 6151220 5923801 5728807 5587819 5517218 5526408 5617295 5784093 6013061 6283445
34002 6283445 6570617 6850383 7102434 7312443 7473710 7588282 7665948 7720557 7765854 7813873
$$ packed form
34070A8283840m87960m90760m74792m41491l91741l24350k37749j33826k0712
34061A5280459Q7939J77368K37555K67013K72062K61814K42166K12813J68907
34052A7208096J05418K0877q1333j93707l06561m11091n02991n84825o64730p51179
34042A3837974q46443r42583j022254j064022j050006r72696q38086o63802m73614
34033E964468k91492j37447k4898M1752O8771P1637O9187P5855R6607J27086J57708
34022F219234J78510J82448J66475J30980P8618J3836n6824j24884j81545k19872
34012F386976k35756k27419j94994j40988p0601R190R0887J66798K28968K70384
34002F283445K87172K79766K52051K10009J61267J14572P7666N4609M5297M8019
$$ plain form
33992 7813873 7876511 7967877 8104645 8303258 8574789 8919343 9322603 9756773 10186242 10575629
33982 10575629 10896622 11131228 11271705 11319540 11285845 11193312 11076863 10979244 10941087 10990088
33972 10990088 11135852 11373135 11689751 12072491 12507389 12976009 13452170 13902339 14290067
33963 14290067 14582623 14757266 14804704 14728485 14540893 14257366 13891719 13453881 12950830 12390170
33953 12390170 11784200 11151688 10515963 9900506 9324521 8800210 8332100 7918478 7555268
33944 7555268 7241688 6985047 6801356 6710341 6726758 6851989 7069829 7348668 7650015 7940679
33934 7940679 8203473 8440602 8666992 8897209 9134520 9369141 9584983 9767305 9904614
33925 9904614 9985244 9994938 9920214 9755930 9510918 9206666 8869086 8518098 8160861 7792112
$$ packed form
33992G813873O2638R1366J36768J98613K71531L44554M03260M34170M29469L89387
33982A0575629L20993K34606J40477M7835l3695r2533j16449r7619l8157M9001
33972A0990088J45764K37283L16616L82740M34898M68620M76161M50169L87728
33963A4290067K92556J74643M7438p6219j87592k83527l65647m37838n03051n60660
33953A2390170o05970o32512o35725o15457n75985n24311m68110m13622l63210
33944G555268l13580k56641j83691r1015J6417J25231K17840K78839L01347K90664
33934G940679K62794K37129K26390K30217K37311K34621K15842J82322J37309
33925I904614Q0630R694p4724j64284k45012l04252l37580l50988l57237l68749
$$ plain form
33915 7792112 7400904 6980113 6534480 6083971 5660875 5300778 5030064 4854827 4756495 4696821
33905 4696821 4630269 4518024 4337591 4085193 3772437 3420422 3053529 2693596 2355039 2041858
33895 2041858 1747010 1454093 1141424 788800 385588 -63374 -537371 -1004918 -1431369
33886 -1431369 -1785749 -2045175 -2196352 -2234076 -2157744 -1968193 -1666752 -1256235 -742062 -132508
33876 -132508 561334 1325152 2141117 2988477 3844444 4684025 5479275 6200759 6823389 7334858
33866 7334858 7741589 8067873 8347874 8613876 8885609 9164627 9435496 9672548 9849000
33857 9849000 9945248 9954327 9883116 9748615 9570837 9366594 9148039 8925889 8713513 8528484
33847 8528484 8390941 8320090 8329943 8425438 8600326 8837918 9114170 9401726 9674086 9909696
$$ packed form
33915G792112l91208m20791m45633m50509m23096l60097k70714j75237r8332n9674
33905D696821o6552j12245j80433k52398l12756l52015l66893l59933l38557l13181
33895B041858k94848k92917l12669l52624m03212m48962m73997m67547m26451
33886a431369l54380k59426j51177l7724P6332J89551L01441M10517N14173O09554
33876a32508O93842P63818Q15965Q47360Q55967Q39581P95250P21484O22630N11469
33866G334858M06731L26284K80001K66002K71733K79018K70869K37052J76452
33857I849000R6248R079p1211j34501j77778k04243k18555k22150k12376j85029
33847H528484j37543p0851R853R5495J74888K37592K76252K87556K72360K35610
$$ plain form
33837 9909696 10095301 10227159 10308965 10346959 10344335 10297997 10199741 10041569 9821972 9549277
33827 9549277 9240088 8914324 8590361 8283079 8004691 7766037 7576115 7439864 7356018 7316565
33817 7316565 7307587 7310375 7302278 7258020 7152674 6966663 6691088 6330133 5898362 5414614 4897300
33806 4897300 4364352 3835992 3335297 2883990 2495773 2172219 1904233 1678210 1483221
33797 1483221 1315387 1177880 1077979 1023846 1022279 1076838 1185797 1341276 1531457 1745722
33787 1745722 1979688 2236361 2521838 2837517 3173528 3507801 3812005 4061103 4241120
33778 4241120 4351567 4402910 4412210 4399487 4385264 4388330 4423250 4498178 4613876 4764301 4938308
33767 4938308 5121737 5299085 5454625 5573763 5645796 5667844 5647409 5600462 5545078 5494893
$$ packed form
33837I909696J85605J31858Q1806L7994k624m6338r8256j58172k19597k72695
33827I549277l09189l25764l23963l07282k78388k38654j89922j36251q3846l9453
33817G316565q978K788q097m4258j05346j86011k75575l60955m31771m83748n17314
33806D897300n32948n28360n00695m51307l88217l23554k67986k26023j94989
33797A483221j67834j37507r9901n4133j567N4559J08959J55479J90181K14265
33787A745722K33966K56673K85477L15679L36011L34273L04204K49098J80017
33778D241120J10447N1343R300j2723j4223L066L4920P4928J15698J50425J74007
33767D938308J83429J77348J55540J19138P2033K2048k0435m6947n5384n0185
$$ plain form
33757 5494893 5457657 5439826 5452578 5513121 5639303 5841026 6113885 6437919 6780806 7103526
33747 7103526 7367431 7542197 7613377 7587076 7489243 7358817 7236551 7153807 7125978 7152522
33737 7152522 7221620 7315415 7413339 7493845 7535457 7517293 7419141 7222767 6916146 6499581 5989824
33726 5989824 5418900 4827764 4257782 3743057 3305386 2952659 2680871 2478991 2335173
33717 2335173 2242673 2203983 2231619 2344188 2557974 2876714 3283865 3741275 4195814 4592141
33707 4592141 4886733 5057631 5106964 5057697 4948011 4824992 4736817 4723072 4806087 4987735
33697 4987735 5253629 5582194 5953750 6355838 6783809 7237953 7718970 8222855 8735855
33688 8735855 9230906 9668521 10004613 10204094 10254581 10173048 10001223 9791182 9587620 9415185
$$ packed form
33757E494893l7236j7831J2752O0543J26182K01723K72859L24034L42887L22720
33747G103526K63905J74766P1180k6301r7833j30426j22266q2744k7829K6544
33737G152522O9098R3795R7924Q0506M1612j8164r8152j96374l06621m16565n09757
33726E989824n70924n91136n69982n14725m37671l52727k71788k01880j43818
33717B335173r2500l8690K7636J12569K13786L18740M07151M57410M54539L96327
33707D592141K94592J70898M9333m9267j09686j23019q8175j3745Q3015J81648
33697D987735K65894L28565L71556M02088M27971M54144M81017N03885N13000
33688H735855M95051M37615L36092J99481N0487q1533j71825k10041k03562j72435
$$ plain form
33678 9415185 9276573 9160792 9055324 8955068 8864945 8797298 8766482 8782551 8846324 8948556
33668 8948556 9074237 9209588 9347397 9488111 9637383 9802548 9989931 10203484 10444291
33659 10444291 10710182 10994876 11286847 11568802 11818739 12012916 12130092 12156146 12088174 11937056
33649 11937056 11727121 11491987 11267485 11084420 10964039 10916986 10944749 11042257 11201022 11411727
33639 11411727 11664534 11946383 12237656 12512480 12744973 12919060 13036568 13119542 13206367 13343938
33629 13343938 13578254 13945036 14462096 15125958 15914578 16795092 17732420 18694124 19650120
33620 19650120 20569819 21420920 22172308 22800074 23293197 23655293 23901348 24051443 24125401
33611 24125401 24141015 24115398 24066498 24012405 23968988 23948227 23958532 24005566 24091658 24214155 24365454
$$ packed form
33678I415185j38612j15781j05468j00256r0123o7647l0816J6069O3773J02232
33668H948556J25681J35351J37809J40714J49272J65165J87383K13553K40807
33659A0444291K65891K84694K91971K81955K49937J94177J17176K6054o7972j51118
33649A1937056k09935k35134k24502j83065j20381m7053K7763R7508J58765K10705
33639A1411727K52807K81849K91273K74824K32493J74087J17508Q2974Q6825J37571
33629A3343938K34316L66782N17060O63862P88620Q80514R37328R61704R55996
33620A9650120R19699Q51101P51388O27766M93123L62096K46055J50095P3958
33611B4125401J5614k5617m8900n4093m3417k0761J0305M7034Q6092J22497J51299
$$ plain form
33600 24365454 24536112 24718773 24908806 25100285 25280386 25427033 25512044 25508002 25395072 25165281
33590 25165281 24823972 24389213 23889048 23356129 22820330 22301987 21808541 21335473 20870146
33581 20870146 20396691 19900860 19374059 18815545 18232017 17634942 17037049 16449163 15877592
33572 15877592 15321785 14772841 14214839 13630781 13011857 12364721 11710775 11076388 10479984
33563 10479984 9924553 9399929 8892063 8392505 7902631 7431402 6989532 6584514 6219618
33554 6219618 5896783 5620600 5400305 5248611 5178156 5197115 5305603 5494443 5747092 6043921
33544 6043921 6366462 6699600 7031593 7353349 7658168 7941710 8201292 8434371 8637074
33535 8637074 8803626 8926640 8997498 9006574 8944162 8803403 8585073 8301594 7976423 7637192
$$ packed form
33600B4365454J70658J82661J90033J91479J80101J46647Q5011m042j12930k29791
33590B5165281l41309m34759n00165n32919n35799n18343m93446m73068m65327
33581B0870146m73455m95831n26801n58514n83528n97075n97893n87886n71571
33572A5877592n55807n48944n58002n84058o18924o47136o53946o34387n96404
33563A0479984n55431n24624n07866m99558m89874m71229m41870m05018l64896
33554F219618l22835k76183k20295j51694p0455J8959J08488J88840K52649K96829
33544F043921L22541L33138L31993L21756L04819K83542K59582K33079K02703
33535H637074J66552J23014P0858R076o2412j40759k18330k83479l25171l39231
$$ plain form
33525 7637192 7305799 6991615 6692131 6399924 6111066 5830578 5573374 5361108 5215970
33516 5215970 5153401 5176712 5275984 5431199 5617469 5810230 5989575 6143454 6268898 6370263
33506 6370263 6454640 6526576 6585384 6627099 6650043 6659960 6670629 6699024 6758008 6850943 6970646
33495 6970646 7101970 7225596 7321119 7368851 7350622 7250156 7054185 6755717 6359476 5886623
33485 5886623 5374472 4869358 4415673 4046540 3779761 3618811 3556489 3579065 3669759 3811309
33475 3811309 3988223 4189328 4410045 4652442 4921838 5221433 5548265 5892986 6243465
33466 6243465 6590271 6931378 7273611 7629498 8010389 8419013 8845109 9266301 9653936
33457 9653936 9981705 10233906 10410255 10525345 10602975 10667628 10736381 10814212 10894158 10961803
$$ packed form
33525G637192l31393l14184k99484k92207k88858k80488k57204k12266j45138
33516E215970o2569K3311R9272J55215J86270J92761J79345J53879J25444J01365
33506F370263Q4377P1936N8808M1715K2944R917J0669K8395N8984R2935J19703
33495F970646J31324J23626R5523M7732j8229j00466j95971k98468l96241m72853
33485E886623n12151n05114m53685l69133k66779j60950o2322K2576R0694J41550
33475C811309J76914K01105K20717K42397K69396K99595L26832L44721L50479
33466F243465L46806L41107L42233L55887L80891M08624M26096M21192L87635
33457I653936L27769K52201J76349J15090P7630O4653O8753P7831P9946O7645
$$ plain form
33447 10961803 11001733 11002696 10959056 10868416 10727572 10529785 10265133 9923641 9499552 8994799
33437 8994799 8420328 7794866 7141908 6486402 5851963 5258262 4718099 4235114 3804154
33428 3804154 3415155 3058858 2731387 2435588 2178861 1968877 1809546 1699871 1636425 1617185
33418 1617185 1642761 1713160 1822194 1953808 2083252 2182930 2230479 2215843 2144857 2038333
33408 2038333 1927462 1847230 1829365 1896059 2055729 2301574 2612536 2955773 3290900 3577009
33398 3577009 3781811 3889140 3900701 3831273 3700846 3528268 3328993 3116800 2907494 2721652
33388 2721652 2583767 2517175 2537187 2646380 2834863 3085288 3379628 3703906 4048526 4405141
33378 4405141 4763404 5110779 5435506 5730136 5993089 6228140 6443354 6649878 6858911
$$ packed form
33447A0961803L9930R63m3640r0640j40844j97787k64652l41492m24089n04753
33437H994799n74471o25462o52958o55506o34439n93701n40163m82985m30960
33428C804154l88999l56297l27471k95799k56727k09984j59331j09675o3446j9240
33418A617185K5576P0399J09034J31614J29444R9678M7549j4636p0986j06524
33408B038333j10871q0232j7865O6694J59670K45845L10962L43237L35127K86109
33398C577009K04802J07329J1561o9428j30427j72578j99275k12193k09306j85842
33388B721652j37885o6592K0012J09193J88483K50425K94340L24278L44620L56615
33378D405141L58263L47375L24727K94630K62953K35051K15214K06524K09033
$$ plain form
33369 6858911 7075441 7291096 7482080 7616637 7669577 7634827 7527600 7375506 7205738 7036710
33359 7036710 6877366 6731677 6604048 6502744 6440173 6429420 6477550 6578572 6710829 6841945
33349 6841945 6939505 6981408 6960346 6881281 6754828 6590467 6392471 6160093 5891745 5590345
33339 5590345 5265929 4933807 4610340 4309702 4042715 3816328 3632456 3486960 3370690
33330 3370690 3273695 3191663 3131755 3114034 3166083 3312162 3562075 3905169 4311493 4738215
33320 4738215 5138437 5470746 5708305 5845089 5896230 5891731 5866404 5850733 5865743 5921927 6020478
33309 6020478 6155212 6314546 6483570 6646443 6789280 6902980 6984775 7037380 7065955 7074688
33299 7074688 7065213 7037783 6994221 6940234 6885020 6837845 6803489 6779400 6756404 6722593 6668322
$$ packed form
33369F858911K16530K15655J90984J34557N2940l4750j07227j52094j69768j69028
33359G036710j59344j45689j27629j01304o2571j0753M8130J01022J32257J31116
33349F841945R7560M1903k1062p9065j26453j64361j97996k32378k68348l01400
33339E590345l24416l32122l23467l00638k66987k26387j83872j45496j16270
33330C370690r6995q2032n9908j7721N2049J46079K49913L43094M06324M26722
33320D738215M00222L32309K37559J36784N1141m499k5327j5671J5010N6184R8551
33309F020478J34734J59334J69024J62873J42837J13700Q1795N2605K8575Q733
33299G074688r475k7430m3562n3987n5214m7175l4356k4089k2996l3811n4271
$$ plain form
33288 6668322 6590167 6492607 6387340 6290981 6222592 6202274 6250729 6387992 6629664 6981375
33278 6981375 7434676 7967264 8547466 9140365 9713065 10238413 10697324 11079222 11379818
33269 11379818 11596978 11727663 11769019 11723896 11607323 11449068 11289455 11169186 11116884 11139254
33259 11139254 11218311 11317596 11394914 11415413 11359269 11222621 11014594 10753414 10462259 10164435
33249 10164435 9878773 9616935 9382915 9173647 8980356 8791988 8601440 8412215 8241031
33240 8241031 8113740 8056142 8084230 8198010 8380501 8601553 8825101 9017868 9157138 9235193
33230 9235193 9258949 9244721 9209862 9164899 9110565 9041818 8956367 8861441 8773235 8708283 8671546
33219 8671546 8648412 8605719 8501481 8298168 7973411 7525390 6973726 6357108 5727347 5139800
$$ packed form
33288F668322p8155r7560j05267r6359o8389k0318M8455J37263K41672L51711
33278F981375M53301N32588N80202N92899N72700N25348M58911L81898L00596
33269A1379818K17160J30685M1356m5123j16573j58255j59613j20269n2302K2370
33259A1139254P9057R9285P7318K0499n6144j36648k08027k61180k91155k97824
33249A0164435k85662k61838k34020k09268j93291j88368j90548j89225j71184
33240H241031j27291n7598K8088J13780J82491K21052K23548J92767J39270P8055
33230I235193K3756j4228l4859m4963n4334o8747q5451r4926q8206o4952l6737
33219H671546k3134m2693j04238k03313l24757m48021n51664o16618o29761n87547
$$ plain form
33209 5139800 4642726 4269658 4036969 3945734 3985669 4139702 4388505 4714265 5102729 5542657
33199 5542657 6022434 6525141 7024956 7487790 7876429 8157291 8305066 8303783 8145533 7829304
33189 7829304 7361561 6758636 6049180 5273804 4479701 3711025 2999329 2359239 1791190
33180 1791190 1288074 840609 439279 75058 -258230 -560305 -822775 -1031469 -1171619
33171 -1171619 -1233167 -1214373 -1123453 -978679 -807325 -643129 -521211 -470052 -502527 -610085
33161 -610085 -763325 -919162 -1032060 -1065857 -1002841 -847360 -623060 -365044 -109571 115948
33151 115948 299862 447397 575064 700832 835001 976068 1112688 1229880 1316008 1367427
33141 1367427 1389428 1394248 1397733 1415552 1459372 1534173 1638242 1766004 1911545 2070385 2238752
$$ packed form
33209E139800m97074l73068k32689r1235L9935J54033K48803L25760L88464M39928
33199E542657M79777N02707M99815M62834L88639K80862J47775j283j58250l16229
33189G829304m67743o02925p09456p75376p94103p68676p11696o40090n68049
33180A791190n03116m47465m01330l64221l33288l02075k62470k08694j40150
33171a171619o1548J8794R0920J44774J71354J64196J21918N1159l2475j07558
33161f10085j53240j55837j12898l3797O3016J55481K24300K58016K55473K25519
33151A15948J83914J47535J27667J25768J34169J41067J36620J17192Q6128N1419
33141A367427K2001M820L485J7819M3820P4801J04069J27762J45541J58840J68367
$$ plain form
33130 2238752 2411374 2579296 2729080 2844424 2910204 2917248 2865084 2761173 2617877 2450011
33120 2450011 2274518 2110886 1979727 1898826 1878989 1922592 2025012 2176152 2359420 2548819
33110 2548819 2707960 2794647 2770908 2613830 2320915 1907273 1398144 823278 216410 -383225
33100 -383225 -932946 -1394140 -1741698 -1970040 -2092935 -2137656 -2136040 -2115897 -2096380 -2088920 -2101541
33089 -2101541 -2141882 -2215903 -2323647 -2456000 -2595402 -2720432 -2812008 -2858450 -2857420 -2814707 -2741919
33078 -2741919 -2655221 -2574968 -2524027 -2523679 -2588806 -2725130 -2929169 -3189435 -3487505 -3799050 -4095581
33067 -4095581 -4347472 -4528598 -4622540 -4628935 -4566839 -4472016 -4387745 -4352308 -4388499 -4499415 -4671047
33056 -4671047 -4878650 -5093312 -5287358 -5438998 -5535813 -5575382 -5562215 -5502791 -5401562 -5259361
$$ packed form
33130B238752J72622J67922J49784J15344O5780P044n2164j03911j43296j67866
33120B450011j75493j63632j31159q0901j9837M3603J02420J51140J83268J89399
33110B548819J59141Q6687k3739j57078k92915m13642n09129n74866o06868n99635
33100c83225n49721m61194l47558k28342j22895m4721J616K0143J9517P460j2621
33089b101541m0341p4021j07744j32353j39402j25030r1576m6442J030M2713P2788
33078b741919Q6698Q0253N0941L48o5127j36324k04039k60266k98070l11545k96531
33067d095581k51891j81126r3942o395O2096R4823Q4271L5437l6191j10916j71632
33056d671047k07603k14662j94046j51640r6815l9569J3167N9424J01229J42201
$$ plain form
33046 -5259361 -5073736 -4840497 -4556254 -4221643 -3844484 -3441745 -3039155 -2667387 -2354979
33037 -2354979 -2120698 -1969408 -1893727 -1879511 -1910893 -1972273 -2048236 -2124067 -2188160 -2235152 -2267523
33026 -2267523 -2294238 -2326564 -2372653 -2433031 -2498726 -2552557 -2573015 -2539701 -2438982 -2268081 -2035739
33015 -2035739 -1758996 -1457940 -1151279 -854434 -579528 -335584 -127827 43432 182772
33006 182772 297247 392398 469737 528624 571788 609913 660500 740516 856890 1000565 1147611
32995 1147611 1267120 1331987 1327040 1250839 1111928 923694 701409 461568 221473 -2143
32985 -2143 -194658 -343899 -439091 -469594 -425028 -297541 -85433 204218 555965 949417
32975 949417 1363477 1779172 2180575 2554679 2891015 3181227 3418870 3599598 3721495 3784702
$$ packed form
33046e259361J85625K33239K84243L34611L77159M02739M02590L71768L12408
33037b354979K34281J51290P5681J4216l1382o1380p5963p5831o4093m6992l2371
33026b267523k6715l2326m6089o0378o5695n3831k0458L3314J00719J70901K32342
33015b035739K76743L01056L06661K96845K74906K43944K07757J71259J39340
33006A82772J14475R5151P7339N8887M3164L8125N0587Q0016J16374J43675J47046
32995A147611J19509O4867m947p6201j38911j88234k22285k39841k40095k23616
32985b143j92515j49241r5192l0503M4566J27487K12108K89651L51747L93452
32975I49417M14060M15695M01403L74104L36336K90212K37643J80728J21897O3207
$$ plain form
32965 3784702 3790220 3738685 3630125 3464811 3244699 2974885 2664494 2326459 1976081 1629248
32955 1629248 1301334 1006891 759354 570162 447405 394543 409635 485464 610889 773193
32945 773193 960717 1164828 1380395 1604182 1831408 2052172 2250312 2406068 2501402 2525060
32935 2525060 2474962 2357609 2185898 1976791 1749482 1523842 1318988 1152118 1037594 985638
32925 985638 1000087 1075763 1197352 1341936 1485868 1614007 1726986 1842152 1987198 2189727
32915 2189727 2467873 2824983 3248670 3713332 4185648 4632022 5025837 5352073 5608087
32906 5608087 5801068 5944204 6053996 6149897 6254680 6392760 6586014 6849753 7191394 7611026
32896 7611026 8101439 8647205 9224799 9805030 10356747 10850207 11259726 11565840 11756928
$$ packed form
32965C784702N518n1535j08560j65314k20112k69814l10391l38035l50378l46833
32955A629248l27914k94443k47537j89192j22757n2862J5092P5829J25425J62304
32945G73193J87524K04111K15567K23787K27226K20764J98140J55756R5334K3658
32935B525060n0098j17353j71711k09107k27309k25640k04854j66870j14524n1956
32925I85638J4449P5676J21589J44584J43932J28139J12979J15166J45046K02529
32915B189727K78146L57110M23687M64662M72316M46374L93815L26236K56014
32906E608087J92981J43136J09792R5901J04783J38080J93254K63739L41641M19632
32896G611026M90413N45766N77594N80231N51717M93460M09519L06114J91088
$$ plain form
32887 11756928 11830200 11792460 11660489 11459647 11219314 10966246 10719163 10487354 10272778 10072353
32877 10072353 9877877 9674687 9442996 9164274 8830397 8449977 8047761 7657159 7309628
32868 7309628 7025341 6808497 6648234 6523673 6410243 6284988 6130131 5934964 5696003
32859 5696003 5415329 5097634 4747109 4365418 3951698 3504632 3025277 2518701 1993578
32850 1993578 1460954 934023 429196 -33203 -430448 -741686 -953847 -1067172 -1098164 -1078039
32840 -1078039 -1045967 -1038364 -1077616 -1164457 -1276904 -1376117 -1417413 -1363617 -1197029 -925687 -580970
32829 -580970 -207604 148863 451726 677568 816525 870390 849893 771661 654906 518203
32819 518203 377266 244516 129749 39779 -23811 -66776 -100979 -139283 -189492 -250961 -315234
$$ packed form
32887A1756928P3272l7740j31971k00842k40333k53068k47083k31809k14576k00425
32877A0072353j94476k03190k31691k78722l33877l80420m02216l90602l47531
32868G309628k84287k16844j60263j24561j13430j25255j54857j95167k38961
32859E696003k80674l17695l50525l81691m13720m47066m79355n06576n25123
32850A993578n32624n26931n04827m62399l97245l11238k12161j13325l0992K0125
32840a078039L2072P603l9252q6841j12447r9213m1296N3796J66588K71342L44717
32829e80970L73366L56467L02863K25842J38957N3865k0497p8232j16755j36703
32819E18203j40937j32750j14767q9970o3590m2965l4203l8304n0209o1469o4273
$$ plain form
32808 -315234 -369446 -400022 -394768 -343256 -237231 -72666 147305 411141 700635 994319
32798 994319 1270488 1509334 1694619 1814615 1861753 1831626 1722832 1538014 1284761 975099
32788 975099 623660 245429 -146237 -540819 -930476 -1308557 -1667933 -2000599 -2298999 -2558001
32778 -2558001 -2775994 -2954396 -3096434 -3207118 -3295904 -3380905 -3490665 -3659208 -3914015 -4262321
32768 -4262321 -4683904 -5135525 -5565001 -5926975 -6192177 -6347528 -6390973 -6327373 -6168769 -5936906
32758 -5936906 -5663254 -5383651 -5129248 -4918633 -4755354 -4631591 -4535192 -4455945 -4387974 -4327889
32748 -4327889 -4271187 -4210443 -4137056 -4044930 -3932555 -3801512 -3652693 -3483333 -3286978 -3056181
32738 -3056181 -2786000 -2476134 -2130768 -1757082 -1364302 -964024 -570404 -198401 139854
$$ packed form
32808c15234n4212l0576N254N1512J06025J64565K19971K63836K89494K93684
32798I94319K76169K38846J85285J19996M7138l0127j08794j84818k53253l09662
32788I75099l51439l78231l91666l94582l89657l78081l59376l32666k98400k59002
32778b558001k17993j78402j42038j10684q8786q5001j09760j68543k54807l48306
32768d262321m21583m51621m29476l61974k65202j55351m3445O3600J58604K31863
32758e936906K73652K79603K54403K10615J63279J23763R6399P9247O7971O0085
32748d327889N6702O0744P3387R2126J12375J31043J48819J69360J96355K30797
32738c056181K70181L09866L45366L73686L92780M00278L93620L72003L38255
$$ plain form
32729 139854 438452 698818 928133 1135788 1328997 1509033 1669682 1798733 1881781 1906998
32719 1906998 1869925 1777394 1649043 1514925 1409613 1365097 1404949 1540483 1768526 2071020
32709 2071020 2417654 2771953 3098693 3368873 3559900 3652668 3630281 3482053 3211889 2845814
32699 2845814 2432744 2036010 1718519 1528338 1490927 1609752 1871678 2252071 2717387 3226782
32689 3226782 3735587 4201605 4592811 4893555 5106334 5247784 5340363 5403449 5447546 5473153
32679 5473153 5473425 5438618 5360284 5234032 5060710 4846760 4604092 4348859 4098394 3866879
32669 3866879 3661881 3483803 3328700 3192970 3077541 2989540 2940835 2944474 3010986 3145934
32659 3145934 3348604 3610863 3915862 4237466 4541824 4791386 4950569 4991714 4900019 4675997
$$ packed form
32729A39854K98598K60366K29315K07655J93209J80036J60649J29051Q3048K5217
32719A906998l7073r2531j28351j34118j05312m4516L9852J35534K28043L02494
32709B071020L46634L54299L26740K70180J91027R2768k2387j48228k70164l66075
32699B845814m13070l96734l17491j90181l7411J18825K61926L80393M65316N09395
32689C226782N08805M66018L91206L00744K12779J41450R2579O3086M4097K5607
32679E473153K72l4807p8334j26252j73322k13950k42668k55233k50465k31515
32669C866879k04998j78078j55103j35730j15429q8001m8705L639O6512J34948
32659C145934K02670K62259L04999L21604L04358K49562J59183M1145r1695k24022
$$ plain form
32649 4675997 4334249 3898619 3395753 2849898 2280545 1702385 1125828 556706 -4537
32640 -4537 -562195 -1121002 -1678521 -2217917 -2706075 -3099223 -3353905 -3438867 -3343967 -3083517
32630 -3083517 -2692507 -2216325 -1697932 -1168718 -647092 -143620 332850 773253 1171406
32621 1171406 1528540 1854758 2165765 2476889 2797903 3131026 3471943 3811990 4139621
32612 4139621 4440909 4700628 4905623 5049939 5138666 5187100 5214434 5234594 5248841 5244173 5198524
32601 5198524 5090058 4906025 4647914 4332468 3989498 3656954 3373612 3170577 3064020
32592 3064020 3051296 3111951 3214234 3325703 3423934 3502221 3567467 3631374 3699057 3760451 3789332
32581 3789332 3751683 3619586 3382739 3051302 2649894 2207713 1750075 1293934 847266 410935
$$ packed form
32649D675997l41748m35630n02866n45855n69353n78160n76557n69122n61243
32640d537n57658n58807n57519n39396m88158l93148k54682q4962R4900K60450
32630c083517L91010M76182N18393N29214N21626N03472M76470M40403L98153
32621A171406L57134L26218L11007L11124L21014L33123L40917L40047L27631
32612D139621L01288K59719K04995J44316Q8727M8434K7334K0160J4247m668m5649
32601E198524j08466j84033k58111l15446l42970l32544k83342k03035j06557
32592C064020j2724O0655J02283J11469R8231P8287O5246O3907O7683O1394K8881
32581C789332l7649j32097k36847l31437m01408m42181m57638m56141m46668m36331
$$ plain form
32571 410935 -18589 -446627 -877806 -1313655 -1751040 -2182031 -2594223 -2970077 -3285824 -3512639
32561 -3512639 -3621756 -3591739 -3414436 -3097586 -2664277 -2149971 -1597156 -1047944 -536014 -80315
32551 -80315 317263 669457 997465 1323776 1666429 2035909 2434733 2859391 3303406 3759272
32541 3759272 4217512 4664096 5079740 5442979 5735061 5943364 6062505 6094603 6049243 5941552
32531 5941552 5787400 5597822 5376452 5122052 4834618 4521134 4197233 3883561 3598836
32522 3598836 3353201 3144563 2958536 2771613 2557088 2292581 1966602 1581686 1153762
32513 1153762 709085 279762 -102237 -412136 -638326 -784752 -868937 -917070 -958683 -1022825
32503 -1022825 -1135901 -1319452 -1586007 -1933733 -2343447 -2781242 -3206350 -3580710 -3876831
$$ packed form
32571D10935m29524m28038m31179m35849m37385m30991m12192l75854l15747k26815
32561c512639j09117L0017J77303L16850M33309N14306N52815N49212N11930M55699
32551h0315L97578L52194L28008L26311L42653L69480L98824M24658M44015M55866
32541C759272M58240M46584M15644L63239K92082K08303J19141L2098m5360j07691
32531E941552j54152j89578k21370k54400k87434l13484l23901l13672k84725
32522C598836k45635k08638j86027j86923k14525k64507l25979l84916m27924
32513A153762m44677m29323l81999l09899k26190j46426q4185m8133m1613o4142
32503a022825j13076j83551k66555l47726m09714m37795m25108l74360k96121
$$ plain form
32494 -3876831 -4082357 -4200705 -4247293 -4242324 -4203163 -4139763 -4054391 -3944655 -3808056 -3646297
32484 -3646297 -3467218 -3282395 -3100701 -2921321 -2730896 -2507130 -2227191 -1876660 -1455163
32475 -1455163 -977047 -467472 45085 538473 1005832 1459613 1927430 2440684 3021026
32466 3021026 3670437 4368378 5076515 5749287 6346372 6841948 7227646 7510292 7707612
32457 7707612 7843105 7939089 8008767 8051732 8056733 8010084 7903692 7738025 7520221 7260569
32447 7260569 6969771 6657366 6330841 5995400 5654560 5311342 4969180 4631817 4302467
32438 4302467 3983611 3678375 3392872 3137594 2926705 2775716 2698655 2705170 2797512 2968128
32428 2968128 3199702 3468696 3751022 4026675 4281060 4503549 4685693 4821033 4906943 4947814
$$ packed form
32494c876831k05526j18348m6588M969L9161O3400Q5372J09736J36599J61759
32484c646297J79079J84823J81694J79380J90425K23766K79939L50531M21497
32475a455163M78116N09575N12557M93388M67359M53781M67817N13254N80342
32466C021026O49411O97941P08137O72772N97085M95576L85698K82646J97320
32457G707612J35493R5984O9678M2965N001m6649j06392j65667k17804k59652
32447G260569k90798l12405l26525l35441l40840l43218l42162l37363l29350
32438D302467l18856l05236k85503k55278k10889j50989p7061O515R2342J70616
32428B968128K31574K68994K82326K75653K54385K22489J82144J35340Q5910M0871
$$ plain form
32418 4947814 4958097 4962645 4991961 5072918 5219360 5427591 5678234 5942208 6188020 6388735
32408 6388735 6527158 6597058 6599643 6537613 6410951 6216878 5953040 5621093 5228445 4787730
32398 4787730 4315197 3829542 3351630 2903829 2507294 2177348 1919510 1729057 1594662
32389 1594662 1503738 1446750 1419573 1424472 1469685 1566446 1723063 1938417 2198817 2480626 2757517
32378 2757517 3008567 3223006 3399509 3541247 3650603 3727153 3769607 3779363 3763202 3734260
32368 3734260 3711471 3717220 3772936 3893421 4081936 4328166 4610042 4898803 5165215 5384625
32358 5384625 5539906 5623121 5636962 5595541 5523065 5449689 5405611 5415286 5493090 5640730 5846203
32347 5846203 6084666 6322068 6521784 6652415 6693454 6636743 6484631 6247427 5941333 5585860
$$ packed form
32418D947814J0283M548K9316Q0957J46442K08231K50643K63974K45812K00715
32408F388735J38423O9900K585o2030j26662j94073k63838l31947l92648m40715
32398D787730m72533m85655m77912m47801l96535l29946k57838j90453j34395
32389A594662r0924n6988k7177M899M5213R6761J56617K15354K60400K81809K76891
32378B757517K51050K14439J76503J41738J09356P6550M2454R756j6161k8942
32368C734260k2789N749N5716J20485J88515K46230K81876K88761K66412K19410
32358E384625J55281Q3215J3841m1421p2476p3376m4078R675P7804J47640K05473
32347E846203K38463K37402J99716J30631M1039n6711j52112k37204l06094l55473
$$ plain form
32337 5585860 5199807 4797048 4384907 3966732 3547354 3138024 2757964 2431949 2185371
32328 2185371 2038603 2001883 2071610 2229072 2442325 2671214 2874851 3019903 3086713 3070002
32318 3070002 2973799 2804810 2569939 2279512 1951899 1613809 1294972 1020908 808403 664988
32308 664988 590448 578027 614937 683279 762145 830361 868938 862826 802083 682307 504199
32297 504199 272634 -4019 -314287 -644242 -978402 -1299664 -1587292 -1813835 -1943820 -1937133
32287 -1937133 -1757733 -1385004 -822637 -100560 730939 1611858 2483613 3298023 4023114
32278 4023114 4645019 5165123 5592975 5937714 6201744 6379288 6460106 6436495 6310228 6095765
32268 6095765 5817663 5503265 5174452 4842230 4505399 4152310 3764976 3325907 2826846
$$ packed form
32337E585860l86053m02759m12141m18175m19378m09330l80060l26015k46578
32328B185371j46768l6720O9727J57462K13253K28889K03637J45052O6810j6711
32318C070002r6203j68989k34871k90427l27613l38090l18837k74064k12505j43415
32308F64988p4540j2421L6910O8342P8866O8216L8577o112o0743j19776j78108
32297E04199k31565k76653l10268l29955l34160l21262k87628k26543j29985O687
32287a937133J79400L72729N62367P22077Q31499Q80919Q71755Q14410P25091
32278D023114O21905N20104M27852L44739K64030J77544Q0818k3611j26267k14463
32268F095765k78102l14398l28813l32222l36831l53089l87334m39069m99061
$$ plain form
32259 2826846 2275311 1693966 1112278 556050 41865 -421400 -827870 -1172098 -1450428
32250 -1450428 -1664038 -1820228 -1930425 -2006129 -2055642 -2083765 -2094290 -2092885 -2087906 -2088414 -2100548
32239 -2100548 -2124094 -2151048 -2167423 -2158264 -2113689 -2032528 -1921529 -1791247 -1651838 -1511252 -1375950
32228 -1375950 -1252703 -1150031 -1078645 -1050834 -1079114 -1174459 -1344175 -1589407 -1902911 -2268331
32218 -2268331 -2661771 -3055032 -3419010 -3726411 -3954280 -4087177 -4120797 -4064496 -3940742 -3780415
32208 -3780415 -3614943 -3468291 -3352448 -3268411 -3211448 -3176889 -3162729 -3168096 -3190049 -3222338 -3257450
32197 -3257450 -3289955 -3318195 -3343587 -3369367 -3400522 -3444501 -3510744 -3607653 -3737751 -3893509 -4056665
32186 -4056665 -4202127 -4304794 -4346011 -4317205 -4220360 -4065997 -3869089 -3643726 -3398773 -3137229
$$ packed form
32259B826846n51535n81345n81688n56228n14185m63265m06470l44228k78330
32250a450428k13610j56190j10197p5704m9513k8123j0525J405M979n08j2134
32239b100548k3546k6954j6375R159M4575Q1161J10999J30282J39409J40586J35302
32228a375950J23247J02672P1386K7811k8280r5345j69716k45232l13504l65420
32218b268331l93440l93261l63978l07401k27869j32897l3620N6301J23754J60327
32208c780415J65472J46652J15843Q4037N6963L4559J4160n367k1953l2289l5112
32197c257450l2505k8240k5392k5780l1155m3979o6243r6909j30098j55758j63156
32186d056665j45462j02667m1217K8806R6845J54363J96908K25363K44953K61544
$$ plain form
32176 -3137229 -2859800 -2569960 -2276589 -1991928 -1725742 -1478959 -1240521 -989735 -703584
32167 -703584 -365760 27066 464900 930012 1405251 1880619 2355238 2834687 3325330 3827386
32157 3827386 4328428 4799950 5199729 5480078 5598498 5526001 5251034 4780508 4140292 3375420
32147 3375420 2547778 1728824 987407 376376 -76500 -369348 -519416 -553504 -500736 -389419
32137 -389419 -246147 -94744 45235 158915 234402 260115 223467 112370 -80681 -353555
32127 -353555 -690376 -1060237 -1420055 -1721723 -1921757 -1990417 -1917424 -1712641 -1401514 -1016674
32117 -1016674 -588786 -140581 313674 764390 1201895 1613687 1984593 2299432 2547087
32108 2547087 2723854 2833524 2883249 2877864 2817087 2698111 2521838 2298430 2048351 1798049
$$ packed form
32176c137229K77429K89840K93371K84661K66186K46783K38438K50786K86151
32167g03584L37824L92826M37834M65112M75239M75368M74619M79449M90643N02056
32157C827386N01042M71522L99779K80349J18420p2497k74967m70526o40216p64872
32147C375420q27642q18954p41417o11031m52876k92848j50068l4088N2768J11317
32137c89419J43272J51403J39979J13680P5487K5713l6648j11097j93051k72874
32127c53555l36821l69861l59818l01668k00034o8660P2993K04783L11127L84840
32117a016674M27888M48205M54255M50716M37505M11792L70906L14839K47655
32108B547087J76767J09670M9725n385o0777j18976j76273k23408k50079k50302
$$ plain form
32098 1798049 1572703 1390059 1258455 1179096 1150127 1169688 1236319 1346554 1490860 1650524
32088 1650524 1798471 1904585 1942852 1896413 1758895 1533152 1229303 863118 455066 29942
32078 29942 -383768 -756117 -1059835 -1275148 -1393388 -1418543 -1366710 -1263322 -1138112 -1018687
32068 -1018687 -924631 -863918 -832458 -816539 -797478 -757342 -684233 -575453 -437373 -282265 -124128
32057 -124128 23976 150413 244999 300380 313790 286662 221578 119467 -20127 -196543
32047 -196543 -406251 -643082 -898575 -1160947 -1414037 -1638911 -1818799 -1945101 -2021389 -2063769
32037 -2063769 -2097896 -2154000 -2261212 -2441960 -2707096 -3052955 -3461703 -3905076 -4350028 -4764317
32027 -4764317 -5120812 -5399807 -5588987 -5681705 -5675657 -5573382 -5383398 -5119473 -4798056 -4437200
$$ packed form
32098A798049k25346j82644j31604p9359k8969J9561O6631J10235J44306J59664
32088A650524J47947J06114L8267m6439j37518k25743l03849l66185m08052m25124
32078B9942m13710l72349l03718k15313j18240k5155N1833J03388J25210J19425
32068a018687R4056O0713L1460J5919J9061M0136P3109J08780J38080J55108J58137
32057a24128J48104J26437R4586N5381J3410k7128o5084j02111j39594j76416
32047a96543k09708k36831k55493k62372k53090k24874j79888j26302p6288m2380
32037b063769l4127n6104j07212j80748k65136l45859m08748m43373m44952m14289
32027d764317l56495k78995j89180r2718O048J02275J89984K63925L21417L60856
$$ plain form
32017 -4437200 -4059516 -3696758 -3390085 -3182405 -3105447 -3168627 -3355749 -3630799 -3949219 -4269221
32007 -4269221 -4559086 -4799412 -4981773 -5106011 -5177707 -5206118 -5202236 -5176959 -5139811 -5098585 -5059670
31996 -5059670 -5028496 -5009552 -5005489 -5014964 -5030064 -5035858 -5014411 -4952529 -4849072 -4717343 -4581307
31985 -4581307 -4467981 -4399538 -4387622 -4430900 -4516031 -4621738 -4724924 -4806837 -4856669 -4870895 -4849210
31974 -4849210 -4790275 -4690516 -4546615 -4359505 -4136762 -3891671 -3639514 -3393522 -3163094 -2955160
31964 -2955160 -2777168 -2639058 -2552444 -2526929 -2565071 -2658712 -2789447 -2934338 -3074629 -3202777
31954 -3202777 -3323642 -3448978 -3588503 -3742841 -3902354 -4051508 -4174562 -4258391 -4292192 -4267223
31944 -4267223 -4178917 -4030156 -3832546 -3603893 -3362919 -3123931 -2894126 -2674663 -2464412 -2263300
$$ packed form
32017d437200L77684L62758L06673K07680P6958o3180j87122k75050l18420l20002
32007d269221k89865k40326j82361j24238p1696k8411L882K5277L7148M1226L8915
31996e059670L1174J8944M063r475j5100n794K1447O1882J03457J31729J36036
31985d581307J13326O8443J1916m3278q5131j05707j03186q1913m9832j4226K1685
31974d849210N8935R9759J43901J87110K22743K45091K52157K45992K30428K07934
31964b955160J77992J38110Q6614K5515l8142r3641j30735j44891j40291j28148
31954c202777j20865j25336j39525j54338j59513j49154j23054q3829l3801K4969
31944d267223Q8306J48761J97610K28653K40974K38988K29805K19463K10251K01112
$$ plain form
31934 -2263300 -2072435 -1890695 -1710192 -1513883 -1277264 -974140 -584521 -101523 465745
31925 465745 1094620 1755204 2417277 3055131 3649915 4190675 4674591 5105692 5491547 5839377
31915 5839377 6153464 6433985 6675631 6865607 6982975 7001342 6894517 6642984 6239655 5694101
31905 5694101 5033694 4299931 3540644 2801739 2121721 1529085 1040636 660255 379769
31896 379769 183203 52999 -25118 -60866 -61010 -30823 27163 116313 247101 433022 682227
31885 682227 990050 1337464 1696188 2036890 2335989 2578605 2758034 2873589 2928460 2928277
31875 2928277 2880038 2791093 2668516 2519542 2353101 2181436 2020362 1887329 1797654 1760402
31865 1760402 1775834 1835760 1926465 2032432 2138879 2232342 2300194 2330675 2314268 2245922 2126611
$$ packed form
31934b263300J90865J81740J80503J96309K36619L03124L89619M82998N67268
31925D65745O28875O60584O62073O37854N94784N40760M83916M31101L85855L47830
31915E839377L14087K80521K41646J89976J17368J8367j06825k51533m03329n45554
31905E694101o60407p33763p59287p38905o80018n92636m88449l80381k80486
31896C79769j96566j30204p8117l5748j44L0187N7986Q9150J30788J85921K49205
31885F82227L07823L47414L58724L40702K99099K42616J79429J15555N4871j83
31875B928277m8239q8945j22577j48974j66441j71665j61074j33033q9675l7252
31865A760402J5432N9926R0705J05967J06447R3463O7852L0481j6407o8346j19311
$$ plain form
31854 2126611 1963030 1765474 1545177 1312681 1078108 852839 650832 487571 376041
31845 376041 321526 318461 351538 400318 444272 465298 447262 374642 233071 12622 -287993
31834 -287993 -659154 -1081160 -1526887 -1964349 -2359029 -2677307 -2891740 -2986602 -2960843 -2827091
31824 -2827091 -2608080 -2333419 -2038289 -1762941 -1550456 -1441298 -1465584 -1635588 -1941102 -2349682
31814 -2349682 -2812599 -3275249 -3688470 -4016197 -4237067 -4341423 -4327701 -4201386 -3976390 -3676111
31804 -3676111 -3331623 -2976768 -2642068 -2349713 -2110823 -1925128 -1782356 -1664452 -1548102
31795 -1548102 -1408045 -1222028 -976875 -673070 -324820 45107 413334 762756 1085627
31786 1085627 1382625 1659720 1925191 2188097 2457661 2742186 3046986 3372138 3711428
$$ packed form
31854B126611j63581j97556k20297k32496k34573k25269k02007j63261j11530
31845C76041n4515l065L3077M8780M3954K1026j8036p2620j41571k20449l00615
31834b87993l71161m22006m45727m37462l94680l18278k14433r4862K5759J33752
31824b827091K19011K74661K95130K75348K12485J09158k4286j70004l05514m08580
31814b349682m62917m62650m13221l27727k20870j04356J3722J26315K24996L00279
31804c676111L44488L54855L34700K92355K38890J85695J42772J17904J16350
31795a548102J40057J86017K45153L03805L48250L69927L68227L49422L22871
31786A085627K96998K77095K65471K62906K69564K84525L04800L25152L39290
$$ plain form
31777 3711428 4052905 4380454 4675427 4917931 5088102 5167950 5144120 5011010 4773061 4445072
31767 4445072 4050422 3618325 3181326 2773027 2424761 2160593 1992201 1916484 1917289 1969946
31757 1969946 2046547 2121165 2175311 2202781 2211372 2219445 2248049 2312123 2414720 2546475 2690155
31746 2690155 2828198 2950264 3057667 3162612 3282253 3430133 3608837 3806797 4000144
31737 4000144 4158598 4253359 4264172 4182913 4012868 3765379 3456227 3102431 2718786 2314271
31727 2314271 1890457 1444276 974992 491893 17615 -415920 -777150 -1044023 -1207203
31718 -1207203 -1267132 -1229331 -1102207 -897713 -632433 -326844 -2325 322934 636989 934457
31708 934457 1214835 1481487 1742863 2013949 2314696 2664771 3077362 3554687 4085553 4644224
$$ packed form
31777C711428L41477L27549K94973K42504J70171P9848k3830j33110k37949l27989
31767D445072l94650m32097m36999m08299l48266k64168j68392p5717Q05N2657
31757A969946P6601P4618N4146K7470Q591Q073K8604O4074J02597J31755J43680
31746B690155J38043J22066J07403J04945J19641J47880J78704J97960J93347
31737D000144J58454R4761J0813q1259j70045k47489l09152l53796l83645m04515
31727B314271m23814m46181m69284m83099m74278m33535l61230k66873j63180
31718a207203n9929L7801J27124K04494K65280L05589L24519L25259L14055K97468
31708I34457K80378K66652K61376K71086L00747L50075M12591M77325N30866N58671
$$ plain form
31698 4644224 5191331 5678777 6059206 6297485 6379276 6312679 6122517 5840713 5497423 5115819
31688 5115819 4710971 4291822 3865159 3439989 3030471 2655767 2336643 2090077 1924235
31679 1924235 1835967 1811873 1831842 1872976 1912411 1929120 1905786 1831315 1703437 1529778 1325852
31668 1325852 1110077 898221 700376 521585 364362 230499 121165 35910 -28825 -81319
31658 -81319 -135081 -206067 -306131 -435921 -582416 -723604 -837659 -911366 -944343 -949047 -947812
31647 -947812 -967542 -1032553 -1157546 -1343608 -1578816 -1842553 -2111515 -2365552 -2591942 -2786578
31637 -2786578 -2951533 -3090671 -3206755 -3302208 -3381946 -3454265 -3527564 -3605126 -3682552 -3749904 -3796149
31626 -3796149 -3811509 -3786051 -3707078 -3559648 -3332305 -3025815 -2659843 -2273487 -1919202 -1652695
$$ packed form
31698D644224N47107M87446L80429K38279Q1791o6597j90162k81804l43290l81604
31688E115819m04848m19149m26663m25170m09518l74704l19124k46566j65842
31679A924235q8268k4094J9969M1134L9435J6709k3334p4471j27878j73659k03926
31668A325852k15775k11856j97845j78791j57223j33863j09334q5255o4735n2494
31658h1319n3762p0986j00064j29790j46495j41188j14055p3707l2977m704J235
31647i47812j9730o5011j24993j86062k35208k63737k68962k54037k26390j94636
31637b786578j64955j39138j16084r5453p9738p2319p3299p7562p7426o7352m6245
31626c796149j5360K5458P8973J47430K27343L06490L65972L86356L54285K66507
$$ plain form
31616 -1652695 -1521662 -1555300 -1756913 -2102947 -2550244 -3048771 -3553321 -4028891 -4449204 -4792233
31606 -4792233 -5037163 -5165196 -5163855 -5032528 -4786386 -4456414 -4084476 -3714353 -3381948 -3109535
31596 -3109535 -2907144 -2779462 -2732415 -2774315 -2911266 -3140803 -3447985 -3805777 -4179336 -4533058
31586 -4533058 -4838668 -5081798 -5264031 -5398847 -5503165 -5589156 -5660936 -5716823 -5753680 -5769095
31576 -5769095 -5760573 -5724177 -5655178 -5550886 -5414091 -5255691 -5096029 -4964685 -4898125 -4934348
31566 -4934348 -5104297 -5421608 -5874354 -6422969 -7006261 -7553887 -8001384 -8303679 -8443373
31557 -8443373 -8430826 -8295439 -8072264 -7791195 -7474072 -7138665 -6803730 -6490065 -6217025 -5997414
31547 -5997414 -5834007 -5719708 -5641761 -5588734 -5556851 -5551784 -5584350 -5662648 -5785574 -5941313 -6110588
$$ packed form
31616a652695J31033l3638k01613l46034m47297m98527n04550m75570m20313l43029
31606d792233k44930j28033J341J31327K46142L29972L71938L70123L32405K72413
31596c109535K02391J27682M7047m1900j36951k29537l07182l57792l73559l53722
31586d533058l05610k43130j82233j34816j04318q5991p1780n5887l6857j5415
31576e769095Q522L6396O8999J04292J36795J58400J59662J31344O6560l6223
31566d934348j69949l17311m52746n48615n83292n47626m47497l02295j39694
31557h443373J2547J35387K23175K81069L17123L35407L34935L13665K73040K19611
31547e997414J63407J14299P7947N3027L1883N067l2566p8298j22926j55739j69275
$$ plain form
31536 -6110588 -6271508 -6403122 -6487226 -6509799 -6462826 -6345613 -6164340 -5929985 -5655860 -5355926
31526 -5355926 -5044124 -4734512 -4441576 -4179724 -3961140 -3792490 -3672290 -3590491 -3530110 -3469274
31516 -3469274 -3382673 -3243319 -3026527 -2716792 -2315168 -1842799 -1337301 -842714 -397384 -25095
31506 -25095 267232 485256 639104 735752 775744 755688 674472 538753 363920 170239
31496 170239 -22247 -196036 -334955 -422664 -444168 -390234 -261743 -71471 157023 393035
31486 393035 604648 765798 861232 886180 840692 722461 523258 232015 -156405 -631496
31476 -631496 -1162373 -1701377 -2194588 -2594301 -2868711 -3006509 -3016544 -2923635 -2761669 -2565216
31466 -2565216 -2361402 -2164496 -1975458 -1786864 -1590707 -1384961 -1175879 -975709 -797681
$$ packed form
31536f110588j60920j31614q4104k2573M6973J17213J81273K34355K74125K99934
31526e355926L11802L09612K92936K61852K18584J68650J20200Q1799O0381O0836
31516c469274Q6601J39354K16792L09735M01624M72369N05498M94587M45330L72289
31506b5095K92327K18024J53848R6648L9992k0056q1216j35719j74833j93681
31496A70239j92486j73789j38919q7709k1504N3934J28491J90272K28494K36012
31486C93035K11613J61150R5434K4948m5488j18231j99203k91243l88420m75091
31476f31496n30877n39004m93211l99713k74410j37798j0035R2909J61966J96453
31466b565216K03814J96906J89038J88594J96157K05746K09082K00170J78028
$$ plain form
31457 -797681 -650789 -536583 -449366 -379651 -319091 -264567 -220289 -198175 -216572 -296517 -454903
31446 -454903 -696517 -1009070 -1364367 -1725252 -2054828 -2324413 -2518366 -2635089 -2684016 -2679185
31436 -2679185 -2631561 -2543130 -2405137 -2201257 -1914828 -1537987 -1079708 -569628 -55354 407199
$$ packed form
31457g97681J46892J14206Q7217O9715O0560N4524M4278K2114j8397p9945j58386
31446d54903k41614l12553l55297l60885l29576k69585j93953j16723m8927M831
31436b679185M7624Q8431J37993K03880K86429L76841M58279N10080N14274M62553
$$ [...]
##END NTUPLES=NMR SPECTRUM
##END=
