##TITLE=31Pdec_DE-27EXT
 D2O
 24 sc
 7.2.2024
##JCAMPDX= 6.0         $$ Bruker NMR JCAMP-DX V2.0
##DATA TYPE= NMR SPECTRUM
##DATA CLASS= NTUPLES
##ORIGIN= UXNMR, Bruker Analytische Messtechnik GmbH
##OWNER= root
$$ XWIN-NMR		Version 3.5
$$ Wed Feb  7 15:39:14 2024 Russian Standard Time (UT+4h)  she@DPX200
##.OBSERVE FREQUENCY= 81.013821
##.OBSERVE NUCLEUS= ^31P
##.ACQUISITION MODE= SIMULTANEOUS
##.ACQUISITION SCHEME= undefined
##.AVERAGES= 24
##.DIGITISER RES= 16
##SPECTROMETER/DATA SYSTEM= spect
##.PULSE SEQUENCE= zgpg30
##.SOLVENT NAME= CDCl3
##.SHIFT REFERENCE= (INTERNAL, CDCl3, 0, 248.564)
##AUDIT TRAIL= $$ (NUMBER, WHEN, WHO, WHERE, WHAT)
$$ ##TITLE= Audit trail, XWIN-NMR		Version 3.5
$$ ##JCAMPDX= 5.01
$$ ##ORIGIN= Bruker BioSpin GmbH
$$ ##OWNER= she
$$ F:/spectra/data/she/nmr/P31/1/pdata/1/auditp.txt
$$ ##AUDIT TRAIL=  $$ (NUMBER, WHEN, WHO, WHERE, WHAT)
(   1,<2024-02-07 15:37:42.64 +0400>,<she>,<DPX200>,
      <created by zg, POWCHK disabled, PULCHK disabled
       configuration hash MD5:
       00 E9 B6 7A A2 85 ED C7 34 08 36 98 17 FE 4E 26
       data hash MD5: 32K
       D2 1E 2B 91 B7 9F B0 63 13 23 AF C7 C6 C0 25 14>)
(   2,<2024-02-07 15:37:45.06 +0400>,<she>,<DPX200>,
      <Start of raw data processing
       efp BC_mod = 2 LB = 10 FT_mod = 6 PKNL = 1 PHC0 = -13615.91 PHC1 = 1959.685 SI = 64K 
       data hash MD5: 64K
       C0 D4 5E A2 84 A4 17 5A 9B 8E D5 9F 57 90 96 E5>)
(   3,<2024-02-07 15:38:47.28 +0400>,<she>,<DPX200>,
      <pk PHC0 = 867.2101 PHC1 = -2202.201 
       data hash MD5: 64K
       5B 41 84 E3 BF 39 8E 6B E0 F6 9D CB 89 ED B5 7D>)
(   4,<2024-02-07 15:38:51.20 +0400>,<she>,<DPX200>,
      <abs ABSG = 5 
       data hash MD5: 64K
       C1 1C E3 FA E6 83 78 FB C5 8C 6E 94 93 63 E6 7D>)
$$ ##END=
$$ 
$$ hash MD5
$$ 45 5F 50 A4 E1 85 60 62 CE 5A 61 F6 43 3D 8C FC
##$RELAX= 
##$RELAX= 
##$RELAX= 
##$RELAX= 
##$RELAX= 
##$RELAX= 
##$RELAX= 
##$RELAX= 
##$RELAX= 
$$ Bruker specific parameters
$$ --------------------------
##$DU= <F:/spectra>
##$EXPNO= 1
##$NAME= <P31>
##$PROCNO= 1
##$TYPE= <nmr>
##$USER= <she>
##$AMP= (0..31)
100 100 100 100 100 100 100 100 100 100 100 100 100 100 100 100 100 100 
100 100 100 100 100 100 100 100 100 100 100 100 100 100 
##$AQSEQ= 0
##$AQ_mod= 1
##$AUNM= <au_zg>
##$AUTOPOS= <>
##$BF1= 81.014009
##$BF2= 200.13
##$BF3= 200.13
##$BF4= 200.13
##$BF5= 200.13
##$BF6= 200.13
##$BF7= 200.13
##$BF8= 200.13
##$BYTORDA= 1
##$CFDGTYP= 0
##$CFRGTYP= 5
##$CHEMSTR= <none>
##$CNST= (0..31)
1 1 145 1 1 1 1 1 1 1 1 1 1 1 1 1 1 1 1 1 1 1 1 1 1 1 1 1 1 1 1 1 
##$CPDPRG= <waltz16>
##$CPDPRG1= <>
##$CPDPRG2= <waltz16>
##$CPDPRG3= <>
##$CPDPRG4= <mlev>
##$CPDPRG5= <mlev>
##$CPDPRG6= <mlev>
##$CPDPRG7= <mlev>
##$CPDPRG8= <mlev>
##$CPDPRGB= <>
##$CPDPRGT= <>
##$D= (0..31)
0 1 0 0 0 0 0 0 0 0 0 0.03 2e-05 3e-06 0 0 0 0 0 0 0 0 0 0 0 0 0 0 0 0 
0 0 
##$DATE= 1707305861
##$DBL= (0..7)
120 120 120 11 120 120 24 19 
##$DBP= (0..7)
150 150 150 150 150 150 150 150 
##$DBP07= 0
##$DBPNAM0= <>
##$DBPNAM1= <>
$$ [...]
##$SUBNAM3= <"">
##$SUBNAM4= <"">
##$SUBNAM5= <"">
##$SUBNAM6= <"">
##$SUBNAM7= <"">
##$SUBNAM8= <"">
##$SUBNAM9= <"">
##$SW= 501.771253377433
##$SWIBOX= (0..15)
0 1 3 0 0 0 0 0 0 0 0 0 0 0 0 0 
##$SW_h= 40650.406504065
##$TD= 32768
##$TD0= 1
##$TE= 0
##$TE2= 300
##$TE3= 300
##$TEG= 300
##$TL= (0..7)
0 120 53 12 22 120 120 120 
##$TP= (0..7)
150 150 150 150 150 150 150 150 
##$TP07= 0
##$TPNAME0= <>
##$TPNAME1= <>
##$TPNAME2= <>
##$TPNAME3= <>
##$TPNAME4= <>
##$TPNAME5= <>
##$TPNAME6= <>
##$TPNAME7= <>
##$TPOAL= (0..7)
0.5 0.5 0.5 0.5 0.5 0.5 0.5 0.5 
##$TPOFFS= (0..7)
0 0 0 0 0 0 0 0 
##$TUNHIN= 0
##$TUNHOUT= 0
##$TUNXOUT= 0
##$USERA1= <user>
##$USERA2= <user>
##$USERA3= <user>
##$USERA4= <user>
##$USERA5= <user>
##$V9= 5
##$VALIST= <valist>
##$VCLIST= <CCCCCCCCCCCCCCC>
##$VD= 0
##$VDLIST= <DDDDDDDDDDDDDDD>
##$VPLIST= <PPPPPPPPPPPPPPP>
##$VTLIST= <TTTTTTTTTTTTTTT>
##$WBST= 1024
##$WBSW= 4
##$XGAIN= (0..3)
0 0 0 0 
##$XL= 0
##$YL= 0
##$YMAX_a= 1589
##$YMIN_a= -1678
##$ZGOPTNS= <>
##$ZL1= 120
##$ZL2= 120
##$ZL3= 120
##$ZL4= 120
##$ABSF1= 248.5645
##$ABSF2= -253.2056
##$ABSG= 5
##$ABSL= 3
##$ALPHA= 0
##$AQORDER= 0
##$ASSFAC= 0
##$ASSFACI= 0
##$ASSFACX= 0
##$ASSWID= 0
##$AUNMP= <proc_1d>
##$AZFE= 0.1
##$AZFW= 0.5
##$BCFW= 0
##$BC_mod= 2
##$BYTORDP= 0
##$COROFFS= 0
##$CY= -3
##$DATMOD= 1
##$DC= 0
##$DFILT= <>
##$DTYPP= 0
##$F1P= 0
##$F2P= 0
##$FCOR= 1
##$FTSIZE= 65536
##$FT_mod= 6
##$GAMMA= 0
##$GB= 0
##$INTBC= 1
##$INTSCL= 6.047779e-11
##$ISEN= 30
##$LB= 10
##$LEV0= 0
##$LPBIN= 0
##$MAXI= 10000
##$MC2= 0
##$MEAN= 0
##$ME_mod= 0
##$MI= 50
##$NCOEF= 0
##$NC_proc= -9
##$NLEV= 6
##$NOISF1= 182.463
##$NOISF2= 159.3651
##$NSP= 0
##$NTH_PI= 0
##$NZP= 0
##$OFFSET= 248.5645
##$PC= 4
##$PHC0= -12748.7
##$PHC1= -242.5159
##$PH_mod= 1
##$PKNL= yes
##$PPARMOD= 0
##$PSCAL= 0
##$PSIGN= 0
##$REVERSE= no
##$SF= 81.0140089999694
##$SI= 65536
##$SIGF1= 159.3651
##$SIGF2= -187.1042
##$SINO= 113.3802
##$SIOLD= 16384
##$SREGLST= <1H.CDCl3>
##$SSB= 0
##$STSI= 65536
##$STSR= 0
##$SW_p= 40650.406504065
##$SYMM= 0
##$S_DEV= 0
##$TDeff= 32768
##$TDoff= 0
##$TI= <>
##$TILT= no
##$TM1= 0
##$TM2= 0
##$TOPLEV= 0
##$USERP1= <user>
##$USERP2= <user>
##$USERP3= <user>
##$USERP4= <user>
##$USERP5= <user>
##$WDW= 1
##$XDIM= 65536
##$YMAX_p= 281041029
##$YMIN_p= -147608157
$$ End of Bruker specific parameters
$$ ---------------------------------
##NTUPLES= NMR SPECTRUM
##VAR_NAME=  FREQUENCY,     SPECTRUM/REAL,   SPECTRUM/IMAG
##SYMBOL=    X,             R,               I
##VAR_TYPE=  INDEPENDENT,   DEPENDENT,       DEPENDENT
##VAR_FORM=  AFFN,          ASDF,            ASDF
##VAR_DIM=   65536,         65536,           65536
##UNITS=     HZ,            ARBITRARY UNITS, ARBITRARY UNITS
##FACTOR=    0.620285442955139, 1,           1
##FIRST=     20137.2065510682, 0,            0
##LAST=      -20513.1999529968, 0,           0
##MIN=       -20513.1999529968, -147608157,  0
##MAX=       20137.2065510682, 281041029,    0
$$ Real data points
##PAGE= N=1
##DATA TABLE= (X++(R..R)), XYDATA
$$ [...]
37237e9196k3030m3013n9835q2716j17954j65260k16621k58335k75153k54775
37227a555888j91542q9025L9032J70962K83312L58656L90728L83949L48612K95624
37217D34420K33868J70067J09272N4697P731l0550n6970o5660n1248j4269L5678
37206H27036Q1956J07000R8769N4382j9728j10459k02103k80243l34269l58383
37196a36042l52195l21393k77470k34622k04207j89915j87290j88218j86950j83203
37186b461505j80874j84485j96686k18019k47850k84709l25397l63758l90449
37177d853732l94648l67221l03999k07431q5655N0049J87478L13874M15498M78885
37167d766902M94939M63270L92763K97517J91617Q6804o815q0192j27217j47555
$$ plain form
37237 -59196 -82226 -125239 -185074 -267790 -385744 -551004 -767625 -1025960 -1301113 -1555888
37227 -1555888 -1747430 -1836455 -1797423 -1626461 -1343149 -984493 -593765 -209816 138796 434420
37217 434420 668288 838355 947627 1002324 1010055 979505 922535 856875 805627 791358 827036
37206 827036 908992 1015992 1114761 1169143 1149415 1038956 836853 556610 222341 -136042
37196 -136042 -488237 -809630 -1087100 -1321722 -1525929 -1715844 -1903134 -2091352 -2278302 -2461505
37186 -2461505 -2642379 -2826864 -3023550 -3241569 -3489419 -3774128 -4099525 -4463283 -4853732
37177 -4853732 -5248380 -5615601 -5919600 -6127031 -6212686 -6162637 -5975159 -5661285 -5245787 -4766902
37167 -4766902 -4271963 -3808693 -3415930 -3118413 -2926796 -2839992 -2846807 -2926999 -3054216 -3201771
37157c201771j47167j35133j18931j01955q5117p0513o2989o7415q3956j06169
37147d181116j24280j31276j26917j16587j06096r6749q4749o5553l9467j3494
37137e086284K223L99j9535n1862q8228j22147j52031j81124k14001k51580k87724
37126f451894l09753l02972k57648j75431p1264L1819J13075J63158J86136J94290
37116f880484K00537K13327K35087K62843K89945L08738L13702L03721K81986
37107d470598K53419K21315J85908J46350J04749O8689M9809N9092J01898J75046
37097c104323K66600L58319M30462M67571M62343M15385L32042K19889Q8912m7756
37087a10556j76113k86687l78599m57948n31331n99864o58238o98611p15375p07270
$$ plain form
37157 -3201771 -3348938 -3484071 -3603002 -3704957 -3790074 -3860587 -3923576 -3990991 -4074947 -4181116
37147 -4181116 -4305396 -4436672 -4563589 -4680176 -4786272 -4883021 -4967770 -5033323 -5072790 -5086284
37137 -5086284 -5084061 -5083662 -5103197 -5155059 -5243287 -5365434 -5517465 -5698589 -5912590 -6164170 -6451894
37126 -6451894 -6761647 -7064619 -7322267 -7497698 -7568962 -7537143 -7424068 -7260910 -7074774 -6880484
37116 -6880484 -6679947 -6466620 -6231533 -5968690 -5678745 -5370007 -5056305 -4752584 -4470598
37107 -4470598 -4217179 -3995864 -3809956 -3663606 -3558857 -3490168 -3440359 -3381267 -3279369 -3104323
37097 -3104323 -2837723 -2479404 -2048942 -1581371 -1119028 -703643 -371601 -151712 -62800 -110556
37087 -110556 -286669 -573356 -951955 -1409903 -1941234 -2541098 -3199336 -3897947 -4613322 -5320592
37077e320592o76142o24203n52505m62239l57968k49634j50664p2706k0341J0862
37067h476132L2259N7268R5532J48202K06803K56980K85329K84861K55593K00922
37057f652383J23786K6110q8405k10956l26516m15887m60155m45985l69790k38934
37047i059115o9289J19469L08524M83138O34535P60594Q64677R52098J025400
37038c979969J080978J108821J095548J029672R07598P37959N41493L45253J73289
37029C040642L8817n7895j25329j73749k10222k38129k59521k76552k90352k99526
37019A148184l01279k94829k83209k71055k60555k49897k35667k16391j93958
37010a158656j72083j53575j38688j25878j14506j06957j07455j17846j34177
$$ plain form
37077 -5320592 -5996734 -6620937 -7173442 -7635681 -7993649 -8243283 -8393947 -8466653 -8486994 -8476132
37067 -8476132 -8443873 -8386605 -8291073 -8142871 -7936068 -7679088 -7393759 -7108898 -6853305 -6652383
37057 -6652383 -6528597 -6502487 -6590892 -6801848 -7128364 -7544251 -8004406 -8450391 -8820181 -9059115
37047 -9059115 -9128404 -9008935 -8700411 -8217273 -7582738 -6822144 -5957467 -5005369 -3979969
37038 -3979969 -2898991 -1790170 -694622 335050 1242648 1980607 2522100 2867353 3040642
37029 3040642 3079459 3021564 2896235 2722486 2512264 2274135 2014614 1738062 1447710 1148184
37019 1148184 846905 552076 268867 -2188 -262743 -512640 -748307 -964698 -1158656
37010 -1158656 -1330739 -1484314 -1623002 -1748880 -1863386 -1970343 -2077798 -2195644 -2329821
37001b329821j47564j48497j30662r2040l4596L5384J06904J65935J99759K01944
36991b173254J74969J28842P6576K9333n884k5418k7331j1383J9243N6404Q7505
36980a670398R8405P8188K4246n5130j43104k21027k75369l00889k99665k78340
36970c043083k45388k08426j71764j35360r6253n1814l326M1586O9367O5194K1171
36959c758096n6379j45888k17716k45948k18851j43169m0760O0840J39448J85444
36949d441075K01621J96897J78614J48499J03994M3209l0407j06862j72470k14552
36939d092532k25267k03080j52375q2029l685O9815J25875J53942J48022J08649
36929d152665M2610l9600j26430k06306k67995l02209l04600k77748k30295j73485
$$ plain form
37001 -2329821 -2477385 -2625882 -2756544 -2848584 -2883180 -2847796 -2740892 -2574957 -2375198 -2173254
36991 -2173254 -1998285 -1869443 -1792867 -1763534 -1769418 -1794836 -1822167 -1833550 -1814307 -1757903 -1670398
36980 -1670398 -1571993 -1493805 -1469559 -1524689 -1667793 -1888820 -2164189 -2465078 -2764743 -3043083
36970 -3043083 -3288471 -3496897 -3668661 -3804021 -3900274 -3952088 -3955414 -3913828 -3844461 -3779267 -3758096
36959 -3758096 -3814475 -3960363 -4178079 -4424027 -4642878 -4786047 -4826807 -4765967 -4626519 -4441075
36949 -4441075 -4239454 -4042557 -3863943 -3715444 -3611450 -3568241 -3598648 -3705510 -3877980 -4092532
36939 -4092532 -4317799 -4520879 -4673254 -4755283 -4758968 -4689153 -4563278 -4409336 -4261314 -4152665
36929 -4152665 -4110055 -4149655 -4276085 -4482391 -4750386 -5052595 -5357195 -5634943 -5865238 -6038723
36919f038723j16885o5124j7162L1238Q3184J37805J91271K40228K83798L22090
36909d948280L53352L73386L78138L67134L44804L18673K95665K78896K67151
36900a971081K57370K47934K39602K33295K27341K17270J98342J68461J29396
36891e2070Q6272M6138J5824p78n084l919o497j9559m4089p6215j11325j47082
36879c18384j82364k14168k37120k46782k42759k27656k03151j67811j18994n6632
36869b215821J4595Q6099J48306J94198K22075K36567K47378K65918L00719L53412
36859a46554M17733M82805N38888N81465O10718O27611O30479O15041N77399N17194
36849E452779M38692L49556K58486J72695R5652K6184l9814j04980j66324k14869
$$ plain form
36919 -6038723 -6155608 -6220732 -6237894 -6206656 -6123472 -5985667 -5794396 -5554168 -5270370 -4948280
36909 -4948280 -4594928 -4221542 -3843404 -3476270 -3131466 -2812793 -2517128 -2238232 -1971081
36900 -1971081 -1713711 -1465777 -1226175 -992880 -765539 -548269 -349927 -181466 -52070
36891 -52070 34202 80340 96164 95386 90302 86383 79886 60327 16238 -59977 -171302 -318384
36879 -318384 -500748 -714916 -952036 -1198818 -1441577 -1669233 -1872384 -2040195 -2159189 -2215821
36869 -2215821 -2201226 -2115127 -1966821 -1772623 -1550548 -1313981 -1066603 -800685 -499966 -146554
36859 -146554 271179 753984 1292872 1874337 2485055 3112666 3743145 4358186 4935585 5452779
36849 5452779 5891471 6241027 6499513 6672208 6767860 6794044 6754230 6649250 6482926 6268057
36839F268057k40024k35816k05000j58842j13165q2752p6811r7332j40194j97170
36829D720951k57186l07119l33521l25879k80452k02957j08454j7658M9456P9850
36819C017031P0008K3970n0721j45391k49642l50035m31384m81295m95071m77061
36809D30409m37383l86584l31918k76820k22306j68402j14937o2291j2213L2293
36799a550152O8812R7925J23631J50584J80089K08377K28831K36435K31001K16895
36789A92428J99659J82059J62353J35781R8203M9440n320n6624r3955j09892j03329
36778F50803p9897m9631k3844j2914k4759o3156j26198k06320k92173l70979m29897
36767a028965m56753m41463l78698k70439j26455L7783K04302L55312M75473N55061
$$ plain form
36839 6268057 6028033 5792217 5587217 5428375 5315210 5232458 5155647 5058315 4918121 4720951
36829 4720951 4463765 4156646 3823125 3497246 3216794 3013837 2905383 2887725 2937181 3017031
36819 3017031 3087039 3111009 3060288 2914897 2665255 2315220 1883836 1402541 907470 430409
36809 430409 -6974 -393558 -725476 -1002296 -1224602 -1393004 -1507941 -1570232 -1582445 -1550152
36799 -1550152 -1481340 -1383415 -1259784 -1109200 -929111 -720734 -491903 -255468 -24467 192428
36789 192428 392087 574146 736499 872280 970483 1019923 1014603 957979 864024 754132 650803
36778 650803 570906 521275 497431 484517 459758 396602 270404 64084 -228089 -599068 -1028965
36767 -1028965 -1485718 -1927181 -2305879 -2576318 -2702773 -2664990 -2460688 -2105376 -1629903 -1074842
36757a074842N93378N99309N86628N66280N41113N06476M55067L81776K86034
36748C441219J72057M7999p5745j88741k82057l48170l80032l71412l19340k27098
36738A468680j05033L1640J66424K84166L72202M21335M27875L95983L37891K70211
36728D071374K07479J56804J17041Q2789M9929J9102m598j5129r958P800L1969
36717D714602N9156R2357J38036J99013K70315L42039M05793M58318M99984N31251
36707G710864N50730N55383N41290N04169M40311L48541K32723J03196k4670j34964
36697A0827573k16550k65985k86310k83202k61625k24955j76298j19957o1220
36688H931471m516M8262R7506J44088J88545K32847K83366L51596M50823N90446
$$ plain form
36757 -1074842 -481464 117845 704473 1270753 1811866 2318342 2773409 3155185 3441219
36748 3441219 3613276 3661275 3585530 3396789 3114732 2766562 2386530 2015118 1695778 1468680
36738 1468680 1363647 1395287 1561711 1845877 2218079 2639414 3067289 3463272 3801163 4071374
36728 4071374 4278853 4435657 4552698 4635487 4685416 4704518 4699920 4684791 4674833 4682633 4714602
36717 4714602 4773758 4866115 5004151 5203164 5473479 5815518 6221311 6679629 7179613 7710864
36707 7710864 8261594 8816977 9358267 9862436 10302747 10651288 10884011 10987207 10962537 10827573
36697 10827573 10611023 10345038 10058728 9775526 9513901 9288946 9112648 8992691 8931471
36688 8931471 8926955 8975217 9072723 9216811 9405356 9638203 9921569 10273165 10723988 11314434
36678A1314434P71468R85526J217328J448930J664483J854500K018865K167408
36670B3442942K317222K487363K693319K944148L243233L591249L988832M437890
36662D9146198M941828N505130O132157O825493P584966Q407906R289469J0221074
36654A08054221J1186410J2156120J3082422J3894239J4494066J4759177J4550324
36647B02176979J3730219J2192700R899718O916530L428030k79658l874201p050609
36639B37139708r594068j1409121j2510693j2990063j2975232j2600333j1988574
36632A53071624j1244966j0452825r670732q930795q240753p590983o965009o350394
36624H3625167n746337n164843m624791m142268l723382l364081l055644k790368
$$ plain form
36678 11314434 12085902 13071428 14288756 15737686 17402169 19256669 21275534 23442942
36670 23442942 25760164 28247527 30940846 33884994 37128227 40719476 44708308 49146198
36662 49146198 54088026 59593156 65725313 72550806 80135772 88543678 97833147 108054221
36654 108054221 119240631 131396751 144479173 158373412 172867478 187626655 202176979
36647 202176979 215907198 228099898 237999616 244916146 248344176 248064518 244190317 237139708
36639 237139708 227545640 216136519 203625826 190635763 177660531 165060198 153071624
36632 153071624 141826658 131373833 121703101 112772306 104531553 96940570 89975561 83625167
36624 83625167 77878830 72713987 68089196 63946928 60223546 56859465 53803821 51013453
36616E1013453k563213k370232k206951k068208j948591j842839j746961j660168
36608C4606290j585655j528357j490415j467347j447506j415318j357033j266532
36600B3048127j148154j014517q80516p57405o50479n60644m87198m29368l86459
36591A6733387l57974l44682l49481l76226m26209m94665n70406o39522o90879
36582A2483343p19868p28308p20935p00944o67545o16910n45598m53991l47826
36573F981418k37496j35801n4965l855J3764n59m1212j00874j73019k52896l35816
36562E658689m14224m77151n13795n18688m93933m46968l86442l19583k51941
36553A835964j88030j31037q1490l6503Q527N6190J04576J49006J86498K18106
$$ plain form
36616 51013453 48450240 46080008 43873057 41804849 39856258 38013419 36266458 34606290
36608 34606290 33020635 31492278 30001863 28534516 27087010 25671692 24314659 23048127
36600 23048127 21899973 20885456 20004940 19247535 18597056 18036412 17549214 17119846 16733387
36591 16733387 16375413 16030731 15681250 15305024 14878815 14384150 13813744 13174222 12483343
36582 12483343 11763475 11035167 10314232 9613288 8945743 8328833 7783235 7329244 6981418
36573 6981418 6743922 6608121 6553156 6549301 6563065 6562506 6521294 6420420 6247401 5994505 5658689
36562 5658689 5244465 4767314 4253519 3734831 3240898 2793930 2407488 2087905 1835964
36553 1835964 1647934 1516897 1435407 1398904 1407431 1463621 1568197 1717203 1903701 2121807
36543B121807K46383K70770K86054K85574K66010K29457J81443J26968O7890L611
36533D085967o5507j34807j94783k33938k43154k18674j62373q0110J9784J27173
36523B899578K30879L20822L90839M39961M71059M88081M93732M88557M71433
36514F694941M41315L99234L48703K94101K39224J88172J47234J24065J23080
36505I000069J40711J65001J80038J71921J33091O4046k7256j28138k25541l10649
36495I163293l81830m44486n07700n79044o60035p44276q18780q67283q74145
36486C285714q28288p26940n78061l99838k16685n3229P1352J47053J74421J63347
36476A038846J29333Q8432N3354L2179K8666M2373O8410R8311J22713J34511J30786
$$ plain form
36543 2121807 2368190 2638960 2925014 3210588 3476598 3706055 3887498 4014466 4082356 4085967
36533 4085967 4020460 3885653 3690870 3456932 3213778 2995104 2832731 2752621 2772405 2899578
36523 2899578 3130457 3451279 3842118 4282079 4753138 5241219 5734951 6223508 6694941
36514 6694941 7136256 7535490 7884193 8178294 8417518 8605690 8752924 8876989 9000069
36505 9000069 9140780 9305781 9485819 9657740 9790831 9854877 9827621 9699483 9473942 9163293
36495 9163293 8781463 8336977 7829277 7250233 6590198 5845922 5027142 4159859 3285714
36486 3285714 2457426 1730486 1152425 752587 535902 482673 554025 701078 875499 1038846
36476 1038846 1168179 1256611 1309965 1342144 1370810 1413183 1481593 1579904 1702617 1837128 1967914
36465A967914J12883Q5075N2428J8921j3057m1792o5410q2417r2980r9181j03556
36454A738828j07149j08605j04992r4164p7616o2027n7593p3388j12165j67778
36444G73351k26568k71791k88836k69042k10899j19247m012J20815K38962L35872
36434G8605M03810M44557M66930M80417M89729M94332M92622M86302M80619M80282
36424D798205M84903M88173M81382M58307M17864L63317K99496K30490J59443
36415H181580R0127K8215j9993n1657p1584r2593j30312j94873k84559l85425
36405G068926m76894n39595n61189n38566m77542l91445k98127k14641j51167
36396C419760j08043p8185n3095k7834k019K2320M3105N8774O7162O4411M5397
$$ plain form
36465 1967914 2080797 2165872 2218300 2237221 2224164 2182372 2116962 2034545 1941565 1842384 1738828
36454 1738828 1631679 1523074 1418082 1323918 1246302 1184275 1126682 1053294 941129 773351
36444 773351 546783 274992 -13844 -282886 -493785 -613032 -617044 -496229 -257267 78605
36434 78605 482415 926972 1393902 1874319 2364048 2858380 3351002 3837304 4317923 4798205
36424 4798205 5283108 5771281 6252663 6710970 7128834 7492151 7791647 8022137 8181580
36415 8181580 8271707 8299922 8279929 8228272 8156688 8064095 7933783 7738910 7454351 7068926
36405 7068926 6592032 6052437 5491248 4952682 4475140 4083695 3785568 3570927 3419760
36396 3419760 3311717 3233532 3180437 3152603 3150584 3172904 3216009 3274783 3341945 3406356 3451753
36385C451753N981n3851j27593k01946k59318k82699k61404j95263r5250J9889
36375B000299J29570K17332K74525L00533L00037K79145K42475J92213J28773
36366D064902N2314l5184j27504k12416k72582k90304k54810j68035m4899R2312
36356B803794K21978L28811M05074M48698M60773M43579L99162L28667K33176
36347F073712J16112j4419j45428k61583l48886l97530m03498l69871l07725k34921
36337C705963j71227j31438j20538j33872j61251j91453k14673k23288k12309
36328B145914j79831j27057n8003K0232R7013J59244J95245J99658J75824J33643
36318B761882Q4643L7796k106l4040n9694q1816j01840j17554j22906j10985p8361
$$ plain form
36385 3451753 3457734 3403883 3276290 3074344 2815026 2532327 2270923 2075660 1980410 2000299
36375 2000299 2129869 2347201 2621726 2922259 3222296 3501441 3743916 3936129 4064902
36366 4064902 4117216 4082032 3954528 3742112 3469530 3179226 2924416 2756381 2711482 2803794
36356 2803794 3025772 3354583 3759657 4208355 4669128 5112707 5511869 5840536 6073712
36347 6073712 6189824 6175405 6029977 5768394 5419508 5021978 4618480 4248609 3940884 3705963
36337 3705963 3534736 3403298 3282760 3148888 2987637 2796184 2581511 2358223 2145914
36328 2145914 1966083 1839026 1781023 1801255 1898268 2057512 2252757 2452415 2628239 2761882
36318 2761882 2846525 2884321 2882215 2848175 2788481 2706665 2604825 2487271 2364365 2253380 2175019
36307B175019k7389L5233J01866J66110K22571K65783K90189K91567K69030K26590
36297D016569J73112J19641P4904M1981J8556K30j6041l0352m0314m3103l8098
36286D277085k8187j7942j0027l496M062J2795J8995J6760J144k9068o9840j12266
36274D060015j45218j59413j50969j22721q2777m1151o300J6526K4896J8698R28
36263C412514k1671m0731n0766n2223n0106m9751n4009o3944q1234j08727j47787
36252B691565j94439k38010k64500k62976k30729j73644j01999k4798N3511J32053
36242A386034K09365K79707L33457L61666L61097L35679K93945K45166J96923
36233D003039J54448J20791R6986Q1982P2344O2447M6188K0059j4574n2181q6199
$$ plain form
36307 2175019 2147630 2182863 2284729 2450839 2673410 2939193 3229382 3520949 3789979 4016569
36297 4016569 4189681 4309322 4384226 4426207 4444763 4444993 4428952 4398600 4358286 4315183 4277085
36286 4277085 4248898 4230956 4220929 4217433 4221495 4234290 4253285 4270045 4271189 4242121 4172281 4060015
36274 4060015 3914797 3755384 3604415 3481694 3398917 3357766 3351466 3367992 3392888 3411586 3412514
36263 3412514 3390843 3350112 3299346 3247123 3197017 3147266 3093257 3029313 2948079 2839352 2691565
36252 2691565 2497126 2259116 1994616 1731640 1500911 1327267 1225268 1200470 1253981 1386034
36242 1386034 1595399 1875106 2208563 2570229 2931326 3267005 3560950 3806116 4003039
36233 4003039 4157487 4278278 4375264 4457246 4529590 4592037 4638225 4658284 4643710 4591529 4505330
36222D505330j11334j22870j14846q0796j7926O8969J68039K65373L50398M17996
36212E328333M67237M98717N11948N03257M65336L89827K72440J17689n9847k38290
36202H256647l93516n04510n57996n51910m96746m13519l27759k61100k24158
36193D525433k14330k19242k23204k13105j82028j30532o5653K355O4474J16070
36183C460238J57056J89367K13852K28874K31554K20708J98592J69365J35518
36174E205124R6385N0996K413m1678p3755r2697j06102j26647j64903k22907k92001
36163D234228l56031l98188m07990l85152l39277k86074k41700k16913k12940
36154A389963k20772k24987k11407j75283j24961p7666m9691m8085o9606j05904
$$ plain form
36222 4505330 4393996 4271126 4156280 4075484 4057558 4126527 4294566 4559939 4910337 5328333
36212 5328333 5795570 6294287 6806235 7309492 7774828 8164655 8437095 8554784 8494937 8256647
36202 8256647 7863131 7358621 6800625 6248715 5751969 5338450 5010691 4749591 4525433
36193 4525433 4311103 4091861 3868657 3655552 3473524 3342992 3277339 3279694 3344168 3460238
36183 3460238 3617294 3806661 4020513 4249387 4480941 4701649 4900241 5069606 5205124
36174 5205124 5301509 5352505 5354918 5313240 5239485 5146788 5040686 4914039 4749136 4526229 4234228
36163 4234228 3878197 3480009 3072019 2686867 2347590 2061516 1819816 1602903 1389963
36154 1389963 1169191 944204 732797 557514 432553 354887 305196 257111 187505 81601
36144H1601j48899j92211k29882k56054k66401k59150k34131j91122j29695n1076
36134a877020L9575J32231K13469K70265K94949K88463K59115K16935J67749J11886
36124A17617M8343j9564q2216j26933j43887j30187q9363k6919N4083J53155K67453
36113B1582L85909M87917N49064N51302M91760L84965K56649J32491K8474n1410
36103C238703j09960j49159j66360j56393j16999n2805K5016J02561J67151K09300
36093B991055K23005K06015J60272R1756R325p6737j56284k21246k67369k94195
36083B665597l02731k92976k63880k15774j52675q1803j0407N7710J23263J89189
36073A715513K56897L23730L82953M25442M42080M26487L77773L01760K09425
$$ plain form
36144 81601 -67298 -259509 -489391 -745445 -1011846 -1270996 -1505127 -1696249 -1825944 -1877020
36134 -1877020 -1837445 -1705214 -1491745 -1221480 -926531 -638068 -378953 -162018 5731 117617
36124 117617 165960 146396 64180 -62753 -206640 -336827 -426190 -453109 -399026 -245871 21582
36113 21582 407491 895408 1444472 1995774 2487534 2872499 3129148 3261639 3290113 3238703
36103 3238703 3128743 2979584 2813224 2656831 2539832 2487027 2512043 2614604 2781755 2991055
36093 2991055 3214060 3420075 3580347 3672103 3681428 3604691 3448407 3227161 2959792 2665597
36083 2665597 2362866 2069890 1806010 1590236 1437561 1355758 1345351 1403061 1526324 1715513
36073 1715513 1972410 2296140 2679093 3104535 3546615 3973102 4350875 4652635 4862060
36064D862060J13445K4847m9126j06009j48033j80758k10847k44041k83374l27161
36054C451003l67746l93076l91589l57530k93414k09190j19835m2204R329K7864
36044A313612J6809j2005m4289o9909q6220r6721j06666j19116j33610j47229
36034E14656j55873j54589j37607r9202l5891N0857J52620K54527L39152L92467
36024A121117M08384L89422L44171K83877K19096J56173R4687K8455m8976j37836
36014B858570k29598l10348l67136l92868l87267l54791l01797k34733j59480
36005A20552q1026l364O9938J34432J84372K14664K24578K19903K10960K07276
35995A502285K12730K24817K37970K47692K52086K50626K42813K28781K10812
$$ plain form
36064 4862060 4975505 5000352 4951226 4845217 4697184 4516426 4305579 4061538 3778164 3451003
36054 3451003 3083257 2690181 2298592 1941062 1647648 1438458 1318623 1276419 1285748 1313612
36044 1313612 1330421 1318416 1274127 1204218 1117998 1021277 914611 795495 661885 514656
36034 514656 358783 204194 66587 -32615 -68506 -17649 134971 389498 728650 1121117
36024 1121117 1529501 1918923 2263094 2546971 2766067 2922240 3016927 3045382 2996406 2858570
36014 2858570 2628972 2318624 1951488 1558620 1171353 816562 514765 280032 120552
36005 120552 39526 36162 106100 240532 424904 639568 864146 1084049 1295009 1502285
35995 1502285 1715015 1939832 2177802 2425494 2677580 2928206 3171019 3399800 3610612
35986C610612J93132J79503J70716J64289J56242J43294J24446J01609P9058O1238
35976D984139M9753M1750L1572J5097o374k6078l5962l1922j6042N252K4649L6104
35964E071938L5155J8895j3500o0067j15966j74310k27959k71905l04734l27698
35954C629849l42132l48030l45595l37939l31310l31383l37949l42027l28022
35945E85462k80542j92599p0392O8699K03673L17684M00779M47227M51962M10781
35935B342734L24489K02844O4112o9965j80386k54795k88129k81445k40516j74614
35925A444329r5255j4523N6806J10733J42543J50729J37262J08285P3710M4249
35915B158868K6989K2656K6512L1583L1805K4224J0391l813j1256q409J587J0195
$$ plain form
35986 3610612 3803744 3983247 4153963 4318252 4474494 4617788 4742234 4843843 4922901 4984139
35976 4984139 5033892 5075642 5107214 5122311 5115937 5089859 5053897 5021975 5005933 5011185 5035834 5071938
35964 5071938 5107093 5125988 5112488 5052421 4936455 4762145 4534186 4262281 3957547 3629849
35954 3629849 3287717 2939687 2594092 2256153 1924843 1593460 1255511 913484 585462
35945 585462 304920 112321 41929 110628 314301 631985 1032764 1479991 1931953 2342734
35935 2342734 2667223 2870067 2934179 2864214 2683828 2429033 2140904 1859459 1618943 1444329
35925 1444329 1349074 1334551 1391357 1502090 1644633 1795362 1932624 2040909 2114619 2158868
35915 2158868 2185857 2208513 2235025 2266608 2298413 2322637 2333028 2329215 2317959 2309550 2311137 2321332
35903B321332P728j2875n4274j14122j84779k54267l09404l40103l42355l18594
35893C98287k76084k24684j74322j32156j00581p7790o0885m8945m3397m5998
35883g86555n6894p4169r4318j12880j25633j30387j27816j20190j09146r4687
35873a832675p5654n0158j5405L1524R1102J58849K25848K82820L25117L54939
35863e03693L79184M04436M32420M58803M75655M75297M52761M05892L34132K37794
35853C552681J18728j8047j62795l00608m12904m81523m94884m53339l69677k63442
35843G14190j52950n0965L3758R2772J17215J01158M5405m2031j49259k64859
35833D44434l80166m88590n83634o58055p05091p20473p03478o56776n85999m99270
$$ plain form
35903 2321332 2329060 2316185 2261911 2147789 1963010 1708743 1399339 1059236 716881 398287
35893 398287 122203 -102481 -276803 -408959 -509540 -587330 -648215 -697160 -740557 -786555
35883 -786555 -843449 -917618 -1011936 -1124816 -1250449 -1380836 -1508652 -1628842 -1737988 -1832675
35873 -1832675 -1908329 -1958487 -1973892 -1942368 -1851266 -1692417 -1466569 -1183749 -858632 -503693
35863 -503693 -124509 279927 712347 1171150 1646805 2122102 2574863 2980755 3314887 3552681
35853 3552681 3671409 3653362 3490567 3189959 2777055 2295532 1800648 1347309 977632 714190
35843 714190 561240 510275 544033 636805 754020 855178 900583 858552 709293 444434
35833 444434 64268 -424322 -1007956 -1666011 -2371102 -3091575 -3795053 -4451829 -5037828 -5537098
35823e537098m05847l13364k25224j40486n7057K4049R6769J51953J81746J83380
35813f041179J60507J22092P9957M5930K9335L5234O3636J09581J64375K18008
35803e012524K62187K92773L10722L21351L31868L47809L70303L96452M22749
35794a956310M48263M74463N02132N28578N47153N48664N23712M66101L76731
35785B459487K65761J50715N0649k0849o0768p7769q8783j12396j61924k41250
35775B162873l44470m58346n66169o52087p05019p20606p00292o48485n70000
35766c202601m69383l51837k24379r6041K3275J25098K05116K65298L14071L63767
35756c047616M25432N02799N88984O68790P26069P51061P42514P03907O38584
$$ plain form
35823 -5537098 -5942945 -6256309 -6481533 -6622019 -6679076 -6655027 -6558258 -6406305 -6224559 -6041179
35813 -6041179 -5880672 -5758580 -5678623 -5632693 -5603358 -5568124 -5504488 -5394907 -5230532 -5012524
35803 -5012524 -4750337 -4457564 -4146842 -3825491 -3493623 -3145814 -2775511 -2379059 -1956310
35794 -1956310 -1508047 -1033584 -531452 -2874 544279 1092943 1616655 2082756 2459487
35785 2459487 2725248 2875963 2926612 2905763 2844995 2767226 2678443 2566047 2404123 2162873
35775 2162873 1818403 1360057 793888 141801 -563218 -1283824 -1984116 -2632601 -3202601
35766 -3202601 -3671984 -4023821 -4248200 -4344241 -4320966 -4195868 -3990752 -3725454 -3411383 -3047616
35756 -3047616 -2622184 -2119385 -1530401 -861611 -135542 615519 1358033 2061940 2700524
35747B700524N48861M39506L21132K08911J16323M8310o16m1156q0429j16260
35737D145106j38834j38161j11512o5735j3752L1491O1662P4652P4066O8169O8198
35726D055350Q4895J23556J80293K42448K93378L18990L12856K77976K24842J67004
35716F281588J16379Q0419O1585N8017O4466P3458P6804O7213L9720p160p0643
35705F841846j44002k18372k85530l40285l81129m08852m24073m25844m12978
35696C800781l87483l57221l34701l31701l52990l93779m42882m89037n25353
35687A85634n49396n60782n59567n46181n21305m85375m39084l85513l31608k86433
35677d479610k56481k41128k31281k12436j71052j01536r951Q8125J75119K40132
$$ plain form
35747 2700524 3249385 3688891 4010023 4218934 4335257 4383567 4382951 4341795 4261366 4145106
35737 4145106 4006272 3868111 3756599 3690864 3677112 3708603 3770265 3844917 3918983 3987152 4055350
35726 4055350 4140245 4263801 4444094 4686542 4979920 5298910 5611766 5889742 6114584 6281588
35716 6281588 6397967 6478386 6539971 6597988 6662454 6735912 6812716 6879929 6919649 6912489 6841846
35705 6841846 6697844 6479472 6193942 5853657 5472528 5063676 4639603 4213759 3800781
35696 3800781 3413298 3056077 2721376 2389675 2036685 1642906 1200024 710987 185634
35687 185634 -363762 -924544 -1484111 -2030292 -2551597 -3036972 -3476056 -3861569 -4193177 -4479610
35677 -4479610 -4736091 -4977219 -5208500 -5420936 -5591988 -5693524 -5703475 -5615350 -5440231 -5200099
35667e200099K83445L13586L39046L61064L73518L69502L47815L13269K71470
35658b227384K24440J71531J14094N8852J6670k397N639L6495P9333J21030J50474
35647a251223J61209J52006J25891Q8552M6704O455k8627n9034q8543j20505j53553
35636a120668j80500j91427j78088j36270o5607L1154J48009K75411M01242N13039
35626e03705O00049O53993O69140O43332N79902M88270L81548K72551J71452Q5983
35616D042515K1846j8666l8225m3366m0720l3971k4223j2562j343P578J5915K9780
35604C904558N6743J00892J59486K23114K78540L12207L13559K77921K08325J14956
35594E950301J2267q4461j61348k06960k13526j78923j08630j6000P9757J57601
$$ plain form
35667 -5200099 -4916654 -4603068 -4264022 -3902958 -3529440 -3159938 -2812123 -2498854 -2227384
35658 -2227384 -2002944 -1831413 -1717319 -1658467 -1641797 -1644194 -1638555 -1602060 -1522727 -1401697 -1251223
35647 -1251223 -1090014 -938008 -812117 -723565 -676861 -670406 -699033 -758067 -846610 -967115 -1120668
35636 -1120668 -1301168 -1492595 -1670683 -1806953 -1872560 -1841406 -1693397 -1417986 -1016744 -503705
35626 -503705 96344 750337 1419477 2062809 2642711 3130981 3512529 3785080 3956532 4042515
35616 4042515 4064361 4045695 4007470 3964104 3923384 3889413 3865190 3852628 3851285 3858863 3874778 3904558
35604 3904558 3961301 4062193 4221679 4444793 4723333 5035540 5349099 5627020 5835345 5950301
35594 5950301 5962568 5878107 5716759 5509799 5296273 5117350 5008720 4992720 5072477 5230078
35584E230078J99447J94458J41614M9690o5420j85195k93073l77525m32857m58292
35574D002925m56494m32488l93160l46554l00411k60218k28288k04846j90309
35565A190157j86632j96352k20461k57155l02230l49963l93274m23579m31747
35556a571236m10480l56830k73081j65632m2965Q5843K11424L23868M13021M70012
35546a316056M89589M71986M23162L53227K73867J96069J29009P9927N4001N3271
35536A208052P5257J12950J57023J98824K31750K50640K51188K31132J92365J41430
35526C050611Q7621M0054N622j1898j2243J215K1954M1668N2527N0030L5360J5353
35514C377874r13p143k812P850J9448K8535L4429L7855L8426L2631J4418k0946
$$ plain form
35584 5230078 5429525 5623983 5765597 5815287 5749867 5564672 5271599 4894074 4461217 4002925
35574 4002925 3546431 3113943 2720783 2374229 2073818 1813600 1585312 1380466 1190157
35565 1190157 1003525 807173 586712 329557 27327 -322636 -715910 -1139489 -1571236
35556 -1571236 -1981716 -2338546 -2611627 -2777259 -2820224 -2734381 -2522957 -2199089 -1786068 -1316056
35546 -1316056 -826467 -354481 68681 421908 695775 891844 1020853 1100780 1154781 1208052
35536 1208052 1283309 1396259 1553282 1752106 1983856 2234496 2485684 2716816 2909181 3050611
35526 3050611 3138232 3178286 3183908 3172010 3159767 3160982 3182936 3224604 3277131 3327161 3362521 3377874
35514 3377874 3376961 3369818 3367006 3374856 3394304 3422839 3457268 3495123 3533549 3566180 3580598 3559652
35502C559652p2016j29568j80173k12666k23201k16209k01317j88209j82153j82792
35492A771348j86637j90746j94141j96097j93821j82398j57315j17333o5546q158
35482B79156M7677R5582J30921J51909J61188J66650J79576K10205K63207L35806
35472B021877M19089N01242N70976O20104O44620O44554O23612N89195N51642
35463G186911N21133N03012M94838M87726M70595M33644L69238K72168J41869
35454A0881134j4108j78996l30415m47049n14238n26262m85980m03406k93629
35445G687051j74059o2026K6228P5865P5643K2610p4028j94575l16758m24673
35435F641278n12138n78895o24509o46147o41468o12503n66144n10815m52609
$$ plain form
35502 3559652 3487636 3358068 3177895 2965229 2742028 2525819 2324502 2136293 1954140 1771348
35492 1771348 1584711 1393965 1199824 1003727 809906 627508 470193 352860 287314 279156
35482 279156 326833 422415 553336 705245 866433 1033083 1212659 1422864 1686071 2021877
35472 2021877 2440966 2942208 3513184 4133288 4777908 5422462 6046074 6635269 7186911
35463 7186911 7708044 8211056 8705894 9193620 9664215 10097859 10467097 10739265 10881134
35454 10881134 10867026 10688030 10357615 9910566 9396328 8870066 8384086 7980680 7687051
35445 7687051 7512992 7450966 7477194 7553059 7628702 7651312 7577284 7382709 7065951 6641278
35435 6641278 6129140 5550245 4925736 4279589 3638121 3025618 2459474 1948659 1496050
35426A496050l93662l33099k69078k00504j27675n1637K7147J09341J95328K82413
35416G34624L62996M25738M59585M58042M21101L54329K66866J70183P7620L199
35406C734283m1113m8628j9625L9365J17454K00785K73180L17586L19804K73683
35396E166774J84893P0218m8254j51671k31316k90005l37280l81744m25881m66314
35386C089420m97642n15564n17000m98771m57407l90759k99806j89118o6089O0274
35376b82462J80311K84439L63957M12212M26001M06522L58992K90824K09432J21105
35366B771333L1415n3793j28260j86680k26882k51494k67775k85183l11608l50126
35356G40947l97901m47313m88027n09068n00881m57424l77438k64379j25921K5920
$$ plain form
35426 1496050 1102388 769289 500211 299707 172032 120395 147542 256883 452211 734624
35416 734624 1097620 1523358 1982943 2440985 2862086 3216415 3483281 3653464 3731084 3734283
35406 3734283 3693170 3644542 3624917 3664282 3781736 3982521 4255701 4573287 4893091 5166774
35396 5166774 5351667 5421885 5373631 5221960 4990644 4700639 4363359 3981615 3555734 3089420
35386 3089420 2591778 2076214 1559214 1060443 603036 212277 -87529 -276647 -342736 -282462
35376 -282462 -102151 182288 546245 958457 1384458 1790980 2149972 2440796 2650228 2771333
35366 2771333 2802748 2748955 2620695 2434015 2207133 1955639 1687864 1402681 1091073 740947
35356 740947 343046 -104267 -592294 -1101362 -1602243 -2059667 -2437105 -2701484 -2827405 -2801485
35346b801485J74790L02370L93604M42082M52339M37767M15336L99027L94647
35337F10477L98668M02019L96267L77919L48736L13276K75968K39209K02968J66001
35327C731508J27837R0004N5704K8603J1585N490Q137J4829K1036K5490L0963
35316D151186M2209O3167R5748J39984J94155K54285L13838L64598L98767M11593
35306F429530M03516L80771L53414L31033L18160L12405L06799K94580K72764
35297I402972K42109K04213J58467J01270K8039o3069j68232k77976l80252m63986
35287H783555n20668n44296n32080m86596m16944l36505k58326j91559j41179
35278E355402j09642r8018j05646j29439j64045k02808k38692k65260k78299k77863
$$ plain form
35346 -2801485 -2626695 -2324325 -1930721 -1488639 -1036300 -598533 -183197 215830 610477
35337 610477 1009145 1411164 1807431 2185350 2534086 2847362 3123330 3362539 3565507 3731508
35327 3731508 3859345 3949349 4005053 4033656 4045241 4050731 4058868 4073697 4094733 4120223 4151186
35316 4151186 4193395 4256562 4352310 4492294 4686449 4940734 5254572 5619170 6017937 6429530
35306 6429530 6833046 7213817 7567231 7898264 8216424 8528829 8835628 9130208 9402972
35297 9402972 9645081 9849294 10007761 10109031 10137070 10074001 9905769 9627793 9247541 8783555
35287 8783555 8262887 7718591 7186511 6699915 6282971 5946466 5688140 5496581 5355402
35278 5355402 5245760 5147742 5042096 4912657 4748612 4545804 4307112 4041852 3763553 3485690
35268C485690k68764k57755k48639k39184k22842j94371j55180j14424q5102p7582
35258A621847r4592j30338j73405k10832k31305k27453j97732j46837q3281j5281
35248A10791N1663J13872J67458K08143K32811K40220K29727K00055J50071Q0933
35238A785744k360r0829j72357k33663k63931k58887k22472j64473r6030k6282
35228B54460L8543R4902J41577J78413K03379K09763J86807J24853K1879j13275
35218A341301k63281m08302n31755o23272o78757o98748o86280o45056n78758
35209c772908m91686l89778k80348j69826o0763M9504J66757K94813M30098N59418
35199c664719O63077P22646P29626O90215O23083N50965M90725M47489M15544
$$ plain form
35268 3485690 3216926 2959171 2710532 2471348 2248506 2054135 1898955 1784531 1699429 1621847
35258 1621847 1527255 1396917 1223512 1012680 781375 553922 356190 209353 126072 110791
35248 110791 162454 276326 443784 651927 884738 1124958 1354685 1554740 1704811 1785744
35238 1785744 1783384 1692555 1520198 1286535 1022604 763717 541245 376772 280742 254460
35228 254460 293003 387905 529482 707895 911274 1121037 1307844 1432697 1454576 1341301
35218 1341301 1078020 669718 137963 -485309 -1164066 -1862814 -2549094 -3194150 -3772908
35209 -3772908 -4264594 -4654372 -4934720 -5104546 -5165309 -5115805 -4949048 -4654235 -4224137 -3664719
35199 -3664719 -3001642 -2278996 -1549370 -859155 -236072 314893 805618 1253107 1668651
35190A668651L84179L44424K93443K35411J78813J31322R5230O6755L9569Q967
35180C446764k7074o9829j21591j85128k61478l47636m35023n09841n56643n64648
35170C67873n33114m71621l94649l14431k36791j62239r0601k5607K4038M8062
35160a789080M0365L300n2340j11472j60318j90276j98351j84885j51033r8115
35150b892205k9091M9782J29252J99789K55083K93853L18593L32200L35197L25473
35140f82074L00036K56267J91558J02776j2006j49620k98525m38770n45619n95721
35130a871698n74584m83382l41458j81224l6336P0783J35236J67432J85435K06907
35120b722889K43774L00038L71772M48431N15332N57435N63789N30773M62481
$$ plain form
35190 1668651 2052830 2397254 2690697 2926108 3104921 3236243 3331473 3398228 3437797 3446764
35180 3446764 3419690 3349861 3228270 3043142 2781664 2434028 1999005 1489164 932521 367873
35170 367873 -165241 -636862 -1031511 -1345942 -1582733 -1744972 -1835573 -1861180 -1837142 -1789080
35160 -1789080 -1748715 -1745415 -1797755 -1909227 -2069545 -2259821 -2458172 -2643057 -2794090 -2892205
35150 -2892205 -2921296 -2871514 -2742262 -2542473 -2287390 -1993537 -1674944 -1342744 -1007547 -682074
35140 -682074 -382038 -125771 65787 168563 156557 6937 -291588 -730358 -1275977 -1871698
35130 -1871698 -2446282 -2929664 -3271122 -3452346 -3488682 -3417899 -3282663 -3115231 -2929796 -2722889
35120 -2722889 -2479115 -2179077 -1807305 -1358874 -843542 -286107 277682 808455 1270936
35111A270936L68555K61316J53242N4245l1568j07503j81581k59939l40863m14362
35101G72478m67961m94691m97753m88883m81576m83048m89530m87548m60922l99917
35091c979351l07405j98337r2980q338M7319P5075Q2770Q1763Q4088R9888J34897
35080c980611J88236K51359L09505L46237L49795L17946K58878J88063J22802
35071a647790P6094N1656M2593L5444J7727j5661o0616j06412j40227j51661j35954
35060b034807r4782l4187L8870J18830K01379K81372L50706L98270M13302L90762
35050B9715L34752K56820J70335Q5759J0102n0832r1235j07112r9613p6701n0983
35039D11007l4143l0962l6308l7004j7748L1323J08700K00586K86338L47360L73525
$$ plain form
35111 1270936 1639491 1900807 2054049 2108294 2076726 1969223 1787642 1527703 1186840 772478
35101 772478 304517 -190174 -687927 -1176810 -1658386 -2141434 -2630964 -3118512 -3579434 -3979351
35091 -3979351 -4286756 -4485093 -4578073 -4586411 -4539092 -4464017 -4381247 -4299484 -4215396 -4115508 -3980611
35080 -3980611 -3792375 -3541016 -3231511 -2885274 -2535479 -2217533 -1958655 -1770592 -1647790
35071 -1647790 -1571696 -1520040 -1477447 -1442003 -1424276 -1439937 -1500553 -1606965 -1747192 -1898853 -2034807
35060 -2034807 -2129589 -2163776 -2124906 -2006076 -1804697 -1523325 -1172619 -774349 -361047 29715
35050 29715 364467 621287 791622 877381 887483 836651 745416 638304 538691 461990 411007
35039 411007 376864 345902 309594 272590 254842 286165 394865 595451 881789 1229149 1602674
35028A602674L63242L19299K45900J49326L9758o9599j66412k43003k97061l29377
35018A614747l41355l34345l10537k73443k27135j75193j20573o6104j4353L3429
35008b14862P8323J23762J74100K31580K92779L47101L79767L78235L37596K61205
34998B389586J57594L7512q6728k01140k91616l47336l64062l45419l01773k47075
34988C99543j94353j51413j19040r3530p1906n5475m8498n3643o8967q9009j07524
34977f53815j17996j11643p6637j714J16988K70464M36679N86286O91267P32627
34967A872506P04463O14200M80113L27118J81172O2741j8661o6276r2500j11246
34957C953630j30603j50260j64764j69099j62196j47105j30096j20383j29212
$$ plain form
35028 1602674 1965916 2285215 2531115 2680441 2720199 2650600 2484188 2241185 1944124 1614747
35018 1614747 1273392 939047 628510 355067 127932 -47261 -167834 -233938 -248291 -214862
35008 -214862 -136539 -12777 161323 392903 685682 1032783 1412550 1790785 2128381 2389586
34998 2389586 2547180 2584692 2497964 2296824 2005208 1657872 1293810 948391 646618 399543
34988 399543 205190 53777 -65263 -158793 -230699 -286174 -334672 -388315 -457282 -546291 -653815
34977 -653815 -771811 -883454 -960091 -961805 -844817 -574353 -137674 448612 1139879 1872506
34967 1872506 2576969 3191169 3671282 3998400 4179572 4242313 4223652 4157376 4064876 3953630
34957 3953630 3823027 3672767 3508003 3338904 3176708 3029603 2899507 2779124 2649912
34948B649912j66177k33851l24482m21492n04551n55279n61660n20713m38779
34939a077072l28847k05855q2620L1573J30326K09571K68309L09648L40201L67133
34929c7633L94287M20164M39341M46480M39901M22475L99489L75047L49262L18092
34919C966905K75996K19279J47222O0565l9857j52059k70725l87260m92543n79520
34909B748003o43412o80846o90120o72139o30098n67513m86835l90102k80632
34900b293694j63700m5599O7906J72558K65870L47001M16283M73900N17783N42198
34890C00506N39189N03173M36178L49926K63123J95312J60476J63100J98276K55779
34880C365038L25809M02468M82268N58916O19377O45727O22354N43418M15280
$$ plain form
34948 2649912 2483735 2249884 1925402 1503910 999359 444080 -117580 -638293 -1077072
34939 -1077072 -1405919 -1611774 -1694394 -1662821 -1532495 -1322924 -1054615 -744967 -404766 -37633
34929 -37633 356654 776818 1216159 1662639 2102540 2525015 2924504 3299551 3648813 3966905
34919 3966905 4242901 4462180 4609402 4669967 4630110 4478051 4207326 3820066 3327523 2748003
34909 2748003 2104591 1423745 733625 61486 -568612 -1136125 -1622960 -2013062 -2293694
34900 -2293694 -2457394 -2502993 -2435087 -2262529 -1996659 -1649658 -1233375 -759475 -241692 300506
34890 300506 839695 1342868 1779046 2128972 2392095 2587407 2747883 2910983 3109259 3365038
34880 3365038 3690847 4093315 4575583 5134499 5753876 6399603 7021957 7565375 7980655
34871G980655K53135P5123j02191k65884m07017n20103o02408o53725o76692o76532
34861D404361o59172o28521n85324n28793m59471l80826k98645k19021j46638
34852D97950q4328l4120J109J7076R717k1756p2677j33439j92399k39081k66098
34841e18046k69416k47730k01831j34477n0855M0984J30762K07957K64029K93263
34831d85360K92422K60766K01311J21773L3214n3158j28573j87050k24590k39186
34821d08431k32075k08956j79270j52867j35283j24765j14050r6522p2439n0104
34811a774762m1063n3090q5913j31598j77864k11778k22633k04411j58047r2396
34801c153555k2143L7493P7032R6452J03901J09931J20502J33084J38466J27059
$$ plain form
34871 7980655 8233790 8308913 8206722 7940838 7533821 7013718 6411310 5757585 5080893 4404361
34861 4404361 3745189 3116668 2531344 2002551 1543080 1162254 863609 644588 497950
34852 497950 413622 379502 380611 397687 407404 385648 312971 179532 -12867 -251948 -518046
34841 -518046 -787462 -1035192 -1237023 -1371500 -1422355 -1381371 -1250609 -1042652 -778623 -485360
34831 -485360 -192938 67828 269139 390912 424126 370968 242395 55345 -169245 -408431
34821 -408431 -640506 -849462 -1028732 -1181599 -1316882 -1441647 -1555697 -1652219 -1724658 -1774762
34811 -1774762 -1815825 -1868915 -1954828 -2086426 -2264290 -2476068 -2698701 -2903112 -3061159 -3153555
34801 -3153555 -3175698 -3138205 -3061173 -2964721 -2860820 -2750889 -2630387 -2497303 -2358837 -2231778
34791b231778R5283M7686n854n5050r2919j17264j30417j37640j43992j50466
34781b922411j51966j39603j06977n6314O18M8542P7912R0876R9962J21085J65870
34770b772406K37404L30042M31712N27306O02410O46698O56024O32611N83605
34761A875406N18690M47167L74939L02608K26110J39953M1128o8916j85038l00459
34751C371588m08319n02335n77247o29163o55392o54070o24566n68756m91785
34742a740045m00815l02384k00410r6103J0667J19688K29113L34783M30441N08648
34732a106417N62051N84529N72005N22697M36952L17745J72768J6967j27903k38927
34722A712467l00551l10481k79303k25132j67204j21163r6262r4113j09113j30931
$$ plain form
34791 -2231778 -2136495 -2088809 -2094663 -2149713 -2242632 -2359896 -2490313 -2627953 -2771945 -2922411
34781 -2922411 -3074377 -3213980 -3320957 -3377271 -3376653 -3328111 -3250199 -3159323 -3059361 -2938276 -2772406
34770 -2772406 -2535002 -2204960 -1773248 -1245942 -643532 3166 659190 1291801 1875406
34761 1875406 2394096 2841263 3216202 3518810 3744920 3884873 3926001 3857085 3672047 3371588
34751 3371588 2963269 2460934 1883687 1254524 599132 -54938 -679504 -1248260 -1740045
34742 -1740045 -2140860 -2443244 -2643654 -2739757 -2729090 -2609402 -2380289 -2045506 -1615065 -1106417
34732 -1106417 -544366 40163 612168 1134865 1571817 1889562 2062330 2079297 1951394 1712467
34722 1712467 1411916 1101435 822132 597000 429796 308633 212371 118258 9145 -121786
34712a21786j48504j54217j46728j31012j15098j04756r9288r1404p1399l2760
34702a216952K4479R4107J66664K32734K85146L19751L35233L32602L14648K85271
34692A173683K48238K05710J57274J00217L1365m9813j38045k21210k83007l08255
34682I16157k87500k18519j05583M1136K05264L64937M96277N79343O04057N73473
34672C169042N02800M14369L30321K65565K23116J93421J58576J00945J2809r8153
34662E272811k11554l04414l62867l88132l92821l90447l85889l73594l43469
34653B119624k88796k10278j15305j5154P7392J49738J91208J94958J59591Q9812
34643B352790m265j09078k10313k95540l56475l90410m00161l91998l72461l45812
$$ plain form
34712 -121786 -270290 -424507 -571235 -702247 -817345 -922101 -1021389 -1112793 -1184192 -1216952
34702 -1216952 -1192473 -1098366 -931702 -698968 -413822 -94071 241162 573764 888412 1173683
34692 1173683 1421921 1627631 1784905 1885122 1916487 1866674 1728629 1507419 1224412 916157
34682 916157 628657 410138 304555 345691 550955 915892 1412169 1991512 2595569 3169042
34672 3169042 3671842 4086211 4416532 4682097 4905213 5098634 5257210 5358155 5370964 5272811
34662 5272811 5061257 4756843 4393976 4005844 3613023 3222576 2836687 2463093 2119624
34653 2119624 1830828 1620550 1505245 1490091 1567483 1717221 1908429 2103387 2262978 2352790
34643 2352790 2348525 2239447 2029134 1733594 1377119 986709 586548 194550 -177911 -523723
34633e23723l13401k74440k27112j69497j00793k2785N9232J36885K00347K40465
34623i94822K51083K31335J86852J28442O8380J6782j9397l5180k7006N647N8155
34612a29729J20858J81831K30271K58903K65617K54766K36976K25971K32698K59623
34602B137785K98700L34276L49481L33035K83888K12122J35961P5930M8069N8618
34592D267865J01956J62604K20543K57577K61822K29046J62006O9923l1838j23968
34582E577536j88519k15394k06160j72753j31638r6477p2902n7880m3412k1870
34572D370531R902M8855Q6181J10176J11645Q9729N4209K1953R534K6719P3900
34561E013334J43219K21574K94487L50574L85333M02142M09421M15779M26308
$$ plain form
34633 -523723 -837124 -1111564 -1338676 -1508173 -1608966 -1631751 -1572519 -1435634 -1235287 -994822
34623 -994822 -743739 -512404 -325552 -197110 -128730 -111948 -131345 -166525 -193531 -187884 -129729
34612 -129729 -8871 172960 403231 662134 927751 1182517 1419493 1645464 1878162 2137785
34602 2137785 2436485 2770761 3120242 3453277 3737165 3949287 4085248 4161178 4209247 4267865
34592 4267865 4369821 4532425 4752968 5010545 5272367 5501413 5663419 5733342 5701504 5577536
34582 5577536 5389017 5173623 4967463 4794710 4663072 4566595 4493693 4435813 4392401 4370531
34572 4370531 4380433 4429288 4515469 4625645 4737290 4827019 4881228 4903181 4912715 4939434 5013334
34561 5013334 5156553 5378127 5672614 6023188 6408521 6810663 7220084 7635863 8062171
34552H062171M41910M60820M80504M99056N15881N31664N47346N62584N74440
34543A2676376N77214N63973N29631M73916M01822L20831K37333J55086P5798
34534A6011980k97p4616j49357k24858k97373l60201m07553m38029m55106m65003
34524A3139587m73762m85138m99841n15602n26872n24088m94160m24224l08152
34515H887748j52358K3027J89448L20102M00716M35268M43147M49273M73272N23652
34505A1993295N98612O90787P91910Q94961R93361J079023J141941J172991J168740
34496B0525621J134731J084445J034328R98026R83007R90511J017137J055964
34488B8823770J096890J127621J136551J116575J067771R97788R20151Q51186
$$ plain form
34552 8062171 8504081 8964901 9445405 9944461 10460342 10992006 11539352 12101936 12676376
34543 12676376 13253590 13817563 14347194 14821110 15222932 15543763 15781096 15936182 16011980
34534 16011980 16011683 15937067 15787710 15562852 15265479 14905278 14497725 14059696 13604590 13139587
34524 13139587 12665825 12180687 11680846 11165244 10638372 10114284 9620124 9195900 8887748
34515 8887748 8735390 8758417 8947865 9267967 9668683 10103951 10547098 10996371 11469643 11993295
34505 11993295 12591907 13282694 14074604 14969565 15962926 17041949 18183890 19356881 20525621
34496 20525621 21660352 22744797 23779125 24777151 25760158 26750669 27767806 28823770
34488 28823770 29920660 31048281 32184832 33301407 34369178 35366966 36287117 37138303
34480C7138303Q05755P93060Q15053Q69075R53055J069137J223014J420314J663473
34471D6750239J951139K279341K642551L034020L446509L874400M316858M779866
34463G3074923N275227N816573O414614P074319P794840Q570763R392664J0246397
34455A33660320J1111812J1961822J2761818J3468388J4026416J4364399J4389396
34448B25744371J3985600J3022512J1378241Q977859N837336K095110j987670
34441B79053359o066851r785436j2849248j5080463j6433459j6975671j6848612
34434A85013619j6225799j5278559j4154050j2964988j1787914j0666594r618788
34427I4316927q646179p745684o917763o167769n501339m919065m414960l978389
$$ plain form
34480 37138303 37944058 38737118 39552171 40421246 41374301 42443438 43666452 45086766 46750239
34471 46750239 48701378 50980719 53623270 56657290 60103799 63978199 68295057 73074923
34463 73074923 78350150 84166723 90581337 97655656 105450496 114021259 123413923 133660320
34455 133660320 144772132 156733954 169495772 182964160 196990576 211354975 225744371
34448 225744371 239729971 252752483 264130724 273108583 278945919 281041029 279053359
34441 279053359 272986508 263201072 250351824 235271361 218837902 201862231 185013619
34434 185013619 168787820 153509261 139355211 126390223 114602309 103935715 94316927
34427 94316927 85670748 77925064 71007301 64839532 59338193 54419128 50004168 46025779
34419D6025779l596531l256005k944988k656706k392263k159525j967444j819049
34411B5233268j707813j619593j538373j451737j353012j240067j113356r75830
34403A4233487q34536p01130n88811n06796m56372m31409m22419m20991m22388
34394I448635m26011m33894m47529m64579m77948m78329m58367m15579l52792
34385E493607k76671j95429j16466m4766J7142O8075J07198J33895J47938J49111
34375E483634J36292J06943N7876j2311r9884j93446k74482l22124l20966k68369
34365D293163j77156p1395K2847Q6717J13159J06100P6757L9332O461j5174k6811
34354D454000l5296m8022o9194r9719j39015j85573k35538k81388l12913l20859
$$ plain form
34419 46025779 42429248 39173243 36228255 33571549 31179286 29019761 27052317 25233268
34411 25233268 23525455 21905862 20367489 18915752 17562740 16322673 15209317 14233487
34403 14233487 13398951 12697821 12109010 11602214 11145842 10714433 10292014 9871023 9448635
34394 9448635 9022624 8588730 8141201 7676622 7198674 6720345 6261978 5846399 5493607
34385 5493607 5216936 5021507 4905041 4860275 4877417 4945492 5052690 5186585 5334523 5483634
34375 5483634 5619926 5726869 5784745 5772434 5672550 5479104 5204622 4882498 4561532 4293163
34365 4293163 4116007 4044612 4067459 4154176 4267335 4373435 4450192 4489524 4495985 4480811 4454000
34354 4454000 4418704 4370682 4301488 4201769 4062754 3877181 3641643 3360255 3047342 2726483
34344B726483l01427k58899k04213j49609j02424o2270k3624J8127O1502R8068
34334A801714J16153J06708O8175Q295n7693j11921j40160j36698j05307n6102
34324A493164q32N0335Q9704J12240J16234J04089Q1945N7704L8136K6231K0070
34313B189020J4021J714k1056n5069r7871j44353j87613k20938k40602k47272
34303I89981k44024k32112k08313j66830j04568k5096O2406J48521K28540L02687
34293G51192L71613M31235M71479M80383M50993L86349K99172K06840J25534O7042
34283D041832L8316M1346P2217J20889J73462K16282K39396K37815K11085J62448
34273E555088R8269K7442l9926r5232j34686j60886j80450j98652k15194k24643
$$ plain form
34344 2726483 2425056 2166157 1961944 1812335 1709911 1647641 1624017 1642144 1703646 1801714
34334 1801714 1917867 2024575 2092750 2101045 2043352 1931431 1791271 1654573 1549266 1493164
34324 1493164 1492332 1542667 1632371 1744611 1860845 1964934 2046879 2104583 2142719 2168950 2189020
34313 2189020 2203041 2204755 2183699 2128630 2030759 1886406 1698793 1477855 1237253 989981
34303 989981 745957 513845 305532 138702 34134 9038 71444 219965 448505 751192
34293 751192 1122805 1554040 2025519 2505902 2956895 3343244 3642416 3849256 3974790 4041832
34283 4041832 4080148 4121494 4193711 4314600 4488062 4704344 4943740 5181555 5392640 5555088
34273 5555088 5653357 5680799 5640873 5545641 5410955 5250069 5069619 4870967 4655773 4431130
34263D431130k20672k00013j63062j12253n1226J3899P3198J14246J26512J06482
34253D118241O0078M87n7443j02883j31316j42911j39576j24031j01543q1654
34243C297449p6443r4972j37527j94439k51019k95302l23233l38573l49012l61862
34233H75067l81058m05871m31629m52627m65610m70940m70421m64081m49094m21348
34223c537612l77913l18894k48570j75623j11367o5578m1663l4348l1910k1796
34213d965274L796M5859J00547J62797K28633K95153L59166M15767M57751M76664
34203b419141M65967M24884L60122K83664K08275J43941R6982P0588O4855P6058
34193b23805R6658J17102J28903J27205J11523Q4548N0056J1573k7074n9741p7001
$$ plain form
34263 4431130 4210458 4010445 3847383 3735130 3683904 3697803 3771001 3885247 4011759 4118241
34253 4118241 4178319 4178806 4121363 4018480 3887164 3744253 3604677 3480646 3379103 3297449
34243 3297449 3221006 3126034 2988507 2794068 2543049 2247747 1924514 1585941 1236929 875067
34233 875067 494009 88138 -343491 -796118 -1261728 -1732668 -2203089 -2667170 -3116264 -3537612
34223 -3537612 -3915525 -4234419 -4482989 -4658612 -4769979 -4835557 -4877220 -4911568 -4943478 -4965274
34213 -4965274 -4961478 -4915619 -4815072 -4652275 -4423642 -4128489 -3769323 -3353556 -2895805 -2419141
34203 -2419141 -1953174 -1528290 -1168168 -884504 -676229 -532288 -435306 -364718 -299863 -223805
34193 -223805 -127147 -10045 118858 246063 357586 442134 492190 503763 476689 416948 339947
34182C39947o8769l0046L4446J10946J82550K35925K64657K68606K51380K18041
34172A807683J74043J25512P9859M4871K5629K1649K7512L7089M7640O0345P7555
34161B529387J00033J26250J53150J76856J92642J94814J77557J37214P5003j823
34151C861083q1970j54287k11107k48428k63813k55066k21778j68346j04773m3107
34141B108408Q580N0034Q7327J27300J72226K18328K58674K88117L06943L20553
34131C946490L35107L52417L68454L76782L73469L58799L34853L02040K57942
34122G006353J98839J22221K8918p5804j82466k79197l54872m02554m22005m19394
34112E220039m03412l79667l47766l03892k46349j78500j06537l5324L3193R8300
$$ plain form
34182 339947 271178 241132 275578 386524 569074 804999 1069656 1338262 1589642 1807683
34172 1807683 1981726 2107238 2187097 2231968 2257597 2279246 2306758 2343847 2391487 2451832 2529387
34161 2529387 2629420 2755670 2908820 3085676 3278318 3473132 3650689 3787903 3862906 3861083
34151 3861083 3779113 3624826 3413719 3165291 2901478 2646412 2424634 2256288 2151515 2108408
34141 2108408 2116988 2167022 2254349 2381649 2553875 2772203 3030877 3318994 3625937 3946490
34131 3946490 4281597 4634014 5002468 5379250 5752719 6111518 6446371 6748411 7006353
34122 7006353 7205192 7327413 7356331 7280527 7098061 6818864 6463992 6061438 5639433 5220039
34112 5220039 4816627 4436960 4089194 3785302 3538953 3360453 3253916 3218592 3251785 3350085
34102C350085J58662K12221K56936K90835L11885L18908L12990K97668K77570
34093E787760K57374K42549K40949K62880L18514M13830N47071P07277Q76029
34084I654233J032654J161219J255330J317279J351951J359910J334205J262393
34076A9729174J132208R38399O88223M02900J12942j51584l71198n41796o71824
34067B1267444p74785q62756r44271j025326j109880j197983j283131j351652
34059A2717660j385560j368509j293080j166062j007772q44115o95734n71423
34051D385405m69300l82704l05233k32777j64108j01531n0980k0553j7791m6913
34041B593515j06907j91102k88687l87723m77781n50467n98006o11939n84268
$$ plain form
34102 3350085 3508747 3720968 3977904 4268739 4580624 4899532 5212522 5510190 5787760
34093 5787760 6045134 6287683 6528632 6791512 7110026 7523856 8070927 8778204 9654233
34084 9654233 10686887 11848106 13103436 14420715 15772666 17132576 18466781 19729174
34076 19729174 20861382 21799781 22488004 22890904 23003846 22852262 22481064 21939268 21267444
34067 21267444 20492659 19629903 18685632 17660306 16550426 15352443 14069312 12717660
34059 12717660 11332100 9963591 8670511 7504449 6496677 5652562 4956828 4385405
34051 4385405 3916105 3533401 3228168 2995391 2831283 2729752 2678772 2658219 2640428 2593515
34041 2593515 2486608 2295506 2006819 1619096 1141315 590848 -7158 -619097 -1203365
34032a203365n11421l98673k61284j20334M656J01681J67789K07103K27898K39811
34022a546139K50940K65340K82426K98754L10778L16747L16941L12213L01698
34013A109698K81634K47029J95541J30310N9073r646p0134j20797j63268k00441
34003A458999k34530k66079k94334l18077l35625l44093l39479l18445k80381
33994a272044k27700j64165r3065j7130N9831J31264J88039K21140K25717K04013
33984g44100J65162J21957Q6930P0101P8485J15535J79206K59888L40863M02312
33974A076339M27175M06100L39830K38589J18694k607j12116k03651k78336l42439
33964A667578m02966m62003n12788n41258n33459m84563m03493l10260k27558
$$ plain form
34032 -1203365 -1714786 -2113459 -2374743 -2495077 -2490421 -2388740 -2220951 -2013848 -1785950 -1546139
34022 -1546139 -1295199 -1029859 -747433 -448679 -137901 178846 495787 808000 1109698
34013 1109698 1391332 1638361 1833902 1964212 2023285 2013639 1943505 1822708 1659440 1458999
34003 1458999 1224469 958390 664056 345979 10354 -333739 -673218 -991663 -1272044
33994 -1272044 -1499744 -1663909 -1756974 -1774104 -1714273 -1583009 -1394970 -1173830 -948113 -744100
33984 -744100 -578938 -456981 -370051 -299950 -221465 -105930 73276 333164 674027 1076339
33974 1076339 1503514 1909614 2249444 2488033 2606727 2604120 2492004 2288353 2010017 1667578
33964 1667578 1264612 802609 289821 -251437 -784896 -1269459 -1672952 -1983212 -2210770
33955b210770j70961j42413j30371j16730q6558l5169L0857R7789J50830J79366
33945b434130J80135J57773J22649Q6478N7492L7637K3259Q336j2386m2024q1384
33934a896165j28332j77030k18967k46711k58236k58487k56808k62286k80129
33925c983151l10677l49952l90061m19708m26818m03759l52059k82533k10241
33916g128959j48281j04136p8868o7547o0852m8843k5616Q659M9873R3898J38555
33905g372117J82688K24129K58446K79172K79381K54258K03622J32854N1447l0195
33895e536315j04038j66019k15068k50282k68638k65402k37155j84920j14733
33886g342570l4948M7897J31890K18972L10711M03518M87112N47833N74517N63205
$$ plain form
33955 -2210770 -2381731 -2524144 -2654515 -2771245 -2857803 -2892972 -2862115 -2764326 -2613496 -2434130
33945 -2434130 -2253995 -2096222 -1973573 -1887095 -1829603 -1791966 -1768707 -1760371 -1772757 -1814781 -1896165
33934 -1896165 -2024497 -2201527 -2420494 -2667205 -2925441 -3183928 -3440736 -3703022 -3983151
33925 -3983151 -4293828 -4643780 -5033841 -5453549 -5880367 -6284126 -6636185 -6918718 -7128959
33916 -7128959 -7277240 -7381376 -7460244 -7527791 -7588643 -7637486 -7663102 -7654443 -7604570 -7510672 -7372117
33905 -7372117 -7189429 -6965300 -6706854 -6427682 -6148301 -5894043 -5690421 -5557567 -5506120 -5536315
33895 -5536315 -5640353 -5806372 -6021440 -6271722 -6540360 -6805762 -7042917 -7227837 -7342570
33886 -7342570 -7377518 -7329621 -7197731 -6978759 -6668048 -6264530 -5777418 -5229585 -4655068 -4091863
33876d091863N18585M52520L80943L19888K81481K70823K84720L12734L40878
33867i29291L57415L58252L48260L37015L31901L33754L37370L34658L16958K76005
33857B402297K05480J04155k1364j57016k84915l87860m52393m70567m41613l73672
33847A22532k83833j94892j29190j01923j16685j64900k29075k88326l24197l25129
33837b035618k88926k22793j40783n9277P737N1634O9787O4476M0516K122m9222
33826b560347j13427j87078k59502l14293l36257l18762k66463j92353j11836
33817d660318l6989K6816Q0920J30452J80243K31566K80697L19654L39170L33295
33807b774494L03054K56721K06407J63531J35815J26612J35811J61218J99409
$$ plain form
33876 -4091863 -3573278 -3120758 -2739815 -2419927 -2138446 -1867623 -1582903 -1270169 -929291
33867 -929291 -571876 -213624 134636 471651 803552 1137306 1474676 1809334 2126292 2402297
33857 2402297 2607777 2711932 2690568 2533552 2248637 1860777 1408384 937817 496204 122532
33847 122532 -161301 -356193 -485383 -587306 -703991 -868891 -1097966 -1386292 -1710489 -2035618
33837 -2035618 -2324544 -2547337 -2688120 -2747397 -2739660 -2688026 -2618239 -2553763 -2513247 -2511125 -2560347
33826 -2560347 -2673774 -2860852 -3120354 -3434647 -3770904 -4089666 -4356129 -4548482 -4660318
33817 -4660318 -4697307 -4670491 -4589571 -4459119 -4278876 -4047310 -3766613 -3446959 -3107789 -2774494
33807 -2774494 -2471440 -2214719 -2008312 -1844781 -1708966 -1582354 -1446543 -1285325 -1085916
33798a085916K45527K92433L30751L50630L44382L08238K42601J51498M2237p4597
33788A147784j85690k77143l38015l63470l55208l18629k59013j79552q2702K6225
33778a185413J35652K27271K80334K79787K24176J28525K0020p1750j25919j38229
33768b25546j21889j00446r6286j21268j74112k43870l15426l73690m05926m02979
33758b581438l60200k78154j62958k5540J20617K62890L92437N05087N99740O75735
33748h51784P31223P63654P71689P56849P24232O82213O41124O10322N94456N91525
33738F015503N94737N96990N94732N89106N84783N87762O02944O32402O75414
33729A1474373P29889P93274Q61821R29633R89960J038360J074751J101812J120523
$$ plain form
33798 -1085916 -840389 -547956 -217205 133425 477807 786045 1028646 1180144 1222381 1147784
33788 1147784 962094 684951 346936 -16534 -371742 -690371 -949384 -1128936 -1211638 -1185413
33778 -1185413 -1049761 -822490 -542156 -262369 -38193 90332 110352 38602 -87317 -225546
33768 -225546 -347435 -447881 -544167 -665435 -839547 -1083417 -1398843 -1772533 -2178459 -2581438
33758 -2581438 -2941638 -3219792 -3382750 -3408290 -3287673 -3024783 -2632346 -2127259 -1527519 -851784
33748 -851784 -120561 643093 1414782 2171631 2895863 3578076 4219200 4829522 5423978 6015503
33738 6015503 6610240 7207230 7801962 8391068 8975851 9563613 10166557 10798959 11474373
33729 11474373 12204262 12997536 13859357 14788990 15778950 16817310 17892061 18993873 20114396
33720B0114396J126089J106931J047211R31300P48311M95551J80550j78734n56038
33711B5015567r21171j245324j505587j687911j788767j815522j784596j716818
33703A2549871j631309j540875j451365j364614j282008j205495j135676j069294
33695A869235r98715r13721q04452o64614m94813l04875j13161N8327J91254K76956
33685a898579L18019L25363L13307K95667K84044K86998L08604L47041L95366
33676I75830M44744M87694N18849N33683N27647M96857M39516L56866K53363J36036
33666E171085J3237j06433k14220l00985l58258l80863l69248l29868k73979k15828
33656B634640j69952j47123j50474j74823k10262k47706k82568l14420l43443
$$ plain form
33720 20114396 21240485 22347416 23394627 24325927 25074238 25569789 25750339 25571605 25015567
33711 25015567 24094396 22849072 21343485 19655574 17866807 16051285 14266689 12549871
33703 12549871 10918562 9377687 7926322 6561708 5279700 4074205 2938529 1869235
33695 1869235 870520 -43201 -847653 -1512267 -2007080 -2311955 -2425116 -2366789 -2175535 -1898579
33685 -1898579 -1580560 -1255197 -941890 -646223 -362179 -75181 233423 580464 975830
33676 975830 1420574 1908268 2427117 2960800 3488447 3985304 4424820 4781686 5035049 5171085
33666 5171085 5184322 5077889 4863669 4562684 4204426 3823563 3454315 3124447 2850468 2634640
33656 2634640 2464688 2317565 2167091 1992268 1782006 1534300 1251732 937312 593869
33647E93869l66685l77288l67808l35229k83616k22065j59536j00393m3620J4011
33637a648360P2885J27022J64814J74476J51195J01078L8961j8590o0007q0627
33627i77153p9699n6576j0473N6294J35561K14678K81163L26809L48660L47915
33617E87179L29221L00763K73310K56858K56424K70065K90710L10416L24149L31097
33607C530192L33272L32558L27846L14014K83369K28803J46706L8317r0502k30192
33597E214383l68506m91778n86888o43753o57367o28312n61491m64183l44849
33588D67256k13304q1462L6681J26854J77986J86011J55729R9340L2228l1679
33578I55640q3044j18128j38161j47478j51114j52879j54775j57490j61088j65561
$$ plain form
33647 593869 227184 -150104 -517912 -853141 -1136757 -1358822 -1518358 -1618751 -1662371 -1648360
33637 -1648360 -1575475 -1448453 -1283639 -1109163 -957968 -856890 -817929 -836519 -896526 -977153
33627 -977153 -1056852 -1113428 -1123901 -1067607 -932046 -717368 -436205 -109396 239264 587179
33617 587179 916400 1217163 1490473 1747331 2003755 2273820 2564530 2874946 3199095 3530192
33607 3530192 3863464 4196022 4523868 4837882 5121251 5350054 5496760 5535077 5444575 5214383
33597 5214383 4845877 4354099 3767211 3123458 2466091 1837779 1276288 812105 467256
33588 467256 253952 172490 209171 336025 514011 700022 855751 955091 987319 955640
33578 955640 872596 754468 616307 468829 317715 164836 10061 -147429 -308517 -474078
33568d74078j71480j80481j94499k13426k32536k42216k31093j91371j23426l7278
33558b291884M9955J19601J57797J60070J32370Q8464M5037J6390J0326K6352
33548a485522N6973R1557J21010J40783J50964J54078J52526J47529J39923J31227
33538a98952J22876J13357R6050O0759r40r0136j98330l09184m02785m60909m72317
33527a740511m36611l64710k75203j87967j17807p0708m3908k9133j7068j000
33517c284626K1284M7489P2535R1475J02055J05188J03255R8082R0178P9208O4719
33506b409158M6842K7086Q730m207r004n467M653J9094L5792N2980O9570Q5417
33494b077672R9947J09504J06526Q3063L6854k4761q6510j31440j47909j33644
$$ plain form
33568 -474078 -645558 -826039 -1020538 -1233964 -1466500 -1708716 -1939809 -2131180 -2254606 -2291884
33558 -2291884 -2241929 -2122328 -1964531 -1804461 -1672091 -1583627 -1538590 -1522200 -1511874 -1485522
33548 -1485522 -1428549 -1336992 -1215982 -1075199 -924235 -770157 -617631 -470102 -330179 -198952
33538 -198952 -76076 37281 133331 194090 193150 103014 -95316 -404500 -807285 -1268194 -1740511
33527 -1740511 -2177122 -2541832 -2817035 -3005002 -3122809 -3193517 -3237425 -3266558 -3283626 -3284626
33517 -3284626 -3263342 -3215853 -3143318 -3051843 -2949788 -2844600 -2741345 -2643263 -2553085 -2473877 -2409158
33506 -2409158 -2362316 -2335230 -2326500 -2330707 -2339711 -2345178 -2340525 -2321431 -2285639 -2232659 -2163089 -2077672
33494 -2077672 -1977725 -1868221 -1761695 -1678632 -1641778 -1666539 -1753049 -1884489 -2032398 -2166042
33484b166042r5147m3404J0979O0485J01005J31600J54435J73625J92479K11226
33474a268759K27455K38607K43495K41939K34091K21030K05516J91054J79355
33465G13783J68189J51447J21455P2097J330q7423j84701k75442l41527l67086
33455b7878l44630k78278j81944p3965K8289J11710J69085K00224K12261K17592
33445C2466K28955K53721K90798L31763L64692L78140L64112L20550K52992J73724
33435B991913R7365L4274j4560n7585j06818j69406k42600l16202l80120m30382
33425A405879m68990m99361n22561n37187n41726n36708n24728n08307m87225
33416c220914m57837m15263l56249k79686j85107p2378N5677J90218L16649M18423
$$ plain form
33484 -2166042 -2261189 -2304593 -2293614 -2233129 -2132124 -2000524 -1846089 -1672464 -1479985 -1268759
33474 -1268759 -1041304 -802697 -559202 -317263 -83172 137858 343374 534428 713783
33465 713783 881972 1033419 1154874 1226971 1228301 1140878 956177 680735 339208 -27878
33455 -27878 -372508 -650786 -832730 -906695 -878406 -766696 -597611 -397387 -185126 32466
33445 32466 261421 515142 805940 1137703 1502395 1880535 2244647 2565197 2818189 2991913
33435 2991913 3089278 3123552 3108992 3051407 2944589 2775183 2532583 2216381 1836261 1405879
33425 1405879 936889 437528 -85033 -622220 -1163946 -1700654 -2225382 -2733689 -3220914
33416 -3220914 -3678751 -4094014 -4450263 -4729949 -4915056 -4987434 -4931757 -4741539 -4424890 -4006467
33406d006467M81551M97467M64667L89858K87545J76326P2760j3418p9736j27788
33396a857235j59969j78401j85391j83631j75806j64524j52859j44563j43199
33387c345578j50491j65025j81976j93948j92623j70889j25203n7517K4553J10343
33377d448354J90450K59730L16744L60928L90650M04098M01626L87360L68700
33368a368068L53928L48859L54211L65148L73038L68027L41317K87295K05690
33359A629445J02726r930j18331k09982k76720l16053l30564l25656l06853k78209
33349d40127k42462k02216j61219j25073j00605r3249j03202j23105j40021j41649
33339a872928j22950q8372m8083j1684J5279L0386L2322K1916N770k331J4165
$$ plain form
33406 -4006467 -3524916 -3027449 -2562782 -2172924 -1885379 -1709053 -1636293 -1649711 -1729447 -1857235
33396 -1857235 -2017204 -2195605 -2380996 -2564627 -2740433 -2904957 -3057816 -3202379 -3345578
33387 -3345578 -3496069 -3661094 -3843070 -4037018 -4229641 -4400530 -4525733 -4583250 -4558697 -4448354
33377 -4448354 -4257904 -3998174 -3681430 -3320502 -2929852 -2525754 -2124128 -1736768 -1368068
33368 -1368068 -1014140 -665281 -311070 54078 427116 795143 1136460 1423755 1629445
33359 1629445 1732171 1722241 1603910 1393928 1117208 801155 470591 144935 -161918 -440127
33349 -440127 -682589 -884805 -1046024 -1171097 -1271702 -1364951 -1468153 -1591258 -1731279 -1872928
33339 -1872928 -1995878 -2084250 -2132333 -2144017 -2128738 -2098352 -2066030 -2044114 -2038344 -2040675 -2026510
33328b026510O6028J51171K53812L50694M20954M54026M51256M21275L73312L13157
33318A229175K43182J64975Q2514M292n7248q9775q6620n0323P640O9528J14798
33307A632138J24852Q9372J1500r2412j99210k87437l43137l61487l45719l04924
33297g6464k51374j97879j55800j33720j36184j62284k04698k50415k84019k93092
33287b145929k73395k30570j77066j26333q8050o6176n9350o2469o9277p5345
33277c373960p9872q4891r2525j02231j09357j05347p9685k3564O5893J83165
33267c802374L15243M45453N58200O42808O95230P16921P11263O79518O19017
33258A581279N25223L96531K38818O6727r9472k39976l41234l98525m14934l98663
$$ plain form
33328 -2026510 -1960482 -1809311 -1555499 -1204805 -783851 -329825 121431 542706 916018 1229175
33318 1229175 1472357 1637332 1719846 1724138 1666890 1577115 1490495 1440172 1447812 1517340 1632138
33307 1632138 1756990 1846362 1857862 1765450 1566240 1278803 935666 574179 228460 -76464
33297 -76464 -327838 -525717 -681517 -815237 -951421 -1113705 -1318403 -1568818 -1852837 -2145929
33287 -2145929 -2419324 -2649894 -2826960 -2953293 -3041343 -3107519 -3166869 -3229338 -3298615 -3373960
33277 -3373960 -3453832 -3538723 -3631248 -3733479 -3842836 -3948183 -4027868 -4051432 -3985539 -3802374
33267 -3802374 -3487131 -3041678 -2483478 -1840670 -1145440 -428519 282744 962262 1581279
33258 1581279 2106502 2503033 2741851 2808578 2709106 2469130 2127896 1729371 1314437 915774
33248I15774l60515l11585k60404k10008j57083r4899j9193O6556J50379K16713
33238f4265K53765K58180K34576J92389J43590J01557P8462Q0705J05780J43724
33228A528463J81907K09374K18737K06325J71605J16154M3131m1565j27246j98459
33218B308426k38914k37620j93462j15476j8530Q3289J81611K73612L57388M27522
33208B827846M75331M93278M79229M37180L74715K99634K17944J33990N2330k0485
33198E770992p6144j07033j09261q4452l9922J2471N8936Q7513R1328O9088K2813
33187E696329m4586j29353k25108l22287m10313m80671n27751n47043n33466m82594
33177A993157l94533k77633j49113l1367N4805R6709R2294M7801k6525j18698
$$ plain form
33248 915774 555259 243674 -16730 -226738 -383821 -478720 -497913 -431357 -280978 -64265
33238 -64265 189500 447680 682256 874645 1018235 1119792 1198254 1278959 1384739 1528463
33228 1528463 1710370 1919744 2138481 2344806 2516411 2632565 2675696 2634131 2506885 2308426
33218 2308426 2069512 1831892 1638430 1522954 1504424 1587713 1769324 2042936 2400324 2827846
33208 2827846 3303177 3796455 4275684 4712864 5087579 5387213 5605157 5739147 5791477 5770992
33198 5770992 5694848 5587815 5478554 5394102 5354180 5366651 5425587 5513100 5604428 5673516 5696329
33187 5696329 5651743 5522390 5297282 4974995 4564682 4084011 3556260 3009217 2475751 1993157
33177 1993157 1598624 1320991 1171878 1140511 1195316 1292025 1384319 1432120 1405595 1286897
33167A286897k14555k97568l51598l65819l38792k79319k03870j31552p8176n1473
33157a025825m9397o2241p7754q7065q8747q8914r7074j20250j58762k05670k49306
33146b311005k77218k80231k55523k07149j43076p0061J0292J01203K06080L22671
33136b904017M39987N40335O05408O22856N89684N11626M00683K73321J49517
33127A229400N0600n178p954M0427J26903K31114L30880M07173M47314M46533
33117C297212M08350L43900K69439K02134J55393J35496J40203J59431J78316
33108E289874J82803J65933J31264R0746N7807L9659L3299K7508R825k5197p1245
33097E932276j11998j28937j10805n9082J3538Q9840J54547J96550K07836J83082
$$ plain form
33167 1286897 1072342 774774 423176 57357 -281435 -560754 -764624 -896176 -974352 -1025825
33157 -1025825 -1075222 -1137463 -1215217 -1302282 -1391029 -1479943 -1577017 -1697267 -1856029 -2061699 -2311005
33146 -2311005 -2588223 -2868454 -3123977 -3331126 -3474202 -3544263 -3533971 -3432768 -3226688 -2904017
33136 -2904017 -2464030 -1923695 -1318287 -695431 -105747 405879 806562 1079883 1229400
33127 1229400 1280000 1274822 1266868 1307295 1434198 1665312 1996192 2403365 2850679 3297212
33117 3297212 3705562 4049462 4318901 4521035 4676428 4811924 4952127 5111558 5289874
33108 5289874 5472677 5638610 5769874 5860620 5918427 5958086 5991385 6018893 6028718 6003521 5932276
33097 5932276 5820278 5691341 5580536 5521454 5534992 5624832 5779379 5975929 6183765 6366847
33087F366847J21956L1864p2521j73542k55831l09793l32626l27666l02433k65633
33077D480622k24240j82168j41023j01758o5930l6231j6381j0147j9252m1270
33067C642222o9593r6119j14895j23871j23979j16876j03272q2731n4843k1250
33057B734793J2867L9420N0496M1638J2606l4448r6846j70799k49159l20123l68859
33046A651586l81594l50241k75813j69057m7813O8295J63414K28917K63746K72307
33036A423747K61128K35743J99451J54785J06454O2733L3577K6692M4655Q4550
33026B633515J39581K01126K60595L10811L46793L66003L68540L57436L38659
33017E323059L20442L11911L20828L50461L96475M45818M79058M75958M22254
$$ plain form
33087 6366847 6488803 6520667 6448146 6274604 6018773 5708980 5376354 5048688 4746255 4480622
33077 4480622 4256382 4074214 3933191 3831433 3765503 3729272 3712891 3702744 3683492 3642222
33067 3642222 3572629 3476510 3361615 3237744 3113765 2996889 2893617 2810886 2756043 2734793
33057 2734793 2747660 2787080 2837576 2879214 2891820 2857372 2760526 2589727 2340568 2020445 1651586
33046 1651586 1269992 919751 643938 474881 427068 495363 658777 887694 1151440 1423747
33036 1423747 1684875 1920618 2120069 2274854 2381308 2444041 2477618 2504310 2548965 2633515
33026 2633515 2773096 2974222 3234817 3545628 3892421 4258424 4626964 4984400 5323059
33017 5323059 5643501 5955412 6276240 6626701 7023176 7468994 7948052 8424010 8846264
33008H846264L15315J66216l141j67189l04755m04070m63201m87629m87412m74722
32998F535676m61041m53773m53934m56876m55825m45377m22173l82967l23139
32989B680571k37864j25325J0260J57286K97815M11456M81510N00319M70047L98431
32979E044506K93433J61482J0188j47740k93708m07272m73048m86283m53570l88948
32969B859040l08832k29084j64072j25243j18231j40802j84222k37683k92544
32960A058327l43802l88851m25349m49392m54781m34134l82258l00017j95402
32951b315659q0554L2786J35608K20887K82369L14949L16255K87518K33464J61898
32941d10479Q3228R391m7857p8858p7964m5793Q779O8896J13749J25669R7179
$$ plain form
33008 8846264 9161579 9327795 9324654 9157465 8852710 8448640 7985439 7497810 7010398 6535676
32998 6535676 6074635 5620862 5166928 4710052 4254227 3808850 3386677 3003710 2680571
32989 2680571 2442707 2317382 2327642 2484928 2782743 3194199 3675709 4176028 4646075 5044506
32979 5044506 5337939 5499421 5509609 5361869 5068161 4660889 4187841 3701558 3247988 2859040
32969 2859040 2550208 2321124 2157052 2031809 1913578 1772776 1588554 1350871 1058327
32960 1058327 714525 325674 -99675 -549067 -1003848 -1437982 -1820240 -2120257 -2315659
32951 -2315659 -2396213 -2363427 -2227819 -2006932 -1724563 -1409614 -1093359 -805841 -572377 -410479
32941 -410479 -327251 -317860 -365717 -444575 -522539 -568332 -559553 -490657 -376908 -251239 -154060
32930a54060L4228m6551j25644j89426k34707k66751k92992l17430l39549l57337
32920b290219l71045l84184m00916m21787m40918m46576m24884l65005k63668
32911e809202j27556K7509J80559L11389M05983M59310M74711M61000M29329L91316
32901b795652L58359L40566L44273L68962M06235M42427M63884M61970M35513
32892H26537L90126L35572K82570K40407K15676K11484K26240K52530K77883K88194
32882C547219K72285K25077J48357M9923n8161j62223k50368l15211l54252l67959
32872B734687l57364l23200k66947j92405j06459j8706N9473J16564J43995J40123
32862A929761J12355P4622M1002J9831J2007J3135J6467J4816K056k5161o6320
$$ plain form
32930 -154060 -119832 -166383 -292027 -481453 -716160 -982911 -1275903 -1593333 -1932882 -2290219
32920 -2290219 -2661264 -3045448 -3446364 -3868151 -4309069 -4755645 -5180529 -5545534 -5809202
32911 -5809202 -5936758 -5909249 -5728690 -5417301 -5011318 -4552008 -4077297 -3616297 -3186968 -2795652
32901 -2795652 -2437293 -2096727 -1752454 -1383492 -977257 -534830 -70946 391024 826537
32892 826537 1216663 1552235 1834805 2075212 2290888 2502372 2728612 2981142 3259025 3547219
32882 3547219 3819504 4044581 4192938 4242861 4184700 4022477 3772109 3456898 3102646 2734687
32872 2734687 2377323 2054123 1787176 1594771 1488312 1469606 1529079 1645643 1789638 1929761
32862 1929761 2042116 2116738 2157740 2177571 2189578 2202713 2219180 2233996 2236052 2210891 2144571
32851B144571j17771j74578k31634k83252l22701l43485l42258l21169k87510
32842b79787k50789k18992j96072j81199j69677j55033j31911r8724n8535j7056
32832a757775K1653N9023J02019J58135K28220L02268L61493L85390L59372K79363
32822D99161J52454n043j70678l19401m27684m78457m65918l97636k91670j69382
32812b074254m8010O2810J59668K41845L08891L60370L96653M19105M29425M29163
32802F85666M20387M06917L94168L86588L84701L85141L84736L85023L92263M12175
32792D637765M44114M80321N10626N27740N28523N11681M76103M22305L55177
32783H894355K84555K22378J78344J56449J53692J60836J65156J54460J20888
$$ plain form
32851 2144571 2026800 1852222 1620588 1337336 1014635 671150 328892 7723 -279787
32842 -279787 -530576 -749568 -945640 -1126839 -1296516 -1451549 -1583460 -1682184 -1740719 -1757775
32832 -1757775 -1736122 -1677099 -1575080 -1416945 -1188725 -886457 -524964 -139574 219798 499161
32822 499161 651615 646572 475894 156493 -271191 -749648 -1215566 -1613202 -1904872 -2074254
32812 -2074254 -2122264 -2059454 -1899786 -1657941 -1349050 -988680 -592027 -172922 256503 685666
32802 685666 1106053 1512970 1907138 2293726 2678427 3063568 3448304 3833327 4225590 4637765
32792 4637765 5081879 5562200 6072826 6600566 7129089 7640770 8116873 8539178 8894355
32783 8894355 9178910 9401288 9579632 9736081 9889773 10050609 10215765 10370225 10491113
32774A0491113O2705j6344j08898k05387k94540l63951m01877m00407l58624k83773
32764H120017j89369r1238l781O1905R8373J02198P4683K1679m8708j29497k16747
32753G799515l08393m01246m89051n63450o17143o47265o57208o55980o55023
32744B804756o63436o83970p12112p38709p53987p50540p24431o74880o03186
32735c500495n11412m01757k77407j44217j1451J09518K07915K76415L13190L22517
32725c617184L13339K96008K78471K63395K47219K21559J77214J09555K2630p0449
32715a758243j51028k00587k06738j67927r4894p223P4086J34119J67398J75794
32705b035243J63603J33893Q8734L2456k5635p2061r3403q1185l5210L5383J13368
$$ plain form
32774 10491113 10553818 10537474 10428576 10223189 9928649 9564698 9162821 8762414 8403790 8120017
32764 8120017 7930648 7839410 7835629 7897534 7995907 8098105 8172788 8194467 8145759 8016262 7799515
32753 7799515 7491122 7089876 6600825 6037375 5420232 4772967 4115759 3459779 2804756
32744 2804756 2141320 1457350 745238 6529 -747458 -1497998 -2222429 -2897309 -3500495
32735 -3500495 -4011907 -4413664 -4691071 -4835288 -4846739 -4737221 -4529306 -4252891 -3939701 -3617184
32725 -3617184 -3303845 -3007837 -2729366 -2465971 -2218752 -1997193 -1819979 -1710424 -1687794 -1758243
32715 -1758243 -1909271 -2109858 -2316596 -2484523 -2579417 -2586640 -2512554 -2378435 -2211037 -2035243
32705 -2035243 -1871640 -1737747 -1649013 -1616557 -1642192 -1714253 -1807656 -1888841 -1924051 -1888668 -1775300
32694a775300J77380K07868J92705J29948K7683r7639k23431l24465l78072l69862
32684b433185k97642j71686j1252J61070L24671M64164N70477O40821O78154O89506
32674F15098O83004O64556O36374N98153N49731M92801M30506L66002L01924K41157
32664E579306J87446J44252J12416Q8718O6787L9804L256m3519r7239j51712j99662
32653E729853k34829k53581k55412k42564k19558j92825j69561j55209j50528
32644C855786j50554j47015j33240j08786q0845o1102n9347p7611j08906j41569
32634B786811j65973j78714j82158j81238j80686j84082j93682k09663k28875
32625A081740k44634k48519k33404j95677j35636n6797L4584J30076K20443K97670
$$ plain form
32694 -1775300 -1597920 -1390052 -1197347 -1067399 -1039716 -1137355 -1360786 -1685251 -2063323 -2433185
32684 -2433185 -2730827 -2902513 -2913765 -2752695 -2428024 -1963860 -1393383 -752562 -74408 615098
32674 615098 1298102 1962658 2599032 3197185 3746916 4239717 4670223 5036225 5338149 5579306
32664 5579306 5766752 5911004 6023420 6112138 6178925 6218729 6221985 6178466 6081227 5929515 5729853
32653 5729853 5495024 5241443 4986031 4743467 4523909 4331084 4161523 4006314 3855786
32644 3855786 3705232 3558217 3424977 3316191 3235346 3174244 3114897 3037286 2928380 2786811
32634 2786811 2620838 2442124 2259966 2078728 1898042 1713960 1520278 1310615 1081740
32625 1081740 837106 588587 355183 159506 23870 -32927 1657 131733 352176 649846
32615F49846L55876L90480L96847L70528L09613K17838J06242q231j07585j79259
32605B502195k20814k39781k48543k57209k68378k76370k70883k42943j89662
32596B87612j15196k7785O4576J56749K45823L28267L97374M43190M55300M26820
32586B662730L57107K52105J22979j5438j45816k49772l10675l17826k70612j80282
32576A904500o7708M2340J28145J76608J85692J62958J20879P1544K4187j3428
32566B735717l2853k6153R492O7862J34263J90275K19692K13710J74283J14006
32556C800294N1036P38l0596m5829n1763n3389n1606m4636l0991j1616J0017K9949
32544C571608M6441O0983P5990R0163R5357P8486K8399n6856j67729k87300l98203
$$ plain form
32615 649846 1005722 1396202 1793049 2163577 2473190 2691028 2797270 2789039 2681454 2502195
32605 2502195 2281381 2041600 1793057 1535848 1267470 991100 720217 477274 287612
32596 287612 172416 144631 209207 365956 611779 940046 1337420 1780610 2235910 2662730
32586 2662730 3019837 3271942 3394921 3379483 3233667 2983895 2673220 2355394 2084782 1904500
32576 1904500 1836792 1879132 2007277 2183885 2369577 2532535 2653414 2724958 2749145 2735717
32566 2735717 2702864 2676711 2686203 2754065 2888328 3078603 3298295 3512005 3686288 3800294
32556 3800294 3851330 3852068 3821472 3775643 3723880 3670491 3618885 3574249 3543258 3531642 3541659 3571608
32544 3571608 3618049 3679032 3755022 3845185 3940542 4019028 4047427 3990571 3822842 3535542 3137339
32533C137339m87276n45729n66884n45172m78357l71498k38933j01601J9192J07449
32523g1470J54541J58224J21369N1719l8649j35265k23934k92580l32573l40749
32513i49367l22046k89979k62546k54548k70844l04743l41960l67061l68898l43540
32503d075532k94555k30861j62484r5983l2100L2805J02378J75712K45425K99702
32493d035493L27156L21853K85963K29534J68114J18867R5380J02680J35218J79759
32483b070969K21464K49417K59023K51508K31910K06162J77904J46666J09215
32474b17700O3491J2087l7524p6003r6015r4766p4602m2222o897K2108L8473M0872
32462d68698L3092K2181J5795K0112L8679P1764J16153J65827K13525K51949K73974
$$ plain form
32533 3137339 2650063 2104334 1537450 992278 513921 142423 -96510 -198111 -178919 -71470
32523 -71470 83071 241295 362664 414383 375734 240469 16535 -276045 -608618 -949367
32513 -949367 -1271413 -1561392 -1823938 -2078486 -2349330 -2654073 -2996033 -3363094 -3731992 -4075532
32503 -4075532 -4370087 -4600948 -4763432 -4859415 -4891515 -4858710 -4756332 -4580620 -4335195 -4035493
32493 -4035493 -3708337 -3386484 -3100521 -2870987 -2702873 -2584006 -2488626 -2385946 -2250728 -2070969
32483 -2070969 -1849505 -1600088 -1341065 -1089557 -857647 -651485 -473581 -326915 -217700
32474 -217700 -154209 -142122 -179646 -255649 -351664 -446430 -521032 -563254 -570151 -548043 -509570 -468698
32462 -468698 -435606 -413425 -397630 -377518 -338839 -267075 -150922 14905 228430 480379 754353
32451G54353K72735K43082J83955R9815K79j01107j88457k46882k67818k53534
32441D96421k16726j74692j41820j25009j23280j30239j37243j36055j20655q8520
32431h97818m1323J5427P4052J26717J66254J85936J80141J47076R1714K5790
32421G3966l6332q3538j11795j23805j25398j21366j13035r8183p2685l3184K0138
32410h25217Q2022J42969J92128K20564K23672K02609J64503J20801Q3514O0864
32400F68429N4450N9072O5483O5473N7107M6622M4776O0018R3647J40038J90605
32389A545720K37853K77580L09266L34831L55862L70245L70672L47136K92868
32380D442033K10215J12137J7389n8459j11158j50081j93134k56987l48137m59222
$$ plain form
32451 754353 1027088 1270170 1454125 1553940 1554219 1453112 1264655 1017773 749955 496421
32441 496421 279695 105003 -36817 -161826 -285106 -415345 -552588 -688643 -809298 -897818
32431 -897818 -939141 -923714 -849662 -722945 -556691 -370755 -190614 -43538 48176 73966
32421 73966 37634 -45904 -157699 -281504 -406902 -528268 -641303 -739486 -812171 -845355 -825217
32410 -825217 -743195 -600226 -408098 -187534 36138 238747 403250 524051 607565 668429
32400 668429 722879 781951 847434 912907 970014 1016636 1061412 1121430 1215077 1355115 1545720
32389 1545720 1783573 2061153 2370419 2705250 3061112 3431357 3802029 4149165 4442033
32380 4442033 4652248 4764385 4781774 4723315 4612157 4462076 4268942 4011955 3663818 3204596
32370C204596n71410o60537p04025o87209o08196m79755l26507j77812n9157J4497
32360a055515M1229L0611r52l6504o4725q3933j01736j29630j74776k33978k94105
32349b104014l39012l58217l51641l28071k99312k74188k55472k40324k22877
32340d773128j97548j61907j18336p3552l5907j1749k721n310j2682j7853j6608
32329e427301q626L600J6906K9437M1961N8391Q4416J23834J74751K29368K78368
32318d394895L16571L45109L68737L90929M10823M24306M28624M27042M29533
32309h53221M47906M88103N44767O01694O37953O36073N88001M96416L72067K30135
32299D189894Q7684l8223j33403j90266k10117k01954j78323j50904j28273j15949
$$ plain form
32370 3204596 2633186 1972649 1268624 581415 -26781 -506536 -833043 -1010855 -1070012 -1055515
32360 -1055515 -1014286 -983675 -984627 -1021131 -1085856 -1169789 -1271525 -1401155 -1575931 -1809909 -2104014
32349 -2104014 -2443026 -2801243 -3152884 -3480955 -3780267 -4054455 -4309927 -4550251 -4773128
32340 -4773128 -4970676 -5132583 -5250919 -5324471 -5360378 -5372127 -5374848 -5380158 -5392840 -5410693 -5427301
32329 -5427301 -5435927 -5432327 -5415421 -5385984 -5344023 -5285632 -5201216 -5077382 -4902631 -4673263 -4394895
32318 -4394895 -4078324 -3733215 -3364478 -2973549 -2562726 -2138420 -1709796 -1282754 -853221
32309 -853221 -405315 82788 627555 1229249 1867202 2503275 3091276 3587692 3959759 4189894
32299 4189894 4277578 4239355 4105952 3915686 3705569 3503615 3325292 3174388 3046115 2930166
32289B930166j16822j30202j50105j65427j64014j39178r4591m3991n444O606
32279A926998j2951n9184j20647j83989k36961k69693k75365k50948j97951j23409
32269A95900m0763L1337P4497P8674M7451l947n6696r6725j18891j26506j28451
32258a44120j35549j56850j96290k50508l08616l54380l70960l47391k84285j95143
32248b744092j01244k2536K9959N5981O2813O0819O0039O7354Q3965J05102J23412
32237b218428J34024J37280J37626J40883J52310J75619K11773K57661L05853
32228e65399L46089L68220L65685L38241K92333K38285J85887J41359J07329Q4668
32218A902697P3668P3814Q3300R9634J20910J46144J74208K02516K26848K42138
$$ plain form
32289 2930166 2813344 2683142 2533037 2367610 2203596 2064418 1969827 1925836 1920392 1926998
32279 1926998 1914047 1854863 1734216 1550227 1313266 1043573 768208 517260 319309 195900
32269 195900 155137 186474 260971 339645 387096 383149 326453 229728 110837 -15669 -144120
32258 -144120 -279669 -436519 -632809 -883317 -1191933 -1546313 -1917273 -2264664 -2548949 -2744092
32248 -2744092 -2845336 -2867872 -2837913 -2781932 -2719119 -2658300 -2598261 -2530907 -2446942 -2341840 -2218428
32237 -2218428 -2084404 -1947124 -1809498 -1668615 -1516305 -1340686 -1128913 -871252 -565399
32228 -565399 -219310 148910 514595 852836 1145169 1383454 1569341 1710700 1818029 1902697
32218 1902697 1976365 2050179 2133479 2233113 2354023 2500167 2674375 2876891 3103739 3345877
32208C345877K43101K24387J81348J12053J9405q8619k01493l09845m07995m93988
32198B624231n67928o30701o84127p31151p74187q11692q35937q34584p95486
32189d041562p11795n84989m25092k48332p3037Q4587K12976L05889L62479L87302
32179d731574L89065L77437L59268L36407L06135K63759K06436J36748O3961J964
32169b290394l4997l6609J65O9130J55270K38490K99743L26794L17832K82570
32159f72006K40087K12456K15659K52713L13317L79745M34363M64552M63651M29284
32149B733821L61664K63936J44286J6930j00589j93078k52721k80465k83747k72543
32139B137494k55966k40568k30550k28779k37216k56306k83867l14326l38843
$$ plain form
32208 3345877 3588978 3813365 3994713 4106766 4126171 4037552 3836059 3526214 3118219 2624231
32198 2624231 2056303 1425602 741475 10324 -763863 -1575555 -2411492 -3246076 -4041562
32189 -4041562 -4753357 -5338346 -5763438 -6011770 -6084807 -6000220 -5787244 -5481355 -5118876 -4731574
32179 -4731574 -4342509 -3965072 -3605804 -3269397 -2963262 -2699503 -2493067 -2356319 -2292358 -2290394
32169 -2290394 -2325391 -2362000 -2361835 -2292705 -2137435 -1898945 -1599202 -1272408 -954576 -672006
32159 -672006 -431919 -219463 -3804 248909 562226 941971 1376334 1840886 2304537 2733821
32149 2733821 3095485 3359421 3503707 3520637 3420048 3226970 2974249 2693784 2410037 2137494
32139 2137494 1881528 1640960 1410410 1181631 944415 688109 404242 89916 -248927
32130b48927l47142l31071k88272k23355j45646o5278R770P4345J24916J57666
32120a282994J67606J50193J04968L8321l7277j07308j59616j86761j86303j60206
32110a659377j14057n6209L384N4884R0718J07257J04916Q6636N6249J8112k2240
32099a329727n8252q4352r8838j05187j10112j19478j34987j53918j71472j83348
32089b549671j86677j79421j59784j26799q2057l0983J8105N7446Q3648R8608
32079c057585J06594J10100J08249R8864Q1521N8107L0562j217l8318p9142j16702
32068b698967j39952j38553j07871n1429K0006R1989J51503J91587K12863K20741
32058b248083K20247K12454J95002J65713J25922Q1031L7983J492k8425n5878
$$ plain form
32130 -248927 -596069 -927140 -1215412 -1438767 -1584413 -1649691 -1639921 -1565576 -1440660 -1282994
32120 -1282994 -1115388 -965195 -860227 -821906 -859183 -966491 -1126107 -1312868 -1499171 -1659377
32110 -1659377 -1773434 -1829643 -1826259 -1771375 -1680657 -1573400 -1468484 -1381848 -1325599 -1307487 -1329727
32099 -1329727 -1387979 -1472331 -1571169 -1676356 -1786468 -1905946 -2040933 -2194851 -2366323 -2549671
32089 -2549671 -2736348 -2915769 -3075553 -3202352 -3284409 -3315392 -3297287 -3239841 -3156193 -3057585
32079 -3057585 -2950991 -2840891 -2732642 -2633778 -2552257 -2494150 -2463588 -2464805 -2503123 -2582265 -2698967
32068 -2698967 -2838919 -2977472 -3085343 -3136772 -3116766 -3024777 -2873274 -2681687 -2468824 -2248083
32058 -2248083 -2027836 -1815382 -1620380 -1454667 -1328745 -1247714 -1209731 -1208239 -1236664 -1292542
32048a292542q5603j18877j51727j76414j84552j69454j26956n5998M0176J52820
32038b169127K68004L69010M40164M70986M59386M12152L41794K61217J79641
32029A033227J02106L1695k8334p4574j05342j22528j31315j37154j42171j44269
32019B81341j40164j29681j17482j11335j19004j45871j93374k58337l33709m10663
32009a678279m80132n32561n57194n43597m85955l87890k64624j40311m0481J7623
31999e093401L1452J1892k4896o6567j08475j51143j94892k36303k68481k84159
31989f384973k78992k53045k10312j57397j02484n4433k1271p484j0818k0507
31979g501716j9210J0679P8948J82362L05619M27961N31421O06235O50789O67207
$$ plain form
32048 -1292542 -1378145 -1497022 -1648749 -1825163 -2009715 -2179169 -2306125 -2362123 -2321947 -2169127
32038 -2169127 -1901123 -1532113 -1091949 -620963 -161577 250575 592369 853586 1033227
32029 1033227 1135333 1167028 1138694 1064120 958778 836250 704935 567781 425610 281341
32019 281341 141177 11496 -105986 -217321 -336325 -482196 -675570 -933907 -1267616 -1678279
32009 -1678279 -2158411 -2690972 -3248166 -3791763 -4277718 -4665608 -4930232 -5070543 -5111024 -5093401
31999 -5093401 -5061949 -5050057 -5074953 -5141520 -5249995 -5401138 -5596030 -5832333 -6100814 -6384973
31989 -6384973 -6663965 -6917010 -7127322 -7284719 -7387203 -7441636 -7462907 -7470391 -7481209 -7501716
31979 -7501716 -7520926 -7510247 -7431299 -7248937 -6943318 -6515357 -5983936 -5377701 -4726912 -4059705
31969d059705O56533O17479N49236M55033L43093K24724J11737J4626n8628j03540
31959a249412j19685j10846q5141n4525l2114k7150m0386o3703q4929r4746r1150
31948b053787p8960o5385n5033m7669l9871k8908j5580l988J276j957j2205k4866
31936b426933l3740l2938j8866Q549M6211Q9214J31966J68831J95458K11190K20353
31925a440705K30162K45921K67404K89252L04702L09581L03918K90497K71631
31916A072363K47212K16474J82311J52907J37050J36180J41326J39362J23693
31907B548878R9889Q1623Q1209J02544J40194J82700K16721K30917K19679J85513
31897D089867J37997Q9341M9611K4618J6254K3217M1196O3586Q3290R4413R2779
$$ plain form
31969 -4059705 -3403172 -2785693 -2236457 -1781424 -1438331 -1213607 -1101870 -1087244 -1145872 -1249412
31959 -1249412 -1369097 -1479943 -1565084 -1619609 -1651723 -1678873 -1719259 -1782962 -1867891 -1962637 -2053787
31948 -2053787 -2132747 -2198132 -2253165 -2300834 -2340705 -2369613 -2385193 -2389181 -2387905 -2389862 -2402067 -2426933
31936 -2426933 -2460673 -2493611 -2512477 -2503928 -2457717 -2368503 -2236537 -2067706 -1872248 -1661058 -1440705
31925 -1440705 -1210543 -964622 -697218 -407966 -103264 206317 510235 800732 1072363
31916 1072363 1319575 1536049 1718360 1871267 2008317 2144497 2285823 2425185 2548878
31907 2548878 2648767 2730390 2811599 2914143 3054337 3237037 3453758 3684675 3904354 4089867
31897 4089867 4227864 4317205 4366816 4391434 4407688 4430905 4472101 4535687 4618977 4713390 4806169
31886D806169P5910M3467k327n7605j18735j83270k48994l12632l69863m16412
31876C215708m48665m63232m56636m26384l73299l03392k27348j56935j00215
31867B59602n8554k7334J000L3992P7280J32767J96858K60636L13361L47228L59554
31856A896390L50932L22017K72493K02937J16906K0641p9408j78383k72067l54309
31846B298149m16229m49150m49395m20836l72961l15954k56778j98856j44773
31837g26783r8647o5434m7276m0256l4702j9377J3276O4245J28841K00203K72438
31826c53472L41002M00898M45975M71323M76725M66843M47614M22713L93430L60593
31816C873644L25172K87393K46690K02948J56751J08077N6170K384m6966q1967
$$ plain form
31886 4806169 4882079 4925546 4923219 4865614 4746879 4563609 4314615 4001983 3632120 3215708
31876 3215708 2767043 2303811 1847175 1420791 1047492 744100 516752 359817 259602
31867 259602 201048 173714 174714 208706 285986 418753 615611 876247 1189608 1536836 1896390
31856 1896390 2247322 2569339 2841832 3044769 3161675 3182316 3102908 2924525 2652458 2298149
31846 2298149 1881920 1432770 983375 562539 189578 -126376 -383154 -582010 -726783
31837 -726783 -825430 -890864 -938140 -978396 -1013098 -1032475 -1019199 -954954 -826113 -625910 -353472
31826 -353472 -12470 388428 834403 1305726 1782451 2249294 2696908 3119621 3513051 3873644
31816 3873644 4198816 4486209 4732899 4935847 5092598 5200675 5256845 5259229 5212263 5130296
31806E130296r4355q1762m7809N2N1647R4134J13647R9422M7884l6398j43143
31795E133615k59801l73737m72998n47273n90216o02134n90480n66553n40225
31786E90198n16571m96676m80606m68603m58948m45096m15878l59738k70295j49602
31776c471815p648J40378K76743L83152M43705M49697M04036L21178K21485J23605
31766g15484L9646k5383p1651j01683j17373j18376j03966p7220m7016k4702j8210
31755a381418k9027n3649q6241j19464j44448j52346j37278r8307l9044L4162
31745b207060J14110J94094K68795L34542L89012M30522M57309M67240M58633
31736I07197M31965L90967L40977K85135K21665J45156N0978o0866j85063l12508
$$ plain form
31806 5130296 5035941 4954179 4906370 4906422 4958069 5052203 5165850 5265272 5313156 5276758 5133615
31795 5133615 4873814 4500077 4027079 3479806 2889590 2287456 1696976 1130423 590198
31786 590198 73627 -423049 -903655 -1372258 -1831206 -2276302 -2692180 -3051918 -3322213 -3471815
31776 -3471815 -3479463 -3339085 -3062342 -2679190 -2235485 -1785788 -1381752 -1060574 -839089 -715484
31766 -715484 -675838 -701221 -772872 -874555 -991928 -1110304 -1214270 -1291490 -1338506 -1363208 -1381418
31755 -1381418 -1410445 -1464094 -1550335 -1669799 -1814247 -1966593 -2103871 -2202178 -2241222 -2207060
31745 -2207060 -2092950 -1898856 -1630061 -1295519 -906507 -475985 -18676 448564 907197
31736 907197 1339162 1730129 2071106 2356241 2577906 2723062 2774040 2713174 2528111 2215603
31726B215603m31837n30317n95434o18089n96188n36444m52932l62658k80117
31717b188413k13529j64724j32337j15426j14503j29387j56225j86346k07826
31708c608716k08944j82210j27724n4165K3944R1980J40746J68248J77169J70651
31698c409021J49869J14811O7293J3953l2826n7399m6506M051Q5341J76564K51525
31687b682345K87315K71724K07183J10390P463p4373j15465j08409n7017K7984
31677b125550J32221K38793L29681L89936M13097M03860L75762L45325L25780
31668H28905L23038L35076L54223L70173L71540L46426K85082J85924O0960o5374
31658C395973j65555k20832k28089j98712j52015j07513p8677o9384p4050q1833
$$ plain form
31726 2215603 1783766 1253449 658015 39926 -556262 -1092706 -1545638 -1908296 -2188413
31717 -2188413 -2401942 -2566666 -2699003 -2814429 -2928932 -3058319 -3214544 -3400890 -3608716
31708 -3608716 -3817660 -3999870 -4127594 -4181759 -4157815 -4065835 -3925089 -3756841 -3579672 -3409021
31698 -3409021 -3259152 -3144341 -3077048 -3063095 -3095921 -3153320 -3199826 -3195775 -3110434 -2933870 -2682345
31687 -2682345 -2395030 -2123306 -1916123 -1805733 -1798270 -1872643 -1988108 -2096517 -2153534 -2125550
31677 -2125550 -1993329 -1754536 -1424855 -1034919 -621822 -217962 157800 503125 828905
31668 828905 1151943 1487019 1841242 2211415 2582955 2929381 3214463 3400387 3461347 3395973
31658 3395973 3230418 3009586 2781497 2582785 2430770 2323257 2244580 2175196 2101146 2019313
31648B019313q3395p6780o8896p1528r4256j38482j95937k51924k90823l01001
31638D46291k77412k22032j42615n0537M1646J22542J84084K23650K45189K57476
31628H28282K68735K80702K87125K78839K51229K07487J55591J03116N4973J4357
$$ plain form
31648 2019313 1935918 1859138 1790242 1718714 1624458 1485976 1290039 1038115 747292 446291
31638 446291 168879 -53153 -195768 -246305 -204659 -82117 101967 325617 570806 828282
31628 828282 1097017 1377719 1664844 1943683 2194912 2402399 2557990 2661106 2716079 2730436
$$ [...]
##END NTUPLES=NMR SPECTRUM
##END=
