##TITLE=31Pdec_DE-27EXT-E
 D2O
  24 sc
 24.11.2023
##JCAMPDX= 6.0         $$ Bruker NMR JCAMP-DX V2.0
##DATA TYPE= NMR SPECTRUM
##DATA CLASS= NTUPLES
##ORIGIN= UXNMR, Bruker Analytische Messtechnik GmbH
##OWNER= root
$$ XWIN-NMR		Version 3.5
$$ Fri Nov 24 13:50:32 2023 Russian Standard Time (UT+4h)  she@DPX200
##.OBSERVE FREQUENCY= 81.013821
##.OBSERVE NUCLEUS= ^31P
##.ACQUISITION MODE= SIMULTANEOUS
##.ACQUISITION SCHEME= undefined
##.AVERAGES= 24
##.DIGITISER RES= 16
##SPECTROMETER/DATA SYSTEM= spect
##.PULSE SEQUENCE= zgpg30
##.SOLVENT NAME= CDCl3
##.SHIFT REFERENCE= (INTERNAL, CDCl3, 0, 248.564)
##AUDIT TRAIL= $$ (NUMBER, WHEN, WHO, WHERE, WHAT)
$$ ##TITLE= Audit trail, XWIN-NMR		Version 3.5
$$ ##JCAMPDX= 5.01
$$ ##ORIGIN= Bruker BioSpin GmbH
$$ ##OWNER= she
$$ F:/spectra/data/she/nmr/P31/1/pdata/1/auditp.txt
$$ ##AUDIT TRAIL=  $$ (NUMBER, WHEN, WHO, WHERE, WHAT)
(   1,<2023-11-24 13:48:08.45 +0400>,<she>,<DPX200>,
      <created by zg, POWCHK disabled, PULCHK disabled
       configuration hash MD5:
       00 E9 B6 7A A2 85 ED C7 34 08 36 98 17 FE 4E 26
       data hash MD5: 32K
       49 19 98 96 E4 40 9B 42 81 91 5C 71 85 33 DC 57>)
(   2,<2023-11-24 13:48:11.07 +0400>,<she>,<DPX200>,
      <Start of raw data processing
       efp BC_mod = 2 LB = 10 FT_mod = 6 PKNL = 1 PHC0 = -11711.93 PHC1 = -7.305786 SI = 64K 
       data hash MD5: 64K
       94 DE 50 DA 95 62 92 90 E1 23 20 FE 5B 95 FD B5>)
(   3,<2023-11-24 13:48:30.84 +0400>,<she>,<DPX200>,
      <pk PHC0 = 20.34021 PHC1 = -43.79985 
       data hash MD5: 64K
       B1 EE F3 CC E0 92 B6 E3 0B 59 A4 4D B4 8B 57 09>)
(   4,<2023-11-24 13:48:38.17 +0400>,<she>,<DPX200>,
      <abs ABSG = 5 
       data hash MD5: 64K
       C2 1D 8D 3A 46 E9 62 6E 2E E2 4F 86 B8 26 6F C3>)
$$ ##END=
$$ 
$$ hash MD5
$$ E1 DB F7 22 2E EC 0F 79 3D 15 F5 77 1A 6C CE 3A
##$RELAX= 
##$RELAX= 
##$RELAX= 
##$RELAX= 
##$RELAX= 
##$RELAX= 
##$RELAX= 
##$RELAX= 
##$RELAX= 
$$ Bruker specific parameters
$$ --------------------------
##$DU= <F:/spectra>
##$EXPNO= 1
##$NAME= <P31>
##$PROCNO= 1
##$TYPE= <nmr>
##$USER= <she>
##$AMP= (0..31)
100 100 100 100 100 100 100 100 100 100 100 100 100 100 100 100 100 100 
100 100 100 100 100 100 100 100 100 100 100 100 100 100 
##$AQSEQ= 0
##$AQ_mod= 1
##$AUNM= <au_zg>
##$AUTOPOS= <>
##$BF1= 81.014009
##$BF2= 200.13
##$BF3= 200.13
##$BF4= 200.13
##$BF5= 200.13
##$BF6= 200.13
##$BF7= 200.13
##$BF8= 200.13
##$BYTORDA= 1
##$CFDGTYP= 0
##$CFRGTYP= 5
##$CHEMSTR= <none>
##$CNST= (0..31)
1 1 145 1 1 1 1 1 1 1 1 1 1 1 1 1 1 1 1 1 1 1 1 1 1 1 1 1 1 1 1 1 
##$CPDPRG= <waltz16>
##$CPDPRG1= <>
##$CPDPRG2= <waltz16>
##$CPDPRG3= <>
##$CPDPRG4= <mlev>
##$CPDPRG5= <mlev>
##$CPDPRG6= <mlev>
##$CPDPRG7= <mlev>
##$CPDPRG8= <mlev>
##$CPDPRGB= <>
##$CPDPRGT= <>
##$D= (0..31)
0 1 0 0 0 0 0 0 0 0 0 0.03 2e-05 3e-06 0 0 0 0 0 0 0 0 0 0 0 0 0 0 0 0 
0 0 
##$DATE= 1700819287
##$DBL= (0..7)
120 120 120 11 120 120 24 19 
##$DBP= (0..7)
150 150 150 150 150 150 150 150 
##$DBP07= 0
##$DBPNAM0= <>
##$DBPNAM1= <>
$$ [...]
##$SUBNAM3= <"">
##$SUBNAM4= <"">
##$SUBNAM5= <"">
##$SUBNAM6= <"">
##$SUBNAM7= <"">
##$SUBNAM8= <"">
##$SUBNAM9= <"">
##$SW= 501.771253377433
##$SWIBOX= (0..15)
0 1 3 0 0 0 0 0 0 0 0 0 0 0 0 0 
##$SW_h= 40650.406504065
##$TD= 32768
##$TD0= 1
##$TE= 0
##$TE2= 300
##$TE3= 300
##$TEG= 300
##$TL= (0..7)
0 120 53 12 22 120 120 120 
##$TP= (0..7)
150 150 150 150 150 150 150 150 
##$TP07= 0
##$TPNAME0= <>
##$TPNAME1= <>
##$TPNAME2= <>
##$TPNAME3= <>
##$TPNAME4= <>
##$TPNAME5= <>
##$TPNAME6= <>
##$TPNAME7= <>
##$TPOAL= (0..7)
0.5 0.5 0.5 0.5 0.5 0.5 0.5 0.5 
##$TPOFFS= (0..7)
0 0 0 0 0 0 0 0 
##$TUNHIN= 0
##$TUNHOUT= 0
##$TUNXOUT= 0
##$USERA1= <user>
##$USERA2= <user>
##$USERA3= <user>
##$USERA4= <user>
##$USERA5= <user>
##$V9= 5
##$VALIST= <valist>
##$VCLIST= <CCCCCCCCCCCCCCC>
##$VD= 0
##$VDLIST= <DDDDDDDDDDDDDDD>
##$VPLIST= <PPPPPPPPPPPPPPP>
##$VTLIST= <TTTTTTTTTTTTTTT>
##$WBST= 1024
##$WBSW= 4
##$XGAIN= (0..3)
0 0 0 0 
##$XL= 0
##$YL= 0
##$YMAX_a= 3722
##$YMIN_a= -3172
##$ZGOPTNS= <>
##$ZL1= 120
##$ZL2= 120
##$ZL3= 120
##$ZL4= 120
##$ABSF1= 248.5645
##$ABSF2= -253.2056
##$ABSG= 5
##$ABSL= 3
##$ALPHA= 0
##$AQORDER= 0
##$ASSFAC= 0
##$ASSFACI= 0
##$ASSFACX= 0
##$ASSWID= 0
##$AUNMP= <proc_1d>
##$AZFE= 0.1
##$AZFW= 0.5
##$BCFW= 0
##$BC_mod= 2
##$BYTORDP= 0
##$COROFFS= 0
##$CY= -3
##$DATMOD= 1
##$DC= 0
##$DFILT= <>
##$DTYPP= 0
##$F1P= 0
##$F2P= 0
##$FCOR= 1
##$FTSIZE= 65536
##$FT_mod= 6
##$GAMMA= 0
##$GB= 0
##$INTBC= 1
##$INTSCL= 6.047779e-11
##$ISEN= 30
##$LB= 10
##$LEV0= 0
##$LPBIN= 0
##$MAXI= 10000
##$MC2= 0
##$MEAN= 0
##$ME_mod= 0
##$MI= 50
##$NCOEF= 0
##$NC_proc= -8
##$NLEV= 6
##$NOISF1= 182.463
##$NOISF2= 159.3651
##$NSP= 0
##$NTH_PI= 0
##$NZP= 0
##$OFFSET= 248.5645
##$PC= 4
##$PHC0= -11691.59
##$PHC1= -51.10564
##$PH_mod= 1
##$PKNL= yes
##$PPARMOD= 0
##$PSCAL= 0
##$PSIGN= 0
##$REVERSE= no
##$SF= 81.0140089999694
##$SI= 65536
##$SIGF1= 159.3651
##$SIGF2= -187.1042
##$SINO= 113.3802
##$SIOLD= 16384
##$SREGLST= <1H.CDCl3>
##$SSB= 0
##$STSI= 65536
##$STSR= 0
##$SW_p= 40650.406504065
##$SYMM= 0
##$S_DEV= 0
##$TDeff= 32768
##$TDoff= 0
##$TI= <>
##$TILT= no
##$TM1= 0
##$TM2= 0
##$TOPLEV= 0
##$USERP1= <user>
##$USERP2= <user>
##$USERP3= <user>
##$USERP4= <user>
##$USERP5= <user>
##$WDW= 1
##$XDIM= 65536
##$YMAX_p= 355431786
##$YMIN_p= -23555862
$$ End of Bruker specific parameters
$$ ---------------------------------
##NTUPLES= NMR SPECTRUM
##VAR_NAME=  FREQUENCY,     SPECTRUM/REAL,   SPECTRUM/IMAG
##SYMBOL=    X,             R,               I
##VAR_TYPE=  INDEPENDENT,   DEPENDENT,       DEPENDENT
##VAR_FORM=  AFFN,          ASDF,            ASDF
##VAR_DIM=   65536,         65536,           65536
##UNITS=     HZ,            ARBITRARY UNITS, ARBITRARY UNITS
##FACTOR=    0.620285442955139, 1,           1
##FIRST=     20137.2065510682, 0,            0
##LAST=      -20513.1999529968, 0,           0
##MIN=       -20513.1999529968, -23555862,   0
##MAX=       20137.2065510682, 355431786,    0
$$ Real data points
##PAGE= N=1
##DATA TABLE= (X++(R..R)), XYDATA
$$ [...]
39342B15827K71595L06280L19332L13288K92449K61184K22370J76849J24776O8253
$$ 215827 487422 793702 1113034 1426322 1718771 1979955 2202325 2379174 2503950 2572203
39332B572203J3153l1682n7701o0425m1508q194K9306O0861P8571P7860N8008
$$ 2572203 2585356 2553674 2495973 2435548 2394040 2385846 2415152 2476013 2554584 2632444 2690452
39321B690452K2195k3021o8882j05875j25566j22924r8226n7109q348L9167P8612
$$ 2690452 2712647 2689626 2620744 2514869 2389303 2266379 2168153 2111044 2102696 2141863 2220475
39310B220475J06242J21588J26789J24798J17518J05489Q9264P0839N3357L9251
$$ 2220475 2326717 2448305 2575094 2699892 2817410 2922899 3012163 3083002 3136359 3175610
39300C175610K8260J6805p61k9597p1824j25389j84813k42938k92632l27969l45125
$$ 3175610 3203870 3220675 3219914 3190317 3118493 2993104 2808291 2565353 2272721 1944752 1599627
39289A599627l42956l22948k88431k43449j91848j36901q1474k8441J9046N7572
$$ 1599627 1256671 933723 645292 401843 209995 73094 -8380 -36821 -17775 39797
39279C9797Q3679R4036Q5970N8642J4640l9139r2635j35530j60384j63988j46530
$$ 39797 123476 217512 303482 362124 376764 337625 244990 109460 -50924 -214912 -361442
39268c61442j09936n7150P169P5968J40623J93324K29308K47285K48035K32757
$$ -361442 -471378 -528528 -521359 -445391 -304768 -111444 117864 365149 613184 845941
39258H45941K02420J58385J03384M2229j8200p0119j07186j27002j31957j27553
$$ 845941 1048361 1206746 1310130 1352359 1334159 1264040 1156854 1029852 897895 770342
39248G70342j19429j11256j04319r8048r0523p8944o0320l2316O039N3550J05881
$$ 770342 650913 539657 435338 337290 246767 167823 107503 75187 81226 134776 240657
39237B40657J55247J92062K08340K00880J72096J28168P6171K1983l0339p8286
$$ 240657 395904 587966 796306 997186 1169282 1297450 1373621 1395604 1365265 1286979
39227A286979j20201j54423j78547j89703j86310j70372j48089j27690j15686
$$ 1286979 1166778 1012355 833808 644105 457795 287423 139334 11644 -104042
39218a04042j14249j21108j31212j38729j38711j28569j09040q4007n8843l8060
$$ -104042 -218291 -339399 -470611 -609340 -748051 -876620 -985660 -1069667 -1128510 -1166570
39208a166570k3488j3825n597N169K1357M3708P0395R7515J20762J37795J49855
$$ -1166570 -1190058 -1203883 -1209480 -1204311 -1182954 -1139246 -1068851 -971336 -850574 -712779 -562924
39197e62924J61220J76725J98959K26794K55763K79745K93263K93346K80174K56153
$$ -562924 -401704 -224979 -26020 200774 456537 736282 1029545 1322891 1603065 1859218
39187A859218K24123J85712J40720Q7862K6803l9520j03945j56746j89407j98236
$$ 1859218 2083341 2269053 2409773 2497635 2524438 2484918 2380973 2224227 2034820 1836584
39177A836584j85674j58815j26450r6308p3606o0844n8407o5371q0135j00458
$$ 1836584 1650910 1492095 1365645 1269337 1195731 1134887 1076480 1011109 930974 830516
39167H30516j22981j42968j55146j55680j43981j22974r7651p3026n2591l7693
$$ 830516 707535 564567 409421 253741 109760 -13214 -110865 -183891 -236482 -274175
39157b74175k7742k1161j6647j3913j3471j5817k1034k9157m0731n6703p7307
$$ -274175 -301917 -323078 -339725 -353638 -367109 -382926 -403960 -433117 -473848 -530551 -607858
39146f07858j00695j22428j36587j38060j24592r7287n9569j5729K9892P3075
$$ -607858 -708553 -830981 -967568 -1105628 -1230220 -1327507 -1387076 -1402805 -1372913 -1299838
39136a299838J09807J36636J51119J52294J41255J21294R6844P1135M4218J3533
$$ -1299838 -1190031 -1053395 -902276 -749982 -608727 -487433 -390589 -319454 -275236 -261703
39126b61703k2765o2249r7607j19684j21962j03418o8519k5175J7798N2865P5166
$$ -261703 -284468 -346717 -444324 -564008 -685970 -789388 -857907 -883082 -865284 -812419 -737253
39115g37253Q3107P8149O4289M7488L4749L2153M2328O2888Q7250J07211J15544
$$ -737253 -654146 -575997 -511708 -464220 -429471 -397318 -354990 -292102 -204852 -97641 17903
39104A7903J07542Q2089M2660k802m4371p4261r0067r5157r6387j00731j12427
$$ 17903 125445 207534 250194 247392 203021 128760 38693 -56464 -152851 -253582 -366009
39093c66009j31561j54739j77336j95810k08493k14682k13460k03480j83828j54948
$$ -366009 -497570 -652309 -829645 -1025455 -1233948 -1448630 -1662090 -1865570 -2049398 -2204346
39083b204346j18901p8822l8159k12L2013N5914O9648P2798O6959N5778M4034
$$ -2204346 -2323247 -2402069 -2440228 -2440440 -2408427 -2352513 -2282865 -2210067 -2143108 -2087330 -2043296
39072b043296L6056L4170L7978M4690N0246N0836M4464L1872J6255J892p409r031
$$ -2043296 -2007240 -1973070 -1935092 -1890402 -1840156 -1789320 -1744856 -1712984 -1696729 -1694837 -1702246 -1711277
39060a711277j419J6368M4770Q3249J29362J78024K21987K53908K68937K66051
$$ -1711277 -1712696 -1696328 -1651558 -1568309 -1438947 -1260923 -1038936 -785028 -516091 -250040
39050b50040K47331K16124J75645J28583P7458K5169k4275o5441r2233j00065
$$ -250040 -2709 213415 389060 517643 595101 620270 595995 530554 438321 338256
39040C38256q8133n9996k1903J9501N8152Q8290J04552J03502Q5381N4202J5887
$$ 338256 250123 190127 168224 187725 245877 334167 438719 542221 627602 681804 697691
39029F97691k3922o1076r2990j18261j35906j44497j41866j26060r6977n7296
$$ 697691 673769 612693 519703 401442 265536 121039 -20827 -146887 -243864 -301160
39019c01160j1940L3185P1990R8591J08086R8194P0858L2564o942l6988m8562
$$ -301160 -313100 -279915 -207925 -109334 -1248 96946 167804 200368 193426 156438 107876
39008A07876l6835k788M7103J03549J57957K04444K39292K59236K60727K41069
$$ 107876 71041 68253 115356 218905 376862 581306 820598 1079834 1340561 1581630
38998A581630K00357J42625P5420Q119n0235r2714j15425j17462j00586o9245
$$ 1581630 1781987 1924612 2000032 2008151 1957916 1865202 1749777 1632315 1531729 1462484
38988A462484l0892M337K5598K4732o33m6282j03477j62364k14578k54090k77152
$$ 1462484 1431592 1435929 1461527 1486259 1485626 1439344 1335867 1173503 958925 704835 427683
38977D27683k82518k71779k48747k17381j79389j33346p6183o343P3208J54009
$$ 427683 145165 -126614 -375361 -592742 -772131 -905477 -981660 -988003 -914795 -760786
38967g60786K24123K72381K92430K84020K51247J99681J34675O1220j5657r0738
$$ -760786 -536663 -264282 28148 312168 563415 763096 897771 958991 943334 852596
38957H52596j58618k13603k50098k63839k53641k22314j75944j21554o4562p635
$$ 852596 693978 480375 230277 -33562 -287203 -509517 -685461 -807015 -871577 -879212
38947h79212M8226J01604J49605J88856K17295K34708K41474K37064K20045J89777
$$ -879212 -830986 -729382 -579777 -390921 -173626 61082 302556 539620 759665 949442
38937I49442J48458J01824N7892K4326N973L840J5641L7014O2504Q6328J03242
$$ 949442 1097900 1199724 1257616 1281942 1287915 1291755 1307396 1344410 1406914 1493242 1596484
38926A596484J09189J01266P7366L6579j9328q4690j50850k09292k55080k88280
$$ 1596484 1705673 1806939 1884305 1920884 1901556 1816866 1666016 1456724 1201644 913364
38916I13364l12337l30627l43378l47006l36199l07433k61574k03988j42061q1646
$$ 913364 601027 270400 -72978 -419984 -756183 -1063616 -1325190 -1529178 -1671239 -1752885
38906a752885k4650L0614Q6405J41813J90977K24596K33949K15116J71163J11340
$$ -1752885 -1777535 -1746921 -1660516 -1518703 -1327726 -1103130 -869181 -654065 -482902 -371562
38896c71562M7945p534m7477o9430p5515p0344n8397m2359k3109r46K3232M7293
$$ -371562 -323617 -331151 -378628 -448058 -523573 -593917 -652314 -694673 -717782 -718728 -695496 -648203
38884f48203O7721P9816P8704O1071K6707k1015p5724j29211j73103k00958k09912
$$ -648203 -580482 -500666 -421962 -360891 -334184 -355199 -430923 -560134 -733237 -934195 -1144107
38873a144107k00700j76127j39481r4254m4968K460M1901O9513Q5873R6169J08030
$$ -1144107 -1344807 -1520934 -1660415 -1754669 -1799637 -1797177 -1755276 -1685763 -1599890 -1503721 -1395691
38862a395691J28131J59183J98551K38889K70863K87055K85076K67959K41711
$$ -1395691 -1267560 -1108377 -909826 -670937 -400074 -113019 172057 440016 681727
38853F81727K12112J83014J56259J31970J08461Q2536N0804J1352l5348q6475
$$ 681727 893839 1076853 1233112 1365082 1473543 1556079 1606883 1618235 1582887 1496412
38843A496412j37261j81643k13788k30240k31125k19429j99222j74761j50762
$$ 1496412 1359151 1177508 963720 733480 502355 282926 83704 -91057 -241819
38834b41819j32370j23811j26484j38324j55021j72227j87291j99454k08575k13803
$$ -241819 -374189 -498000 -624484 -762808 -917829 -1090056 -1277347 -1476801 -1685376 -1899179
38824a899179k13603k07118j94894j77840j55496j25601q5390l3440K9123R8196
$$ -1899179 -2112782 -2319900 -2514794 -2692634 -2848130 -2973731 -3059121 -3092561 -3063438 -2965242
38814b965242J67173K28483K75600L04201L12154K99220K67256K20450J64812
$$ -2965242 -2798069 -2569586 -2293986 -1989785 -1677631 -1378411 -1111155 -890705 -725893
38805g25893J07091N3929J1327j6092k6138j9900j760K1646M3323N7915O2773
$$ -725893 -618802 -564873 -553546 -569638 -595776 -615676 -617436 -595790 -552467 -494552 -431779
38794d31779N7525M3001K0644p220l7184o5555q9813j09502j25484j38078j45721
$$ -431779 -374254 -331253 -310609 -317829 -355013 -420568 -510381 -619883 -745367 -883445 -1029166
38783a029166j45678j36366j19391r9386q1698o9613o2819n7935n0523l7408j7936
$$ -1029166 -1174844 -1311210 -1430601 -1529987 -1611685 -1681298 -1744117 -1802052 -1852575 -1889983 -1907919
38772a907919O198L2053N6415P6301Q9174R3318Q8228P4788N4978L1355O612j6553
$$ -1907919 -1901721 -1869668 -1813253 -1736952 -1647778 -1554460 -1466232 -1391444 -1336466 -1305111 -1298499 -1315052
38760a315052l5541m8132n2868m9375l8527k2608m872J1725K6026L8904N1762
$$ -1315052 -1350593 -1398725 -1451593 -1500968 -1539495 -1562103 -1566975 -1555250 -1529224 -1490320 -1438558
38749a438558O4869P7290Q8363R8939J11034J26349J44869J64409J81255J91714
$$ -1438558 -1373689 -1296399 -1208036 -1109097 -998063 -871714 -726845 -562436 -381181 -189467
38739a89467J93920J88857J79795J70473J63190J57944J52745J44599J30579J08988
$$ -189467 4453 193310 373105 543578 706768 864712 1017457 1162056 1292635 1401623
38729A401623Q0404M7970J6174j1430l3723n1456o5378p5106p9930q0487p9233
$$ 1401623 1482027 1529997 1546171 1534741 1501018 1449562 1384184 1309078 1229148 1148661 1069428
38718A069428p8956q0549q2155q0605p3933o2791m9643l6592k3629q512J1539
$$ 1069428 990472 909923 827768 747163 673230 610439 560796 524204 500575 492063 503602
38707E03602L7130O4597Q6320R3904Q2439N3142J2960k8358o2250q4627r6861
$$ 503602 540732 605329 691649 785553 867992 921134 934094 905736 843486 758859 661998
38696F61998j03594j08750j12640j12345j04702q9228o8842m8333l2144k3168
$$ 661998 558404 449654 337014 224669 119967 30739 -38103 -86436 -118580 -141748
38686a41748k2770l1291m8000p0585r5028j16304j29553j31256j19969r6395o2627
$$ -141748 -164518 -195809 -243809 -314394 -409422 -525726 -655279 -786535 -906504 -1002899 -1065526
38675a065526k1160K5200P2484J15045J46833J63960J66675J59145J47309J36237
$$ -1065526 -1086686 -1061486 -989002 -873957 -727124 -563164 -396489 -237344 -90035 46202
38665D6202J28460J23906J21133J18943J17275J16825J17735J18529J16580J10216
$$ 46202 174662 298568 419701 538644 655919 772744 890479 1009008 1125588 1235804
38655A235804J00752R2325Q9189R2809J01418J12180J23602J35755J48580J60300
$$ 1235804 1336556 1428881 1518070 1610879 1712297 1824477 1948079 2083834 2232414 2392714
38645B392714J67748J68180J60872J47171J29179J08174Q3703N3755J6055k9912
$$ 2392714 2560462 2728642 2889514 3036685 3165864 3274038 3357741 3411496 3427551 3397639
38635C397639q1234j31666j73934k03102k18942k25852k30223k36739k45883k54224
$$ 3397639 3316405 3184739 3010805 2807703 2588761 2362909 2132686 1895947 1650064 1395840
38625A395840k57018k50922k34952k09802j76718j36796r0668l8698J8285P8052
$$ 1395840 1138822 887900 652948 443146 266428 129632 38964 266 18551 96603
38615I6603J36801J89847K32655K61701K75486K75370K65282K49686K31058K09071
$$ 96603 233404 423251 655906 917607 1193093 1468463 1733745 1983431 2214489 2423560
38605B423560J82118J49683J13555P7410M5693K2675J1832J5155L2365O0469R4157
$$ 2423560 2605678 2755361 2868916 2946326 2992019 3014694 3026526 3041681 3074046 3134515 3228672
38594C228672J27065J53365J68914J71717J62050J42477J17493R2112O9571M9623
$$ 3228672 3355737 3509102 3678016 3849733 4011783 4154260 4271753 4363865 4433436 4483059
38584D483059K8915L434k8886o7222j08570j48844j83449k07714k17812k11932
$$ 4483059 4511974 4515408 4486522 4419300 4310730 4161886 3978437 3770723 3552911 3340979
38574C340979j91023j58878j21689q6970o1453m8526m6681n0335n2448m7377l2599
$$ 3340979 3149956 2991078 2869389 2782419 2720966 2672440 2625759 2575424 2522976 2475599 2443000
38563B443000r112J9251M7386P1066Q8718J01845J14018J29280J50914J80860
$$ 2443000 2433888 2453139 2500525 2571591 2660309 2762154 2876172 3005452 3156366 3337226
38553C337226K19743K67290L22626L83920M47193N05075N47099N62257N42957
$$ 3337226 3556969 3824259 4146885 4530805 4977998 5483073 6030172 6592429 7135386
38544G135386M87960M02248K94158J72159M3449q5461k07908l17361m08612m78939
$$ 7135386 7623346 8025594 8319752 8491911 8535360 8449899 8241991 7924630 7516018 7037079
38534G037079n28523n59989n77124n83021n78451n61464n28540m76702m05387
$$ 7037079 6508556 5948567 5371443 4788422 4209971 3648507 3119967 2643265 2237878
38525B237878l17241k17505j12686r335Q6359J68593K32317K74323K94315K95151
$$ 2237878 1920637 1703132 1590446 1581111 1667470 1836063 2068380 2342703 2637018 2932169
38515B932169K81869K60100K34550K07813J79643J47054J05916N3908o787o9117
$$ 2932169 3214038 3474138 3708688 3916501 4096144 4243198 4349114 4403022 4396235 4327118
38505D327118j23757j62864j82424j82132j64188j32788r4662n9183l6565l4386
$$ 4327118 4203361 4040497 3858073 3675941 3511753 3378965 3284303 3225120 3188555 3154169
38495C154169n4437r1964j37688j81175k13566k28946k24933k03202j69845j34361
$$ 3154169 3099732 3007768 2870080 2688905 2475339 2246393 2021460 1818258 1648413 1514052
38485A514052j06745r3702r6321j10798j31176j51641j66959j72079j62930j38490
$$ 1514052 1407307 1313605 1217284 1106486 975310 823669 656710 484631 321701 183211
38475A83211j02382o2379k7939p281n199k2229n5253r9057j47817j95607k36296
$$ 183211 80829 18450 -9489 -16770 -21969 -44198 -99451 -198508 -346325 -541932 -778228
38464g78228k63888k73621k62934k31292j79253j08120k0736P7278J77243K68804
$$ -778228 -1042116 -1315737 -1578671 -1809963 -1989216 -2097336 -2118072 -2040794 -1863551 -1594747
38454a594747L42599L93052M19717M26281M17767L97932L68503L30212K84047
$$ -1594747 -1252148 -859096 -439379 -13098 404669 802601 1171104 1501316 1785363
38445A785363K31705J75073J15446N2967j3055q2681j53454k19405k71836l01405
$$ 1785363 2017068 2192141 2307587 2360554 2347499 2264818 2111364 1891959 1620123 1318718
38435A318718l00751k67170k04807j24996m3474K4760P0294R1316R2291Q0686
$$ 1318718 1017967 750797 545990 420994 377520 402280 472574 563890 656181 736867
38425G36867O3542M5255K7034P819j4183m0041o9267r9588j27413j48719j60162
$$ 736867 800409 845664 872698 880517 866334 826293 757026 657438 530025 381306 221144
38414B21144j59848j47564j24571r3542n8884k6727l554O491L772p197k0489l1735
$$ 221144 61296 -86268 -210839 -304381 -363265 -389992 -393546 -387055 -383283 -390480 -410969 -442704
38402d42704l9141m2463m1385l4700k0681J872L2739O9873J09478J46334J74668
$$ -442704 -481845 -524308 -565693 -600393 -621074 -619202 -586463 -516590 -407112 -260778 -86110
38391h6110J89885J90587J79493J62363J45473J33146J26383J23037J19310J11903
$$ -86110 103775 294362 473855 636218 781691 914837 1041220 1164257 1283567 1395470
38381A395470R9552Q3156O4774M6506K9811J5171K092j0277k1947l1188l4893
$$ 1395470 1495022 1578178 1642952 1689458 1719269 1734440 1736532 1726255 1704308 1673120 1638227
38370A638227l0288j6943K368K2707L9370M9919N4363N3533M7237L3976J2597
$$ 1638227 1607939 1590996 1593364 1616071 1655441 1705360 1759723 1813256 1860493 1894469 1907066
38359A907066j5379m4804o8538q1021q1507p4644o8208o9679q3735j11228j49111
$$ 1907066 1891687 1846883 1778345 1697324 1615817 1541173 1472965 1403286 1319551 1208323 1059212
38348A059212j90957k28242k52328k56540k37557j96013j36599o7718l45N4339
$$ 1059212 868255 640013 387685 131145 -106412 -302425 -439024 -506742 -507087 -452748
38338d52748Q8097R8444Q9535P0391N1181L9548L8638M7329O1561P5770Q4014
$$ -452748 -364651 -266207 -176672 -106281 -55100 -15552 23086 70415 131976 207746 291760
38327B91760Q1139O4304L4427l215m0083o7113p7948p1122n0011k0972R114L4885
$$ 291760 372899 437203 471630 468415 428332 361219 283271 212149 162138 141166 150280 185165
38315A85165N3863O6949P7664Q9850J04992J20795J32038J32888J19232R0095
$$ 185165 239028 305977 383641 473491 578483 699278 831316 964204 1083436 1173531
38305A173531M8118p64m8485q6833j09862j15878j07954r2378p5819o2789n4707
$$ 1173531 1221649 1220885 1172400 1085567 975705 859827 751873 659495 583676 520887 466180
38294D66180n0382m7096m1787l2503j9597n655O044J3253J5236J1973L555r589
$$ 466180 415798 368702 326915 294412 274815 269160 275204 288457 303693 315666 319221 309632
38282C09632k6014m3046n7256o5183o4089n2740l2257o619J8001L5363M1940L8350
$$ 309632 283618 240572 183316 118133 54044 1304 -30953 -37572 -19571 15792 57732 96082
38270I6082K8150J4977N22j4989l0828m4725n3983n7615n7115n4894n1701m5555
$$ 96082 124232 139209 139731 124742 93914 49189 -4794 -62409 -119524 -174418 -226119 -271674
38258b71674l3308j3479J2088L8813O1545P7017Q5699R2053J02606J22464J52634
$$ -271674 -304982 -318461 -306373 -267560 -206015 -128998 -43299 48754 151360 273824 426458
38247D26458J89705K27465K58678K76441K75630K54660K16438J67687J16600O9871
$$ 426458 616163 843628 1102306 1378747 1654377 1909037 2125475 2293162 2409762 2479633
38237B479633L0372l234l4394o5476r5715j21536j38418j42883j33927j13592
$$ 2479633 2510005 2506771 2472377 2406901 2311186 2189650 2051232 1908349 1774422 1660830
38227A660830q6340n7151k9726o228J1562K1084J9218L703k5228o4097j06934
$$ 1660830 1574490 1517339 1487613 1481385 1492947 1514031 1533249 1536952 1511724 1447627 1340693
38216A340693j47287j80308k03645k16790k19691k11735j91590j58029j11185
$$ 1340693 1193406 1013098 809453 592663 372972 161237 -30353 -188382 -299567
38207b99567n3452J0577P4850J32588J76757K00945K01069J77231J34513Q1921
$$ -299567 -353019 -342442 -267592 -135004 41753 242698 443767 620998 755511 837432
38197H37432K9848j3066m2389n8518o5180o6848o6903o7495p0438p7450q9032
$$ 837432 867280 854214 811825 753307 688127 621279 554376 486881 416443 338993 249961
38186B49961j02929j14121j16993j08234q8048n8882k3163J7731O2571J08940
$$ 249961 147032 32911 -84082 -192316 -280364 -339246 -362409 -344678 -282107 -173167
38176a73167J53058J90941K19684K37800K44830K40849K26203K01289J66468J22550
$$ -173167 -20109 170832 390516 628316 873146 1113995 1340198 1541487 1707955 1830505
38166A830505P1703J7944l3481p7528j10460j30123j35691j27326j05877p2676
$$ 1830505 1902208 1920152 1886671 1809143 1698683 1568560 1432869 1305543 1199666 1126990
38156A126990k9759J9308O8842J11671J41183J53417J47848J26673R3852N4595
$$ 1126990 1097231 1116539 1185381 1297052 1438235 1591652 1739500 1866173 1960025 2014620
38146B014620J4842j9960m6355o3184p0497o8563n8606m4436l2569k9543l8162
$$ 2014620 2029462 2009502 1963147 1899963 1829466 1760903 1702297 1657861 1625292 1595749 1557587
38135A557587n5749p5924r2414j02072j05350j04730j02941j02061j03244j06249
$$ 1557587 1501838 1425914 1333500 1231428 1126078 1021348 918407 816346 713102 606853
38125F06853j08741j06183r2951o4397j9010M0338J06731J71256K25758K64821
$$ 606853 498112 391929 298978 234581 215571 255909 362640 533896 759654 1024475
38115A024475K86106K89608K76928K51056K16226J77293J38486J02155O8442L6465
$$ 1024475 1310581 1600189 1877117 2128173 2344399 2521692 2660178 2762333 2830775 2867240
38105B867240O361j9554l7628m4928m0758k6664n560J8954M2812O1434O9863O3521
$$ 2867240 2873601 2854047 2816419 2771491 2730733 2704069 2698509 2717463 2760275 2821709 2891572 2955093
38093B955093L9848J24n0119j02987j51505j92080k24605k50642k71175k85506
$$ 2955093 2994941 2995065 2944946 2841959 2690454 2498374 2273769 2023127 1751952 1466446
38083A466446k91758k88395k75687k56098k33548k11815j92761j75171j55440
$$ 1466446 1174688 886293 610606 354508 120960 -90855 -283616 -458787 -614227
38074f14227j30321j00117o9813m7010l8268m6369o9798j03763j41544j75594
$$ -614227 -744548 -844665 -914478 -961488 -999756 -1046125 -1115923 -1219686 -1361230 -1536824
38064a536824j98572k04519j90075j55346j03920m2121K1978P9477J21648J41406
$$ -1536824 -1735396 -1939915 -2129990 -2285336 -2389256 -2431377 -2409399 -2329922 -2208274 -2066868
38054b066868J35000J03172N1377j1108p3229j25192j61279j80728j86008j80008
$$ -2066868 -1931868 -1828696 -1777319 -1788427 -1861656 -1986848 -2148127 -2328855 -2514863 -2694871
38044b694871j64441j40309j09482p5796m4891k2839j3948j8550l2014m5960n1497
$$ -2694871 -2859312 -2999621 -3109103 -3184899 -3229790 -3252629 -3266577 -3285127 -3317141 -3363101 -3414598
38033c414598m2981k0327J1293M4113P1447R0448J02506J11204J19218J26153
$$ -3414598 -3457579 -3477906 -3466613 -3422500 -3351053 -3260605 -3158099 -3046895 -2927677 -2801524
38023b801524J28632J22510J06096Q2769O1223N2434O4404R8010J46865K00913
$$ -2801524 -2672892 -2550382 -2444286 -2361517 -2300294 -2247860 -2183456 -2085446 -1938581 -1737668
38013a737668K50481K88098L08516L09104K91162K60635K26404J96636J75370
$$ -1737668 -1487187 -1199089 -890573 -581469 -290307 -29672 196732 393368 568738
38004E68738J61657J51721J42533J33997J28377J27833J32332J39121J43561J40603
$$ 568738 730395 882116 1024649 1158646 1287023 1414856 1547188 1686309 1829870 1970473
37994A970473J26540J00493O4860K4665j3736m4206o2828o9837o9981p0331p6821
$$ 1970473 2097013 2197506 2262366 2287031 2273295 2229089 2166261 2096424 2026443 1956112 1879291
37983A879291r2051j15441j44780j77475k10734k41089k64060k74705k69231k46933
$$ 1879291 1787240 1671799 1527019 1349544 1138810 897721 633661 358956 89725 -157208
37973a57208k11049j67878j24439q6111n5433l2579j6778p171k487m54J527M534
$$ -157208 -368257 -536135 -660574 -746685 -802118 -834697 -851475 -858646 -861133 -861587 -860060 -855526
37961h55526P067O229N31p976j3679r265J1564N1426J07459J71199K30638K73909
$$ -855526 -848459 -842230 -841699 -849675 -863354 -872619 -861055 -809629 -702170 -530971 -300333 -26424
37949b6424K92742K83808K47751J87533J08118J7584p2318j47977j97615k14545
$$ -26424 266318 550126 797877 985410 1093528 1111112 1038794 890817 693202 478657
37939D78657j98079j52281q3873o00Q9622J79067K60411L27008L73276L95300
$$ 478657 280578 128297 44424 43824 133446 312513 572924 899932 1273208 1668508
37929A668508L91647L64190L18400K62533K05682J55391J15730Q6472O3493M0263
$$ 1668508 2060155 2424345 2742745 3005278 3210960 3366351 3482081 3568553 3632046 3672309
37919C672309J0114l1108q2972j40171j94589k38857k69196k85917k91705k89281
$$ 3672309 3682423 3651315 3568343 3428172 3233583 2994726 2725530 2439613 2147908 1858627
37909A858627k79862k62977k37441k02966j61511j17360p5830m1551j7352l933
$$ 1858627 1578765 1315788 1078347 875381 713870 596510 520680 479129 461777 457844
37899D57844J39j967o464j0559j3452j5919j8996k2819k6317k7665k5161j8274
$$ 457844 457983 456016 449552 438993 425541 409622 390626 367807 341490 313825 288664 270390
37887B70390q320J780Q678R944M838n571j8574l0299l6681l4629k2698q51L0141
$$ 270390 262070 263850 272528 282472 287310 281739 263165 232866 196185 161556 138858 138007 168148
37874A68148O8946J13528J60983K07429K47860K76306K87028K76766K46745K02719
$$ 168148 237094 350622 511605 719034 966894 1243200 1530228 1806994 2053739 2256458
37864B256458J52697J03692N9513K0775j3382m3602o9906r2477j12478j31988
$$ 2256458 2409155 2512847 2572360 2593135 2579753 2536151 2466245 2373768 2261290 2129302
37854B129302j53106j76654k00867k20580k27915k15037j78020j19703m9783J7936
$$ 2129302 1976196 1799542 1598675 1378095 1150180 935143 757123 637420 587637 605573
37844F05573O9803R6399R4936O9241K7567k0560o6994j06187j35144j52842j59915
$$ 605573 675376 771775 866711 935952 963519 942959 875965 769778 634634 481792 321877
37833C21877j58567j52074j43478j34074j22851j07371q5510n6868k3306J1420
$$ 321877 163310 11236 -132242 -266316 -389167 -496538 -582048 -638916 -662222 -650802
37823f50802M2603O5795P8025P8671O9440N3067L1189K949l4062q0720j33490
$$ -650802 -608199 -542404 -464379 -385708 -316268 -263201 -232012 -229063 -263125 -343845 -477335
37812d77335j84020k21681k37594k28199j96963j53402j09551p5389n5492m8337
$$ -477335 -661355 -883036 -1120630 -1348829 -1545792 -1699194 -1808745 -1884134 -1939626 -1987963
37802a987963m8110m7649m1218k6369m638J8977L7742M5748M0220K2285m108l4043
$$ -1987963 -2036073 -2083722 -2124940 -2151309 -2155947 -2136970 -2099228 -2053480 -2013260 -1990975 -1995083 -2029126
37790b029126o2926q7050j04108j13609j16527j13971j06137r2709p4358n3624
$$ -2029126 -2092052 -2179102 -2283210 -2396819 -2513346 -2627317 -2733454 -2826163 -2900521 -2954145
37780b954145l4181j8984q990l561j918l760q102j1779r921J374K2746N1834Q5155
$$ -2954145 -2988326 -3007310 -3016300 -3019861 -3021779 -3025539 -3033641 -3045420 -3055341 -3053967 -3031221 -2979387 -2894232
37767b894232J19144J49636J71586J80397J73768J52407J19453P9887M0436Q932
$$ -2894232 -2775088 -2625452 -2453866 -2273469 -2099701 -1947294 -1827841 -1747954 -1707518 -1698586
37757a698586p733o158J2225M1931P5553J06033J28375J40684J44207J41949J36456
$$ -1698586 -1706319 -1712477 -1700252 -1658321 -1582768 -1476735 -1348360 -1207676 -1063469 -921520 -785064
37746g85064J28232J16154R9415P9214N8880M2564L3807L4739M6033O6968R5388
$$ -785064 -656832 -540678 -441263 -362049 -303169 -260605 -226798 -192059 -146026 -79058 16330
37735A6330J27756J59716J87129K07090K18246K20526K14452K00585J79305J51404
$$ 16330 144086 303802 490931 698021 916267 1136793 1351245 1551830 1731135 1882539
37725A882539J19134Q6908O0450M4619M1235M8273O0764P2642P8916P7404O9475
$$ 1882539 2001673 2088581 2149031 2193650 2234885 2283158 2343922 2416564 2495480 2572884 2642359
37714B642359N9132N0799M6868M6478M6190M1980L1085J2527j3496m6233q4275
$$ 2642359 2701491 2752290 2799158 2845636 2891826 2933806 2964891 2977418 2963922 2917689 2833414
37703B833414j25277j66377k05298k41208k74583l06283l36553l64370l87058
$$ 2833414 2708137 2541760 2336462 2095254 1820671 1514388 1177835 813465 426407
37694D26407m00324l99109l79513l40959k87086k24281j58863r5131l5453J8375
$$ 426407 26083 -373026 -752539 -1093498 -1380584 -1604865 -1763728 -1858859 -1894312 -1875937
37684a875937O4161R9412J21819J29741J22895J03399P6364M9142K9306K2524
$$ -1875937 -1811776 -1712364 -1590545 -1460804 -1337909 -1234510 -1158146 -1109004 -1079698 -1057174
37674a057174L1364N5006Q9053J25232J52038J57548J34056Q1776R018p1447j47210
$$ -1057174 -1025810 -970804 -881751 -756519 -604481 -446933 -312877 -231101 -222083 -293530 -440740
37663d40740k09612k54754k82767k96241k98433k92084k79252k61796k41471k19356
$$ -440740 -650352 -905106 -1187873 -1484114 -1782547 -2074631 -2353883 -2615679 -2857150 -3076506
37653c076506j95388j68804j39325j08033p7210m9198k5145m451J4736L4307N5109
$$ -3076506 -3271894 -3440698 -3580023 -3688056 -3765266 -3814464 -3839609 -3844060 -3829324 -3795017 -3739908
37642c739908P6534R6793J13575J24743J28816J25045J13191R3575O7753L9346
$$ -3739908 -3663374 -3566581 -3453006 -3328263 -3199447 -3074402 -2961211 -2867636 -2799883 -2760537
37632b760537J3815l412r623o477M95M427K72j2700l0160m4178m6572l2757l993
$$ -2760537 -2746722 -2750134 -2759757 -2766234 -2765739 -2761312 -2761040 -2773740 -2803900 -2848078 -2894650 -2927407 -2931400
37619b931400L3246P0330J00129J19413J29374J34485J40238J50573J66164J84481
$$ -2931400 -2898154 -2827824 -2727695 -2608282 -2478908 -2344423 -2204185 -2053612 -1887448 -1702967
37609a702967K01427K13050K16284K08950J90000J60132J21896P8777L4111r187
$$ -1702967 -1501540 -1288490 -1072206 -863256 -673256 -513124 -391228 -312451 -278340 -287527
37599b87527m7976p8460r6877j01190r2682p6259n8826m6465m2029m4627n1109
$$ -287527 -335503 -413963 -510840 -612030 -704712 -780971 -839797 -886262 -928291 -972918 -1024027
37588a024027n8225o3895o6776o4720n3791k9511R650N9119J08457J45598J62222
$$ -1024027 -1082252 -1146147 -1212923 -1277643 -1331434 -1360945 -1351295 -1292176 -1183719 -1038121 -875899
37577h75899J56578J32663R7187N6477J4401k8155p2065j17554j62205k00917
$$ -875899 -719321 -586658 -489471 -432994 -418593 -446748 -518813 -636367 -798572 -999489
37567i99489k27941k39441k34852k16327j87167j50679j10023o8395k8379R119
$$ -999489 -1227430 -1466871 -1701723 -1918050 -2105217 -2255896 -2365919 -2434314 -2462693 -2453574
37557b453574M4999Q0319J14156J43008J62403J69271J63162J45887J20473R0522
$$ -2453574 -2408575 -2328256 -2214100 -2071092 -1908689 -1739418 -1576256 -1430369 -1309896 -1219374
37547a219374O0117L3505J4075L123m68R86N829J4079K7007M5863P0835J00395
$$ -1219374 -1159257 -1125752 -1111677 -1108554 -1109022 -1108036 -1102207 -1088128 -1061121 -1015258 -944423 -844028
37535h44028J31063J57787J75352J80418J72985J56432J36312J18854J09437J11086
$$ -844028 -712965 -555178 -379826 -199408 -26423 130009 266321 385175 494612 605698
37525F05698J23176J41191J57832J65185J57139J31442R0659M1285q887n3792
$$ 605698 728874 870065 1027897 1193082 1350221 1481663 1572322 1613607 1604720 1550928
37515A550928r0541j18763j39050j52204j59623j63909j68377j75504j85503j96213
$$ 1550928 1460387 1341624 1202574 1050370 890747 726838 558461 382957 197454 1241
37505A241k04262k06435k00103j82998j53102j09137n1486J6872Q9812J58523
$$ 1241 -203021 -409456 -609559 -792557 -945659 -1054796 -1106282 -1089410 -999598 -841075
37495h41075K13526K47620K58205K47573K21371J86507J49734J17225R4637Q6807
$$ -841075 -627549 -379929 -121724 125849 347220 533727 683461 800686 895323 982130
37485I82130R6389J21900J56614J89710K09421K06794J78414J27297O1787p055
$$ 982130 1078519 1200419 1357033 1546743 1756164 1962958 2141372 2268669 2330456 2323401
37475B323401o8483j14457j40724j46902j35722j11729p9775m4086q187K4513
$$ 2323401 2254918 2140461 1999737 1852835 1717113 1605384 1525609 1481523 1473336 1497849
37465A497849N0263O5402O7636N7560L8946J7227l037j9729l2993m3825n2892
$$ 1497849 1548112 1613514 1681150 1738710 1777656 1794883 1791846 1772117 1739124 1695299 1642407
37454A642407o0148o5137o7748o9078p1846p9835r6384j22724j57054j95069k31843
$$ 1642407 1582259 1517122 1449374 1380296 1308450 1228615 1132231 1009507 852453 657384 425541
37443D25541k63955k90470l11927l28193l36896l33835l15352k81222k36128j88375
$$ 425541 161586 -128884 -440811 -769004 -1105900 -1439735 -1755087 -2036309 -2272437 -2460812
37433b460812j46392j15109r4313p9698o5703m8470k7239l596K0481M3947O6389
$$ -2460812 -2607204 -2722313 -2816626 -2896324 -2962027 -3010497 -3037736 -3041332 -3020851 -2976904 -2910515
37422b910515Q7122J05202J20388J33554J45715J56586J64172J65940J60773J50611
$$ -2910515 -2823393 -2718191 -2597803 -2464249 -2318534 -2161948 -1997776 -1831836 -1671063 -1520452
37412a520452J40694J38035J48522J74069K11254K52106K86523L05356L03092
$$ -1520452 -1379758 -1241723 -1093201 -919132 -707878 -455772 -169249 136107 439199
37403D39199K79313K38463J87998J35681Q7140M4758Q382k2652m7599o3794o8057
$$ 439199 718512 956975 1144973 1280654 1367794 1412552 1420934 1398282 1350683 1286889 1218832
37392A218832n9043l8967j3471J0227K5797K9616K1549M641j6157l5838n0816
$$ 1218832 1159789 1120822 1107351 1117578 1143375 1172991 1194540 1199181 1183024 1147186 1096370
37381A096370n9233o0397n4693m4386l4103k9537l4592m9056o8661q7293r9545
$$ 1096370 1037137 976740 922047 877661 843558 814021 779429 730373 661712 574419 474874
37370D74874j01995r3151p3046m3176o603L2346O8777R8040J16609J23112J19072
$$ 474874 372879 279728 206682 163506 156903 189249 258026 356066 472675 595787 714859
37359G14859J08470R5903Q4394P4459O4704N3102L7942J8321n397l1195n5573
$$ 714859 823329 919232 1003626 1078085 1142789 1195891 1233833 1252154 1246757 1215562 1159989
37348A159989p4530q4981q5848p8576o7038n6948n4512o4336q7244j19032j51037
$$ 1159989 1085459 1000478 914630 836054 769016 712068 657556 593220 505976 386944 235907
37337B35907j72666j75199j55403j17070o9417k3231J3025L5193M3233L9869K9148
$$ 235907 63241 -111958 -267361 -384431 -453848 -477079 -464054 -428861 -385628 -345759 -316611
37326c16611J5347K399o403q553k600J1656L3007N8774Q4831J06152J17907J16683
$$ -316611 -301264 -298865 -305268 -313821 -316421 -304765 -271758 -212984 -128153 -22001 95906 212589
37314B12589J01052P1507L0294j8606o9761j17282j56307j84289k01467k10238
$$ 212589 313641 385148 415442 396836 327075 209793 53486 -130803 -332270 -542508
37304e42508k13773k14521k13276k09098j99875j83198j57330j21901p7914k7076
$$ -542508 -756281 -970802 -1184078 -1393176 -1593051 -1776249 -1933579 -2055480 -2133394 -2160470
37294b160470K8995Q8996J51301K12806K68063L09404L28604L19578K81068K17978
$$ -2160470 -2131475 -2042479 -1891178 -1678372 -1410309 -1100905 -772301 -452723 -171655 46323
37284D6323J40667O2275n111n3971q2834r4894r4676q4914o5476l4721P946O0055
$$ 46323 186990 249265 244154 190183 107349 12455 -82221 -167135 -232611 -267332 -259386 -199331
37272a99331J15930J68419K11570K42722K63199K77333K90135L04267L17554L22854
$$ -199331 -83401 85018 296588 539310 802509 1079842 1369977 1674244 1991798 2314652
37262B314652L11162K76642K20551J51564Q2367K4499j5661l7881m5772m2900
$$ 2314652 2625814 2902456 3123007 3274571 3356938 3381437 3365776 3327895 3282123 3239223
37252C239223l0255o950K6877O7915J10149J46917J72293J81316J70312J38237
$$ 3239223 3208968 3202018 3228895 3296810 3406959 3553876 3726169 3907485 4077797 4216034
37242D216034Q7980K5922m0491j05582j66735k23492k75249l19419l51359l66245
$$ 4216034 4304014 4329936 4289445 4183863 4017128 3793636 3518387 3198968 2847609 2481364
37232B481364l61600l39011l04220k65516k31034k05829j90037j78952j65041
$$ 2481364 2119764 1780753 1476533 1211017 979983 774154 584117 405165 240124
37223B40124j41038j02929n1593P692O7484J20735J62137J88254J97417J90051
$$ 240124 99086 -3843 -55436 -47744 19740 140475 302612 490866 688283 878334
37213H78334J68817J37949J01994O4844K9410k374k9521n1863o9794q3873r4312
$$ 878334 1047151 1185100 1287094 1351938 1381348 1378974 1349453 1297590 1227796 1143923 1049611
37202A049611j00525j01070r4402p9985n8966l3886q024J5158L2329M0851L9529
$$ 1049611 949086 848016 753614 673629 614663 580777 572753 587911 620240 661091 700620
37191G00620K9193J2938l985j4804j2972N358L9471Q4350J33026J79332K19121
$$ 700620 729813 742751 738766 723962 710990 716348 755819 840169 973195 1152527 1371648
37180A371648K49554K67675K70028K53944K19443J70119J12322N3268p05m5035
$$ 1371648 1621202 1888877 2158905 2412849 2632292 2802411 2914733 2968001 2967296 2922261
37170B922261p7177r6516j04364j04052j00587r9317j03683j13406j24799j33346
$$ 2922261 2845084 2748568 2644204 2540152 2439565 2340248 2236565 2123159 1998360 1865014
37160A865014j36738j35944j33517j30592j25062j12678r0471n9923k7302r24
$$ 1865014 1728276 1592332 1458815 1328223 1203161 1090483 1000012 940089 912787 911863
37150I11863J2418R306j0581m5437r1767j44462j97314k44052k79213k98448k98563
$$ 911863 924281 933587 923006 877569 785802 641340 444026 199974 -79239 -377687 -676250
37139f76250k78084k38522j85369j27242p2829k7422Q191L5504N4860O4065O0329
$$ -676250 -954334 -1192856 -1378225 -1505467 -1578296 -1605718 -1597527 -1562023 -1507163 -1443098 -1382769
37128a382769M3816J9703l020j5199j1132J0096M5659R0644J38699J81985K11904
$$ -1382769 -1338953 -1319250 -1322270 -1337469 -1348601 -1338505 -1292846 -1202202 -1063503 -881518 -669614
37117f69614K21177K06136J67804J11478M5336k1476q0884j27504j59171j76427
$$ -669614 -448437 -242301 -74497 36981 82317 60841 -20043 -147547 -306718 -483145
37107d83145j81360j76118j61442j35981r7389m4949J8119Q4429J44480J89730
$$ -483145 -664505 -840623 -1002065 -1138046 -1235435 -1280384 -1262265 -1177836 -1033356 -843626
37097h43626K15036K19637K06492J80638J47661J13071Q2385O0814N1907N5708
$$ -843626 -628590 -408953 -202461 -21823 125838 238909 321294 382108 434015 489723
37087D89723O7981Q1491Q8999Q6299P3482N3773L1000P492j6174l9906o2566q1575
$$ 489723 557704 639195 728194 814493 887975 941748 972748 980240 964066 924160 861594 780019
37075G80019r3905r7480r1864p7992n7860l4884j4413k948n641k3368n1529q1557
$$ 780019 686114 588634 496770 418778 360918 326034 311621 308673 303032 279664 228135 146578
37063A46578j04342j13514j06963q6186n4652j6544K3552O0829R1024J11585J22265
$$ 146578 42236 -71278 -178241 -264427 -319079 -335623 -312071 -251242 -160218 -48633 73632
37052G3632J24844J22187J17162J11577J05634R8526R0000Q1530P5873P5334Q0290
$$ 73632 198476 320663 437825 549402 655036 753562 843562 925092 1000965 1076299 1156589
37041A156589Q9034R8578J05507J06561R9109Q1745N4935K1495j3549m4155o5531
$$ 1156589 1245623 1344201 1449708 1556269 1655378 1737123 1792058 1813553 1800004 1755849 1690318
37030A690318p6213p8379p5903p1668o6297n9123n0270m1842l7360l9994n0847
$$ 1690318 1614105 1535726 1459823 1388155 1321858 1262735 1212465 1170623 1133263 1093269 1042422
37019A042422o8348q8917j08645j25110j38303j49891j60980j69822j71323j59122
$$ 1042422 974074 885157 776512 651402 513099 363208 202228 32406 -138917 -298039
37009b98039j28823q0058j6190N7209J33428K04921K63908L03836L20757L13757
$$ -298039 -426862 -506920 -523110 -465901 -332473 -127552 136356 440192 760949 1074706
36999A074706K84743K38362J81676J22534O7058J8058k4381o1013r2039j16927
$$ 1074706 1359449 1597811 1779487 1902021 1969079 1987137 1962756 1901743 1809704 1692777
36989A692777j34830j45020j47382j42837j33152j19780j02378p8320m4105J763
$$ 1692777 1557947 1412927 1265545 1122708 989556 869776 767398 689078 644973 646736
36979F46736N6266J11831J59220J91568K06757K06834J95637J76655J52280J24062
$$ 646736 703002 814833 974053 1165621 1372378 1579212 1774849 1951504 2103784 2227846
36969B227846R3138O0450K6829o768l9093o8689r4400j15811j33048j45910j53155
$$ 2227846 2320984 2381434 2408263 2401495 2362402 2293713 2199313 2083502 1950454 1804544 1651389
36958A651389j52881j43861j26881j04989q2514o3379m9584m0291l1843j8779
$$ 1651389 1498508 1354647 1227766 1122777 1040263 976884 927300 887009 855166 836387
36948H36387M107L9199Q4169J32228J74843K05640K23130K30837K34970K41241
$$ 836387 840494 879693 963862 1096090 1270933 1476573 1699703 1930540 2165510 2406751
36938B406751K52522K68090K84397K96673L00612K93565K75007K46217K09543
$$ 2406751 2659273 2927363 3211760 3508433 3809045 4102610 4377617 4623834 4833377
36929D833377J67748J23732Q0519M1100Q094j6465l1168l5418l0249j9400r211
$$ 4833377 5001125 5124857 5205376 5246476 5254570 5238105 5206937 5171519 5141270 5121870 5112659
36918E112659o736j6756l9799p2310j08442j42158j68920j86755j96468k00637
$$ 5112659 5105923 5089167 5049368 4977058 4868616 4726458 4557538 4370783 4174315 3973678
36908C973678k01853k01376j98983j93564j83789j68573j47503j21193r1332o0352
$$ 3973678 3771825 3570449 3371466 3177902 2994113 2825540 2678037 2556844 2465512 2405160
36898B405160l0771m426J8044L6846N1810O1293O2286N1853K8929m430m2739p8085
$$ 2405160 2374389 2369963 2388007 2424853 2476663 2537956 2600242 2652095 2681024 2676594 2633855 2555770
36886B555770j02441j10519j01682p9864n1627k3376J093K1422L9441N6518P1518
$$ 2555770 2453329 2342810 2241128 2161264 2109637 2086261 2087354 2108776 2148217 2204735 2276253
36875B276253Q0726P9725O5934M0557R077k0192l9195m3527l4250j7026R36J4355
$$ 2276253 2356979 2436704 2502638 2543195 2552272 2532080 2492885 2449358 2415108 2398082 2399018 2413373
36863B413373K1781K4948K6258K6391K3658J5435P59j7586l3189l9137l2534j6928
$$ 2413373 2435154 2460102 2486360 2512751 2536409 2551844 2552603 2535017 2501828 2462691 2430157 2413229
36851B413229l59R449Q842j399j7844l5974n0794n7579n3378l8586j7451K893
$$ 2413229 2412870 2422319 2431161 2429762 2411918 2375944 2325150 2267571 2214193 2175607 2158156 2161049
36839B161049J4432J0758j0695m7301r1465j32716j61320j71813j64666j45088
$$ 2161049 2175481 2186239 2175544 2128243 2036778 1904062 1742742 1570929 1406263 1261175
36829A261175j20089r5839p6486o4124n9034o0071o5514p4029q4649r5379j01875
$$ 1261175 1141086 1045247 968761 904637 845603 785532 720018 645989 561340 465961 364086
36818C64086r8380q1114n1637j7087J3157L2175L8624L6824L3901L5499M2466
$$ 364086 265706 184592 132955 115868 129025 161200 199824 236648 270549 306048 348514
36807C48514N0798N4694N0184L6789J7161l824j9980k5518j7436K991L1045O0974
$$ 348514 399312 454006 504190 540979 558140 554316 534336 508818 491382 494373 525418 586392
36795E86392Q8049J09292J23416J30736J33165J33686J35217J39463J46479J55073
$$ 586392 674441 783733 907149 1037885 1171050 1304736 1439953 1579416 1725895 1880968
36785A880968J63403J69349J70861J66725J57295J44321J29770J14672R8832Q1239
$$ 1880968 2044371 2213720 2384581 2551306 2708601 2852922 2982692 3097364 3196196 3277435
36775C277435O0854L7623J3419q017k2782k9135k8622k5151k3007k5132l2507
$$ 3277435 3338289 3375912 3389331 3381314 3358532 3329397 3300775 3275624 3252617 3227485 3194978
36764C194978m4662o0848q0803j04263j29497j52483j67905j71415j61416j39304
$$ 3194978 3150316 3089468 3008665 2904402 2774905 2622422 2454517 2283102 2121686 1982382
36754A982382j08570p3773l9710j0435J2020K8289M0744N1458O0787O7818P1669
$$ 1982382 1873812 1800039 1760329 1749894 1761914 1790203 1830947 1882405 1943192 2011010 2082679
36743B082679P1904O7965N9065M5252K8499J2249k36p299r094o969k754J786N234
$$ 2082679 2154583 2222548 2281613 2326865 2355364 2367613 2367377 2360078 2350984 2344015 2341261 2343047 2348281
36730B348281O475M664l70p477j4224j8150j8588j7472j8192k3175l1729l9642
$$ 2348281 2354756 2359420 2359050 2351573 2337349 2319199 2300611 2283139 2264947 2241772 2210043 2170401
36718B170401m0921l0869r011J9768M6669O2564O2023M5877K1241r70j0114N3
$$ 2170401 2129480 2098611 2089600 2109368 2156037 2218601 2280624 2326501 2347742 2346772 2336658 2336711
36706B336711K9134P1054J17496J61634J99906K31624K57437K77809K92024K97902
$$ 2336711 2365845 2436899 2554395 2716029 2915935 3147559 3404996 3682805 3974829 4272731
36696D272731K92399K72665K37013J85497J20378M6597k8209r4821j44794j73251
$$ 4272731 4565130 4837795 5074808 5260305 5380683 5427280 5399071 5304250 5159456 4986205
36686D986205j80782j73322j59815j48652j44429j46456j49799j48475j39000
$$ 4986205 4805423 4632101 4472286 4323634 4179205 4032749 3882950 3734475 3595475
36677C595475j21897j00132p6123n0252k2031P699L6226O0753Q0610R7600J13764
$$ 3595475 3473578 3373446 3297323 3247071 3225040 3232739 3268965 3329718 3410328 3507928 3621692
36666C621692J28496J37475J34693J16211Q3087M1534K07l3842n8299p6065r2841
$$ 3621692 3750188 3887663 4022356 4138567 4221654 4263188 4263395 4229553 4171254 4095189 4002348
36655D002348j13643j40572j72648k06925k39697k67645k88926l03637l13072
$$ 4002348 3888705 3748133 3575485 3368560 3128863 2861218 2572292 2268655 1955583
36646A955583l18217l18488l11472k93678k62034k15744j57430r2567k7428L3137
$$ 1955583 1637366 1318878 1007406 713728 451694 235950 78520 -14047 -41475 -8338
36636h338Q6736J33190J73454K08342K37483K59124K70822K70443K56629K28934
$$ -8338 78398 211588 385042 593384 830867 1089991 1360813 1631256 1887885 2116819
36626B116819J88251J37875Q4075L5154j222k0906k4795j8240q962m533j0281
$$ 2116819 2305070 2442945 2527020 2562174 2560952 2540046 2515251 2497011 2488049 2483516 2473235
36615B473235k8004n5812q9175j22748j52049j74248j88108j93697j92172j85485
$$ 2473235 2445231 2389419 2300244 2177496 2025447 1851199 1663091 1469394 1277222 1091737
36605A091737j75622j63595j48790j29255j02953o9317l0235J0125M6312P2847
$$ 1091737 916115 752520 603730 474475 371522 302205 271970 282095 328407 401254
36595D01254Q5405Q2050O4316L7254P860j7367l4305m1781m1031l4626k5069j3700
$$ 401254 486659 568709 633025 670279 678139 660772 626467 584686 543655 509029 483960 470260
36583D70260p42J3538K7754L9653M7298M9818M7169L9682K8298J5280M432L5M755
$$ 470260 469518 483056 510810 550463 597761 647579 694748 734430 762728 778008 782440 782475 787230
36570G87230J7951L6008N4724P1779Q7084J01054J13084J21807J26410J27403
$$ 787230 805181 841189 895913 967692 1054776 1155830 1268914 1390721 1517131 1644534
36560A644534J26184J24009J21039J15858J05830Q8410O2746L0717l059l2350
$$ 1644534 1770718 1894727 2015766 2131624 2237454 2325864 2388610 2419327 2416268 2383918
36550B383918n1485n7766n2482l9402k1902j363K1860M6383O9027Q6145R5647
$$ 2383918 2332433 2274667 2222185 2182783 2160881 2159518 2181378 2227761 2296788 2382933 2478580
36539B478580R8033R5865R2501R0956R3314J00437J11786J25517J38877J48701
$$ 2478580 2576613 2672478 2764979 2855935 2949249 3049686 3161472 3286989 3425866 3574567
36529C574567J51709J44968J26900R8423O3056K5384j1163m5540p8428j10395
$$ 3574567 3726276 3871244 3998144 4096567 4159623 4185007 4173844 4128304 4049876 3939481
36519C939481j40280j64806j79504j80481j66285j39051j04252o8899l8856j6744
$$ 3939481 3799201 3634395 3454891 3274410 3108125 2969074 2864822 2795923 2757067 2740323
36509B740323j501J0136K1079L1690L9355M0301L2662J8635M294k653M320K8495
$$ 2740323 2738822 2748958 2770037 2801727 2841082 2881383 2914045 2932680 2936974 2934321 2938641 2967136
36497B967136O8858J20144J74086K21713K55676K71404K66686K40614J93382J27440
$$ 2967136 3035994 3156138 3330224 3551937 3807613 4079017 4345703 4586317 4779699 4907139
36487D907139M8941l2106j03766j55304j79976j76319j47653j00271m1283K2690
$$ 4907139 4956080 4923974 4820208 4664904 4484928 4308609 4160956 4060685 4019402 4042092
36477D042092Q5746J42692J89894K26657K55622K81234L07083L34006L60472L84835
$$ 4042092 4127838 4270530 4460424 4687081 4942703 5223937 5531020 5865026 6225498 6610333
36467F610333M07432M30477M55604M81034N00880N07351M94493M61379M12925
$$ 6610333 7017765 7448242 7903846 8384880 8885760 9393111 9887604 10348983 10761908
36458A0761908L57605L03094K52535K04161J54245J00477M3134j5872p4164j29019
$$ 10761908 11119513 11422607 11675142 11879303 12033548 12134025 12177159 12161287 12087123 11958104
36448A1958104j77106k14775k38947k47855k40879k17706j77539j19404m3581
$$ 11958104 11780998 11566223 11327276 11079421 10838542 10620836 10443297 10323893 10280312
36439A0280312M6824J45466K43906L33550M07463M61567M95369N12153N18520
$$ 10280312 10327136 10472602 10716508 11050058 11457521 11919088 12414457 12926610 13445130
36430A3445130N23002N33860N56773N93473O42018O98643P60056Q24919Q93603
$$ 13445130 13968132 14501992 15058765 15652238 16294256 16992899 17752955 18577874 19471477
36421A9471477R66737J043773J123089J203453J285527J371813J465142J567034
$$ 19471477 20438214 21481987 22605076 23808529 25094056 26465869 27931011 29498045
36413B9498045J677332J795162J920486K055348K204292K373748K570693K801669
$$ 29498045 31175377 32970539 34891025 36946373 39150665 41524413 44095106 46896775
36405D6896775L072920L391315L764394M198735M697751N260984N885899O571197
$$ 46896775 49969695 53361010 57125404 61324139 66021890 71282874 77168773 83739970
36397H3739970P319915Q140929R047890J0055512J1174339J2405950J3739913
$$ 83739970 91059885 99200814 108248704 118304216 129478555 141884505 155624418
36390A55624418J5152157J6603269J8034683J9360471K0454588K1138057K1175989
$$ 155624418 170776575 187379844 205414527 224774998 245229586 266367643 287543632
36383B87543632K0296488J8240645J4843769J0129717M377535j888190q004301
$$ 287543632 307840120 326080765 340924534 351054251 355431786 353543596 345539295
36376C45539295j3339248j7450323k0159831k1533724k1797543k1240735k0143750
$$ 345539295 332200047 314749724 294589893 273056169 251258626 230017891 209874141
36369B09874141j8737985j7193447j5624028j4100476j2664136j1338163j0134907
$$ 209874141 191136156 173942709 158318681 144218205 131554069 120215906 110080999
36362A10080999r059285q109306p276266o546414n903681n332202m818179m351327
$$ 110080999 101021714 92912408 85636142 79089728 73186047 67853845 63035666 58684339
36354E8684339l925681l539087l191584k883552k614491k382645k185209k018642
$$ 58684339 54758658 51219571 48027987 45144435 42529944 40147299 37962090 35943448
36346C5943448j878616j759714j655312j558133j461264j359398j249887j133059
$$ 35943448 34064832 32305118 30649806 29091673 27630409 26271011 25021124 23888065
36338B3888065j011368q87818p64738o43630n25796m13223l09497k20169j51547
$$ 23888065 22876697 21988879 21224141 20580511 20054715 19641492 19331995 19111826 18960279
36329A8960279j07889q8916q9919j04615j28323j59158j96928k41125k89482l37621
$$ 18960279 18852390 18763474 18673555 18568940 18440617 18281459 18084531 17843406 17553924 17216303
36319A7216303l79754m10115m24575m21788m03541l74341l40678l10093k90046
$$ 17216303 16836549 16426434 16001859 15580071 15176530 14802189 14461511 14151418 13861372
36310A3861372k86486l02440l37042l85182m37792m83162n09603n09148m80667
$$ 13861372 13574886 13272446 12935404 12550222 12112430 11629268 11119665 10610517 10129850
36301A0129850m30690l71059l14389k69556k39408k21242k08975j95538j75183
$$ 10129850 9699160 9328101 9013712 8744156 8504748 8283506 8074531 7878993 7703810
36292G703810j45932j11321p9673o0419n9602p7457j08872j45463j77711j96842
$$ 7703810 7557878 7446557 7366884 7306465 7246863 7169406 7060534 6915071 6737360 6540518
36282F540518j96614j74785j33736p9980k2463L0096P1933J01491J20201J29628
$$ 6540518 6343904 6169119 6035383 5955403 5932940 5963036 6034969 6136460 6256661 6386289
36272F386289J29233J16385Q8238M3762j5192q3605j53524k15416k60981k86021
$$ 6386289 6515522 6631907 6720145 6763907 6748715 6665110 6511586 6296170 6035189 5749168
36262E749168k91148k79702k54909k18683j72260j17238n5896Q757P2640J30086
$$ 5749168 5458020 5178318 4923409 4704726 4532466 4415228 4359332 4368089 4440729 4570815
36252D570815J73993J97132J94552J66026J16963N6547n998o4452j15881j58753
$$ 4570815 4744808 4941940 5136492 5302518 5419481 5476028 5470030 5405578 5289697 5130944
36242E130944j91212k11309k18527k14942k04905j93585j85318j82459j85077
$$ 5130944 4939732 4728423 4509896 4294954 4090049 3896464 3711146 3528687 3343610
36233C343610j91553j99614k07259k12995k15676k14441k08858j98962j84972
$$ 3343610 3152057 2952443 2745184 2532189 2316513 2102072 1893214 1694252 1509280
36224A509280j66910j44403j16620q2391m0696Q452O3313J20537J76004K25738
$$ 1509280 1342370 1197967 1081347 998956 958260 966712 1030025 1150562 1326566 1552304
36214A552304K66544K96322L14288L21126L18997L11252L01669K93231K87072
$$ 1552304 1818848 2115170 2429458 2750584 3069581 3380833 3682502 3975733 4262805
36205D262805K82144K75720K64133K43676K11726J67786J13603N2002j4670q5061
$$ 4262805 4544949 4820669 5084802 5328478 5540204 5707990 5821593 5873595 5858925 5773864
36195E773864j58029k31456l01718l63943m12728m42943m50784m34989l97669
$$ 5773864 5615835 5384379 5082661 4718718 4305990 3863047 3412263 2977274 2579605
36186B579605l44076k81084k15275j51794r4334m5535o724K2783M5668O5075Q2451
$$ 2579605 2235529 1954445 1739170 1587376 1493042 1447507 1440783 1463566 1509234 1574309 1656760
36175A656760R6499J04129J02659R1555P2726M9365K4273j312k7618n4967q2164
$$ 1656760 1753259 1857388 1960047 2051602 2124328 2173693 2197966 2196654 2169036 2114069 2031905
36164B031905j05840j21354j24509j13153q8054n3200j5330J7466L8094M2862
$$ 2031905 1926065 1804711 1680202 1567049 1478995 1425795 1410465 1427931 1466025 1508887
36154A508887L2808J3485o607j8412j5228M693L7196P4112J07079J30794J43423
$$ 1508887 1541695 1555180 1548573 1530161 1514933 1519626 1556822 1630934 1738013 1868807 2012230
36143B012230J44725J34383J12369Q0509M2969M840l0094o0445q6752j10182j31475
$$ 2012230 2156955 2291338 2403707 2484216 2527185 2532025 2501931 2441486 2354734 2244552 2113077
36132B113077j50638j67231j80968j92117k01061k07074k07192j96572j70696
$$ 2113077 1962439 1795208 1614240 1422123 1221062 1013988 806796 610224 439528
36123D39528j28182p2149r296N2475J06059J45968J68500J72268J59000J33613
$$ 439528 311346 239197 229901 282376 388435 534403 702903 875171 1034171 1167784
36113A167784J02561P1196M1965J4798j0927l4612n4234o7553p3402p1930o3737
$$ 1167784 1270345 1341541 1383506 1398304 1387377 1352765 1298531 1230978 1157576 1085646 1021909
36102A021909m9080k8381l754K0292L8304M6527M4364L3727J7626m36j6457k6427
$$ 1021909 972829 944448 940694 960986 999290 1045817 1090181 1123908 1141534 1141098 1124641 1098214
36090A098214k7436j8366M17K7779O2110J01136J41857J80969K15570K43913K65948
$$ 1098214 1070778 1052412 1052829 1080608 1142718 1243854 1385711 1566680 1782250 2026163 2292111
36079B292111K83624L00581L20610L45092L70799L90093L94021L76362L36124
$$ 2292111 2575735 2876316 3196926 3542018 3912817 4302910 4696931 5073293 5409417
36070E409417K77400K07526J34724O5880M870m8076r5633j41685j89284k38932
$$ 5409417 5686817 5894343 6029067 6094947 6099817 6051741 5956108 5814423 5625139 5386207
36060E386207k87793l30330l60270l72914l66733l43525l07412k63402k16375
$$ 5386207 5098414 4768084 4407814 4034900 3668167 3324642 3017230 2753828 2537453
36051B537453j70761j30492r8753p7586o7532o7315p3463q0529q2697p6570o3274
$$ 2537453 2366692 2236200 2137447 2059861 1992329 1925014 1851551 1771022 1688325 1611755 1548481
36040A548481m8046l7194l4333l8292m4170m6664m3102l3800k0019k104K0045
$$ 1548481 1500435 1463241 1428908 1390616 1346446 1299782 1256680 1222880 1202861 1200757 1220802
36029A220802M4768O7184Q0010P6218N2024Q787m7107j06551j61083k05261k36617
$$ 1220802 1265570 1332754 1412764 1488982 1541006 1549793 1502686 1396135 1235052 1029791 793174
36018G93174k53741k54605k36793j99636j46439q4790k4327K6734O4191Q8192
$$ 793174 539433 284828 48035 -151601 -298040 -382830 -407157 -380423 -316232 -228040
36008b28040J01571J07567J08352J05135R9355R3597R1057R3839J01688J12351
$$ -228040 -126469 -18902 89450 194585 293940 387537 478594 572433 674121 786472
35998G86472J23090J31804J37108J37959J33839J25317J14144J02461R1686Q1836
$$ 786472 909562 1041366 1178474 1316433 1450272 1575589 1689733 1792194 1883880 1965716
35988A965716P1696N9608M4612K7602J1810J830J166R580K2270L2131L4069K8499
$$ 1965716 2037412 2097020 2141632 2169234 2181044 2182874 2184040 2193620 2215890 2248021 2282090 2310589
35976B310589K1465K1234L3865O0635R8423J41849J85444K24803K56838K79505
$$ 2310589 2332054 2353288 2387153 2447788 2546211 2688060 2873504 3098307 3355145 3634650
35966C634650K91276K90571K75395K43799J95275J32524O2276n796o1849r8935
$$ 3634650 3925926 4216497 4491892 4735691 4930966 5063490 5125766 5119970 5058121 4959186
35956D959186j14911j12580r8405q0543o6773o2597o9770q5752j04559j18833
$$ 4959186 4844275 4731695 4633290 4552747 4485974 4423377 4353607 4267855 4163296 4044463
35946D044463j22212j10976q4686m6108o46M4882Q4101J12826J29875J36516J35066
$$ 4044463 3922251 3811275 3726589 3680481 3679835 3724717 3808818 3921644 4051519 4188035 4323101
35935D323101J27673J15955J01292Q4866O7096M7046K2802p325m3765q5417j29777
$$ 4323101 4450774 4566729 4668021 4752887 4819983 4867029 4889831 4882506 4838741 4753324 4623547
35924D623547j72905k09388k33075k38965k25668j96970j60816j25718r6937p5552
$$ 4623547 4450642 4241254 4008179 3769214 3543546 3346576 3185760 3060042 2963105 2887553
35914B887553o0983n3902n6197o7969q4905r8946j01851q8920o0279j9462K9125
$$ 2887553 2826570 2772668 2716471 2648502 2563597 2464651 2362800 2273880 2213601 2194139 2223264
35903B223264Q1756J35171J85476K27714K56706K68644K62303K39525K04849J64474
$$ 2223264 2305020 2440191 2625667 2853381 3110087 3378731 3641034 3880559 4085408 4249882
35893D249882J24721R0466O4120M5421L1905J9688M296j8377n0982r3732j44087
$$ 4249882 4374603 4465069 4529189 4574610 4606515 4626203 4630499 4612122 4561140 4467408 4323321
35882D323321j97094k46099k83682l03203l00883k77444k37947j89738j39824
$$ 4323321 4126227 3880128 3596446 3293243 2992360 2714916 2476969 2287231 2147407
35873B147407r3095n1974j7125J1577L4422N1759O3858P0465P0418O2248M5592
$$ 2147407 2054312 2002338 1985213 1996790 2031212 2082971 2146829 2217294 2287712 2349960 2395552
35862B395552K2062n569l5364o7564j03823j44881j88499k29645k63029k85925
$$ 2395552 2417614 2412045 2376681 2309117 2205294 2060413 1871914 1642269 1379240 1093315
35852A093315k98793l03369l00282k88600k67452k37711k02160j64393j27711
$$ 1093315 794522 491153 190871 -97729 -365181 -602892 -805052 -969445 -1097156
35843a097156r4790o7754m7971l5421k8217k2754j4799j118J9034M3500O8219
$$ -1097156 -1191946 -1259700 -1307671 -1343092 -1371309 -1394063 -1408862 -1409980 -1390946 -1347446 -1279227
35832a279227Q9040J03084J08841J05612R3409P3580M9219K4636M158q820j2293
$$ -1279227 -1190187 -1087103 -978262 -872650 -779241 -705661 -656442 -631806 -627648 -636468 -648761
35821f48761n831R355L0460N3410P3719Q7992R5436R7858R7438R3933Q4076O4220
$$ -648761 -654592 -645237 -614777 -561367 -487648 -399656 -304220 -206362 -108924 -14991 69085 133305
35809A33305L4046j725l4864n7238o4338n7078m1259k5167j6638k0682l8176o5532
$$ 133305 167351 165626 130762 73524 9186 -47892 -89151 -114318 -130956 -151638 -189814 -255346
35797b55346r5499j19118j28332j18171q7929m1307J4511P0720J19385J55562
$$ -255346 -350845 -469963 -598295 -716466 -804395 -845702 -831191 -760471 -641086 -485524
35787d85524J78314J90397J96718K01886K07947K13863K17312K17370K15694K15285
$$ -485524 -307210 -116813 79905 281791 489738 703601 920913 1138283 1353977 1569262
35777A569262K18127K23589K28453K28221K18923J98770J68836J32398R3406N5080
$$ 1569262 1787389 2010978 2239431 2467652 2686575 2885345 3054181 3186579 3279985 3335065
35767C335065J9430j2581m0689o5106q6208j04152j18730j29633j36825j40517
$$ 3335065 3354495 3341914 3301225 3236119 3149911 3045759 2927029 2797396 2660571 2520054
35757B520054j40740j37067j29000j16699j01453q5535p1603o1856n7121n6036
$$ 2520054 2379314 2242247 2113247 1996548 1895095 1809560 1737957 1676101 1618980 1562944
35747A562944n4932m8733l2986o305K8074O3102R1261J08530J15984J17901J18156
$$ 1562944 1508012 1459279 1426293 1419988 1448062 1511164 1602425 1710955 1826939 1944840 2062996
35736B062996J17976J16482J12834J07746J03048R9847R6872R0587P7101N4443
$$ 2062996 2180972 2297454 2410288 2518034 2621082 2720929 2817801 2908388 2985489 3039932
35726C039932K3612j1911m7368p7915r9638j10242j09131r6883p4847m5207j1056
$$ 3039932 3063544 3051633 3004265 2926350 2826712 2716470 2607339 2510456 2435609 2390402 2379346
35715B379346K4283N8375R0086J18684J42504J58508J63337J54987J33879J02917
$$ 2379346 2403629 2462004 2552090 2670774 2813278 2971786 3135123 3290110 3423989 3526906
35705C526906O6969L2170M710j1283j5803j3266j0243j2252k1935l9435o3505
$$ 3526906 3593875 3626045 3630755 3619472 3603669 3590403 3580160 3567908 3545973 3506538 3443033
35694C443033r1628j19364j40437j48627j40480j17106q4070m9777k3159j1194
$$ 3443033 3351405 3232041 3091604 2942977 2802497 2685391 2601321 2551544 2528385 2517191
35684B517191j6709l7336o6443r5966j19790j35859j45905j52857j57632j57417
$$ 2517191 2500482 2463146 2396703 2300737 2180947 2045088 1899183 1746326 1588694 1431277
35674A431277j46818j21244q0137k7883K7950P9580J21373J50437J65772J67141
$$ 1431277 1284459 1163215 1083078 1055195 1083145 1162725 1284098 1434535 1600307 1767448
35664A767448J54772J29915R5187N4064J0199l2265o7854q9978r3237p6376m3393
$$ 1767448 1922220 2052135 2147322 2201386 2211585 2179320 2111466 2021488 1928251 1851875 1808482
35653A808482j721M1328Q1606J18902J55194J91414K24808K48789K55371K38503
$$ 1808482 1806761 1848089 1929695 2048597 2203791 2395205 2620013 2868802 3124173 3362676
35643C362676J96239J31116M9330m0576j29259k08262k71356l15417l40682l50284
$$ 3362676 3558915 3690031 3739361 3698785 3569526 3361264 3089908 2774491 2433809 2083525
35633B083525l48750l40048l26510l09508k91013k74171k62047k55482k51777
$$ 2083525 1734775 1394727 1068217 758709 467696 193525 -68522 -324004 -575781
35624e75781k45044k28091j94877j42797p4059M258Q1767J47812J95030K21815
$$ -575781 -820825 -1048916 -1243793 -1386590 -1460649 -1456391 -1374624 -1226812 -1031782 -809967
35614h09967K32211K33289K31455K29679K26640K17890J98191J63991J14950N3967
$$ -809967 -577756 -344467 -113012 116667 343307 561197 759388 923379 1038329 1092296
35604A092296j4001q3496j49407k06839k50670k75924k79401k61402k26040j79731
$$ 1092296 1078295 994799 845392 638553 387883 111959 -167442 -428844 -654884 -834615
35594h34615j29181q0176l7404m518J6301K5179K5024K0964J8566K1730L1405
$$ -834615 -963796 -1043972 -1081376 -1085894 -1069593 -1044414 -1019390 -998426 -979860 -958130 -926725
35583i26725M5549N9913O9488P0598O3106N0931L9760L3377L1449L0455K6556
$$ -926725 -881176 -821263 -751775 -681177 -618071 -567140 -527380 -494003 -462554 -432099 -405543
35572d05543J8156O727l948r241n112J1010L9997Q1058J31601J86832K39576K81027
$$ -405543 -387387 -380660 -384608 -393849 -398961 -387951 -347954 -266896 -135295 51537 291113 572140
35560E72140L02915L00607K75330K33747J84822J36218R2708N6938L0584J4177
$$ 572140 875055 1175662 1450992 1684739 1869561 2005779 2098487 2155425 2186009 2200186
35550B200186N903J318m855j5880l1318m8036o3162p6773r2176j13532j42530
$$ 2200186 2206089 2207407 2202552 2186672 2155354 2107318 2044156 1967383 1875207 1761675 1619145
35539A619145j76448k08708k31356k37819k24888j93516j48345r6131m3613M175
$$ 1619145 1442697 1233989 1002633 764814 539926 346410 198065 101934 58321 62496
35529F2496M4356P5511R6717J07114J06311R5264P6800N5216L5206K0723J4202
$$ 62496 106852 182363 279080 386194 492505 587769 664569 719785 754991 775714 789916
35518G89916J5984K4116L5223M6631N8231P2154Q9999J09792J25107J27045J07774
$$ 789916 805900 830016 865239 911870 970101 1042255 1132254 1242046 1367153 1494198 1601972
35507A601972O3838j993q0906j60198k26625k69768k84239k70195k32335j78199
$$ 1601972 1665810 1663817 1582911 1422713 1196088 926320 642081 371886 139551 -38648
35497c8648j16599n6444n581L0801N1766O1088O5875P3614Q9124J12684J40021
$$ -38648 -155247 -211691 -217272 -186471 -134705 -73617 -7742 65872 154996 267680 407701
35486D07701J63829J76217J71416J47869J09123O3167K0504q667j7620n683K1247
$$ 407701 571530 747747 919163 1067032 1176155 1239322 1259826 1251159 1233539 1227856 1249103
35475A249103N3098Q0068R6664J03002J02888J00196R5937Q7590P0841M2416K491
$$ 1249103 1302201 1382269 1478933 1581935 1684823 1785019 1880956 1968546 2039387 2081803 2084294
35464B084294m4511r1046j29092j53201j62433j60138j51981j43428j37752j35021
$$ 2084294 2039783 1948737 1819645 1666444 1504011 1343873 1191892 1048464 910712 775691
35454G75691j32380j25866j13104r5226p6503o1824n3569m9848m5203l3517j1513
$$ 775691 643311 517445 404341 309115 232612 170788 117219 67371 22168 -11349 -22862
35443b2862J9361N3743Q4998J07737J19290J20224J14146J06533J02464J04357
$$ -22862 -3501 50242 135240 242977 362267 482491 596637 703170 805634 909991
35433I09991J11103J18977J23521J21220J10569R2638P0931N0147L3973K3159
$$ 909991 1021094 1140071 1263592 1384812 1495381 1588019 1658950 1709097 1743070 1766229
35423A766229J5271O388o557k4175m4385o3276p6862q3151q3504q2000q3147q9735
$$ 1766229 1781500 1787888 1781331 1757156 1712771 1649495 1572633 1489482 1405978 1323978 1240831 1151096
35411A151096j02533j21538j46989j78919k15547k51993k80394k91563k77548
$$ 1151096 1048563 927025 780036 601117 385570 133577 -146817 -438380 -715928
35402g15928k34148j62695p0535K9980J24038J98176K44291K62130K58692K44774
$$ -715928 -950076 -1112771 -1183306 -1153326 -1029288 -831112 -586821 -324691 -65999 178775
35392A78775K30623K23179K25744K38830K60720K87496L13413L32057L37505L24844
$$ 178775 409398 632577 858321 1097151 1357871 1645367 1958780 2290837 2628342 2953186
35382B953186K90583K33987J59097P5376m602o9494j12908j34579j39409j35377
$$ 2953186 3243769 3477756 3636853 3712229 3707627 3638133 3525225 3390646 3251237 3115860
35372C115860j30615j29952j32594j33157j25908j09137q6391o4221m8737m3273
$$ 3115860 2985245 2855293 2722699 2589542 2463634 2354497 2268106 2203885 2155148 2111875
35362B111875m7888o0093p6058r1524j02264j04407r5172p3653m1113p01M2766
$$ 2111875 2063987 2003894 1927836 1836312 1734048 1629641 1534469 1460816 1419703 1419002 1461768
35351A461768Q2904J12449J25190J18342R4100N9426K4140k113j3038p679R844
$$ 1461768 1544672 1657121 1782311 1900653 1994753 2054179 2078319 2076206 2063168 2055489 2065333
35340B065333L2683N4460P1657Q4168R3980J02924J11068J16662J17331J11338
$$ 2065333 2098016 2152476 2224133 2308301 2402281 2505205 2616273 2732935 2850266 2961604
35330B961604R8258P9131N6261L2460R798j1322l1878n2822p3574r1511j02619
$$ 2961604 3059862 3138993 3195254 3227714 3237512 3226190 3194312 3141490 3067916 2976405 2873786
35319B873786j02969r0484o6357l5325m236K0705L6486M3999M6380M6158M3420
$$ 2873786 2770817 2680333 2613976 2578651 2574415 2595120 2631606 2675605 2721985 2768143 2811563
35308B811563L6377K3923Q027o191j3087j0131n7R858J1110j942k9416o6070j03862
$$ 2811563 2847940 2871863 2879890 2873699 2860612 2850481 2850424 2860282 2871392 2869450 2840034 2773964 2670102
35295B670102j34942j53202j54319j35770r7659m3664J9347Q3301J41436J89907
$$ 2670102 2535160 2381958 2227639 2091869 1994210 1950546 1969893 2053194 2194630 2384537
35285B384537K27675K55062K72164K78493K73928K59745K38500K13027J85821
$$ 2384537 2612212 2867274 3139438 3417931 3691859 3951604 4190104 4403131 4588952
35276D588952J59118J34755J13209R2935P1307M7043K2059R81j1737j5144j3070
$$ 4588952 4748070 4882825 4996034 5088969 5160276 5207319 5229378 5230359 5218622 5203478 5190408
35265E190408j2182j7919l1292m8848o5524p7804q4908q7743q7190q3298p5788
$$ 5190408 5178226 5160307 5129015 5080167 5014643 4936839 4851931 4764188 4676998 4593700 4517912
35254D517912o5035n2500m0352l0898k6427k9355m2071o6264j02225j48348k00703
$$ 4517912 4452877 4400377 4360025 4329127 4302700 4273345 4231274 4165010 4062785 3914437 3713734
35243C713734k52672k95452l19976l19666k92451k41085j72001r3619j4704N7139
$$ 3713734 3461062 3165610 2845634 2525968 2233517 1992432 1820431 1726812 1712108 1769247
35233A769247J16639J61139J89661K01359J94752J68737J24620O7378M796n4880
$$ 1769247 1885886 2047025 2236686 2438045 2632797 2801534 2926154 2993532 2998328 2943448
35223B943448j05185j42432j65443j74555j70595j54584j28471r6201o3930l8826
$$ 2943448 2838263 2695831 2530388 2355833 2185238 2030654 1902183 1805982 1742052 1703226
35213A703226k7083l2051n2869q4077j16811j41707j52270j46746j27502r8634
$$ 1703226 1676143 1644092 1591223 1507146 1390335 1248628 1096358 949612 822110 723476
35203G23476o3521k3890J9094O2842J02238J30692J42567J35156J09011O7152
$$ 723476 659955 636065 655159 718001 820239 950931 1093498 1228654 1337665 1404817
35193A404817J4211m3937j00479j48303j81034j94155j85792j56947j11356n5126
$$ 1404817 1419028 1375091 1274612 1126309 945275 751120 565328 408381 297025 241899
35183B41899M018N8136J00817J28262J39042J33259J12324P9670M1383N531j9925
$$ 241899 245917 304053 404870 533132 672174 805433 917757 997427 1038810 1044341 1024416
35172A024416k9606k2379j358K7769N9260Q9281J16302J40031J59905J74198J80007
$$ 1024416 994810 972431 971073 998842 1058102 1147383 1263685 1403716 1563621 1737819 1917826
35161A917826J74149J54653J22329Q1248L7604k484l4679n6745o7847o7774n6710
$$ 1917826 2091975 2246628 2368957 2450205 2487809 2485325 2450646 2393901 2326054 2258280 2201570
35150B201570l5526o143K8621O5990J04169J42007J77209K04863K18331K12379
$$ 2201570 2166044 2159901 2188522 2254512 2358681 2500688 2677897 2882760 3101091 3313470
35140C313470J86158J43763R2210L8293j3791o2918j09393j52469j89179k15692
$$ 3313470 3499628 3643391 3735601 3773894 3760103 3697185 3587792 3435323 3246144 3030452
35130C030452k29945k32905k27228k14803j95965j71276j44042j20744j08444
$$ 3030452 2800507 2567602 2340374 2125571 1929606 1758330 1614288 1493544 1385100
35121A385100j10979j26921j50554j74838j94106k05069k06230j96926j77065
$$ 1385100 1274121 1147200 996646 821808 627702 422633 216403 19477 -157588
35112a57588j47798j12346p5898m4370k2570j2633j3255j9988k6815k8700k3927
$$ -157588 -305386 -417732 -493630 -538000 -560570 -573203 -586458 -606446 -633261 -661961 -685888
35101f85888j4883o674m354j0094k1804l3934m0079l6025k1536k6K3659M5910
$$ -685888 -700771 -707445 -711799 -721893 -743697 -777631 -817710 -853735 -875271 -875297 -851638 -805728
35089h05728O5786Q4219J01660J16363J24817J24074J13938R7421P9622O5996
$$ -805728 -739942 -655723 -554063 -437700 -312883 -188809 -74871 22550 102172 168168
35079A68168O1029O7482Q5984J14811J49893J85198K13518K27648K21975J94563
$$ 168168 229197 296679 382663 497474 647367 832565 1046083 1273731 1495706 1690269
35069A690269J48876R3803M1086J326j9356k0513o621J4626L4385M4833M1067
$$ 1690269 1839145 1932948 1974034 1975360 1956004 1935491 1928870 1943496 1977881 2022714 2063781
35058B063781K2168q961m6933q5769j20393j47121j63487j68339j62361j48248
$$ 2063781 2085949 2076988 2030055 1944286 1823893 1676772 1513285 1344946 1182585 1034337
35048A034337j29947j11319r5077q2170p1200n8073l6792k089M6870J04146J58299
$$ 1034337 904390 793071 697994 615824 544624 486551 449759 447670 494540 598686 756985
35037G56985J97456K15383K14537K04189J95371J96159K09559K33658K62601K87908
$$ 756985 954441 1169824 1384361 1588550 1783921 1980080 2189639 2423297 2685898 2973806
35027B973806L00612K94434K68694K29096J85299J46434J17146R6156P7562N3562
$$ 2973806 3274418 3568852 3837546 4066642 4251941 4398375 4515521 4611677 4689239 4742801
35017D742801J7377l4330j00070j73777k47100l12899l68161m14352m54841m91060
$$ 4742801 4760178 4725848 4625778 4452001 4204901 3892002 3523841 3109489 2654648 2163588
35007B163588n20274n36459n33325n07135m57714l88022l03389k10999j19299
$$ 2163588 1643314 1106855 573530 66395 -391319 -779341 -1082730 -1293729 -1413028
34998a413028l6881K9119P4662R9793J08452J06878J01301R5932R2275Q9916Q7995
$$ -1413028 -1449909 -1420790 -1346128 -1246335 -1137883 -1031005 -929704 -833772 -741497 -651581 -563586
34987e63586Q6351Q5767Q7496R2484J00623J10174J17797J19557J12461R5645
$$ -563586 -477235 -391468 -303972 -211488 -110865 -691 117106 236663 349124 444769
34977D44769P0549M0218Q309k1691m7040o6115p8594q5382q8176q8749q8069q5807
$$ 444769 515318 555536 563845 542154 495114 428999 350405 265023 176847 88098 29 -85778
34965h5778q0693p1594n8666m3705k9665j9730j6496k1233l3219m9468o5236p5082
$$ -85778 -166471 -238065 -296731 -340436 -370101 -389831 -406327 -427560 -460779 -510247 -575483 -650565
34953f50565p3846n7497k4445K2757P6676J26790J63482J81792J82603J70925
$$ -650565 -724411 -781908 -806353 -783596 -706920 -580130 -416648 -234856 -52253 118672
34943A18672J52891J33566J16381J03571R6469R5122R7806J01361J02472R9187
$$ 118672 271563 405129 521510 625081 721550 816672 914478 1015839 1118311 1217498
34933A217498R1554Q0816O7510M9714K3262j5515o6092j22132j73538k10941k29588
$$ 1217498 1309052 1389868 1457378 1507092 1530354 1514839 1448747 1326615 1153077 942136 712548
34922G12548k30445k18504j99948j79969j61922j47334j36070j26523j16353j03750
$$ 712548 482103 263599 63651 -116318 -278240 -425574 -561644 -688167 -804520 -908270
34912i08270q8500p2032n6467m3443l3336k5179j7373q790M43R105J5755J9363
$$ -908270 -996770 -1068802 -1125269 -1168712 -1202048 -1227227 -1244600 -1253390 -1252947 -1243842 -1228087 -1208724
34900a208724J9269J4620M139j3325l7677o6674r6007j20278j34177j33489j16060
$$ -1208724 -1189455 -1174835 -1170696 -1184021 -1221698 -1288372 -1384379 -1504657 -1638834 -1772323 -1888383
34889a888383q2552l6167J8845P8756J40491K00687K55432L01532L38016L65965
$$ -1888383 -1970935 -2007102 -1988257 -1909501 -1769010 -1568323 -1312891 -1011359 -673343 -307378
34879c07378L86656L99709M02823L93279L69875L34065K89722K41809J94710J50899
$$ -307378 79278 478987 881810 1275089 1644964 1979029 2268751 2510560 2705270 2856169
34869B856169J10437P1663L2753o820m5955q2731j15486j43534j67617j90066
$$ 2856169 2966606 3038269 3071022 3064202 3018247 2935516 2820030 2676496 2508879 2318813
34859B318813k14002k41224k69924k94117l05783k98733k71958k30439j82863
$$ 2318813 2104811 1863587 1593663 1299546 993763 695030 423072 192633 9770
34850I770j37642r9641o9445m4928k3398k687J8799M2389O9268J00247J35182
$$ 9770 -127872 -227513 -296958 -341886 -365284 -367971 -349172 -306783 -237515 -137268 -2086
34839b086J71869K05131K27294K30939K13004J77579J34888R6535O9814N4808
$$ -2086 169783 374914 602208 833147 1046151 1223730 1358618 1455153 1524967 1579775
34829A579775M5887L5973K0535j116k6986n4244q0182j02172j17553j24058j20392
$$ 1579775 1625662 1661635 1682170 1681054 1654068 1599824 1519642 1417470 1299917 1175859 1055467
34818A055467j06460q3141n2212j6619J9160M9399O8282P1741N9287L4909O506
$$ 1055467 949007 865866 813654 797035 816195 865594 933876 1005617 1064904 1099813 1106319
34807A106319j6435k6147j9507R94K8617N5129P3269P8164O7841M3350Q580l0150
$$ 1106319 1089884 1063737 1044230 1045224 1073841 1128970 1202239 1280403 1348244 1391594 1400174 1370024
34795A370024o4913q7660r2570p8306m8473r703L1333O9784J02868J29325J48841
$$ 1370024 1305111 1217451 1124881 1046575 998102 988399 1019732 1089516 1192384 1321709 1470550
34784A470550J61457J67032J65279J56335J41088J20719R6245O8842M0584J4435
$$ 1470550 1632007 1799039 1964318 2120653 2261741 2382460 2478705 2547547 2588131 2602566
34774B602566o804k1597k9929l2681l0953k5930j9192j3082j0613j4964k8937
$$ 2602566 2595762 2574165 2544236 2511555 2480602 2454672 2435480 2422398 2411785 2396821 2367884
34763B367884n4529r2298j40129j91958k38007k67443k72343k50452k05146j43170
$$ 2367884 2313355 2221057 2080928 1888970 1650963 1383520 1111177 860725 655579 512409
34753E12409p2243J31O6959J22190J61595J83566J89203J81603J64806J42856
$$ 512409 440166 440297 507256 629446 791041 974607 1163810 1345413 1510219 1653075
34743A653075J19236R6626P6578N9105M2721K5625P536r329k1305k5858k3818
$$ 1653075 1772311 1868937 1945515 2004620 2047341 2072966 2080502 2071173 2049868 2024010 2000192
34732B000192j9694j9651k8296m6192o9663r2953j11071j21295j22988j16872
$$ 2000192 1980498 1960847 1932551 1886359 1816696 1723743 1612672 1491377 1368389 1251517
34722A251517j04852q9978p5568o3355n2155l8434j8809P280L6723O4130Q4143
$$ 1251517 1146665 1056687 981119 917764 865609 827175 808366 815646 852369 916499 1000642
34711A000642R2894Q8454P1222M4748J5814p463j8881j6325j299K3328N5095R2223
$$ 1000642 1093536 1181990 1253212 1297960 1313774 1306311 1287430 1271105 1269806 1293134 1348229 1440452
34699A440452J33042J75452K16520K52202K77844K90104K89142K79061K65806
$$ 1440452 1573494 1748946 1965466 2217668 2495512 2785616 3074758 3353819 3619625
34690C619625K54180K46276K41640K37872K30806K15040J85711J40911Q3070J8267
$$ 3619625 3873805 4120081 4361721 4599593 4830399 5045439 5231150 5372061 5455131 5473398
34680E473398m6083j03779j51421j88358k15187k32002k37789k31613k14495j90446
$$ 5473398 5427315 5323536 5172115 4983757 4768570 4536568 4298779 4067166 3852671 3662225
34670C662225j65699j46559j36831j36064j39708j41614j37610j27588j14488
$$ 3662225 3496526 3349967 3213136 3077072 2937364 2795750 2658140 2530552 2416064
34661B416064j01200q8203p3735n5681l3115o661K1994N0922P9138J07748J39839
$$ 2416064 2314864 2226661 2152926 2097245 2064130 2057469 2079463 2130385 2209523 2317271 2457110
34650B457110J78328K22782K67683L03700L21120L13109K77169K15023J31995
$$ 2457110 2635438 2858220 3125903 3429603 3750723 4063832 4341001 4556024 4688019
34641D688019L6149o3236j57950k42802l15808l76530m23796m54849m66700m58829
$$ 4688019 4724168 4660932 4502982 4260180 3944372 3567842 3144046 2689197 2222497 1763668
34631A763668m35064m02941l70952l45463l29155l21163l18189l15810l09668
$$ 1763668 1328604 925663 554711 209248 -119907 -441070 -759259 -1075069 -1384737
34622a384737k96252k73251k39771j96740j47357r6947n1970j8289Q92O862N715
$$ -1384737 -1680989 -1954240 -2194011 -2390751 -2538108 -2635055 -2687025 -2705314 -2704422 -2697560 -2691845
34611b691845O193J5757L7414O9417J07731J48947J91523K34976K78103L17781
$$ -2691845 -2685652 -2669895 -2632481 -2563064 -2455333 -2306386 -2114863 -1879887 -1601784 -1284003
34601a284003L49037L66184L64401L41546K99801K46037J89948J40404J02521
$$ -1284003 -934966 -568782 -204381 137165 436966 683003 872951 1013355 1115876
34592A115876P7208O2698N5985N3415N1107M5856L6019K1916O021p027j1311k079
$$ 1115876 1193084 1255782 1311767 1365182 1416289 1462145 1498164 1520080 1526101 1519074 1507763 1505684
34580A505684K1373N4375Q8275J13613J23268J14296Q8142M9626N373l7655p3446
$$ 1505684 1527057 1581432 1669707 1783320 1906588 2020884 2109026 2158652 2164025 2126370 2052924
34569B052924r8154j11096j14952j14827j16432j24024j38811j58184j76179j85328
$$ 2052924 1954770 1843674 1728722 1613895 1497463 1373439 1234628 1076444 900265 714937
34559G14937j79434j56196j18493p3681l1321l58J3254P847j3798m5440p9409
$$ 714937 535503 379307 260814 187133 155812 155454 168708 176555 162757 117317 37908
34548C7908j09075j30598j43025j46948j43088j31850j13868r0496o3497l4184
$$ 37908 -71167 -201765 -344790 -491738 -634826 -766676 -880544 -971040 -1034537 -1068721
34538a068721k868L0785O6647J03084J36845J64148J82239J90184J88412J77760
$$ -1068721 -1071589 -1040804 -974157 -871073 -734228 -570080 -387841 -197657 -9245 168515
34528A68515J59265J35038J09302Q8217P8215Q3577J04491J36511J71691K00879
$$ 168515 327780 462818 572120 660337 738552 822129 926620 1063131 1234822 1435701
34518A435701K16178K12512J88040J43870Q3806J4100n7235j22005j73797k09418
$$ 1435701 1651879 1864391 2052431 2196301 2280107 2294207 2236972 2114967 1941170 1731752
34508A731752k29006k34879k29844k15923j94092j64836j28994q8211m5018k548
$$ 1731752 1502746 1267867 1038023 822100 628008 463172 334178 245967 200949 198401
34498A98401L5907O7484R0384J04450J11694J16431J24356J40265J65471J96819
$$ 198401 234308 301792 392176 496626 608320 724751 849107 989372 1154843 1351662
34488A351662K28014K52180K64034K60863K42614K11305J69969J21841P0221J8696
$$ 1351662 1579676 1831856 2095890 2356753 2599367 2810672 2980641 3102482 3172703 3191399
34478C191399k9084p0002j01697j22335j31003j29070j21322j15221j18302j35126
$$ 3191399 3162315 3092313 2990616 2868281 2737278 2608208 2486886 2371665 2253363 2118237
34468B118237j65417k04142k43498k75948k96646l03805k97507k78541k48436
$$ 2118237 1952820 1748678 1505180 1229232 932586 628781 331274 52733 -195703
34459a95703k10018j67243j23943q2248m1803m43M3862R0803J36639J75034J99486
$$ -195703 -405721 -572964 -696907 -779155 -820958 -821401 -777539 -686736 -550097 -375063 -175577
34448a75577K06073J95057J70523J38341J03723O9880L8173Q969j7718m1798o2578
$$ -175577 30496 225553 396076 534417 638140 708020 746193 755162 737444 695646 633068
34437F33068p8335q6637q5266p3213n1215k2048R599L8113N8725O8847O8174N7942
$$ 633068 554733 468096 382830 309617 258402 236354 245953 284066 342791 411638 479812 537754
34425E37754M0539J9551l36j3955j6356l575K6042P0190J22126J72709K14137
$$ 537754 578293 597844 597508 583553 567197 563622 589664 659854 781980 954689 1168826
34414A168826K42911K60144K69354K73737K74701K72266K66390K57819K47897
$$ 1168826 1411737 1671881 1941235 2214972 2489673 2761939 3028329 3286148 3534045
34405C534045K37884K28538K20044K11969K03310J92977J80549J66615J52230
$$ 3534045 3771929 4000467 4220511 4432480 4635790 4828767 5009316 5175931 5328161
34396E328161J38030J23731J08262R0390O9707M7723K8516J8196K2747M4957Q2112
$$ 5328161 5466191 5589922 5698184 5788574 5858281 5906004 5934520 5952716 5975463 6020420 6102532
34385F102532J25957J65403J90584J96265J83099J56664J25025R6129P6009O8205
$$ 6102532 6228489 6393892 6584476 6780741 6963840 7120504 7245529 7341658 7417667 7485872
34375G485872P3961R2516J21319J56501J93819K30004K63984K97304L33062L73535
$$ 7485872 7559833 7652349 7773668 7930169 8123988 8353992 8617976 8915280 9248342 9621877
34365I621877M18154M63797N07409N48710N90587O36986O90264P50009Q14002
$$ 9621877 10040031 10503828 11011237 11559947 12150534 12787520 13477784 14227793 15041795
34356A5041795Q80572R50623J027846J116982J221639J343141J480323J629082
$$ 15041795 15922367 16872990 17900836 19017818 20239457 21582598 23062921 24692003
34348B4692003J781250J923712K038618K104174K095380J985769J752828J388048
$$ 24692003 26473253 28396965 30435583 32539757 34635137 36620906 38373734 39761782
34340C9761782R07550L55297k06458p16289j131491j435010j630286j731021j753397
$$ 39761782 40669332 41024629 40818171 40101882 38970391 37535381 35905095 34174074 32420677
34331C2420677j713154j625180j503163j358938j202353j041744q84399p36349
$$ 32420677 30707523 29082343 27579180 26220242 25017889 23976145 23091746 22355397
34323B2355397o01960m83797l82983k99511k32323j79411j38151j05406p7168
$$ 22355397 21753437 21269640 20886657 20587146 20354823 20175412 20037261 19931855 19854687
34314A9854687m8366j3760L0364Q4909J47974K15894K84777L52172M18389M86375
$$ 19854687 19806321 19792561 19822925 19907834 20055808 20271702 20556479 20908651 21327040 21813415
34304B1813415N59756O39986P24729Q08678Q86429R55608J018220J079379J144167
$$ 21813415 22373171 23013157 23737886 24546564 25432993 26388601 27406821 28486200 29630367
34295B9630367J215046J291813J374116J464152J566964J687972J829937J991832
$$ 29630367 30845413 32137226 33511342 34975494 36542458 38230430 40060367 42052199
34287D2052199K170177K361514K564583K781833L019880L288296L596802L952650
$$ 42052199 44222376 46583890 49148473 51930306 54950186 58238482 61835284 65787934
34279F5787934M360153M822521N344106N931277O591546P331746Q156069R064366
$$ 65787934 70148087 74970608 80314714 86245991 92837537 100169283 108325352 117389718
34271A17389718J0050324J1098815J2182019J3254440J4246885J5059406J5554421
$$ 117389718 127440042 138538857 150720876 163975316 178222201 193281607 208836028
34264B08836028J5554491J4852542J3244094J0587099O880413K328598k652697
$$ 208836028 224390519 239243061 252487155 263074254 269954667 272283265 269630568
34257B69630568p517302j1731970j4916490j6916519j7790263j7738059j7019350
$$ 269630568 262113266 250381296 235464806 218548287 200758024 183019965 166000615
34250A66000615j5886884j4547756j3149334j1783569j0500399r322002q254020
$$ 166000615 150113731 135565975 122416641 110633072 100132673 90810671 82556651
34243H2556651p293802o435957n674736n003572m413767l894363l433700l021694
$$ 82556651 75262849 68826892 63152156 58148584 53734817 49840454 46406754 43385060
34235D3385060k651233k317657k016881j743735j491832j254563j026178q02416
$$ 43385060 40733827 38416170 36399289 34655554 33163722 31909159 30882981 30080565
34227C0080565n80807l60735j43147P0048K76530M74082O60970Q36128R98691
$$ 30080565 29499758 29139023 28995876 29065924 29342454 29816536 30477506 31313634 32312325
34218C2312325J146544J273758J367568J406473J361530J202246R06563M72392
$$ 32312325 33458869 34732627 36100195 37506668 38868198 40070444 40977007 41449399
34210D1449399p3847o77151j265160j767679k135837k352226k428968k397286
$$ 41449399 41375552 40698401 39433241 37665562 35529725 33177499 30748531 28351245
34202B8351245k294844k155875k005930j860746j727507j606890j495168j386348
$$ 28351245 26056401 23900526 21894596 20033850 18306343 16699453 15204285 13817937
34194A3817937j274187j154001j023993q85662p43146o01930m67944l47276k45685
$$ 13817937 12543750 11389749 10365756 9480094 8736948 8135018 7667074 7319798 7074113
34185G074113j66946j10834p2411m3610j6665J2213M0772O1608O5857M7737P442
$$ 7074113 6907167 6796333 6723922 6680312 6663647 6675860 6716632 6778240 6844097 6891834 6899276
34174F899276m8620j09660j63277j98409k07716j88848j44569q2257j2977N0119
$$ 6899276 6850656 6740996 6577719 6379310 6171594 5982746 5838177 5755920 5742943 5793062
34164E793062R4216J09456R1257M1801k9834j09612j82317k35736k63512k65897
$$ 5793062 5887278 5996734 6087991 6129792 6099958 5990346 5808029 5572293 5308781 5042884
34154E042884k48477k19479j86619j54777j25521r8193p1430m4087j5419J4837
$$ 5042884 4794407 4574928 4388309 4233532 4108011 4009818 3938388 3894301 3878882 3893719
34144C893719M6136P6643J03133J21809J29948J27564J17784J05285R3430Q1946
$$ 3893719 3939855 4016498 4119631 4241440 4371388 4498952 4616736 4722021 4815451 4897397
34134D897397O6891M3046P235l9313r0707j38129j72579j87303j79063j48288
$$ 4897397 4964288 5007334 5014569 4975256 4884549 4746420 4573841 4386538 4207475 4059187
34124D059187r8944l8188K4831Q1566J27043J61321J88341K12795K36898K59135
$$ 4059187 3960243 3922055 3946886 4028452 4155495 4316816 4505157 4717952 4954850 5213985
34114E213985K75668K83292K81612K73240K62836K56245K59421K76335L06612
$$ 5213985 5489653 5772945 6054557 6327797 6590633 6846878 7106299 7382634 7689246
34105G689246L45303L85754M23682M59608M98406N46766O10086O90203P84946
$$ 7689246 8034549 8420303 8843985 9303593 9801999 10348765 10958851 11649054 12434000
34096A2434000Q89485R98264J106412J210556J309425J403904J495855J585740
$$ 12434000 13323485 14321749 15428161 16638717 17948142 19352046 20847901 22433641
34088B2433641J670122J739897J779567J767585J678195J485633J171407P33881
$$ 22433641 24103763 25843660 27623227 29390812 31069007 32554640 33726047 34459928
34080C4459928J96283l92752r69354j471897j856943k106205k223853k228967
$$ 34459928 34656211 34263459 33294105 31822208 29965265 27859060 25635207 23406240
34072B3406240k148341k011289j845506j673160j508048j355292j213999j081392
$$ 23406240 21257899 19246610 17401104 15727944 14219896 12864604 11650605 10569213
34064A0569213r55914q37832p28019o27024n35673m56121l91353l42629l07142
$$ 10569213 9613299 8775467 8047448 7420424 6884751 6428630 6037277 5694648 5387506
34055E387506k78554k50410k19688j87817j59097j38334j29066j32506j46809
$$ 5387506 5108952 4858542 4638854 4451037 4291940 4153606 4024540 3892034 3745225
34046C745225j66697j83794j88227j71679j31156p1272l206N9530J06007J30966
$$ 3745225 3578528 3394734 3206507 3034828 2903672 2832400 2829194 2888724 2994731 3125697
34036C125697J35229J24038J04344Q1925N9472L6355J0010k1866n9291r9049j35430
$$ 3125697 3260926 3384964 3489308 3571233 3630705 3667060 3677070 3655204 3595913 3496864 3361434
34025C361434j62350j75538j73616j58080j32952j04379p9618o5405o6523q5393
$$ 3361434 3199084 3023546 2849930 2691850 2558898 2454519 2374901 2309496 2242973 2157580
34015B157580j22121j74244k36385l01051l60567m08667m40363m50811m35325
$$ 2157580 2035459 1861215 1624830 1323779 963212 554545 114182 -336629 -771954
34006g71954l91252l20323k29637j30573l6395M0587R1704J13670J08551Q1943
$$ -771954 -1163206 -1483529 -1713166 -1843739 -1880134 -1839547 -1747843 -1634173 -1525622 -1443679
33996a443679M0499r856o4327j18826j69681k13771k48575k71735k80585k72536
$$ -1443679 -1403180 -1413036 -1477363 -1596189 -1765870 -1979641 -2228216 -2499951 -2780536 -3053072
33986c053072k46261k02283j42061o6646K3173J24759K31481L32873M17391M76001
$$ -3053072 -3299333 -3501616 -3643677 -3710323 -3687150 -3562391 -3330910 -2998037 -2580646 -2104645
33976b104645N04273N02203M72791M20965L53387K78103K03248J35393P8832L6195
$$ -2104645 -1600372 -1098169 -625378 -204413 148974 427077 630325 765718 844550 880745
33966H80745R044k508q50Q620J8109J9139M861k7615p5967j33172j89511k35129
$$ 880745 889789 887281 886431 895051 913160 932299 937160 909545 833578 700406 510895 275766
33954B75766k62246k66603k47934k09496j57170r8577m1994N230L8605N7645O5414
$$ 275766 13520 -253083 -501017 -710513 -867683 -966260 -1008254 -1003024 -964419 -906774 -841360
33943h41360O6535O4801O1658N6269M6798L1699J0301j7170m9322q3132j13818
$$ -841360 -774825 -710024 -648366 -592097 -545299 -513600 -503299 -520469 -569791 -652923 -766741
33932g66741j35642j43304j33481j06042o4207j3264M1672R7083J50499J98778
$$ -766741 -902383 -1045687 -1179168 -1285210 -1349417 -1362681 -1321009 -1223926 -1073427 -874649
33922h74649K37357K61529K68548K58612K34015J97751J53029J03822N5198J2457
$$ -874649 -637292 -375763 -107215 151397 385412 583163 736192 840014 895212 907669
33912I07669k0716m3678n8861p0205q0767r0723r7187r6280q6346o9867n2501
$$ 907669 886953 843275 784414 714209 633442 542719 445532 349252 262906 193039 140538
33901A40538l9903l4806l6329m1482m7339n2101n4805n4486m9690l8705k0227
$$ 140538 100635 65829 29500 -11982 -59321 -111422 -166227 -220713 -270403 -309108 -329335
33890c29335N874L7974P2829J06646J36345J59707J74283J76479J62355J29845
$$ -329335 -323461 -285487 -212658 -106012 30333 190040 364323 540802 703157 833002
33880H33002Q0687K0725m1488r7065j39359j65740j77681j79063j73910j64988
$$ 833002 913689 934414 892926 795861 656502 490762 313081 134018 -39892 -204880
33870b04880j53649j40147j23712j02352p3180l3776J5669P1012J25009J70386
$$ -204880 -358529 -498676 -622388 -724740 -797920 -831696 -816027 -745015 -620006 -449620
33860d49620K02993K22728K31735K31869K23609K06894J82415J51894J17293Q0076
$$ -449620 -246627 -23899 207836 439705 663314 870208 1052623 1204517 1321810 1401886
33850A401886M1418K992l2629o2347q3255r3038r0135p4112m6453j1173K5474
$$ 1401886 1443304 1446296 1413667 1351320 1268065 1175027 1084892 1010780 964327 953154 978628
33839I78628N6405P5722Q0607P2330N5929L8429K6148K2202K5455L1576L5749
$$ 978628 1035033 1110755 1191362 1263692 1319621 1358050 1384198 1406400 1431855 1463431 1499180
33828A499180L5766L3736L5104M5092O4804Q9860J12710J26685J28501J17961
$$ 1499180 1534946 1568682 1603786 1648878 1713682 1803542 1916252 2042937 2171438 2289399
33818B289399R6401O5996L0210o133l7926o1433p5092p8945p3352n8178l3440
$$ 2289399 2385800 2451796 2482006 2475873 2437947 2376514 2301422 2222477 2149125 2090947 2057507
33807B057507j052L3902O3985Q2388Q6104P7196O1395M5109L2687K5211K1159
$$ 2057507 2056455 2090357 2154342 2236730 2322834 2400030 2461425 2506534 2539221 2564432 2585591
33796B585591J8216J4874J0746N652j300j1392k4912m0154n4006o3558o7186o4441
$$ 2585591 2603807 2618681 2629427 2635079 2633779 2622387 2597475 2557321 2503315 2439757 2372571 2308130
33784B308130n5672m2409k7869j6331j1467j5109k7304m6912p1731r8368j22775
$$ 2308130 2252458 2210049 2182180 2165849 2154382 2139273 2111969 2065057 1993326 1894958 1772183
33773A772183j41526j53077j58187j59237j58561j56425j50148j35533j09996
$$ 1772183 1630657 1477580 1319393 1160156 1001595 845170 695022 559489 449493
33764D49493p5332l7947o287J3117J8603J3324K116j2438l1593n8525r4470j35911
$$ 449493 374161 336214 329927 343044 361647 374971 377087 364649 333056 274531 180061 44150
33752D4150j74526j99964k03949j83719j43178r1412l9584K443K8706L8312L4756
$$ 44150 -130376 -330340 -534289 -718008 -861186 -952598 -992182 -989739 -961033 -922721 -887965
33741h87965K3722J0668p34q875j3663j5550j4616j0318k057R940K4266L8562
$$ -887965 -864243 -853575 -854309 -863184 -876847 -892397 -907013 -917331 -919388 -909448 -885182 -846620
33729h46620N0108N6577N7011N2608M6643M3218M5296N2917O2652O8996O7220
$$ -846620 -796512 -739935 -682924 -630316 -583673 -540455 -495159 -442242 -379590 -310594 -243374
33718b43374N5759L6386J2267j4115m1380o7937r0549j04511j05988r5200p8012
$$ -243374 -187615 -151229 -138962 -153077 -194457 -262394 -352943 -457454 -563442 -658642 -736654
33707g36654o4232o3464q0993j15788j60955k06171k41116k58727k56817k37525
$$ -736654 -800886 -864350 -945343 -1061131 -1222086 -1428257 -1669373 -1928100 -2184917 -2422442
33697b422442k05576j66597j26039q8611n8169l7561k8019k8097l3368l7776l5850
$$ -2422442 -2628018 -2794615 -2920654 -3009265 -3067434 -3104995 -3133014 -3161111 -3194479 -3232255 -3268105
33686c268105k4190j543L1803P4345J23372J74839K23321K62455K86117K90236
$$ -3268105 -3292295 -3293838 -3262035 -3187690 -3064318 -2889479 -2666158 -2403703 -2117586 -1827350
33676a827350K74152K40738J95136J42906Q8470L4744j6027o1102r6788j19064
$$ -1827350 -1553198 -1312460 -1117324 -974418 -885948 -851204 -867231 -928333 -1025121 -1144185
33666a144185j24666j12160q2843m1127O319N2619R2801J24582J47809J63535
$$ -1144185 -1268851 -1381011 -1463854 -1504981 -1498662 -1446043 -1353242 -1228660 -1080851 -917316
33656i17316J73472J79794J85057J92141K04140K24077K54612K97975L56007M29679
$$ -917316 -743844 -564050 -378993 -186852 17288 241365 495977 793952 1149959 1579638
33646A579638N17857O15982P15849Q07202Q80672R31021R59187R72196R80556
$$ 1579638 2097495 2713477 3429326 4236528 5117200 6048221 7007408 7979604 8960160
33637H960160R94240J019270J056643J103974J158252J217830J282599J352547
$$ 8960160 9954400 10973670 12030313 13134287 14292539 15510369 16792968 18145515
33629A8145515J425452J494447J546350J561527J515787J384152J146216P92895
$$ 18145515 19570967 21065414 22611764 24173291 25689078 27073230 28219446 29012341
33621B9012341L33261k01512p60699j284344j718063k025964k196407k239650
$$ 29012341 29345602 29144090 28383391 27099047 25380984 23355020 21158613 18918963
33613A8918963k180610k050737j881264j698249j519511j353879j202905j064163
$$ 18918963 16738353 14687616 12806352 11108103 9588592 8234713 7031808 5967645
33605E967645r34579q12541o98250n92611m95837m07086l25528k51691j87412
$$ 5967645 5033066 4220525 3522275 2929664 2433827 2026741 1701213 1449522 1262110
33596A262110j34058r0663n4060k1301P673K9494L9562L5295J8197o230l0204
$$ 1262110 1128052 1037389 983329 962028 969701 999195 1038757 1074052 1092249 1086019 1055815
33585A055815m6009m8122l4493o500L2096P6280J20280J57960J83763J94018J87500
$$ 1055815 1009806 961684 927191 920691 952787 1029067 1149347 1307307 1491070 1685088 1872588
33574A872588J64821J27539P8100K0341m0470r8575j48779j86761k08916k12783
$$ 1872588 2037409 2164948 2243048 2263389 2222919 2124344 1975565 1788804 1579888 1367105
33564A367105j98286j68756j30523r0951n6137k9412j1099Q19R569J8352K9191
$$ 1367105 1168819 1000063 869540 778589 722452 693040 681941 682760 692329 710681 739872
33553G39872M2027N4588O3440O6041O2468N5230M7340M0353L4023K7220J8592
$$ 739872 781899 836487 899927 965968 1028436 1083666 1131006 1171359 1205382 1232602 1251194
33542A251194O356j1700l7159o9368j04729j37522j61839j73674j72410j61069
$$ 1251194 1257550 1245850 1208691 1139323 1034594 897072 735233 561559 389149 228080
33532B28080j45052j29812j18727j12254j08835j06715j05587j06923j13039j25419
$$ 228080 83028 -46784 -165511 -277765 -386600 -493315 -598902 -705825 -818864 -944283
33522i44283j43260j62887j78424j83719j74746j51050j15175p0699k0777L1534
$$ -944283 -1087543 -1250430 -1428854 -1612573 -1787319 -1938369 -2053544 -2124243 -2145020 -2113486
33512b113486Q1932J24450J52819J62659J52873J25720Q6055M0198n567m6505
$$ -2113486 -2031554 -1907104 -1754285 -1591626 -1438753 -1313033 -1226978 -1186780 -1192347 -1238852
33502a238852p9946j04195j16958j15254r7550o6269k8117Q408L6549N3433O0158
$$ -1238852 -1318798 -1422993 -1539951 -1655205 -1752755 -1819024 -1847141 -1838733 -1802184 -1748751 -1688593
$$ [...]
##END NTUPLES=NMR SPECTRUM
##END=
