##TITLE=31Pdec_DE-27EXT-X
 D2O
  64 sc
 23.11.2023
##JCAMPDX= 6.0         $$ Bruker NMR JCAMP-DX V2.0
##DATA TYPE= NMR SPECTRUM
##DATA CLASS= NTUPLES
##ORIGIN= UXNMR, Bruker Analytische Messtechnik GmbH
##OWNER= root
$$ XWIN-NMR		Version 3.5
$$ Thu Nov 23 16:13:03 2023 Russian Standard Time (UT+4h)  she@DPX200
##.OBSERVE FREQUENCY= 81.013821
##.OBSERVE NUCLEUS= ^31P
##.ACQUISITION MODE= SIMULTANEOUS
##.ACQUISITION SCHEME= undefined
##.AVERAGES= 24
##.DIGITISER RES= 16
##SPECTROMETER/DATA SYSTEM= spect
##.PULSE SEQUENCE= zgpg30
##.SOLVENT NAME= D2O
##.SHIFT REFERENCE= (INTERNAL, D2O, 0, 248.564)
##AUDIT TRAIL= $$ (NUMBER, WHEN, WHO, WHERE, WHAT)
$$ ##TITLE= Audit trail, XWIN-NMR		Version 3.5
$$ ##JCAMPDX= 5.01
$$ ##ORIGIN= Bruker BioSpin GmbH
$$ ##OWNER= she
$$ F:/spectra/data/she/nmr/P31/1/pdata/1/auditp.txt
$$ ##AUDIT TRAIL=  $$ (NUMBER, WHEN, WHO, WHERE, WHAT)
(   1,<2023-11-23 16:12:00.67 +0400>,<she>,<DPX200>,
      <created by zg, POWCHK disabled, PULCHK disabled
       configuration hash MD5:
       00 E9 B6 7A A2 85 ED C7 34 08 36 98 17 FE 4E 26
       data hash MD5: 32K
       4F 4B AA 14 05 4E 4B B3 4D 05 8F 91 35 9B EE CA>)
(   2,<2023-11-23 16:12:03.98 +0400>,<she>,<DPX200>,
      <Start of raw data processing
       efp BC_mod = 2 LB = 10 FT_mod = 6 PKNL = 1 PHC0 = -11951.55 PHC1 = 538.0942 SI = 64K 
       data hash MD5: 64K
       38 40 2C 9F 29 62 08 13 15 B4 88 F0 B8 4B AC 69>)
(   3,<2023-11-23 16:12:23.17 +0400>,<she>,<DPX200>,
      <pk PHC0 = 239.6221 PHC1 = -545.4 
       data hash MD5: 64K
       A6 9D 56 64 19 FF 85 C0 2D 77 29 A2 31 76 2F F8>)
(   4,<2023-11-23 16:12:27.20 +0400>,<she>,<DPX200>,
      <abs ABSG = 5 
       data hash MD5: 64K
       F9 81 C8 A6 5A EF F0 41 07 B1 3B 3B B9 27 E7 22>)
$$ ##END=
$$ 
$$ hash MD5
$$ 19 97 B8 43 A2 CE 9C 86 C5 BB 23 4B E9 33 13 76
##$RELAX= 
##$RELAX= 
##$RELAX= 
##$RELAX= 
##$RELAX= 
##$RELAX= 
##$RELAX= 
##$RELAX= 
##$RELAX= 
$$ Bruker specific parameters
$$ --------------------------
##$DU= <F:/spectra>
##$EXPNO= 1
##$NAME= <P31>
##$PROCNO= 1
##$TYPE= <nmr>
##$USER= <she>
##$AMP= (0..31)
100 100 100 100 100 100 100 100 100 100 100 100 100 100 100 100 100 100 
100 100 100 100 100 100 100 100 100 100 100 100 100 100 
##$AQSEQ= 0
##$AQ_mod= 1
##$AUNM= <au_zg>
##$AUTOPOS= <>
##$BF1= 81.014009
##$BF2= 200.13
##$BF3= 200.13
##$BF4= 200.13
##$BF5= 200.13
##$BF6= 200.13
##$BF7= 200.13
##$BF8= 200.13
##$BYTORDA= 1
##$CFDGTYP= 0
##$CFRGTYP= 5
##$CHEMSTR= <none>
##$CNST= (0..31)
1 1 145 1 1 1 1 1 1 1 1 1 1 1 1 1 1 1 1 1 1 1 1 1 1 1 1 1 1 1 1 1 
##$CPDPRG= <waltz16>
##$CPDPRG1= <>
##$CPDPRG2= <waltz16>
##$CPDPRG3= <>
##$CPDPRG4= <mlev>
##$CPDPRG5= <mlev>
##$CPDPRG6= <mlev>
##$CPDPRG7= <mlev>
##$CPDPRG8= <mlev>
##$CPDPRGB= <>
##$CPDPRGT= <>
##$D= (0..31)
0 1 0 0 0 0 0 0 0 0 0 0.03 2e-05 3e-06 0 0 0 0 0 0 0 0 0 0 0 0 0 0 0 0 
0 0 
##$DATE= 1700741520
##$DBL= (0..7)
120 120 120 11 120 120 24 19 
##$DBP= (0..7)
150 150 150 150 150 150 150 150 
##$DBP07= 0
##$DBPNAM0= <>
##$DBPNAM1= <>
$$ [...]
##$SUBNAM3= <"">
##$SUBNAM4= <"">
##$SUBNAM5= <"">
##$SUBNAM6= <"">
##$SUBNAM7= <"">
##$SUBNAM8= <"">
##$SUBNAM9= <"">
##$SW= 501.771253377433
##$SWIBOX= (0..15)
0 1 3 0 0 0 0 0 0 0 0 0 0 0 0 0 
##$SW_h= 40650.406504065
##$TD= 32768
##$TD0= 1
##$TE= 0
##$TE2= 300
##$TE3= 300
##$TEG= 300
##$TL= (0..7)
0 120 53 12 22 120 120 120 
##$TP= (0..7)
150 150 150 150 150 150 150 150 
##$TP07= 0
##$TPNAME0= <>
##$TPNAME1= <>
##$TPNAME2= <>
##$TPNAME3= <>
##$TPNAME4= <>
##$TPNAME5= <>
##$TPNAME6= <>
##$TPNAME7= <>
##$TPOAL= (0..7)
0.5 0.5 0.5 0.5 0.5 0.5 0.5 0.5 
##$TPOFFS= (0..7)
0 0 0 0 0 0 0 0 
##$TUNHIN= 0
##$TUNHOUT= 0
##$TUNXOUT= 0
##$USERA1= <user>
##$USERA2= <user>
##$USERA3= <user>
##$USERA4= <user>
##$USERA5= <user>
##$V9= 5
##$VALIST= <valist>
##$VCLIST= <CCCCCCCCCCCCCCC>
##$VD= 0
##$VDLIST= <DDDDDDDDDDDDDDD>
##$VPLIST= <PPPPPPPPPPPPPPP>
##$VTLIST= <TTTTTTTTTTTTTTT>
##$WBST= 1024
##$WBSW= 4
##$XGAIN= (0..3)
0 0 0 0 
##$XL= 0
##$YL= 0
##$YMAX_a= 3528
##$YMIN_a= -2502
##$ZGOPTNS= <>
##$ZL1= 120
##$ZL2= 120
##$ZL3= 120
##$ZL4= 120
##$ABSF1= 248.5645
##$ABSF2= -253.2056
##$ABSG= 5
##$ABSL= 3
##$ALPHA= 0
##$AQORDER= 0
##$ASSFAC= 0
##$ASSFACI= 0
##$ASSFACX= 0
##$ASSWID= 0
##$AUNMP= <proc_1d>
##$AZFE= 0.1
##$AZFW= 0.5
##$BCFW= 0
##$BC_mod= 2
##$BYTORDP= 0
##$COROFFS= 0
##$CY= -3
##$DATMOD= 1
##$DC= 0
##$DFILT= <>
##$DTYPP= 0
##$F1P= 0
##$F2P= 0
##$FCOR= 1
##$FTSIZE= 65536
##$FT_mod= 6
##$GAMMA= 0
##$GB= 0
##$INTBC= 1
##$INTSCL= 6.047779e-11
##$ISEN= 30
##$LB= 10
##$LEV0= 0
##$LPBIN= 0
##$MAXI= 10000
##$MC2= 0
##$MEAN= 0
##$ME_mod= 0
##$MI= 50
##$NCOEF= 0
##$NC_proc= -9
##$NLEV= 6
##$NOISF1= 182.463
##$NOISF2= 159.3651
##$NSP= 0
##$NTH_PI= 0
##$NZP= 0
##$OFFSET= 248.5645
##$PC= 4
##$PHC0= -11711.93
##$PHC1= -7.305847
##$PH_mod= 1
##$PKNL= yes
##$PPARMOD= 0
##$PSCAL= 0
##$PSIGN= 0
##$REVERSE= no
##$SF= 81.0140089999694
##$SI= 65536
##$SIGF1= 159.3651
##$SIGF2= -187.1042
##$SINO= 113.3802
##$SIOLD= 16384
##$SREGLST= <1H.CDCl3>
##$SSB= 0
##$STSI= 65536
##$STSR= 0
##$SW_p= 40650.406504065
##$SYMM= 0
##$S_DEV= 0
##$TDeff= 32768
##$TDoff= 0
##$TI= <>
##$TILT= no
##$TM1= 0
##$TM2= 0
##$TOPLEV= 0
##$USERP1= <user>
##$USERP2= <user>
##$USERP3= <user>
##$USERP4= <user>
##$USERP5= <user>
##$WDW= 1
##$XDIM= 65536
##$YMAX_p= 389873789
##$YMIN_p= -96714398
$$ End of Bruker specific parameters
$$ ---------------------------------
##NTUPLES= NMR SPECTRUM
##VAR_NAME=  FREQUENCY,     SPECTRUM/REAL,   SPECTRUM/IMAG
##SYMBOL=    X,             R,               I
##VAR_TYPE=  INDEPENDENT,   DEPENDENT,       DEPENDENT
##VAR_FORM=  AFFN,          ASDF,            ASDF
##VAR_DIM=   65536,         65536,           65536
##UNITS=     HZ,            ARBITRARY UNITS, ARBITRARY UNITS
##FACTOR=    0.620285442955139, 1,           1
##FIRST=     20137.2065510682, 0,            0
##LAST=      -20513.1999529968, 0,           0
##MIN=       -20513.1999529968, -96714398,   0
##MAX=       20137.2065510682, 389873789,    0
$$ Real data points
##PAGE= N=1
##DATA TABLE= (X++(R..R)), XYDATA
$$ [...]
39074 3535207 3219203 2850526 2456469 2048868 1626707 1182989 711671 212372 -307750
39065 -307750 -835144 -1353728 -1850209 -2318225 -2758815 -3176828 -3575670 -3953580 -4302700 -4609898
39055 -4609898 -4858522 -5031673 -5117343 -5113264 -5028108 -4878078 -4681389 -4453992 -4207779 -3950362
39045 -3950362 -3685188 -3411547 -3124809 -2817673 -2483121 -2118586 -1729102 -1326872 -927043
39036 -927043 -542471 -181486 149799 442877 684293 857952 950951 958616 885235 740812
39026 740812 537453 288517 10165 -277772 -554033 -800538 -1006534 -1170424 -1299503 -1408287
39016 -1408287 -1514786 -1633712 -1768236 -1905004 -2016778 -2072276 -2047694 -1933519 -1734322 -1464022
39006 -1464022 -1140693 -783058 -408616 -32698 331725 673956 986168 1265050 1513281
38997 1513281 1739008 1952983 2164822 2380044 2598648 2815314 3021322 3207890 3369772
38988 3369772 3507722 3628943 3745234 3868952 4007647 4159493 4311829 4443615 4530345 4549090
38978 4549090 4481897 4317407 4051848 3690962 3253178 2771912 2293779 1871186 1551618 1368383
38968 1368383 1336712 1455414 1711005 2080564 2532004 3023685 3506378 3928866 4245767 4425146
38958 4425146 4454093 4341072 4114037 3814082 3486371 3171447 2899543 2688734 2546276 2471474
38948 2471474 2458131 2495229 2566629 2652128 2731181 2787536 2811360 2797284 2740281 2632914 2466164
38937 2466164 2233737 1937900 1593944 1230469 884310 591814 380258 262497 235602 282600
38927 282600 376479 486051 582718 646238 667631 648859 600307 537684 479440 444659 450507
38916 450507 508542 620933 779502 970149 1182091 1417366 1694608 2043719 2492895 3053778
38906 3053778 3711484 4424122 5132166 5774003 6301448 6689084 6934305 7049368 7050608 6950448
38896 6950448 6755307 6468649 6095992 5648447 5143193 4601415 4045326 3495231 2966508
38887 2966508 2466832 1995346 1545499 1110568 688012 279435 -113158 -490769 -856951
38878 -856951 -1213401 -1554877 -1867378 -2131651 -2330620 -2456708 -2514975 -2520782 -2493930 -2452589
38868 -2452589 -2409605 -2372197 -2344797 -2333231 -2347354 -2399618 -2499445 -2646087 -2823853 -3002532 -3143369
38857 -3143369 -3208404 -3169551 -3014175 -2745834 -2380883 -1942744 -1456124 -943738 -427334 67840
38847 67840 509278 858605 1078829 1143659 1044180 791027 412853 -47953 -542019 -1021029
38837 -1021029 -1444551 -1784010 -2024604 -2166836 -2227414 -2237103 -2233682 -2251024 -2308112 -2402750 -2513291
38826 -2513291 -2607998 -2657130 -2641252 -2552630 -2392325 -2167996 -1894504 -1594722 -1296725 -1026627
38816 -1026627 -800507 -619953 -473336 -341591 -205701 -53612 115318 290678 457720
38807 457720 608373 750284 907881 1114632 1401217 1785550 2267842 2830815 3443431 4066106
38797 4066106 4656175 5173778 5588887 5888325 6079564 6188623 6252374 6308196 6384399 6494338
38787 6494338 6635977 6796110 6955776 7093472 7186475 7213612 7161363 7030846 6840768 6623361
38777 6623361 6414411 6241787 6117617 6037253 5984386 5938781 5883002 5806702 5708909 5598683
38767 5598683 5493357 5413286 5373700 5377146 5411245 5453762 5481498 5476505 5426257 5320548 5150458
38756 5150458 4911429 4607557 4252850 3867844 3473306 3084215 2706628 2338188 1971232
38747 1971232 1596829 1208497 804953 391417 -20756 -415946 -776972 -1088330 -1339622
38738 -1339622 -1528444 -1661664 -1754617 -1828383 -1905452 -2004231 -2133783 -2290944 -2461272 -2623512
38728 -2623512 -2755802 -2841469 -2872533 -2850098 -2782389 -2682125 -2564166 -2442818 -2328173 -2222662
38718 -2222662 -2120086 -2008384 -1875002 -1712582 -1522844 -1317518 -1116063 -940763 -810631
38709 -810631 -736146 -716830 -742824 -799682 -873782 -955466 -1038551 -1117285 -1183255 -1224656 -1228835 -1186790
38697 -1186790 -1096719 -964129 -798178 -606198 -389270 -140924 150170 494202 893089 1335493
38687 1335493 1796669 2243631 2643630 2972545 3220287 3391791 3503818 3579308 3641849 3712357
38677 3712357 3808097 3942086 4121235 4344176 4601617 4880313 5168169 5456749 5739967 6010865
38667 6010865 6259096 6470818 6631721 6732676 6775095 6771795 6741476 6699961 6653847 6600052 6530103
38656 6530103 6435428 6310560 6153585 5965099 5747401 5504695 5243668 4973657 4706288 4454798
38646 4454798 4232834 4052529 3922781 3849128 3835047 3882345 3988820 4144345 4328678 4513368
38636 4513368 4667343 4763945 4787031 4734225 4616082 4451654 4263090 4072239 3900156 3767831
38626 3767831 3695905 3702716 3801350 3996397 4280854 4634158 5023094 5406665 5744414 6005970
38616 6005970 6178713 6270603 6306487 6318761 6335721 6372151 6426084 6483515 6529299 6558495 6581297
38605 6581297 6618510 6690935 6809249 6968723 7149240 7319288 7443052 7489196 7438744 7289218
38595 7289218 7053838 6756443 6424262 6081549 5746552 5431597 5143529 4882685 4642051
38586 4642051 4409375 4172022 3921175 3652825 3366640 3065364 2755733 2449179 2159952
38577 2159952 1899902 1672329 1469552 1277687 1086816 899784 733309 610817 551820 563530
38567 563530 637868 754486 888564 1020152 1140478 1251918 1361987 1475016 1585752 1677385
38557 1677385 1724305 1698255 1575827 1345152 1009854 588898 112465 -384226 -866230 -1301767
38547 -1301767 -1663766 -1931792 -2094161 -2147776 -2094387 -1935626 -1670954 -1299935 -826123 -258868
38537 -258868 387769 1096875 1849555 2625093 3401498 4156318 4866846 5509808 6061738 6501113
38527 6501113 6811835 6986619 7028908 6952736 6780568 6539647 6257595 5958258 5658914 5369500
38517 5369500 5093424 4828746 4569123 4305515 4029870 3740026 3442673 3151701 2882486
38508 2882486 2645747 2444722 2277201 2141573 2044039 2002754 2044680 2194310 2459231 2821307
38498 2821307 3239705 3664301 4051234 4372153 4614433 4775850 4858958 4867772 4806120 4676215
38488 4676215 4477591 4207735 3865058 3452867 2981895 2469872 1938678 1411103 908918
38479 908918 452274 58816 -259013 -498108 -667652 -788261 -887115 -991525 -1123642 -1297178
38469 -1297178 -1515394 -1770115 -2042751 -2308263 -2541353 -2722522 -2841476 -2896944 -2893960 -2840756
38459 -2840756 -2746842 -2622369 -2477907 -2323983 -2170274 -2024453 -1890409 -1765962 -1641168 -1499006
38449 -1499006 -1319735 -1088434 -802910 -477818 -141995 170339 430044 620001 736238
38440 736238 784750 777139 727320 649716 558236 465267 380364 309164 253355 212049 183825 168178
38428 168178 165776 177884 205710 249692 308221 375822 441889 491503 508779 481486 404868 283286
38416 283286 129640 -36823 -194072 -322445 -410881 -461921 -492377 -528315 -596560 -717275
38406 -717275 -900915 -1149116 -1456562 -1811767 -2197717 -2594791 -2986191 -3362644 -3722204 -4064538
38396 -4064538 -4384160 -4668387 -4901691 -5072400 -5176330 -5215805 -5197163 -5130061 -5028610 -4911660
38386 -4911660 -4800534 -4715033 -4669655 -4670956 -4715780 -4790321 -4870970 -4928193 -4933212 -4865009 -4714068
38375 -4714068 -4481127 -4172670 -3797059 -3363920 -2886255 -2382623 -1876856 -1394375 -956055
38366 -956055 -572685 -243609 39150 283999 494755 669926 804988 894934 935578 923290
38356 923290 853552 719833 515224 237822 -102573 -480960 -859666 -1196240 -1453507 -1608032
38346 -1608032 -1653949 -1601528 -1472792 -1297130 -1107436 -934908 -802277 -718889 -681497 -680562 -707765
38335 -707765 -760242 -840069 -950402 -1091128 -1256741 -1437490 -1622455 -1802174 -1969937 -2122644
38325 -2122644 -2261779 -2393299 -2524930 -2661539 -2801314 -2935201 -3049785 -3131838 -3172018 -3166095
38315 -3166095 -3113513 -3014796 -2870061 -2679949 -2448384 -2185114 -1906325 -1633096 -1388476 -1193855
38305 -1193855 -1065138 -1009575 -1024445 -1097945 -1211503 -1342577 -1467821 -1566648 -1624405 -1634268 -1597861
38294 -1597861 -1525462 -1435719 -1353666 -1306125 -1315418 -1393676 -1539979 -1741366 -1977138 -2224370 -2461947
38283 -2461947 -2671736 -2837706 -2945101 -2981159 -2937087 -2810084 -2604609 -2332951 -2015550 -1680764
38273 -1680764 -1363055 -1098916 -921112 -852863 -903471 -1066299 -1319502 -1629238 -1954192 -2250160
38263 -2250160 -2474605 -2592314 -2582320 -2443591 -2195594 -1871799 -1508341 -1133205 -760864 -393594
38253 -393594 -26649 346508 730679 1126458 1528468 1925350 2302376 2645440 2943817 3190256
38243 3190256 3378828 3502067 3549094 3506375 3361779 3110488 2759701 2329627 1850333 1355805
38233 1355805 877289 438037 51031 -280051 -557716 -786971 -972414 -1116957 -1222481
38224 -1222481 -1291816 -1330579 -1347745 -1354770 -1363673 -1384350 -1421451 -1472123 -1526668 -1573323 -1605658 -1628299
38212 -1628299 -1656392 -1708072 -1794308 -1912713 -2048577 -2180925 -2288692 -2353983 -2362874 -2305878 -2179377
38201 -2179377 -1987615 -1743843 -1469551 -1192075 -941682 -748625 -639475 -632067 -730056 -919482
38191 -919482 -1169535 -1438511 -1684263 -1876284 -2004503 -2080313 -2129417 -2180918 -2258230 -2374287
38181 -2374287 -2530156 -2715635 -2912000 -3097297 -3252756 -3367181 -3436988 -3462553 -3444004 -3379533
38171 -3379533 -3266837 -3105960 -2901111 -2660119 -2391739 -2102439 -1795075 -1471126 -1135567
38162 -1135567 -800918 -487042 -216581 -9345 120625 164389 115846 -29209 -271232 -602878
38152 -602878 -1005148 -1446553 -1886971 -2285399 -2608406 -2835492 -2959335 -2982012 -2910465 -2754377
38142 -2754377 -2527080 -2247541 -1940556 -1633765 -1352305 -1113258 -921715 -769537 -637279
38133 -637279 -499369 -331697 -119390 138014 425813 717659 981853 1188751 1317611 1361019
38123 1361019 1325342 1227314 1088934 933290 782411 656452 572804 544139 575513 661830
38113 661830 787712 930817 1067163 1175597 1239954 1249985 1202862 1104724 969816 815711
38103 815711 656472 497704 336518 166064 -18547 -216478 -421044 -622370 -811085 -981791
38093 -981791 -1135326 -1278519 -1420726 -1568668 -1722943 -1878411 -2027324 -2162013 -2275255 -2359161
38083 -2359161 -2404618 -2402265 -2344522 -2227376 -2050602 -1816082 -1525701 -1181302 -787614 -355874
38073 -355874 95342 543194 965250 1343109 1664693 1926274 2133970 2302746 2451946 2599132
38063 2599132 2755262 2923051 3098389 3273438 3439685 3589232 3713960 3804390 3850869 3847569
38053 3847569 3796277 3706357 3590493 3459777 3321901 3182379 3045300 2911145 2773332 2617651
38043 2617651 2426073 2181966 1872704 1489501 1027970 491797 -102759 -725988 -1339022
38034 -1339022 -1900325 -2370735 -2716706 -2914245 -2954673 -2849727 -2631861 -2348176 -2050324 -1784602
38024 -1784602 -1585190 -1471104 -1446089 -1500613 -1615089 -1763374 -1915868 -2042722 -2118304 -2127107
38014 -2127107 -2068844 -1959268 -1824900 -1693586 -1585659 -1509704 -1463473 -1437095 -1415496 -1379359
38004 -1379359 -1306590 -1176446 -976159 -707459 -389765 -58045 244753 478950 619390 662040
37994 662040 622889 530329 415763 307163 226656 189947 205103 270367 372800 490175 597037
37983 597037 673259 711013 716388 704972 694270 696922 717022 749700 783081 801845 791587 742719
37971 742719 652517 524620 366857 189268 3623 -175872 -331961 -444553 -491953 -453740
37961 -453740 -316276 -79876 236171 595037 950867 1260644 1494124 1638526 1697641 1687281
37951 1687281 1629886 1550534 1474601 1425339 1419659 1462749 1544667 1642244 1726867 1774846 1775004 1729920
37939 1729920 1651696 1556723 1463306 1392232 1367039 1410978 1540842 1760804 2059924 2414816
37929 2414816 2795821 3173308 3521472 3819426 4051354 4207322 4284753 4289116 4232466 4130040
37919 4130040 3996842 3846453 3692474 3550483 3437685 3369491 3355015 3394139 3477156 3586245
37909 3586245 3698176 3788523 3837435 3835153 3784325 3697587 3591980 3483479 3383783 3298877 3227983
37898 3227983 3162917 3089442 2991600 2857442 2682735 2470099 2224143 1946213 1632865 1279379
37888 1279379 885633 459671 16382 -427430 -858032 -1266995 -1649849 -2001784 -2312369
37879 -2312369 -2562574 -2726953 -2780628 -2707115 -2503114 -2179548 -1760244 -1278649 -772013 -274205
37869 -274205 189473 603392 959966 1257773 1499582 1689211 1828142 1914604 1945925 1921310
37859 1921310 1842077 1709687 1524426 1286554 999435 673136 327247 -8312 -295531 -493619
37849 -493619 -566263 -489145 -255861 119808 606464 1161218 1736252 2283550 2758622 3125215
37839 3125215 3360916 3460845 3436611 3310895 3111011 2864835 2599605 2341178 2111447 1924218
37829 1924218 1782064 1676207 1589321 1500062 1388337 1240277 1051222 825324 572309 303424
37819 303424 28483 -245364 -513187 -770904 -1014864 -1244287 -1465822 -1696249 -1959371 -2277501
37809 -2277501 -2662094 -3108368 -3595574 -4091579 -4559691 -4966224 -5287509 -5514567 -5653630
37800 -5653630 -5721634 -5738002 -5716168 -5658664 -5557947 -5402387 -5184432 -4907045 -4585305 -4242478
37790 -4242478 -3903061 -3586816 -3306469 -3068599 -2875122 -2723595 -2606637 -2512107 -2425268 -2332706
37780 -2332706 -2226686 -2107834 -1984303 -1867167 -1764037 -1674431 -1589229 -1493959 -1373858 -1219071
37770 -1219071 -1029403 -817574 -608647 -433653 -318690 -274311 -290501 -339317 -383061 -383744 -310521
37759 -310521 -143939 122484 482612 919542 1408849 1922704 2434007 2919429 3360659 3744060
37749 3744060 4060146 4304481 4480138 4599802 4684722 4759646 4845629 4954003 5083873 5223572
37739 5223572 5354948 5458765 5519547 5528755 5486086 5399136 5281478 5149076 5015707 4889472
37729 4889472 4772528 4663948 4563066 4470433 4386320 4309290 4236742 4166684 4098451 4031484 3963289
37718 3963289 3888174 3797190 3678891 3520369 3308374 3031115 2681873 2264630 1799183 1321231
37708 1321231 874848 499689 218870 32801 -79216 -151082 -218915 -310892 -441196 -609230
37698 -609230 -802975 -1004406 -1195456 -1363512 -1505042 -1625658 -1735951 -1844589 -1952121 -2048808
37688 -2048808 -2117407 -2138696 -2096298 -1979097 -1782271 -1508835 -1171659 -793857 -405307 -35633
37678 -35633 293248 571234 799150 984431 1136394 1263444 1372663 1471041 1566967 1670341
37668 1670341 1790290 1931480 2091867 2263842 2437489 2602618 2747813 2858245 2915732 2902662
37658 2902662 2808021 2631840 2385317 2086753 1756009 1410791 1066393 737783 441332 193683
37648 193683 7583 -112819 -173846 -189835 -178224 -155417 -135031 -127422 -138996 -171322 -221241
37637 -221241 -282193 -345483 -400104 -431360 -420048 -344093 -183203 74683 427520 856322 1327069
37626 1327069 1797593 2227588 2587889 2864813 3058003 3174262 3222199 3211195 3154447 3072657
37616 3072657 2994036 2948417 2957416 3026348 3143304 3285820 3429936 3555795 3648532 3697580 3697327
37605 3697327 3648583 3558636 3439243 3304021 3166539 3039026 2931127 2848683 2792714 2758285
37595 2758285 2733192 2697866 2628575 2504453 2315895 2069950 1789165 1503260 1236693 997802
37585 997802 775216 543999 278988 -30934 -374357 -718669 -1021061 -1244547 -1371312 -1406795
37575 -1406795 -1373401 -1299327 -1210166 -1127142 -1069927 -1058898 -1113154 -1244533 -1451376 -1716542 -2011566
37564 -2011566 -2304550 -2567151 -2777959 -2923425 -2998922 -3010165 -2972350 -2904821 -2822787 -2730918
37554 -2730918 -2623141 -2488665 -2319727 -2115673 -1881673 -1625011 -1353182 -1075224 -804075
37545 -804075 -556916 -352240 -204533 -118736 -86865 -88476 -94941 -75955 -6393 127702 325038
37534 325038 568077 825993 1060947 1235765 1320782 1298050 1161954 916761 573047 145119
37524 145119 -350190 -894429 -1468825 -2055385 -2636866 -3195634 -3712118 -4163389 -4522568 -4760296
37514 -4760296 -4849061 -4769631 -4517378 -4106447 -3570516 -2959331 -2330789 -1740279 -1231197 -830425
37504 -830425 -549064 -384976 -323415 -335886 -381505 -414670 -397544 -310326 -152695 63806 325740
37493 325740 622600 944742 1278916 1607194 1910840 2175707 2394749 2566204 2690105 2766649
37483 2766649 2797862 2790794 2759190 2721665 2696545 2695746 2720778 2762957 2807054 2835671 2832194 2782632
37471 2782632 2677727 2515287 2301040 2046877 1767164 1474401 1174771 864299 527562
37462 527562 141208 -317827 -862524 -1488506 -2171967 -2873122 -3543330 -4132959 -4597533 -4901904
37452 -4901904 -5024032 -4959246 -4723129 -4350046 -3886493 -3381847 -2880261 -2415849 -2010980 -1676749
37442 -1676749 -1414885 -1220736 -1086765 -1005618 -971542 -979250 -1020698 -1081980 -1143373 -1183943 -1188931
37431 -1188931 -1155392 -1091712 -1010148 -916291 -801911 -645985 -423827 -119760 262819 698663
37421 698663 1146615 1561928 1909292 2170549 2344492 2441254 2475936 2463861 2416605 2337756
37411 2337756 2219994 2045983 1793550 1442729 982262 414733 -240101 -945630 -1654390
37402 -1654390 -2318918 -2903029 -3388471 -3774944 -4075278 -4309014 -4496670 -4655430 -4796199
37393 -4796199 -4922261 -5030226 -5113755 -5169235 -5200648 -5220270 -5244104 -5284894 -5347807 -5431611 -5533425
37382 -5533425 -5652212 -5788183 -5939490 -6099563 -6256748 -6395501 -6498256 -6548282 -6533470 -6448873
37372 -6448873 -6295530 -6076201 -5792334 -5446148 -5046787 -4615010 -4181505 -3779312 -3435831
37363 -3435831 -3169755 -2993470 -2916660 -2946345 -3082376 -3311922 -3607713 -3932190 -4245642 -4513925
37353 -4513925 -4712363 -4825875 -4848102 -4782009 -4641308 -4449771 -4236258 -4026439 -3834824 -3661052
37343 -3661052 -3492365 -3310723 -3100371 -2852039 -2563596 -2240028 -1894545 -1548920 -1229739
37334 -1229739 -960457 -753326 -606049 -504939 -432356 -373980 -322042 -273456 -225292 -171180
37324 -171180 -100740 -1746 135968 316003 532192 769329 1008501 1234101 1437920 1618085
37314 1618085 1774447 1904059 1999516 2050612 2047943 1986697 1869956 1711691 1538418 1386698
37304 1386698 1294254 1286913 1367856 1515636 1692278 1856949 1978213 2040114 2041554 1991917 1906273
37293 1906273 1801995 1696832 1607805 1550116 1535305 1568732 1647973 1764428 1908675 2076996
37283 2076996 2274673 2513003 2801047 3137005 3504670 3877202 4225548 4526568 4767428
37274 4767428 4946154 5070055 5153763 5217772 5287153 5388940 5546683 5772933 6063188 6394962
37264 6394962 6732604 7035554 7267301 7403306 7436502 7378530 7255916 7102764 6952980 6833813
37254 6833813 6760487 6731547 6726711 6710544 6643159 6494437 6254756 5936577 5566320 5171250
37244 5171250 4768247 4359434 3935521 3483592 2994433 2466254 1905451 1326998 755801
37235 755801 226976 -218133 -540980 -716567 -740981 -632681 -428085 -173885 81632 297040
37225 297040 444678 514333 512260 455992 367466 268127 178166 118511 111373 176109 321798
37214 321798 541745 814075 1107810 1390401 1633782 1818939 1939911 2006187 2040957 2074141
37204 2074141 2132484 2231407 2372338 2545743 2736864 2930634 3114228 3278064 3416470 3528204
37194 3528204 3616155 3685835 3743353 3793997 3841906 3890166 3940131 3989933 4033881 4064687 4078054
37183 4078054 4076276 4067410 4059814 4055575 4047173 4019157 3953684 3837468 3667744 3455027 3220687
37172 3220687 2989318 2779109 2595306 2429675 2264387 2076210 1838965 1525853 1114134
37163 1114134 591748 -37610 -754241 -1527466 -2323669 -3114438 -3882231 -4621323 -5332759
37154 -5332759 -6014571 -6651889 -7213017 -7655054 -7937219 -8035394 -7950915 -7710274 -7357047 -6939905
37144 -6939905 -6500781 -6066688 -5647635 -5241011 -4839698 -4439551 -4043225 -3660069 -3303384
37135 -3303384 -2986186 -2716675 -2495411 -2316151 -2170220 -2051703 -1960199 -1899475 -1872720 -1876971
37125 -1876971 -1899906 -1921093 -1916939 -1865930 -1750925 -1558247 -1276291 -896577 -417714 149951
37115 149951 782089 1442383 2088337 2678546 3178708 3564504 3821074 3940404 3918992 3757881
37105 3757881 3465307 3059975 2572243 2041917 1513519 1030833 631981 345422 187235
37096 187235 160464 256896 460327 749349 1098682 1480433 1867529 2239409 2586837 2911939
37086 2911939 3222526 3523806 3812470 4076872 4303444 4485685 4629940 4753836 4878108
37077 4878108 5017024 5173173 5338468 5498719 5637590 5738096 5783086 5757270 5651336 5465946
37067 5465946 5212726 4911593 4586280 4260463 3955277 3687323 3466390 3293655 3162058
37058 3162058 3059549 2973476 2893124 2808822 2709004 2577889 2395349 2138883 1787460 1327221
37048 1327221 757837 96278 -625167 -1366848 -2092125 -2775202 -3402932 -3970372 -4473075
37039 -4473075 -4900677 -5235328 -5455609 -5543925 -5494283 -5317502 -5041281 -4704074 -4344717 -3992812
37029 -3992812 -3664851 -3367113 -3101871 -2871991 -2681811 -2535982 -2439181 -2397481 -2418889 -2509668
37019 -2509668 -2665940 -2864844 -3061805 -3197835 -3214839 -3072428 -2759626 -2298283 -1738398 -1147383
37009 -1147383 -596254 -146324 159970 302071 278855 103371 -202652 -613462 -1103077 -1647748
36999 -1647748 -2225899 -2815247 -3389346 -3917060 -4366475 -4711158 -4934765 -5031611 -5003640 -4856239
36989 -4856239 -4595613 -4229637 -3772059 -3247094 -2690023 -2141226 -1635846 -1194857 -822634
36980 -822634 -511284 -247458 -17162 191950 388248 572569 736102 863000 937262 949690
36970 949690 901560 804839 680085 552083 443313 367758 328681 321374 337744 368501 401654
36959 401654 419864 400661 321334 166637 -65324 -362987 -707444 -1081076 -1473476 -1881248
36949 -1881248 -2301988 -2726196 -3131991 -3485959 -3750206 -3892966 -3898910 -3775482 -3552201 -3271995
36939 -3271995 -2977232 -2696714 -2439866 -2199930 -1962558 -1714388 -1448518 -1166775 -879488
36930 -879488 -602723 -353352 -143823 21093 145053 239523 322527 416177 542166 715872
36920 715872 940892 1205898 1485303 1744025 1944926 2055852 2054067 1928603 1682450 1334378
36910 1334378 917499 472255 35807 -367081 -727513 -1049929 -1346151 -1628658 -1904519
36901 -1904519 -2170650 -2411439 -2600118 -2704348 -2694667 -2553043 -2278982 -1891539 -1426278 -927185
36891 -927185 -435737 18311 420258 767530 1064062 1315728 1527999 1705066 1850037 1966043
36881 1966043 2056984 2126312 2174410 2197788 2192435 2159703 2110383 2064361 2046703 2082570 2192461
36870 2192461 2388275 2671011 3031103 3451327 3910612 4386714 4856959 5297762 5684300
36861 5684300 5991214 6194754 6276526 6228543 6057781 5786916 5448968 5077440 4697186 4320945
36851 4320945 3952277 3591504 3240270 2902398 2581461 2277241 1983664 1689648 1382424
36842 1382424 1051333 689994 296042 -130705 -589703 -1079073 -1592729 -2116788 -2627457
36833 -2627457 -3091856 -3472062 -3732051 -3846450 -3808726 -3635035 -3360944 -3031457 -2688435 -2360669
36823 -2360669 -2060045 -1784368 -1525185 -1277361 -1045956 -846469 -698040 -613925 -595240 -630704
36813 -630704 -700695 -782500 -855203 -903577 -919661 -901289 -849574 -768827 -669832 -572966 -506795
36802 -506795 -501386 -579803 -752103 -1013783 -1347695 -1727146 -2118414 -2482608 -2778486 -2967969
36792 -2967969 -3024523 -2941914 -2739077 -2457524 -2150945 -1870559 -1651765 -1506367 -1421782 -1366384
36782 -1366384 -1299097 -1180927 -985596 -706593 -358836 25334 404618 738970 998288 1167087
36772 1167087 1244733 1242589 1180085 1081171 971648 876771 818372 811709 863717 973893 1137200
36761 1137200 1346646 1593813 1867638 2152773 2428657 2670164 2850691 2947983 2950935 2863781
36751 2863781 2704559 2497705 2264214 2014309 1746027 1449917 1117060 746834 351639
36742 351639 -42884 -402681 -694224 -894444 -996956 -1011203 -955536 -849394 -709970 -554603
36732 -554603 -404794 -286071 -221335 -221560 -281276 -383602 -512381 -663413 -847588 -1084857
36722 -1084857 -1393539 -1781035 -2239658 -2748104 -3276412 -3791179 -4258995 -4648882 -4935891
36713 -4935891 -5105981 -5159111 -5107363 -4968545 -4759086 -4489839 -4165484 -3786258 -3350915 -2860683
36703 -2860683 -2323644 -1757895 -1191378 -657544 -188174 193632 477723 667835 780360
36694 780360 842290 888314 956211 1080072 1282430 1567913 1921363 2312032 2702629 3059363
36684 3059363 3358563 3587921 3743766 3827650 3844302 3800691 3704830 3564076 3384257 3170941
36674 3170941 2932646 2683968 2446012 2242443 2092066 2001586 1963181 1958947 1969778 1983489
36664 1983489 1998221 2020674 2061177 2128324 2225575 2351108 2499723 2663572 2829707 2976906
36654 2976906 3077054 3103436 3041998 2898340 2696141 2468714 2248922 2062108 1923816 1841186
36644 1841186 1815504 1843773 1919027 2030578 2165238 2309477 2452150 2587678 2718906 2857586
36634 2857586 3020652 3223135 3471194 3758532 4066901 4369561 4636419 4839859 4959859
36625 4959859 4986815 4921476 4772817 4555426 4287566 3990413 3688091 3407178 3174008 3009442
36615 3009442 2923520 2914105 2971879 3089387 3268122 3518415 3852163 4273485 4773004 5327620
36605 5327620 5903584 6460060 6953096 7341832 7597625 7713271 7707436 7621202 7507803 7419521
36595 7419521 7395666 7453825 7585788 7759521 7927339 8037726 8046549 7924619 7661296 7265165
36585 7265165 6761973 6189143 5587391 4992166 4428417 3910203 3443675 3030470 2669412
36576 2669412 2356485 2084304 1842161 1617167 1396616 1171535 940699 713653 511020
36567 511020 361154 293348 329050 473620 711922 1010441 1326128 1618758 1861695 2046993
36557 2046993 2183699 2290998 2389258 2492375 2604140 2719477 2828867 2922799 2993887 3036475
36547 3036475 3045187 3014114 2937729 2813804 2647498 2454637 2261805 2101952 2006757 1999253 2090510
36536 2090510 2281530 2567681 2941507 3392412 3905636 4463789 5051098 5657168 6277218
36527 6277218 6908526 7545269 8174438 8774746 9319437 9782091 10142936 10392780 10533048
36518 10533048 10572400 10521831 10390598 10184794 9909021 9569708 9178237 8752798 8318715 7906702
36508 7906702 7548236 7268689 7081230 6984606 6965149 7000650 7064148 7128170 7170518 7179931 7157596
36497 7157596 7112239 7051974 6979471 6894752 6803427 6723088 6681535 6706459 6812676 6994578 7227433
36486 7227433 7475297 7700422 7870779 7965361 7978047 7919447 7815087 7699273 7606684 7565586
36476 7565586 7595765 7710947 7922019 8237006 8656965 9170921 9754092 10371338 10984721 11562447
36466 11562447 12086385 12555642 12984766 13397240 13816954 14260780 14734283 15231467 15738624
36457 15738624 16241074 16729937 17205746 17677659 18159550 18665292 19204922 19782239 20393969
36448 20393969 21030187 21675784 22313003 22925307 23501935 24041089 24549828 25040817 25527919
36439 25527919 26022443 26530193 27049213 27569560 28076917 28559667 29015583 29453493 29888643
36430 29888643 30335578 30804086 31300362 31830358 32400571 33014967 33671091 34359043 35063956
36421 35063956 35769988 36464165 37139763 37799249 38456070 39134855 39870221 40704320 41682597
36412 41682597 42847741 44233680 45862245 47743369 49876668 52251616 54845996 57625270
36404 57625270 60545690 63561405 66632993 69734502 72857625 76013207 79230556 82554801
36396 82554801 86042445 89755254 93752690 98083930 102781847 107861651 113324906 119166764
36388 119166764 125383250 131976660 138958406 146348593 154171797 162450206 171197049 180412540
36380 180412540 190082050 200174928 210643366 221421972 232428215 243563002 254710958
36373 254710958 265740840 276505982 286843487 296571568 305487641 313371698 319997463
36366 319997463 325149272 328639976 330326254 330120451 327999197 324008285 318262121 310936322
36358 310936322 302254029 292468568 281845685 270647386 259117813 247471383 235884634
36351 235884634 224493725 213398177 202668736 192355344 182491782 173096344 164171225
36344 164171225 155704450 147675782 140063981 132850765 126019308 119549891 113417761 107595917
36336 107595917 102060643 96795063 91788260 87031859 82517818 78238590 74187480 70356975
36328 70356975 66736022 63309271 60059674 56972772 54040097 51260617 48640223 46189092
36320 46189092 43916984 41828170 39918961 38179547 36598751 35168234 33883344 32740473
36312 32740473 31733038 30848595 30068304 29368423 28722980 28106878 27498570 26881301 26242522
36303 26242522 25572706 24865575 24120842 23348310 22570488 21821043 21138211 20555035 20090396
36294 20090396 19744502 19499829 19325603 19183349 19032617 18837316 18572208 18227277 17807229
36285 17807229 17325465 16795229 16222703 15606116 14941432 14231405 13492822 12757788 12067590
36276 12067590 11460893 10960883 10567376 10258252 10000061 9762666 9530793 9307277 9107429
36267 9107429 8948516 8840827 8785460 8779270 8822203 8920763 9084724 9319422 9618695 9961992
36257 9961992 10315786 10637352 10879532 10996841 10953510 10732024 10338485 9801190 9162264 8466145
36247 8466145 7750460 7043048 6364986 5735966 5177192 4709299 4346764 4092988 3939399
36238 3939399 3868841 3860961 3897155 3963578 4051778 4157045 4274960 4397423 4509998 4592614 4624324
36227 4624324 4590459 4488406 4328697 4131143 3918954 3714403 3537385 3405236 3331081 3319577
36217 3319577 3361966 3434526 3503272 3534081 3503719 3406869 3256999 3082046 2917153 2796152
36207 2796152 2743210 2766717 2857856 2994769 3150478 3300843 3429313 3527580 3593594 3629299
36197 3629299 3639425 3630652 3609634 3580038 3541094 3490044 3427572 3362353 3311591 3297801 3344040
36186 3344040 3469441 3686024 3997570 4400633 4886316 5441106 6046791 6680996 7318966
36177 7318966 7935412 8505246 9003662 9406853 9693941 9849632 9866752 9747838 9505190 9159697
36167 9159697 8739383 8277913 7811797 7375091 6992717 6675654 6420634 6214125 6037832
36158 6037832 5872888 5702002 5511159 5292786 5049774 4796983 4556906 4350087 4185383
36149 4185383 4056128 3944800 3833604 3714964 3596165 3495924 3435338 3428354 3476204 3567416
36139 3567416 3682341 3799926 3903681 3983735 4033833 4045996 4008066 3907056 3735947 3498580
36129 3498580 3209516 2890102 2563480 2250041 1963842 1711288 1493283 1309741 1163214
36120 1163214 1059280 1004281 1002734 1055913 1161676 1315093 1509446 1737156 1989958 2257924
36110 2257924 2527673 2781034 2995798 3149598 3226203 3221744 3147853 3029620 2898499 2782901
36100 2782901 2701085 2659951 2659221 2696874 2771927 2884381 3034643 3223520 3451474 3715891 4007562
36089 4007562 4309307 4598433 4851942 5051649 5186824 5254110 5255975 5199166 5093582 4951678
36079 4951678 4788773 4624307 4482666 4391172 4374425 4447150 4609528 4847511 5137436 5451973
36069 5451973 5764632 6052028 6294689 6477735 6592142 6636410 6617515 6549485 6448583 6326405
36059 6326405 6184364 6012974 5796582 5520962 5179920 4778107 4329702 3854905 3376860
36050 3376860 2920205 2510037 2169530 1916250 1759305 1699228 1730601 1846386 2042677 2322172
36040 2322172 2693587 3165215 3734594 4379969 5059071 5716015 6292418 6737627 7015628
36031 7015628 7109241 7022515 6780645 6425809 6008588 5577103 5167225 4796742 4464670 4155211
36021 4155211 3844810 3510023 3133798 2708329 2234440 1719635 1177478 628692 101200
36012 101200 -374001 -771059 -1077719 -1299894 -1460716 -1595024 -1740955 -1930297 -2179877 -2486816
36002 -2486816 -2829741 -3175704 -3489650 -3741980 -3911216 -3982572 -3945861 -3795613 -3533141 -3168298
35992 -3168298 -2719026 -2208416 -1660166 -1093855 -521906 50816 625591 1208574 1809956
35983 1809956 2441587 3111405 3816584 4539823 5251651 5917046 6502254 6979103 7327282
35974 7327282 7536173 7606820 7553208 7401736 7188141 6951586 6726710 6535806 6384053 6259687
35964 6259687 6138811 5993030 5797668 5538966 5219204 4858818 4494190 4170136 3928470
35955 3928470 3796936 3783504 3877653 4055831 4287039 4536711 4769555 4952272 5056223 5059974
35945 5059974 4952024 4733588 4420245 4040914 3633074 3234612 2874783 2568306 2315563
35936 2315563 2108059 1934720 1785086 1649250 1517102 1378702 1225197 1049068 843945
35927 843945 605306 332420 30167 -291141 -618298 -938599 -1242243 -1523295 -1779967 -2014704
35917 -2014704 -2233145 -2440817 -2638179 -2816924 -2960781 -3051461 -3076656 -3035290 -2937261 -2798777
35907 -2798777 -2636957 -2466653 -2299973 -2147184 -2017528 -1918995 -1856975 -1832413 -1840571 -1871233
35897 -1871233 -1910493 -1943956 -1961061 -1959420 -1947173 -1941958 -1967036 -2046174 -2197968 -2429652 -2732032
35886 -2732032 -3078885 -3432597 -3753677 -4009545 -4179804 -4257819 -4248979 -4165661 -4020469 -3821496
35876 -3821496 -3572471 -3276482 -2939146 -2568740 -2174514 -1765669 -1351451 -941307 -544741
35867 -544741 -171967 164276 447604 659963 786798 822724 774663 661704 512756 362798
35857 362798 247336 195154 221768 327395 501173 728966 999326 1304077 1634835 1980124
35847 1980124 2326438 2662560 2983432 3290537 3588615 3880998 4166009 4435354 4673938
35838 4673938 4860317 4968225 4970451 4845445 4584775 4198050 3712751 3169020 2611759 2082873
35828 2082873 1615150 1227735 923036 686123 488069 293004 66467 -217432 -570846
35819 -570846 -989376 -1453543 -1936523 -2416308 -2886049 -3356413 -3848617 -4381845 -4960605 -5567075
35809 -5567075 -6161577 -6690993 -7101163 -7348102 -7405660 -7270364 -6964155 -6533094 -6039543 -5548382
35799 -5548382 -5112068 -4760482 -4498702 -4311548 -4171368 -4046178 -3906970 -3733600 -3518078
35790 -3518078 -3264291 -2984763 -2696512 -2417795 -2166084 -1956490 -1799840 -1700499 -1655105 -1653533
35780 -1653533 -1681859 -1725454 -1770951 -1807905 -1831413 -1844564 -1857888 -1885222 -1939083 -2028895 -2161922
35769 -2161922 -2344116 -2578922 -2864771 -3192978 -3547158 -3904551 -4239300 -4527227 -4750674
35760 -4750674 -4901321 -4979546 -4990650 -4940263 -4831470 -4664824 -4440811 -4163591 -3844581 -3503772
35750 -3503772 -3167088 -2860419 -2603404 -2405678 -2265909 -2172700 -2107352 -2048794 -1979420 -1889044
35740 -1889044 -1775254 -1640964 -1491628 -1334109 -1177576 -1034474 -918603 -839338 -795347 -773435
35730 -773435 -755172 -727587 -690667 -656636 -642159 -659457 -712299 -798565 -915982 -1066021 -1253159
35719 -1253159 -1480351 -1743725 -2029560 -2315377 -2574758 -2783573 -2924911 -2991714 -2987873 -2928228
35709 -2928228 -2836564 -2740585 -2664497 -2621812 -2611486 -2619214 -2623176 -2601118 -2535360 -2414539 -2233154
35698 -2233154 -1990413 -1688894 -1333470 -931460 -494464 -40373 406852 820515 1176107
35689 1176107 1455437 1648459 1752902 1772863 1717594 1600766 1439498 1252434 1057300 868955
35679 868955 698627 554240 441859 367996 341641 374160 476374 654595 908194 1229425
35669 1229425 1603980 2011119 2424736 2817362 3166316 3458142 3688492 3858846 3973788
35660 3973788 4040486 4068699 4069595 4054112 4032676 4016280 4017160 4047859 4119284 4239070 4410670 4632546
35648 4632546 4896799 5187399 5478922 5736870 5920451 5988650 5909793 5672298 5291405 4806734
35638 4806734 4270898 3735279 3239673 2807529 2444421 2138487 1864560 1593228 1302367
35629 1302367 986255 658723 349812 97376 -63989 -113894 -54151 88446 265850 418677
35619 418677 489753 436970 241442 -90649 -531867 -1041305 -1574111 -2089821 -2556696 -2951311
35609 -2951311 -3255544 -3454563 -3538232 -3505601 -3369457 -3157061 -2904944 -2649249 -2415870 -2214688
35599 -2214688 -2039579 -1873067 -1692975 -1478557 -1214543 -893018 -513981 -85130 379457
35590 379457 862031 1344491 1810988 2249526 2653299 3021839 3360842 3680042 3990481 4302802
35580 4302802 4626189 4965831 5318389 5667993 5986196 6236950 6385158 6406121 6292911 6058602
35570 6058602 5731830 5347834 4939912 4535258 4154980 3815283 3527499 3297054 3122723
35561 3122723 2997020 2908116 2843245 2792773 2752987 2725917 2716615 2730400 2772155 2847424 2963145
35550 2963145 3126379 3341473 3607281 3915592 4250877 4590912 4908298 5173262 5358144
35541 5358144 5443076 5421030 5299695 5098639 4842939 4556820 4260761 3972533 3709315 3487184
35531 3487184 3316972 3199358 3123481 3070478 3018894 2947282 2832920 2650717 2377450 2001720
35521 2001720 1533859 1008664 478409 -82 -377583 -618888 -702913 -619727 -368589 41234
35511 41234 588650 1240882 1956230 2687545 3385122 4000715 4494719 4844808 5050497 5129730
35501 5129730 5109481 5016505 4872820 4695896 4500590 4300346 4106913 3928916 3770224 3629512
35491 3629512 3502128 3383711 3273124 3172430 3084082 3008062 2941535 2880927 2824299 2772168
35481 2772168 2726697 2690106 2662928 2642619 2623177 2596095 2551934 2481675 2378308 2239685 2071815
35470 2071815 1889171 1709392 1544401 1394087 1247474 1090612 915747 726270 535183
35461 535183 358183 205024 74177 -45213 -164947 -289447 -414274 -532003 -639412 -739669
35451 -739669 -838682 -939580 -1039212 -1127909 -1191941 -1217605 -1195270 -1121025 -994619 -814895 -576080
35440 -576080 -268018 118993 587002 1124634 1705887 2294419 2851812 3346528 3759824 4086333
35430 4086333 4330071 4499166 4602490 4648792 4647087 4607536 4543093 4471652 4416686 4404133 4455138
35419 4455138 4577109 4757409 4963947 5154084 5288423 5342637 5311860 5207417 5049998 4863305
35409 4863305 4669315 4484435 4316279 4162049 4009761 3842760 3646590 3416138 3160279
35400 3160279 2901672 2670961 2496880 2395859 2365533 2385073 2422162 2443544 2425057 2357759
35390 2357759 2248264 2113379 1971686 1836509 1714017 1606742 1518949 1459221 1438078 1462430
35380 1462430 1531052 1634157 1756685 1882136 1994275 2077041 2115047 2096218 2015370 1876325
35370 1876325 1691405 1479092 1261095 1059140 891421 769464 696695 669376 679138 716241
35360 716241 773279 848955 949814 1087049 1268337 1489393 1731775 1969387 2179702 2352414
35350 2352414 2490711 2605307 2705223 2790363 2849749 2866145 2823734 2713646 2534312 2288450
35340 2288450 1981174 1621669 1226567 820884 434300 94237 -180679 -384296 -523748
35331 -523748 -618636 -698694 -798682 -950160 -1172525 -1467437 -1819219 -2200556 -2580631 -2932631
35321 -2932631 -3238369 -3488492 -3678298 -3801472 -3845767 -3793955 -3630445 -3350571 -2967857 -2515320
35311 -2515320 -2039849 -1591790 -1213715 -932106 -754321 -671596 -666860 -724036 -834395 -997178
35301 -997178 -1215230 -1489050 -1812495 -2171256 -2543527 -2902024 -3216984 -3459985 -3608337 -3649422
35291 -3649422 -3583639 -3424010 -3191380 -2906656 -2584039 -2228870 -1840601 -1417963 -962586 -479575
35281 -479575 23797 539518 1059798 1578261 2091240 2597810 3097419 3586013 4053185 4482111
35271 4482111 4852103 5142683 5338507 5434586 5440206 5379064 5284249 5189443 5120223 5089741 5100652
35260 5100652 5151276 5241337 5373842 5553291 5783400 6066854 6407117 6810353 7285397 7840462
35250 7840462 8476880 9182662 9930184 10680569 11392806 12032582 12576997 13015132 13346453
35241 13346453 13577835 13718522 13773276 13737151 13596655 13338955 12964620 12495416 11971198 11437170
35231 11437170 10928821 10461986 10031095 9614571 9184752 8719491 8212016 7675401 7139950
35222 7139950 6644925 6228178 5916831 5720662 5629037 5612326 5628058 5630377 5579843 5450826
35212 5450826 5235247 4942606 4596518 4228379 3869980 3547771 3280372 3078573 2945820
35203 2945820 2878040 2863551 2884255 2918419 2944157 2942721 2901250 2815182 2690210 2543099 2400124
35192 2400124 2292277 2247843 2285039 2408242 2609856 2876517 3195451 3556745 3950300 4360275
35182 4360275 4761654 5121957 5407637 5592265 5663507 5627015 5506253 5337788 5162812 5017384
35172 5017384 4924437 4889478 4900340 4931036 4949740 4929658 4858954 4744849 4609411 4479263 4374837
35161 4374837 4304606 4266562 4255037 4267982 4309659 4386656 4499746 4637143 4774029 4879246
35151 4879246 4925815 4900031 4805296 4660205 4493029 4335274 4215619 4154844 4162692 4237971 4371809
35140 4371809 4551949 4765765 5001433 5248237 5496620 5737745 5962750 6162886 6331472
35131 6331472 6466637 6572773 6659386 6737896 6818030 6905088 6998426 7090781 7168239 7211487 7199196
35120 7199196 7113107 6942553 6686259 6351562 5953409 5514625 5066208 4644886 4286840 4019695
35110 4019695 3856625 3795423 3822567 3919581 4068080 4251413 4453514 4657455 4845783 5002776
35100 5002776 5116890 5181412 5192840 5148578 5046484 4887573 4680487 4444407 4207627 4001510
35090 4001510 3852313 3774606 3769139 3825437 3926795 4054552 4190101 4315462 4414261 4474012
35080 4474012 4488878 4460859 4397558 4306629 4189811 4040816 3849028 3606600 3314053 2981343
35070 2981343 2624822 2262243 1907547 1567067 1238855 915890 591663 265816 -51642
35061 -51642 -338472 -562451 -689198 -693490 -568375 -327219 992 378838 766381 1125011
35051 1125011 1420227 1624030 1716983 1689606 1542573 1285271 933377 507026 30655 -466498
35041 -466498 -951583 -1392487 -1764262 -2054362 -2263757 -2403303 -2487733 -2530588 -2542278 -2530916
35031 -2530916 -2503739 -2466968 -2423824 -2372871 -2309366 -2229678 -2134960 -2029582 -1914146 -1778515 -1601618
35020 -1601618 -1359744 -1038418 -639984 -182073 311656 822086 1339725 1861734 2383769
35011 2383769 2892370 3362407 3760840 4054923 4221264 4251758 4154255 3948794 3662462 3325239
35001 3325239 2966976 2614358 2287297 1995590 1737142 1499074 1262414 1009749 733190
34992 733190 438911 145812 -121171 -339954 -498156 -594825 -636549 -630693 -579987 -481348 -328500
34981 -328500 -116203 155649 478487 832738 1188377 1509516 1761957 1920690 1974707 1928436
34971 1928436 1800624 1621318 1426775 1252076 1122701 1047893 1018728 1011763 996526 943910
34961 943910 833328 657704 425852 161523 -101259 -325806 -481059 -547941 -521797 -410748
34951 -410748 -231243 -2781 256782 534817 826276 1134647 1471365 1853862 2302718 2838035
34941 2838035 3474901 4218312 5059149 5973248 6924515 7871100 8772628 9596550 10322111
34932 10322111 10940761 11453052 11864165 12181299 12414493 12578996 12695733 12788069 12876092 12971182
34922 12971182 13072914 13168874 13237240 13251781 13188556 13032794 12783810 12456108 12076160 11675902
34912 11675902 11284998 10924186 10601742 10314196 10050733 9798792 9547740 9288916 9013041
34903 9013041 8708064 8360115 7957393 7493828 6969313 6386549 5747873 5055222 4313238
34894 4313238 3533120 2735105 1948641 1209882 556313 19539 -381657 -646115 -791926
34885 -791926 -854094 -877739 -908147 -981062 -1116412 -1316247 -1565692 -1835874 -2088669 -2282802
34875 -2282802 -2380197 -2351859 -2183571 -1881300 -1474339 -1013009 -559475 -174212 96361 226491
34865 226491 211348 63726 -190106 -515024 -872786 -1228287 -1553886 -1829700 -2040054 -2168898
34855 -2168898 -2197936 -2109951 -1896540 -1566144 -1147155 -683470 -224369 186115 515598 744296
34845 744296 862964 871297 778218 602838 373871 126201 -104967 -290573 -412207 -462791
34835 -462791 -443730 -361133 -223807 -43522 164240 381260 589817 776833 936346 1068291
34825 1068291 1174107 1252446 1298585 1308196 1282656 1232197 1175140 1133808 1128841 1173631 1270508
34814 1270508 1410024 1573765 1740066 1890980 2018502 2128094 2238058 2374400 2562507
34805 2562507 2818431 3142933 3520123 3920848 4309818 4654640 4933858 5140410 5278637
34796 5278637 5356767 5379490 5344547 5243854 5067030 4804847 4451714 4007839 3482094 2895083
34786 2895083 2279979 1678792 1134222 680119 334040 94227 -57989 -150315 -208510 -247222
34776 -247222 -267278 -259638 -211826 -112419 47021 270369 554303 886147 1244822 1605620
34766 1605620 1946701 2254085 2523189 2757060 2962584 3145691 3306384 3435123 3512931 3516883
34756 3516883 3429622 3248442 2989002 2681659 2362757 2065529 1814554 1624691 1502645 1448728
34746 1448728 1457878 1520860 1626685 1765658 1931023 2117817 2319583 2525139 2717618 2876609
34736 2876609 2982509 3020949 2985310 2877040 2705091 2485338 2239390 1991919 1766892 1583981
34726 1583981 1455477 1383429 1357715 1356936 1352875 1316863 1225525 1064891 833045 540991 210598
34715 210598 -130539 -455672 -744547 -986604 -1181278 -1335686 -1460555 -1565953 -1658425 -1739957
34705 -1739957 -1808166 -1857059 -1878732 -1866382 -1817685 -1736419 -1630963 -1510615 -1382064 -1247989
34695 -1247989 -1108250 -962976 -816201 -678394 -566865 -503989 -513482 -614627 -815077 -1105143
34685 -1105143 -1457472 -1833442 -2193043 -2503262 -2742329 -2900541 -2979286 -2988653 -2943508 -2858915
34675 -2858915 -2746840 -2615606 -2471763 -2322543 -2177049 -2045603 -1938037 -1861953 -1821419 -1815851
34665 -1815851 -1838831 -1877352 -1912902 -1925911 -1903170 -1844667 -1765106 -1688068 -1635954 -1621755 -1647003
34654 -1647003 -1705776 -1791207 -1900463 -2036007 -2203288 -2406584 -2645179 -2911763 -3193854 -3477325
34644 -3477325 -3749453 -3999321 -4216072 -4387797 -4502918 -4552910 -4533927 -4446852 -4297538 -4098589
34634 -4098589 -3871493 -3646322 -3457003 -3332826 -3289440 -3323477 -3413188 -3524101 -3616489 -3651766
34624 -3651766 -3596730 -3426212 -3125483 -2693535 -2146594 -1519041 -858602 -215948 367337 867490
34614 867490 1281260 1622423 1913464 2175097 2417471 2636531 2816376 2935765 2975838 2926718
34604 2926718 2791381 2585875 2335943 2071286 1819338 1600472 1426053 1299653 1220256 1185194
34594 1185194 1190815 1230549 1292073 1356657 1402861 1413817 1384033 1321171 1241450 1161739 1093665
34583 1093665 1043279 1015371 1018099 1063529 1163560 1324900 1547242 1825144 2150477 2512952
34573 2512952 2899615 3296051 3689846 4073892 4447054 4812147 5172851 5530867 5883712
34564 5883712 6223806 6539758 6819863 7056431 7249065 7405719 7541114 7672397 7812981
34555 7812981 7967088 8128009 8280840 8407284 8489021 8508725 8451028 8306240 8076526 7780594
34545 7780594 7452514 7133709 6861757 6661461 6541701 6497872 6517266 6584666 6686552 6813256
34535 6813256 6959074 7120725 7295101 7477197 7658833 7828309 7970845 8069583 8107047 8067306
34525 8067306 7939013 7719116 7416096 7051067 6655048 6261822 5898124 5575278 5286981
34516 5286981 5015010 4740013 4451419 4151470 3852249 3568447 3310320 3080460 2875534
34507 2875534 2691428 2528395 2393212 2297348 2252616 2266799 2340894 2467773 2631201 2805801
34497 2805801 2960621 3068156 3116121 3115009 3095613 3096834 3149921 3266724 3436838 3634517 3832029
34486 3832029 4012942 4178917 4347488 4543416 4788370 5092915 5453044 5852213 6267797
34477 6267797 6678613 7069688 7432560 7761987 8051186 8287927 8454030 8529947 8503177 8376143
34467 8376143 8168656 7913497 7647955 7406059 7214343 7090578 7043418 7072340 7169159 7321849
34457 7321849 7519142 7753207 8019023 8310781 8616448 8912538 9162567 9322336 9351039 9222386
34447 9222386 8929659 8483408 7905390 7222705 6463308 5652241 4808987 3947827 3082257
34438 3082257 2231456 1424406 698084 89747 -372963 -679436 -838060 -872656 -815181 -697008
34428 -697008 -540776 -354726 -131522 146975 499946 936722 1449789 2014600 2595494 3154297
34418 3154297 3657800 4081878 4412579 4646352 4790776 4864656 4895335 4913400 4947641 5022321
34408 5022321 5155458 5355732 5618478 5924153 6241901 6537243 6780510 6952603 7046336 7063798
34398 7063798 7012363 6902688 6750115 6577406 6414960 6296375 6250693 6295152 6431911 6649834
34388 6649834 6929896 7251606 7598072 7958355 8326837 8700681 9077238 9452967 9823955
34379 9823955 10187149 10541496 10888915 11234973 11588594 11960130 12358252 12787386 13247684
34370 13247684 13737894 14259088 14815846 15413262 16051581 16722222 17407319 18081821 18716133
34361 18716133 19278736 19739539 20074126 20267605 20316549 20228683 20021038 19717618 19347126 18940829
34351 18940829 18530306 18144714 17807508 17533154 17325259 17177860 17080514 17025598 17014449 17059090
34341 17059090 17178180 17388184 17693297 18079384 18516227 18967725 19404418 19811727 20191625
34332 20191625 20560076 20943060 21371825 21876977 22482077 23198078 24019563 24924280 25878270
34323 25878270 26846939 27807501 28755538 29702182 30665228 31660456 32696561 33773188 34880862
34314 34880862 36002808 37118934 38211027 39267412 40285499 41271428 42237492 43199570
34306 43199570 44176730 45192378 46273743 47447401 48732944 50139477 51667459 53313943
34298 53313943 55077654 56962271 58978526 61145383 63489148 66039452 68823266 71859643
34290 71859643 75157321 78715351 82525790 86577655 90861492 95373626 100118884 105111477
34282 105111477 110374314 115936817 121830699 128084338 134718728 141748430 149187945 157059438
34274 157059438 165396213 174239147 183627951 193592355 204147811 215296955 227033729
34267 227033729 239344717 252203757 265560246 279325522 293362473 307481513 321443215
34260 321443215 334965958 347736138 359418655 369667137 378136297 384500450 388480187
34253 388480187 389873789 388585123 384639261 378181314 369459536 358797454 346560929 333125727
34245 333125727 318850350 304057418 289024817 273985076 259129467 244612755 230556159
34238 230556159 217048482 204147371 191882805 180263747 169286663 158942898 149221819
34231 149221819 140109314 131584783 123620909 116187696 109258235 102812245 96835511 91316222
34223 91316222 86240600 81590026 77340493 73463564 69926992 66694375 63725547 60979794
34215 60979794 58421415 56024344 53772807 51657461 49668727 47790062 45994444 44246654
34207 44246654 42510795 40758644 38974542 37156306 35314933 33474275 31668722 29937108
34199 29937108 28314525 26825872 25483357 24287320 23228902 22293577 21464886 20727619
34191 20727619 20070131 19485933 18974249 18538597 18183121 17908029 17706232 17562339 17453707
34182 17453707 17352643 17229266 17055108 16807375 16472927 16049997 15546075 14972555 14339395
34173 14339395 13653329 12920577 12151486 11363194 10578266 9820363 9110078 8463269 7891802
34164 7891802 7404608 7007015 6698439 6470348 6306685 6187433 6094287 6016472 5954703 5921583
34154 5921583 5937420 6021910 6184453 6417370 6695380 6981428 7235893 7425415 7528931 7539970
34144 7539970 7465325 7321124 7128162 6908318 6682483 6469235 6283555 6135922 6032543 5976963
34134 5976963 5972263 6022454 6132105 6304415 6538826 6829080 7161766 7515480 7861889 8170165
34124 8170165 8413898 8576873 8654470 8651058 8576685 8445552 8275626 8087191 7899466 7726545
34114 7726545 7574524 7440687 7314527 7179895 7017716 6808923 6537482 6193344 5775020
34105 5775020 5291310 4761710 4215069 3686128 3209892 2814513 2514133 2304026 2160602
34096 2160602 2047716 1927902 1774082 1576696 1344164 1098463 869177 688093 584732
34087 584732 582840 697739 933809 1281665 1716510 2200597 2691085 3150446 3554366 3893765
34077 3893765 4171352 4395696 4576193 4721157 4839342 4943314 5052197 5191966 5392420
34068 5392420 5680898 6073905 6569843 7146711 7766413 8383494 8954126 9442525 9824307
34059 9824307 10087198 10229416 10256659 10179581 10013295 9778296 9500495 9208548 8928944 8681034
34049 8681034 8474238 8308467 8177260 8072090 7985774 7913790 7853973 7806161 7772433 7756453
34039 7756453 7760042 7777603 7792177 7777134 7703771 7550829 7310711 6989623 6602808 6168428
34029 6168428 5703908 5226420 4755983 4317244 3936389 3633507 3414865 3270170 3176191 3103727
34019 3103727 3023964 2912831 2754634 2546092 2299564 2042581 1811724 1642336 1559064 1572340
34009 1572340 1681817 1882541 2168418 2531223 2957816 3428975 3920689 4406903 4862696
34000 4862696 5267224 5605305 5866903 6045624 6138621 6148631 6085743 5965479 5802568 5603768
33990 5603768 5364649 5072846 4716043 4290198 3804035 3278589 2743079 2229124 1764910
33981 1764910 1370211 1052789 806663 613123 445280 275604 83815 -138524 -388470
33972 -388470 -655942 -928767 -1196098 -1449202 -1679671 -1876152 -2021939 -2096220 -2080040 -1964728
33962 -1964728 -1758208 -1485317 -1181952 -886331 -631266 -439071 -318616 -264280 -258025 -275467
33952 -275467 -294096 -299574 -287363 -260561 -227176 -198885 -190431 -217285 -290705 -412213 -571206
33941 -571206 -747924 -920671 -1073525 -1201074 -1309074 -1412111 -1529687 -1681689 -1884019 -2145410
33931 -2145410 -2466080 -2837867 -3244959 -3665088 -4072100 -4440636 -4751788 -4996751 -5176064
33922 -5176064 -5295124 -5359547 -5373524 -5341031 -5267004 -5156695 -5014291 -4842966 -4646436 -4430074
33912 -4430074 -4200798 -3967346 -3742365 -3544191 -3394004 -3307105 -3283287 -3304030 -3339656 -3361582
33902 -3361582 -3351044 -3299514 -3203447 -3059744 -2865687 -2621851 -2334000 -2011730 -1665318 -1304069
33892 -1304069 -938413 -584527 -267134 -16231 142329 197252 156587 44156 -109610 -277288
33882 -277288 -440964 -594554 -742014 -892116 -1051588 -1219493 -1385230 -1530572 -1634441 -1678322
33872 -1678322 -1650415 -1547374 -1374047 -1142890 -874288 -597001 -346387 -159037 -65256 -82666
33862 -82666 -213727 -447594 -764434 -1139465 -1545121 -1951901 -2329786 -2651331 -2895682 -3051606
33852 -3051606 -3118426 -3104965 -3027266 -2905757 -2762491 -2618993 -2494839 -2406322 -2364598 -2373442 -2427882
33841 -2427882 -2515216 -2618837 -2723452 -2819112 -2902057 -2972406 -3030605 -3075201 -3103790 -3117010 -3122738
33830 -3122738 -3136385 -3175334 -3250335 -3359508 -3488467 -3615417 -3717645 -3776824 -3782289 -3732225 -3632964
33819 -3632964 -3497057 -3340047 -3175151 -3006197 -2822634 -2601656 -2318499 -1959819 -1532879
33810 -1532879 -1066559 -605121 -198227 109342 285701 316071 202850 -37745 -380990 -798714
33800 -798714 -1262297 -1743253 -2213043 -2644285 -3014191 -3308959 -3526787 -3677334 -3777209 -3843573
33790 -3843573 -3889453 -3922951 -3949190 -3972114 -3994616 -4017720 -4040149 -4058567 -4068275 -4064339 -4043218 -4004401
33778 -4004401 -3951338 -3891055 -3832522 -3784504 -3754048 -3746256 -3764778 -3811868 -3887613 -3988921 -4108761
33767 -4108761 -4235874 -4355793 -4454162 -4521658 -4557657 -4570256 -4573331 -4583000 -4614519 -4678539 -4776442
33756 -4776442 -4897045 -5018049 -5113287 -5163066 -5162460 -5123134 -5067854 -5021179 -5001437 -5016938 -5065585
33745 -5065585 -5135413 -5205067 -5245735 -5226647 -5124088 -4930583 -4659230 -4340159 -4010743 -3704615
33735 -3704615 -3444449 -3240219 -3091467 -2990521 -2924045 -2872300 -2808219 -2699576 -2515630 -2236103
33725 -2236103 -1858630 -1401933 -903927 -415111 11470 330836 513265 545423 426012 159356
33715 159356 -248814 -790431 -1448962 -2191523 -2964875 -3699691 -4323000 -4773764 -5015009 -5038538
33705 -5038538 -4862512 -4524775 -4074563 -3564293 -3042871 -2551814 -2124097 -1783835 -1544712
33696 -1544712 -1406972 -1354456 -1353252 -1353225 -1294015 -1116772 -779853 -272504 380746 1127961 1906059
33685 1906059 2657208 3338550 3923681 4399082 4759856 5007107 5146826 5189186 5147542 5037156
33675 5037156 4873896 4673184 4448888 4211628 3966874 3714777 3453696 3186447 2924980
33666 2924980 2689425 2501975 2380466 2336557 2378967 2517857 2765796 3133779 3624387 4225658
33656 4225658 4908479 5629071 6337036 6987534 7553456 8032226 8444036 8822583 9202288
33647 9202288 9606170 10038130 10482965 10915248 11313342 11670950 12000028 12324973 12672955
33638 12672955 13065456 13513182 14014609 14558068 15126821 15705260 16283594 16859337 17435866
33629 17435866 18019636 18617700 19236140 19878724 20544726 21226150 21906354 22561945 23167156
33620 23167156 23697398 24129417 24438928 24599358 24584676 24376223 23970893 23387071 22665181
33611 22665181 21861379 21035692 20238797 19502723 18838613 18240716 17692601 17171601 16650728
33602 16650728 16100580 15494400 14816030 14066612 13265248 12442251 11628235 10844298 10097209
33593 10097209 9380704 8681352 7986119 7288412 6590436 5901642 5234850 4602288 4012876
33584 4012876 3471065 2977204 2529654 2128346 1778142 1489608 1276273 1150089 1118201 1182602
33574 1182602 1341397 1588980 1914091 2297374 2711316 3123832 3504084 3827897 4081010
33565 4081010 4259878 4370357 4424798 4438680 4428428 4411178 4405237 4428758 4495431 4608603 4757068
33554 4757068 4915315 5048780 5122026 5106711 4987047 4762403 4447677 4071361 3670433 3281980
33544 3281980 2933867 2638200 2390288 2172869 1963088 1739642 1488846 1209099 912747
33535 912747 623935 372327 184755 78260 57192 114751 236960 405931 600513 795467
33525 795467 962853 1077958 1127425 1113750 1052127 961634 857120 746741 634510 523300
33515 523300 414852 307793 197252 78054 -50333 -180510 -297391 -381368 -412824 -376664
33505 -376664 -265519 -80213 172761 485065 848992 1257365 1701722 2170668 2649687 3122612
33495 3122612 3574209 3992732 4370919 4704482 4989302 5220217 5393461 5511250 5584295 5629011
33485 5629011 5660227 5683329 5690056 5660392 5570610 5404525 5162229 4860627 4524771 4175190
33475 4175190 3818855 3448504 3049744 2611762 2136632 1643304 1164756 740006 405157
33466 405157 187434 103316 158878 349652 659387 1059561 1511826 1973193 2401282 2757252
33456 2757252 3006746 3121345 3082452 2886866 2551271 2112570 1622363 1136296 701665 348306
33446 348306 86512 -88251 -188121 -228200 -226534 -206200 -194897 -219270 -295666 -422433 -578846
33435 -578846 -732220 -850122 -911922 -914628 -871172 -802726 -728866 -659869 -594223 -521683 -429154
33424 -429154 -305484 -143035 63082 315679 614520 954123 1321593 1695601 2046734 2339224
33414 2339224 2534169 2594661 2492604 2215536 1771019 1187111 509372 -204630 -892933 -1498198
33404 -1498198 -1975622 -2296711 -2448432 -2430279 -2251516 -1928306 -1480020 -926514 -289248 404355
33394 404355 1118233 1810880 2443074 2984657 3416212 3726307 3908116 3958779 3882059 3692018
33384 3692018 3414479 3084646 2742253 2426672 2172498 2004247 1930375 1940598 2010708 2113616
33374 2113616 2229642 2349349 2468801 2583480 2687253 2777284 2860242 2954044 3083084 3269637
33364 3269637 3526082 3851037 4229719 4637178 5042821 5414871 5723766 5944668 6060253
33355 6060253 6064534 5966269 5788673 5563348 5319949 5076474 4835041 4584894 4310512 4000703
33345 4000703 3655038 3285544 2913594 2563687 2256922 2006361 1814858 1674963 1571103
33336 1571103 1484363 1398669 1305174 1202608 1094565 986906 886826 802523 741728 709588
33326 709588 707822 735971 793127 877889 986259 1109922 1237910 1362021 1482758 1611280
33316 1611280 1765406 1961809 2208841 2503414 2832428 3177099 3517787 3837615 4124024
33307 4124024 4368364 4564398 4706890 4791155 4813537 4772096 4667240 4502940 4289402 4046384
33297 4046384 3804052 3598297 3460799 3408677 3439840 3536710 3675338 3834026 3997211 4154539
33287 4154539 4298232 4421733 4520212 4591469 4635744 4654689 4650862 4628599 4595546 4563508 4547650
33276 4547650 4563657 4622955 4727800 4869642 5033523 5207028 5388358 5588309 5825448 6117936
33266 6117936 6476223 6898717 7370333 7863200 8339282 8755578 9072211 9262039 9318319 9256837
33256 9256837 9111383 8924645 8738250 8585030 8484835 8443708 8455539 8505168 8571993 8633537
33246 8633537 8669092 8663956 8613840 8527325 8423886 8327364 8257588 8223683 8221218 8233806 8238461 8212146
33234 8212146 8135809 7994529 7776682 7476202 7097775 6660176 6193668 5732249 5304786 4928483
33224 4928483 4606320 4329124 4081598 3849587 3625075 3407381 3201457 3014766 2853378
33215 2853378 2717725 2599345 2480333 2336768 2146210 1897562 1599300 1281106 986545
33206 986545 759505 630996 612069 694349 855450 1065588 1293216 1509494 1691825 1826083
33196 1826083 1906442 1932651 1906504 1830396 1709327 1554166 1382086 1212374 1060518 935240
33186 935240 839822 774244 734257 708057 675422 612960 503462 343279 143127 -77066 -294845
33175 -294845 -489728 -645012 -748590 -794066 -781778 -718503 -615067 -482621 -329558 -161018
33165 -161018 19083 205731 392193 570752 732806 868099 965655 1018717 1032298 1028328
33155 1028328 1043750 1120772 1293084 1574060 1952148 2394868 2858601 3299193 3679445 3972519
33145 3972519 4162696 4245174 4225362 4117037 3938952 3710736 3449646 3169195 2879556 2588924
33135 2588924 2305003 2035984 1790626 1577285 1401878 1264850 1158068 1064133 960582 828396
33125 828396 660415 464944 263685 86816 -32288 -63146 13802 199068 470946 791139
33115 791139 1117300 1415410 1665196 1857512 1988473 2055859 2059640 2004305 1899692 1758793
33105 1758793 1593697 1412949 1223018 1033098 858398 717335 623134 575785 560339 552427
33095 552427 526846 463925 351495 184067 -37506 -304543 -599020 -894921 -1162965 -1376698
33085 -1376698 -1517676 -1578952 -1566243 -1495501 -1386524 -1255249 -1108897 -946272 -762156 -552703
33075 -552703 -319035 -67657 191880 450035 698929 932298 1145274 1335525 1505413 1663250
33065 1663250 1821777 1993246 2182568 2381906 2570571 2721833 2813978 2839654 2808166 2739736
33055 2739736 2655954 2572705 2499286 2442229 2408781 2406049 2436172 2491707 2555462 2605682 2623917
33044 2623917 2601612 2542612 2460914 2374745 2299198 2240379 2193793 2147902 2091066 2017897 1931608
33033 1931608 1841835 1760568 1699053 1665993 1665192 1691893 1730410 1756798 1746993 1685856 1571399 1412277
33021 1412277 1221465 1010620 787386 555243 314660 65085 -192429 -452964 -707326
33012 -707326 -944032 -1152209 -1323267 -1450716 -1529738 -1558434 -1540597 -1487487 -1415912 -1342339 -1275915
33001 -1275915 -1214548 -1146311 -1054919 -925975 -751481 -532170 -277815 -5128 266713 521097
32991 521097 747005 939151 1096496 1220407 1312507 1372110 1394749 1374041 1307147 1200846
32981 1200846 1073943 953870 869209 842217 884535 996565 1169053 1385642 1626023 1869365
32971 1869365 2096907 2292532 2441117 2526209 2529583 2434470 2231351 1922175 1519277 1039639
32961 1039639 499414 -87027 -704124 -1332292 -1948099 -2527048 -3047219 -3492813 -3857133
32952 -3857133 -4143686 -4364202 -4533976 -4666856 -4772241 -4854823 -4916119 -4956238 -4974744 -4970351
32942 -4970351 -4939718 -4876033 -4768247 -4601984 -4362259 -4036779 -3617965 -3103356 -2496286 -1808810
32932 -1808810 -1065953 -307561 415344 1049183 1547943 1881557 2041092 2040299 1913095 1707415
32922 1707415 1477335 1275655 1147642 1125479 1224051 1440171 1756238 2146222 2580330 3026866
32912 3026866 3452865 3825828 4117185 4306357 4383769 4351233 4218938 4000170 3706888 3348920
32902 3348920 2936648 2484402 2012146 1545064 1111670 740336 454279 266612 178270 180041
32892 180041 256799 390903 563706 756714 953676 1142375 1313864 1459199 1567046 1625601
32882 1625601 1628521 1580418 1497306 1401220 1312687 1246029 1209580 1208822 1248650 1332839 1461711 1630156
32870 1630156 1826794 2033778 2227072 2378226 2458455 2444123 2321244 2087269 1750413 1328318
32860 1328318 847157 340123 -156735 -611769 -1005038 -1331445 -1597841 -1816546 -1999406
32851 -1999406 -2154501 -2284683 -2386387 -2448997 -2456222 -2390215 -2237240 -1993040 -1666685 -1282254
32841 -1282254 -877179 -496073 -180572 41331 161826 193002 160557 94622 21131 -43527
32831 -43527 -93058 -127552 -148500 -156064 -149869 -131263 -104327 -75133 -50661 -37917 -41760 -60688
32819 -60688 -83293 -89970 -61220 11969 122564 250221 370153 462643 518651 539836 534495
32808 534495 512720 483789 456391 439730 443180 474101 535598 626253 742158 879344 1034017
32797 1034017 1199922 1365109 1511442 1617998 1666119 1643227 1544582 1373885 1143224 871694
32787 871694 582441 299008 41839 -174808 -344993 -470498 -556100 -601825 -596120 -514256
32777 -514256 -323894 3680 481011 1095907 1810370 2566714 3297330 3934321 4417875 4704543
32767 4704543 4775944 4645234 4356717 3975806 3571827 3200813 2895975 2668822 2517648 2436451
32757 2436451 2418858 2456382 2534170 2628333 2707227 2736884 2689092 2549549 2323332 2035806 1728412
32746 1728412 1450013 1245442 1144107 1152465 1253444 1413073 1591272 1752101 1869950 1931112
32736 1931112 1932749 1881192 1789629 1674012 1547366 1414928 1272697 1109867 913878 676676
32726 676676 400589 101106 -195818 -460769 -667442 -795051 -827817 -755837 -579132 -311659
32716 -311659 19445 380585 740876 1078761 1383536 1652821 1888531 2093276 2267833 2410272
32706 2410272 2517174 2586329 2618845 2619047 2592844 2546781 2488873 2429869 2382773 2359807 2367928 2404857
32694 2404857 2457424 2503370 2516807 2475968 2370250 2203180 1989658 1749082 1498221 1247292
32684 1247292 999893 755194 510900 266728 28171 -191241 -371589 -492164 -537733 -501588
32674 -501588 -384862 -194976 54553 344219 651289 954908 1239885 1496336 1716610 1893178
32664 1893178 2018977 2088445 2097140 2040245 1912498 1711599 1444335 1131488 806991 509880
32654 509880 272497 110172 15689 -41233 -109752 -248708 -513334 -941429 -1543587 -2300362
32644 -2300362 -3166471 -4080198 -4974979 -5789815 -6476432 -7003305 -7357658 -7545700 -7590498 -7527018
32634 -7527018 -7394453 -7226634 -7042942 -6844009 -6615194 -6335724 -5986858 -5554309 -5026556
32625 -5026556 -4394754 -3657343 -2826828 -1933511 -1023205 -149793 634164 1285594 1776103
32616 1776103 2093751 2241934 2236226 2100310 1862141 1551026 1195628 822707 456611 119299
32606 119299 -170320 -398966 -563023 -671215 -742899 -801595 -866585 -946546 -1037733 -1126729 -1196140
32595 -1196140 -1230917 -1223170 -1173792 -1090347 -982135 -854788 -707018 -531211 -317603 -60237
32585 -60237 237973 563314 893540 1203484 1471637 1685033 1841064 1946612 2015859 2067918
32575 2067918 2124524 2207328 2334313 2515840 2752181 3034654 3350662 3689962 4048319 4426374
32565 4426374 4824962 5239934 5659107 6062618 6426672 6729375 6955991 7100665 7163877 7147925
32555 7147925 7054101 6883577 6641118 6339050 5999099 5650823 5326729 5055561 4856281 4735275
32545 4735275 4687951 4703575 4770217 4876407 5008131 5143184 5247372 5276550 5185072 4937429
32535 4937429 4518059 3935275 3218315 2409593 1555972 702044 -113720 -860719 -1516617
32526 -1516617 -2066633 -2501987 -2818271 -3014508 -3093255 -3061509 -2931505 -2719694 -2442925 -2113691
32516 -2113691 -1738697 -1322989 -876319 -415568 39278 471843 873022 1239660 1570759
32507 1570759 1864659 2118938 2332896 2510844 2663257 2803788 2943676 3087916 3236087
32498 3236087 3386051 3536225 3684199 3823608 3943029 4029028 4072402 4074346 4049044 4020649
32488 4020649 4015208 4050419 4127478 4228872 4323640 4378191 4368340 4288291 4154208 4001640 3877135
32477 3877135 3825884 3878999 4044661 4305762 4624182 4949890 5231958 5428454 5513209 5479030
32467 5479030 5337538 5115262 4846004 4561864 4287011 4036415 3817859 3633949 3482689
32458 3482689 3357919 3251083 3154198 3062182 2972590 2882327 2783492 2662031 2501342 2289150
32448 2289150 2023415 1714071 1380345 1045474 730739 450454 209016 751 -187417
32439 -187417 -371118 -563232 -770824 -996106 -1240087 -1505029 -1792976 -2101614 -2421363 -2736482
32429 -2736482 -3029627 -3286808 -3499639 -3663804 -3775562 -3829751 -3821279 -3748785 -3617176 -3437237
32419 -3437237 -3223157 -2989466 -2747768 -2503530 -2254736 -1994798 -1719299 -1432544 -1149411
32410 -1149411 -891843 -683227 -543842 -487679 -519454 -632303 -808295 -1022568 -1249071 -1465349
32400 -1465349 -1655985 -1815489 -1949980 -2075194 -2209509 -2364432 -2537651 -2712728 -2865403
32391 -2865403 -2972347 -3017292 -2992556 -2898253 -2742416 -2542094 -2321886 -2107296 -1915025 -1745857
32381 -1745857 -1584416 -1405500 -1183346 -900251 -552709 -154460 264339 662813 999644
32372 999644 1245114 1389798 1445471 1437874 1395968 1344177 1300872 1280839 1296922 1357985 1464378
32361 1464378 1604023 1751799 1873794 1936345 1917061 1812534 1638626 1424285 1203794 1011281
32351 1011281 877229 825085 867885 1006782 1232442 1528213 1873291 2245294 2622679 2987607
32341 2987607 3328900 3643762 3936709 4215552 4486315 4749868 5002078 5237357 5453621
32332 5453621 5655743 5854933 6063914 6290463 6532645 6777494 7003361 7185612 7304275
32323 7304275 7349898 7323372 7229455 7068971 6835961 6521844 6123693 5651720 5131949 4602042
32313 4602042 4101351 3659779 3290954 2991990 2747558 2534881 2328889 2108795 1865604
32304 1865604 1607003 1356029 1143547 998535 940539 975979 1097201 1282882 1499937 1708180
32294 1708180 1867885 1948120 1932529 1820195 1621925 1354537 1035987 682501 307038 -82006
32284 -82006 -481889 -895347 -1328392 -1786590 -2271560 -2779197 -3299803 -3819168 -4319522 -4780292
32274 -4780292 -5179356 -5495579 -5712617 -5823192 -5832428 -5758662 -5630577 -5480774 -5337291 -5215541
32264 -5215541 -5113481 -5012620 -4886021 -4711337 -4483506 -4220960 -3962164 -3753860 -3635850
32255 -3635850 -3627954 -3723938 -3894685 -4099134 -4297913 -4463506 -4583380 -4656833 -4689446 -4688734 -4661874
32244 -4661874 -4613875 -4544770 -4446722 -4303575 -4094225 -3798624 -3404111 -2910873 -2336308 -1717206
32234 -1717206 -1107068 -566392 -147104 123377 251310 274342 248718 231860 267298 376447
32224 376447 558116 794339 1059873 1331821 1595760 1846350 2083355 2305934 2508234 2678090
32214 2678090 2799189 2855879 2838777 2749025 2599605 2413407 2218639 2042535 1904536 1810993
32204 1810993 1754017 1716000 1677936 1626601 1556263 1464888 1349234 1203556 1022996 808602
32194 808602 569327 318391 65419 -190618 -462609 -769607 -1128141 -1545615 -2017632 -2527526
32184 -2527526 -3046669 -3536707 -3955799 -4268059 -4452135 -4504655 -4437467 -4271023 -4027397 -3725448
32174 -3725448 -3379268 -2999998 -2599845 -2195804 -1810425 -1468742 -1192863 -996727 -883031
32165 -883031 -843328 -861382 -918349 -997129 -1084083 -1168987 -1245637 -1313904 -1381212 -1461002 -1567937
32154 -1567937 -1711852 -1892999 -2100336 -2313470 -2507230 -2656786 -2741599 -2748026 -2670992 -2514740
32144 -2514740 -2292447 -2025208 -1740821 -1471420 -1248572 -1096647 -1027836 -1041671 -1128620 -1275007
32134 -1275007 -1467125 -1694002 -1948545 -2226570 -2524078 -2834517 -3147811 -3451365 -3732007
32125 -3732007 -3977860 -4179660 -4331123 -4427995 -4466392 -4441945 -4350814 -4191712 -3966827 -3680695
32115 -3680695 -3338676 -2947436 -2517641 -2066318 -1615928 -1190264 -810111 -491445 -245902
32106 -245902 -80834 2733 12881 -32859 -111162 -199014 -279157 -342284 -385377 -407275 -404322
32095 -404322 -369235 -294374 -176999 -22260 158124 349682 538222 710707 854944 959301
32085 959301 1012620 1004472 926443 774883 553612 274058 -48512 -400673 -774456 -1166304
32075 -1166304 -1572693 -1986351 -2395817 -2787348 -3146251 -3456344 -3699181 -3855423 -3908585 -3848991
32065 -3848991 -3675484 -3394452 -3017695 -2561003 -2043724 -1487924 -916120 -348290 199973
32056 199973 717234 1194791 1625435 2003124 2323914 2588334 2804501 2989776 3168487 3365339
32046 3365339 3596788 3863876 4149566 4422074 4643447 4780051 4810476 4728079 4538642 4255729
32036 4255729 3896183 3476833 3012562 2515835 1998016 1472336 957058 476157 55719
32027 55719 -282407 -525353 -669310 -716316 -671944 -546223 -356045 -125502 117541 347128
32017 347128 544054 697823 806406 876182 923060 972280 1053326 1190166 1392238 1651959
32007 1651959 1949437 2259861 2558818 2824248 3036517 3178245 3234725 3195263 3055439 2819276
31997 2819276 2499646 2115704 1687757 1231854 756977 266457 -237511 -749153 -1256734
31988 -1256734 -1743265 -2189575 -2578622 -2899703 -3151248 -3341553 -3487499 -3611289 -3734970
31979 -3734970 -3873696 -4030630 -4196473 -4353712 -4482724 -4567003 -4597115 -4573932 -4510175 -4427969
31969 -4427969 -4351534 -4297471 -4267338 -4246640 -4211124 -4137234 -4011019 -3830826 -3603379 -3337325
31959 -3337325 -3039632 -2717444 -2383479 -2059869 -1775930 -1559568 -1427145 -1378406 -1399365 -1470084
31949 -1470084 -1571571 -1688477 -1808445 -1920643 -2015108 -2083472 -2121317 -2131254 -2124209 -2116771 -2125533
31938 -2125533 -2161853 -2229461 -2324359 -2435413 -2545666 -2635518 -2687547 -2690976 -2643930 -2553216 -2432237
31927 -2432237 -2297615 -2165634 -2050437 -1965038 -1923535 -1941261 -2031417 -2200087 -2443062 -2746191
31917 -2746191 -3088502 -3446399 -3797646 -4124107 -4412247 -4650819 -4827038 -4924163 -4923131 -4808101
31907 -4808101 -4572561 -4222206 -3773576 -3250921 -2684059 -2107067 -1555158 -1058235 -633332
31898 -633332 -280644 13818 269955 504305 724420 928552 1108490 1252245 1345271 1371663
31888 1371663 1317000 1172332 937233 620723 240679 -177468 -602969 -1003467 -1349625 -1619049
31878 -1619049 -1798351 -1883572 -1880024 -1802420 -1674972 -1529811 -1401900 -1320647 -1301431 -1341375 -1421492
31867 -1421492 -1513634 -1588617 -1622618 -1600957 -1519871 -1387051 -1220775 -1046249 -888258 -762078
31857 -762078 -667449 -589691 -507340 -401413 -262008 -91634 93456 264489 386209 427470
31847 427470 371651 221116 -6071 -283767 -584855 -885185 -1164698 -1407598 -1603189 -1747682
31837 -1747682 -1845607 -1908881 -1952607 -1988872 -2021296 -2043071 -2039970 -1997574 -1909464 -1781919 -1632269
31826 -1632269 -1481621 -1345912 -1229921 -1127324 -1026820 -920907 -811610 -709110 -624187 -560221
31816 -560221 -510616 -462945 -406080 -335062 -251255 -159323 -64648 26901 108129 171176 210166
31805 210166 223603 214559 189208 155696 123770 103912 105360 134415 194516 287119 410753 557155
31793 557155 707181 831051 895105 872196 749696 530856 230285 -132032 -534613 -956091
31783 -956091 -1376773 -1781377 -2161617 -2516065 -2846156 -3150139 -3418840 -3636202 -3784132 -3848351
31773 -3848351 -3822070 -3706897 -3512586 -3256879 -2964976 -2667202 -2394515 -2173118 -2020254 -1942639
31763 -1942639 -1937391 -1994108 -2096264 -2221040 -2338351 -2411383 -2401065 -2274600 -2014867 -1625816
31753 -1625816 -1130937 -566107 28863 616085 1161764 1636036 2012769 2271259 2400462
31744 2400462 2404306 2304884 2140444 1957772 1801682 1705571 1685779 1740497 1852625 1995296
31734 1995296 2138500 2255281 2326629 2344863 2315064 2253586 2183061 2125309 2095326 2099331 2137191
31723 2137191 2206559 2305081 2429137 2571114 2718964 2859949 2986466 3099794 3209449 3329591
31713 3329591 3475574 3662128 3902264 4205199 4572719 4994835 5446801 5890069 6278809
31704 6278809 6570664 6737116 6768317 6670662 6460161 6156421 5779465 5347743 4874850 4365297
31694 4365297 3812506 3201468 2515007 1740372 874003 -75422 -1085141 -2118543 -3128929
31685 -3128929 -4066878 -4889216 -5566562 -6086572 -6451617 -6672338 -6761047 -6728519 -6584318 -6337745
31675 -6337745 -5997147 -5568587 -5056512 -4467045 -3811806 -3109745 -2386345 -1670934 -992596
31666 -992596 -374978 168836 639024 1047168 1409973 1741225 2045926 2319767 2554264 2744635
31656 2744635 2895718 3022320 3144078 3278483 3436510 3622687 3837864 4081615 4352879
31647 4352879 4649871 4970560 5313404 5677051 6058791 6452973 6850394 7238335 7600637
31638 7600637 7918440 8172702 8348191 8436942 8439521 8364462 8227185 8048709 7853172 7663597
31628 7663597 7497051 7361191 7253273 7161275 7066230 6945254 6775180 6536630 6217831 5817244
31618 5817244 5344180 4817157 4260569 3700688 3161661 2661479 2208299 1798899 1421563
31609 1421563 1063237 717023 384856 73779 -210345 -466097 -694548 -894915 -1062288
31600 -1062288 -1189217 -1269160 -1298302 -1274313 -1193751 -1051231 -841881 -565395 -228643 154991
31590 154991 568795 996357 1423973 1840844 2236862 2599170 2910012 3148013 3292161 3325414
31580 3325414 3235892 3016735 2667044 2193889 1612881 945811 217117 -547781 -1321768 -2075120
31570 -2075120 -2776674 -3397234 -3913977 -4314607 -4600355 -4786879 -4902480 -4983468 -5067140 -5183384
31560 -5183384 -5347495 -5557649 -5798496 -6048239 -6284383 -6485622 -6631480 -6702591 -6682663 -6560937
31550 -6560937 -6334125 -6007356 -5593656 -5111320 -4580014 -4018105 -3443264 -2875573 -2340077
31541 -2340077 -1866414 -1485607 -1225887 -1108929 -1146884 -1340092 -1675495 -2125744 -2649348 -3193569
31531 -3193569 -3702280 -4128497 -4446508 -4656494 -4778831 -4842248 -4873249 -4890951 -4906274 -4922674
31521 -4922674 -4937344 -4943302 -4932324 -4897509 -4834383 -4740810 -4616985 -4466340 -4296710 -4119764 -3947311
31510 -3947311 -3785903 -3633623 -3481942 -3321382 -3146213 -2954521 -2744593 -2511804 -2248838
31501 -2248838 -1948322 -1605043 -1216753 -785235 -319408 160324 619858 1014629 1299139
31492 1299139 1440008 1427278 1278642 1034147 743155 448570 174202 -80110 -333837 -613865
31482 -613865 -941330 -1323369 -1752305 -2210178 -2675110 -3127216 -3552956 -3946441 -4306622 -4631859
31472 -4631859 -4915771 -5147629 -5316732 -5416987 -5448063 -5412794 -5313824 -5153046 -4934708 -4669641
31462 -4669641 -4376969 -4081635 -3808955 -3578801 -3401735 -3278366 -3202089 -3163689 -3154960 -3169029
31452 -3169029 -3197731 -3228894 -3246199 -3231815 -3169656 -3047189 -2855568 -2589208 -2245813 -1826906
31442 -1826906 -1338339 -790356 -197252 422896 1048101 1652642 2209430 2695641 3099557
31433 3099557 3423896 3682325 3891113 4061815 4199401 4305132 4379943 4425240 4441485 4426706
31423 4426706 4376177 4282957 4138871 3936631 3673801 3357468 3006432 2648181 2311322 2017663
31413 2017663 1778552 1596872 1472134 1404455 1394725 1441273 1535600 1660261 1790832 1901955
31403 1901955 1975045 2003622 1992676 1951711 1885377 1787476 1642129 1431363 1144608 784826
31393 784826 368220 -81588 -541097 -992195 -1423625 -1829532 -2206469 -2549732 -2850122 -3093058
31383 -3093058 -3261612 -3342741 -3333716 -3245039 -3097744 -2915541 -2714968 -2497979 -2250510 -1947940
31373 -1947940 -1565362 -1088603 -521530 112986 777901 1429394 2023678 2522069 2894532
31364 2894532 3121611 3194242 3111988 2881259 2514596 2030465 1452347 806521 119231 -585297
31354 -585297 -1284692 -1956494 -2577069 -3124353 -3584468 -3958354 -4263506 -4528530 -4782277 -5042124
31344 -5042124 -5307103 -5559740 -5775662 -5934825 -6027721 -6055020 -6024602 -5950045 -5850496 -5749008
31334 -5749008 -5668125 -5624685 -5626678 -5673227 -5756852 -5866447 -5989761 -6115054 -6232269 -6333809
31324 -6333809 -6414162 -6467260 -6482504 -6443077 -6330143 -6132442 -5855753 -5525676 -5181432 -4864141
31314 -4864141 -4605706 -4422755 -4316511 -4276957 -4289043 -4339131 -4420165 -4534140 -4690778 -4902472
31304 -4902472 -5177212 -5512381 -5892204 -6290253 -6676431 -7025861 -7325859 -7577832 -7793665
31295 -7793665 -7989369 -8179893 -8376927 -8588552 -8818378 -9063412 -9312433 -9547419 -9748737
31286 -9748737 -9901671 -9999930 -10043537 -10032824 -9963798 -9829100 -9623909 -9351688 -9024731 -8658968
31276 -8658968 -8267280 -7856592 -7430608 -6995304 -6562457 -6148850 -5772443 -5448307 -5185705
31267 -5185705 -4986553 -4845793 -4754507 -4704749 -4692793 -4718238 -4779563 -4869202 -4970693 -5058615 -5101179
31256 -5101179 -5065090 -4921687 -4652793 -4255029 -3741938 -3143325 -2501246 -1863302 -1275053 -773109
31246 -773109 -379267 -96361 92004 215760 307738 392729 481428 571326 652476 713624 745287
31235 745287 739919 692110 601140 474718 330490 193414 90326 44399 71219 177169 360621
31224 360621 615670 936439 1319131 1760337 2252743 2781065 3320826 3841090 4310215 4702089
31214 4702089 4999925 5196035 5288266 5275745 5156949 4931676 4605703 4194742 3724438 3225871
31204 3225871 2729221 2259213 1833964 1466063 1163276 927325 751410 618860 505365
31195 505365 385847 244399 83219 -74379 -189346 -218877 -129939 90930 434452 872245
31185 872245 1365175 1872771 2360030 2799969 3173181 3466633 3672578 3786872 3806323 3726418
31175 3726418 3541445 3247627 2847883 2355556 1794971 1198072 598314 24279 -504335
31166 -504335 -977042 -1389973 -1742731 -2036899 -2276653 -2469988 -2628428 -2764199 -2885538 -2992190
31156 -2992190 -3073428 -3110047 -3079883 -2964696 -2755682 -2455914 -2079516 -1648684 -1190098 -731816
31146 -731816 -300584 81338 400279 654855 856681 1026045 1183168 1338702 1488516 1616098
31136 1616098 1701362 1730615 1702073 1625135 1515766 1391338 1266336 1148594 1036211 916602
31126 916602 769046 570542 303349 -38016 -442607 -883843 -1325872 -1732964 -2077229 -2341621
31116 -2341621 -2519515 -2614344 -2640044 -2619094 -2575372 -2524032 -2464496 -2380963 -2249894 -2050379 -1773104
31105 -1773104 -1425015 -1028183 -613252 -210108 160195 489136 779482 1041067 1285813
31096 1285813 1522935 1754173 1969709 2147019 2254763 2261115 2143138 1893563 1523177 1059077
31086 1059077 540025 10277 -486887 -915152 -1249867 -1480330 -1608958 -1648751 -1621895 -1560498
31076 -1560498 -1506433 -1505673 -1596268 -1795051 -2090695 -2447654 -2819184 -3162800 -3451063 -3674395
31066 -3674395 -3837380 -3952327 -4032804 -4087904 -4117933 -4113259 -4057723 -3935569 -3738743 -3471691
31056 -3471691 -3152703 -2812121 -2487797 -2218350 -2035780 -1959584 -1993888 -2127918 -2339489 -2600850
31046 -2600850 -2885287 -3171841 -3446256 -3698833 -3921920 -4109339 -4257980 -4370456 -4457341 -4537183
31036 -4537183 -4632530 -4761838 -4930876 -5129331 -5335770 -5528123 -5692628 -5826041 -5931667 -6013924
31026 -6013924 -6075196 -6114905 -6128725 -6107180 -6035044 -5893452 -5664924 -5339639 -4920031 -4420979
31016 -4420979 -3865101 -3275799 -2672534 -2071097 -1487962 -944959 -470580 -96319 150785
31007 150785 256355 223891 74589 -158263 -438094 -733298 -1021403 -1287733 -1520826 -1708940
30997 -1708940 -1840517 -1907478 -1908179 -1848112 -1738893 -1596780 -1440884 -1290422 -1160881 -1060248
30987 -1060248 -987564 -935626 -897396 -872621 -870074 -903346 -982423 -1106242 -1260463 -1421351 -1563078
30976 -1563078 -1664457 -1712654 -1704227 -1645306 -1551807 -1448352 -1363829 -1323405 -1340019 -1410157 -1517075
30965 -1517075 -1640287 -1765946 -1892495 -2029531 -2192249 -2395319 -2648184 -2951244 -3291940
30956 -3291940 -3641621 -3955929 -4181021 -4265206 -4172445 -3892767 -3445667 -2875073 -2237562 -1588405
30946 -1588405 -970829 -411895 75561 488154 827617 1098478 1307820 1466289 1588700
30937 1588700 1692411 1792883 1898127 2005392 2102686 2174996 2211930 2212042 2180921 2124358 2041592
30926 2041592 1923694 1758247 1536683 1258843 931700 563742 159803 -279522 -753367
30917 -753367 -1254366 -1765313 -2261276 -2716031 -3109007 -3429134 -3674688 -3850948 -3967727 -4036977
30907 -4036977 -4069526 -4071602 -4043967 -3985766 -3901011 -3802168 -3707019 -3630757 -3579566 -3550141 -3534047
30896 -3534047 -3522603 -3509670 -3493121 -3476302 -3469022 -3486701 -3547394 -3667356 -3855923 -4110872 -4416487
30885 -4416487 -4745999 -5067477 -5350134 -5568758 -5705870 -5751617 -5701152 -5550534 -5294194 -4926676
30875 -4926676 -4447791 -3867255 -3205413 -2490078 -1752217 -1022948 -331885 294825 837693
30866 837693 1287060 1644200 1919845 2131581 2301428 2453272 2609115 2784044 2981062 3187697
30856 3187697 3376397 3510342 3554297 3487089 3310479 3050347 2749354 2453896 2200545 2007368
30846 2007368 1873175 1783690 1720596 1669121 1622064 1580379 1551154 1543413 1562437 1604927 1658327
30835 1658327 1705669 1733052 1734432 1710658 1664566 1596618 1504382 1385785 1243383 1085868 924523
30824 924523 766246 608522 441259 255087 50310 -159620 -351978 -503090 -596385 -626396
30814 -626396 -597458 -518662 -398343 -240749 -45443 191441 474956 808481 1191055 1616273
30804 1616273 2073199 2548080 3024883 3484171 3902071 4251679 4507767 4653485 4686395 4621017
30794 4621017 4486121 4317234 4147432 4000287 3886884 3805919 3744922 3681963 3588694 3435667
30784 3435667 3199550 2870476 2457082 1987083 1502465 1050071 670054 386083 201340
30775 201340 102149 66793 74203 108355 158050 214532 269548 315378 347079 365494 378296 398012
30763 398012 438814 514335 635754 807637 1022125 1255922 1473751 1636800 1711406 1674962
30753 1674962 1519334 1252920 900970 502710 104798 -247462 -518205 -685947 -744836 -703373
30743 -703373 -581834 -408796 -216883 -38242 99488 176130 180146 107826 -38595 -252110
30733 -252110 -521072 -830208 -1164147 -1511997 -1869567 -2237631 -2617965 -3009677 -3406747 -3796456
30723 -3796456 -4158901 -4468554 -4698303 -4825254 -4836520 -4732958 -4529477 -4252033 -3932444 -3602248
30713 -3602248 -3286378 -2998099 -2737435 -2494372 -2255162 -2007861 -1744436 -1460016 -1152077
30704 -1152077 -821625 -476082 -131684 187103 452137 638831 732914 733719 652995 510560
30694 510560 328857 128151 -76755 -277890 -473407 -664865 -852655 -1030735 -1183617 -1288999
30684 -1288999 -1326543 -1288399 -1184811 -1041330 -889984 -759622 -669017 -623113 -611711 -611001 -588855
30673 -588855 -513459 -362640 -130138 173911 528471 910323 1301429 1690925 2071073 2430915
30663 2430915 2753354 3018554 3211031 3324808 3363261 3335152 3250659 3119800 2952842 2761153
30653 2761153 2557142 2352696 2156424 1971293 1794734 1621907 1450264 1281883 1121358
30644 1121358 970316 822714 665255 484225 275854 54229 -148945 -294433 -350908 -306990
30634 -306990 -172687 29375 275401 546305 825939 1096022 1333674 1513975 1615678 1626288
30624 1626288 1543338 1371344 1116733 784211 376477 -103607 -650720 -1255796 -1905242 -2580089
30614 -2580089 -3255923 -3904848 -4498865 -5011992 -5419325 -5694894 -5812338 -5750171 -5498850 -5065039
30604 -5065039 -4471120 -3751464 -2947759 -2104158 -1261941 -454142 298255 986768 1611978
30595 1611978 2177683 2685600 3133242 3515322 3827021 4066944 4238599 4350223 4413271 4440569
30585 4440569 4445197 4440417 4439600 4455135 4496414 4567806 4667241 4785564 4907363 5014070 5088643
30574 5088643 5119026 5097800 5018462 4871695 4644837 4324935 3903523 3381075 2769948 2094665
30564 2094665 1388384 685985 16766 -599346 -1150567 -1629303 -2029665 -2349100 -2593041
30555 -2593041 -2778382 -2931302 -3078207 -3233406 -3390152 -3520548 -3584851 -3545657 -3380205 -3086243
30545 -3086243 -2681189 -2197584 -1677696 -1167888 -711917 -343417 -79795 79659 150160 153577
30535 153577 109599 29646 -84247 -236124 -431148 -671730 -955934 -1277633 -1627404 -1993239
30525 -1993239 -2360869 -2714320 -3037706 -3318340 -3549728 -3732461 -3872381 -3977216 -4053582 -4105252
30515 -4105252 -4132194 -4129703 -4088089 -3994128 -3834671 -3600865 -3290985 -2911212 -2475135 -2002640
30505 -2002640 -1517902 -1046349 -611343 -231737 78823 310342 453133 495294 424469 234583
30495 234583 -66511 -454028 -889773 -1329960 -1734022 -2072662 -2333745 -2524052 -2665678 -2788156
30485 -2788156 -2918892 -3074622 -3256459 -3450695 -3635534 -3790904 -3906888 -3987741 -4050883 -4121842
30475 -4121842 -4226682 -4384054 -4599183 -4861570 -5146916 -5422784 -5656207 -5820419 -5897910 -5879066
30465 -5879066 -5758522 -5532605 -5200189 -4766568 -4247517 -3670456 -3071587 -2490641 -1965453
30456 -1965453 -1527155 -1195594 -975826 -858221 -823489 -850407 -921682 -1025209 -1151720 -1292172
30446 -1292172 -1437066 -1577227 -1703864 -1806943 -1873681 -1890427 -1848704 -1751857 -1617097 -1471187
30436 -1471187 -1342989 -1257428 -1232405 -1277159 -1390994 -1563430 -1776987 -2011599 -2248202 -2470316
30426 -2470316 -2664500 -2820699 -2932143 -2994095 -3002302 -2952967 -2844713 -2680581 -2467919 -2216365
30416 -2216365 -1936243 -1639045 -1338961 -1053244 -800505 -598272 -461308 -400614 -422182 -525496
30406 -525496 -703141 -942324 -1227435 -1542232 -1871339 -2201621 -2523408 -2830581 -3119291 -3386725
30396 -3386725 -3631555 -3855839 -4066345 -4273339 -4487114 -4714388 -4956640 -5210539 -5468649
30387 -5468649 -5718762 -5942676 -6117202 -6219007 -6231425 -6148899 -5975958 -5721181 -5389688 -4978596
30377 -4978596 -4478427 -3880238 -3184650 -2407427 -1578476 -735132 86509 858344 1562656
30368 1562656 2189886 2733830 3187961 3545522 3802778 3962148 4032434 4026040 3954945 3827184
30358 3827184 3645117 3406610 3109475 2757389 2363711 1950564 1543762 1166762 836545
30349 836545 561945 343488 174092 40946 -71307 -177234 -288800 -415811 -567349 -752234
30339 -752234 -977757 -1247752 -1561466 -1913236 -2292048 -2681303 -3061225 -3415386 -3738520 -4039338
30329 -4039338 -4334527 -4637151 -4947526 -5252764 -5534619 -5780257 -5990164 -6180115 -6376696
30320 -6376696 -6607920 -6892208 -7230289 -7603415 -7977937 -8313072 -8568345 -8709360 -8712232 -8566697
30310 -8566697 -8277039 -7860345 -7343044 -6757098 -6136464 -5513861 -4918111 -4372319 -3892478
30301 -3892478 -3485793 -3149127 -2869216 -2626021 -2398729 -2172230 -1941467 -1711798 -1495233
30292 -1495233 -1304469 -1147704 -1026146 -934092 -860488 -791950 -717763 -635719 -555386 -495866 -479063
30281 -479063 -523113 -639984 -836692 -1116097 -1474617 -1898657 -2363801 -2838366 -3288693 -3682589
30271 -3682589 -3990429 -4186500 -4252567 -4182166 -3981925 -3668067 -3260218 -2776830 -2234850 -1652410
30261 -1652410 -1050864 -453265 120693 660268 1165989 1646634 2112034 2565593 3000391
30252 3000391 3400305 3744573 4013257 4191954 4275278 4268699 4187924 4055313 3894105 3722717
30242 3722717 3551667 3384252 3219806 3056990 2895282 2735111 2578280 2429088 2294683
30233 2294683 2183067 2099779 2046267 2021556 2025322 2058860 2122888 2214451 2325749 2445451 2561212
30222 2561212 2662434 2742524 2799284 2832227 2838226 2809489 2736747 2616308 2456483 2279455 2117295
30211 2117295 2003243 1961458 1999947 2110335 2273757 2467706 2668935 2852273 2989452 3051409
30201 3051409 3013712 2862104 2595668 2226959 1779353 1282035 763533 245716 -259306 -747915
30191 -747915 -1219817 -1671478 -2091494 -2460672 -2757447 -2966522 -3086762 -3134322 -3139041 -3135380
30181 -3135380 -3151861 -3203286 -3287788 -3387867 -3473878 -3509995 -3463305 -3314532 -3065720 -2740333
30171 -2740333 -2375576 -2011392 -1681786 -1411314 -1215672 -1103141 -1074302 -1120536 -1224366 -1363881
30161 -1363881 -1519449 -1678123 -1833009 -1979285 -2110734 -2218593 -2291861 -2317897 -2283538 -2177483
30151 -2177483 -1993639 -1734285 -1411852 -1048943 -676548 -330308 -44507 155630 260580
30142 260580 277912 226325 125107 -14554 -191510 -409795 -670911 -967561 -1281682 -1587581
30132 -1587581 -1858832 -2075601 -2229064 -2321639 -2364274 -2372729 -2364260 -2355439 -2361181 -2394092 -2462641
30121 -2462641 -2567932 -2700968 -2842903 -2969010 -3054385 -3078771 -3029230 -2901400 -2700418 -2441498
30111 -2441498 -2148784 -1851425 -1577549 -1348268 -1173533 -1050233 -962211 -882611 -779411 -623948
30101 -623948 -400077 -110388 223186 564641 873117 1112979 1261742 1313922 1280232 1183097
30091 1183097 1050275 908583 779314 676032 604343 562433 541400 525847 496185 433575
30081 433575 326518 176701 1783 -166315 -287805 -324597 -249926 -54822 250114 637280
30071 637280 1068002 1500533 1897786 2232237 2487424 2658104 2750792 2783178 2779509 2761932
30061 2761932 2742088 2717608 2674445 2592648 2453108 2244389 1968720 1644471 1302474 977090
30051 977090 697226 482559 345089 291068 319100 415975 555615 703989 827224 898000
30041 898000 898325 820704 669838 463913 232260 7841 -182697 -325780 -420761 -474245 -493771
30030 -493771 -484484 -448809 -387157 -298801 -183487 -44076 110669 264562 394799 475787 485895
30019 485895 415427 272467 83233 -114334 -281913 -392928 -440502 -437541 -408710 -378370 -360795
30008 -360795 -356971 -357512 -347997 -313809 -244266 -136707 400 147411 277476 363300 384147
29997 384147 330848 207424 29460 -179397 -391470 -579667 -723244 -813372 -855261 -864514
29987 -864514 -859307 -852847 -850174 -850178 -850508 -851543 -856650 -869220 -889415 -913229 -933883 -943896 -936751 -908250
29973 -908250 -857488 -786704 -699584 -598807 -484535 -355093 -209332 -48403 125166 310554
29963 310554 510635 730110 970623 1226545 1484437 1725996 1932056 2085087 2169351 2170065
29953 2170065 2073897 1871772 1562446 1154667 667492 129716 -421752 -946241 -1406643 -1776904
29943 -1776904 -2045827 -2215597 -2296601 -2301767 -2243388 -2133826 -1988821 -1829896 -1682633 -1570547
29933 -1570547 -1507603 -1493659 -1515642 -1554080 -1591561 -1619031 -1637902 -1658446 -1695583 -1762663 -1864832
29922 -1864832 -1995383 -2137824 -2272467 -2382868 -2458548 -2494379 -2489496 -2447511 -2377055 -2290332 -2198850
29911 -2198850 -2108386 -2016724 -1915776 -1796030 -1649872 -1472709 -1263684 -1027678 -777657 -535177
29901 -535177 -328055 -185889 -134526 -190439 -356421 -620211 -956633 -1332218 -1710789 -2059151
29891 -2059151 -2352349 -2577307 -2733012 -2826252 -2863838 -2844389 -2753723 -2567319 -2260635 -1823860
29881 -1823860 -1274042 -657499 -40160 510094 941243 1228208 1374525 1406075 1360713 1277846
29871 1277846 1190532 1120599 1076182 1051472 1029078 985097 895618 742542 516902 219015 -143851
29860 -143851 -560680 -1018849 -1504261 -2000228 -2486747 -2941449 -3342136 -3669932 -3912177 -4064473
29850 -4064473 -4131437 -4125396 -4062923 -3960279 -3829877 -3679150 -3511352 -3326660 -3122698 -2895294
29840 -2895294 -2640820 -2360331 -2063614 -1770057 -1504090 -1286011 -1122576 -1002828 -901605
29831 -901605 -788472 -637268 -432749 -173386 129181 453414 772958 1062316 1301884 1481505
29821 1481505 1601474 1670037 1697893 1692586 1656035 1586150 1480640 1340698 1173488 993208
29811 993208 820071 676693 582663 549151 575275 646885 737957 814529 840672 785226 627759
29800 627759 362310 -2316 -446267 -945298 -1477548 -2027198 -2583653 -3137558 -3676665 -4184302
29790 -4184302 -4641388 -5031006 -5343687 -5581696 -5761159 -5910858 -6066723 -6262693 -6520830
29781 -6520830 -6844689 -7218555 -7612214 -7988684 -8311941 -8552978 -8694019 -8730947 -8673071 -8539342
29771 -8539342 -8352085 -8131457 -7893586 -7652058 -7419634 -7207270 -7020332 -6854287 -6692550
29762 -6692550 -6508062 -6268553 -5943991 -5514058 -4973712 -4335489 -3627750 -2889197 -2161330
29753 -2161330 -1481475 -878243 -370002 33951 330335 518720 600389 579791 466522 275216
29743 275216 22997 -273074 -596514 -930417 -1257595 -1563390 -1839832 -2087769 -2314522 -2528095
29733 -2528095 -2731780 -2922427 -3092245 -3231280 -3328398 -3371316 -3347454 -3246214 -3061461 -2792924
29723 -2792924 -2446357 -2033041 -1568779 -1071962 -560584 -49518 449977 927864 1372096
29714 1372096 1767899 2101010 2362992 2554843 2686404 2771705 2822263 2840959 2818798 2735920
29704 2735920 2566758 2287595 1883999 1355712 717569 -3438 -773567 -1558383 -2328169
29695 -2328169 -3061907 -3748920 -4387069 -4977372 -5516847 -5992881 -6382109 -6654692 -6782444
29686 -6782444 -6747688 -6549646 -6206204 -5750477 -5223227 -4663726 -4102328 -3556989 -3033839 -2530291
29676 -2530291 -2039366 -1554648 -1074772 -605397 -157344 257842 631907 961416 1247187
29667 1247187 1492965 1704067 1886260 2045132 2186014 2313684 2431142 2537913 2629350 2697920
29657 2697920 2736070 2739311 2708282 2649334 2574325 2500529 2450525 2450280 2524075 2687732 2943855
29646 2943855 3281536 3679543 4110314 4543795 4951712 5312012 5611117 5842137 6000447
29637 6000447 6080591 6077551 5991657 5833119 5621954 5382283 5134300 4889270 4650629 4419298
29627 4419298 4198254 3993149 3810039 3653507 3526661 3431730 3369912 3341375 3347181 3392570
29617 3392570 3488285 3647030 3875902 4169102 4505617 4853699 5180325 5461293 5687563 5865901
29607 5865901 6015109 6160630 6328881 6540776 6804119 7107357 7419101 7696103 7897554
29598 7897554 7999169 8000117 7919598 7785319 7619816 7430733 7208824 6933851 6585602 6155128
29588 6155128 5651267 5099740 4536085 3996547 3511212 3100975 2777073 2541149 2385449
29579 2385449 2294597 2249978 2235240 2239668 2257680 2285903 2320967 2359471 2399052 2438545 2476435
29568 2476435 2508636 2527617 2524471 2493519 2436630 2363807 2288803 2222250 2166499 2115076 2056687
29557 2056687 1981316 1885218 1772784 1655446 1549297 1472523 1442038 1468504 1551150 1675952
29547 1675952 1819981 1960960 2087190 2202208 2321406 2462480 2635069 2835046 3045942
29538 3045942 3246099 3417478 3551786 3651275 3724681 3781434 3827938 3867651 3903630 3940808 3985945
29527 3985945 4045438 4122861 4218267 4329686 4455176 4593507 4743231 4901679 5065001 5228568
29517 5228568 5386318 5528934 5642413 5708722 5709004 5628107 5458553 5202361 4870759 4482905
29507 4482905 4064432 3644929 3253011 2909271 2619978 2374953 2151399 1922518 1667520
29498 1667520 1378561 1061529 730851 402405 89660 -194748 -434630 -608156 -691322 -665817
29488 -665817 -526911 -287237 25080 372578 716127 1021347 1262119 1421262 1489427 1463438
29478 1463438 1344631 1137822 851768 501339 109842 -291509 -668726 -993400 -1250281
29469 -1250281 -1440007 -1575741 -1675689 -1755385 -1823049 -1879252 -1920027 -1941241 -1941731 -1923385 -1888191
29458 -1888191 -1834691 -1757064 -1648125 -1504473 -1330707 -1140835 -957025 -806476 -716814 -710567
29448 -710567 -799868 -982745 -1241673 -1544692 -1849654 -2112105 -2295496 -2379926 -2365359 -2268189
29438 -2268189 -2113938 -1930315 -1743089 -1574369 -1441529 -1355768 -1321075 -1335285 -1393964 -1495098
29428 -1495098 -1640725 -1833210 -2068294 -2330103 -2591867 -2821755 -2990184 -3075559 -3067520 -2968150
29418 -2968150 -2791500 -2561502 -2308517 -2064840 -1859521 -1713142 -1634247 -1619282 -1656565 -1731866
29408 -1731866 -1831990 -1944671 -2056567 -2152237 -2214741 -2226191 -2167207 -2016681 -1753943 -1363586
29398 -1363586 -841117 -197284 540612 1331055 2123631 2864997 3503361 3991610 4291136
29389 4291136 4377544 4246782 3918785 3436384 2858902 2251664 1674520 1173193 775600 492264
29379 492264 318547 237697 225531 257208 314398 389533 484730 605625 753474 919929 1087130
$$ [...]
##END NTUPLES=NMR SPECTRUM
##END=
