##TITLE=31Pdec_DE-26rm
 
  24 sc
 20.11.2023
##JCAMPDX= 6.0         $$ Bruker NMR JCAMP-DX V2.0
##DATA TYPE= NMR SPECTRUM
##DATA CLASS= NTUPLES
##ORIGIN= UXNMR, Bruker Analytische Messtechnik GmbH
##OWNER= root
$$ XWIN-NMR		Version 3.5
$$ Mon Nov 20 13:47:42 2023 Russian Standard Time (UT+4h)  she@DPX200
##.OBSERVE FREQUENCY= 81.013821
##.OBSERVE NUCLEUS= ^31P
##.ACQUISITION MODE= SIMULTANEOUS
##.ACQUISITION SCHEME= undefined
##.AVERAGES= 24
##.DIGITISER RES= 16
##SPECTROMETER/DATA SYSTEM= spect
##.PULSE SEQUENCE= zgpg30
##.SOLVENT NAME= CDCl3
##.SHIFT REFERENCE= (INTERNAL, CDCl3, 0, 248.564)
##AUDIT TRAIL= $$ (NUMBER, WHEN, WHO, WHERE, WHAT)
$$ ##TITLE= Audit trail, XWIN-NMR		Version 3.5
$$ ##JCAMPDX= 5.01
$$ ##ORIGIN= Bruker BioSpin GmbH
$$ ##OWNER= she
$$ F:/spectra/data/she/nmr/P31/1/pdata/1/auditp.txt
$$ ##AUDIT TRAIL=  $$ (NUMBER, WHEN, WHO, WHERE, WHAT)
(   1,<2023-11-20 13:46:21.29 +0400>,<she>,<DPX200>,
      <created by zg, POWCHK disabled, PULCHK disabled
       configuration hash MD5:
       00 E9 B6 7A A2 85 ED C7 34 08 36 98 17 FE 4E 26
       data hash MD5: 32K
       92 4A 11 BD 5E 1E B4 56 D2 55 5A E7 28 21 E4 EC>)
(   2,<2023-11-20 13:46:23.53 +0400>,<she>,<DPX200>,
      <Start of raw data processing
       efp BC_mod = 2 LB = 5 FT_mod = 6 PKNL = 1 PHC0 = -10371.47 PHC1 = -1082.109 SI = 64K 
       data hash MD5: 64K
       62 3A DC BC CF 30 87 B5 32 34 7D D8 C5 E0 11 A9>)
(   3,<2023-11-20 13:46:40.43 +0400>,<she>,<DPX200>,
      <pk PHC0 = 60.8425 PHC1 = 0 
       data hash MD5: 64K
       AE AB B4 85 4D 4B DD 02 A1 73 FE CB 42 7E 4A 50>)
(   4,<2023-11-20 13:46:43.68 +0400>,<she>,<DPX200>,
      <abs ABSG = 5 
       data hash MD5: 64K
       7A 14 D3 AB A0 6A 7A 5D AC 2B 1A 6B D1 7B 5E 69>)
(   5,<2023-11-20 13:46:53.81 +0400>,<she>,<DPX200>,
      <pk PHC0 = 3.989806 PHC1 = 0 
       data hash MD5: 64K
       89 35 AD C1 33 17 DF 94 1B 55 E3 22 02 9E 22 FA>)
(   6,<2023-11-20 13:47:10.81 +0400>,<she>,<DPX200>,
      <pk PHC0 = 6.399999 PHC1 = 0 
       data hash MD5: 64K
       94 8B 79 B9 73 AC 1F B0 59 76 7D 8E 46 86 F5 A6>)
$$ ##END=
$$ 
$$ hash MD5
$$ 3D FE FD 2D F5 36 D9 0D E3 FB 49 01 C2 C1 8D C0
##$RELAX= 
##$RELAX= 
##$RELAX= 
##$RELAX= 
##$RELAX= 
##$RELAX= 
##$RELAX= 
##$RELAX= 
##$RELAX= 
$$ Bruker specific parameters
$$ --------------------------
##$DU= <F:/spectra>
##$EXPNO= 1
##$NAME= <P31>
##$PROCNO= 1
##$TYPE= <nmr>
##$USER= <she>
##$AMP= (0..31)
100 100 100 100 100 100 100 100 100 100 100 100 100 100 100 100 100 100 
100 100 100 100 100 100 100 100 100 100 100 100 100 100 
##$AQSEQ= 0
##$AQ_mod= 1
##$AUNM= <au_zg>
##$AUTOPOS= <>
##$BF1= 81.014009
##$BF2= 200.13
##$BF3= 200.13
##$BF4= 200.13
##$BF5= 200.13
##$BF6= 200.13
##$BF7= 200.13
##$BF8= 200.13
##$BYTORDA= 1
##$CFDGTYP= 0
##$CFRGTYP= 5
##$CHEMSTR= <none>
##$CNST= (0..31)
1 1 145 1 1 1 1 1 1 1 1 1 1 1 1 1 1 1 1 1 1 1 1 1 1 1 1 1 1 1 1 1 
##$CPDPRG= <waltz16>
##$CPDPRG1= <>
##$CPDPRG2= <waltz16>
##$CPDPRG3= <>
##$CPDPRG4= <mlev>
##$CPDPRG5= <mlev>
$$ [...]
##$SUBNAM3= <"">
##$SUBNAM4= <"">
##$SUBNAM5= <"">
##$SUBNAM6= <"">
##$SUBNAM7= <"">
##$SUBNAM8= <"">
##$SUBNAM9= <"">
##$SW= 501.771253377433
##$SWIBOX= (0..15)
0 1 3 0 0 0 0 0 0 0 0 0 0 0 0 0 
##$SW_h= 40650.406504065
##$TD= 32768
##$TD0= 1
##$TE= 0
##$TE2= 300
##$TE3= 300
##$TEG= 300
##$TL= (0..7)
0 120 53 12 22 120 120 120 
##$TP= (0..7)
150 150 150 150 150 150 150 150 
##$TP07= 0
##$TPNAME0= <>
##$TPNAME1= <>
##$TPNAME2= <>
##$TPNAME3= <>
##$TPNAME4= <>
##$TPNAME5= <>
##$TPNAME6= <>
##$TPNAME7= <>
##$TPOAL= (0..7)
0.5 0.5 0.5 0.5 0.5 0.5 0.5 0.5 
##$TPOFFS= (0..7)
0 0 0 0 0 0 0 0 
##$TUNHIN= 0
##$TUNHOUT= 0
##$TUNXOUT= 0
##$USERA1= <user>
##$USERA2= <user>
##$USERA3= <user>
##$USERA4= <user>
##$USERA5= <user>
##$V9= 5
##$VALIST= <valist>
##$VCLIST= <CCCCCCCCCCCCCCC>
##$VD= 0
##$VDLIST= <DDDDDDDDDDDDDDD>
##$VPLIST= <PPPPPPPPPPPPPPP>
##$VTLIST= <TTTTTTTTTTTTTTT>
##$WBST= 1024
##$WBSW= 4
##$XGAIN= (0..3)
0 0 0 0 
##$XL= 0
##$YL= 0
##$YMAX_a= 186
##$YMIN_a= -192
##$ZGOPTNS= <>
##$ZL1= 120
##$ZL2= 120
##$ZL3= 120
##$ZL4= 120
##$ABSF1= 248.5645
##$ABSF2= -253.2056
##$ABSG= 5
##$ABSL= 3
##$ALPHA= 0
##$AQORDER= 0
##$ASSFAC= 0
##$ASSFACI= 0
##$ASSFACX= 0
##$ASSWID= 0
##$AUNMP= <proc_1d>
##$AZFE= 0.1
##$AZFW= 0.5
##$BCFW= 0
##$BC_mod= 2
##$BYTORDP= 0
##$COROFFS= 0
##$CY= -3
##$DATMOD= 1
##$DC= 0
##$DFILT= <>
##$DTYPP= 0
##$F1P= 0
##$F2P= 0
##$FCOR= 1
##$FTSIZE= 65536
##$FT_mod= 6
##$GAMMA= 0
##$GB= 0
##$INTBC= 1
##$INTSCL= 6.047779e-11
##$ISEN= 30
##$LB= 5
##$LEV0= 0
##$LPBIN= 0
##$MAXI= 10000
##$MC2= 0
##$MEAN= 0
##$ME_mod= 0
##$MI= 50
##$NCOEF= 0
##$NC_proc= -13
##$NLEV= 6
##$NOISF1= 182.463
##$NOISF2= 159.3651
##$NSP= 0
##$NTH_PI= 0
##$NZP= 0
##$OFFSET= 248.5645
##$PC= 4
##$PHC0= -10300.24
##$PHC1= -1082.109
##$PH_mod= 1
##$PKNL= yes
##$PPARMOD= 0
##$PSCAL= 0
##$PSIGN= 0
##$REVERSE= no
##$SF= 81.0140089999694
##$SI= 65536
##$SIGF1= 159.3651
##$SIGF2= -187.1042
##$SINO= 113.3802
##$SIOLD= 16384
##$SREGLST= <1H.CDCl3>
##$SSB= 0
##$STSI= 65536
##$STSR= 0
##$SW_p= 40650.406504065
##$SYMM= 0
##$S_DEV= 0
##$TDeff= 32768
##$TDoff= 0
##$TI= <>
##$TILT= no
##$TM1= 0
##$TM2= 0
##$TOPLEV= 0
##$USERP1= <user>
##$USERP2= <user>
##$USERP3= <user>
##$USERP4= <user>
##$USERP5= <user>
##$WDW= 1
##$XDIM= 65536
##$YMAX_p= 430224154
##$YMIN_p= -68883553
$$ End of Bruker specific parameters
$$ ---------------------------------
##NTUPLES= NMR SPECTRUM
##VAR_NAME=  FREQUENCY,     SPECTRUM/REAL,   SPECTRUM/IMAG
##SYMBOL=    X,             R,               I
##VAR_TYPE=  INDEPENDENT,   DEPENDENT,       DEPENDENT
##VAR_FORM=  AFFN,          ASDF,            ASDF
##VAR_DIM=   65536,         65536,           65536
##UNITS=     HZ,            ARBITRARY UNITS, ARBITRARY UNITS
##FACTOR=    0.620285442955139, 1,           1
##FIRST=     20137.2065510682, 0,            0
##LAST=      -20513.1999529968, 0,           0
##MIN=       -20513.1999529968, -68883553,   0
##MAX=       20137.2065510682, 430224154,    0
$$ Real data points
##PAGE= N=1
##DATA TABLE= (X++(R..R)), XYDATA
$$ [...]
42725f245666K285K39333L76572L54723K48643J38373L8823l4413m0254k845l4834
42714d959260j93618l73229m17866l09178j70019j06905j22784j78068k56944
42705g087871l41554l72769k88706r6681J22251K86848L78962M25271M32036L69272
42695f172941K30952Q1463P873L5265J21575K29149L57680M96734N89679N78821
42685c443750M71015L34307K34226J84725J54328J06484K7627q2799k29743l95636
42675b639216n00043m49097k62075q8063l0313p132J17159L02546L66517K48500
42665b941217R7614N0491N6866N741r6440j81257k47027k96632k27273N1066M14526
42654c313542O02839N07918K49392m8803m01159q18045j153892j209736r37892
$$ plain form
42725 -6245666 -6243381 -6004048 -5627476 -5272753 -5024110 -4885737 -4846914 -4881327 -4921581 -4924426 -4959260
42714 -4959260 -5152878 -5526107 -5943973 -6253151 -6423170 -6530075 -6652859 -6830927 -7087871
42705 -7087871 -7429425 -7802194 -8090900 -8187581 -8065330 -7778482 -7399520 -6974249 -6542213 -6172941
42695 -6172941 -5941989 -5860526 -5852653 -5817388 -5695813 -5466664 -5108984 -4612250 -4022571 -3443750
42685 -3443750 -2972735 -2638428 -2404202 -2219477 -2065149 -1958665 -1931038 -2013837 -2243580 -2639216
42675 -2639216 -3139259 -3588356 -3850431 -3938494 -3968807 -3975939 -3858780 -3556234 -3189717 -2941217
42665 -2941217 -2843603 -2793112 -2736246 -2730505 -2826945 -3008202 -3255229 -3551861 -3779134 -3728068 -3313542
42654 -3313542 -2710703 -2202785 -1953393 -2002196 -2403355 -3221400 -4375292 -5585028 -6522920
42645f522920m81240n3770J82501J96576J11548J02429K18065L44714L75552L41423
42635e185122L19114K95458K17246J15360O5174N2832l132j01713j46498j05523
42625d476804p8839j58287l04452m25781n15729o36055q00609r49384j022118
42616i368058r90645q25012n07628j16683J62274J78864k3194k29097k52329r5351
42606a2066859R1062J74172J37379M4097k9461o759J85434N59952J012873J363296
42596h534814J469372J303261R30318M53613j0202l38193m36138k94821j3153
42587e470757K51714L84059L77757L05132K17634R4084j00420l24101m60547m19610
42577e145055k22764J4935J76681K20051J83376J33883J09723J04089R1250N1903
$$ plain form
42645 -6522920 -7004160 -7057930 -6875429 -6678853 -6567305 -6464876 -6246811 -5902097 -5526545 -5185122
42635 -5185122 -4866008 -4570550 -4353304 -4237944 -4172770 -4119938 -4123070 -4224783 -4371281 -4476804
42625 -4476804 -4555643 -4713930 -5018382 -5444163 -5959892 -6595947 -7396556 -8345940 -9368058
42616 -9368058 -10358703 -11183715 -11691343 -11808026 -11645752 -11466888 -11490082 -11719179 -11971508 -12066859
42606 -12066859 -11975797 -11801625 -11664246 -11620149 -11649610 -11656369 -11470935 -10910983 -9898110 -8534814
42596 -8534814 -7065442 -5762181 -4831863 -4378250 -4388452 -4726645 -5162783 -5457604 -5470757
42587 -5470757 -5219043 -4834984 -4457227 -4152095 -3934461 -3840377 -3940797 -4264898 -4725445 -5145055
42577 -5145055 -5367819 -5352884 -5176203 -4956152 -4772776 -4638893 -4529170 -4425081 -4333831 -4281928
42567d281928k5273j40303k61905l29816l08018k37647k16951l19347n29654p47238
42557g398080q42822p36545m56125j21770J47327L17834M30320N20871N79808
42548g559182N78974N09191L88471K55870J56213J07468Q3818N3421K7170M0795
42538e357791R4247J47871J81952K15912K50109K26713Q2270j70983m29603n57775
42528e317078m75843k31990Q601R3699L0004k8304N0072K50028M62522N97417
42518d560872O09880M80640K41804p594j77549k66085l16652l29422k82422k15476
42508d823748k03255k39149k30285j33562k3045J5461p443l3420o5797j68341
42498e912584l68800o02749p46192o90633m20545m9913K42697L51655L08482K00260
$$ plain form
42567 -4281928 -4307201 -4447504 -4709409 -5039225 -5347243 -5584890 -5801841 -6121188 -6650842 -7398080
42557 -7398080 -8240902 -8977447 -9433572 -9555342 -9408015 -9090181 -8659861 -8138990 -7559182
42548 -7559182 -6980208 -6471017 -6082546 -5826676 -5670463 -5562995 -5479177 -5425756 -5398586 -5357791
42538 -5357791 -5263544 -5115673 -4933721 -4717809 -4467700 -4240987 -4158717 -4329700 -4759303 -5317078
42528 -5317078 -5792921 -6024911 -6016310 -5922611 -5892607 -5920911 -5870839 -5620811 -5158289 -4560872
42518 -4560872 -3950992 -3470352 -3228548 -3236142 -3413691 -3679776 -3996428 -4325850 -4608272 -4823748
42508 -4823748 -5027003 -5266152 -5496437 -5629999 -5653044 -5637583 -5645026 -5678446 -5744243 -5912584
42498 -5912584 -6281384 -6884133 -7630325 -8320958 -8741503 -8791416 -8548719 -8197064 -7888582 -7688322
42488g688322O4930j00585k71626l94004m36595l99809k86757j13117O9521K15550
42478i340814L43044M88489O03280N71094L63087J18563J7543R5680K20711K29595
42468f289728N5333k54210n85338q16753q69320p32932m56569j19828J90117M04047
42458i475181N02599N16992M80182L87071K24330K8603j17184j49619o4792J04536
42448g562463L15206N02335N79253M93668K84998N8847j02149j84917k05627j60812
42438e981661n1707O0503P8563k1402j31073j05801P5106K74841L37830K34878
42428e229923N4441j13764k38642l03995k69734j15476J00904K66654L01722K15018
42418e332795Q4621n730k8719l8524j23961l03959m70650m74125k80782k1213
$$ plain form
42488 -7688322 -7623392 -7723977 -7995603 -8389607 -8826202 -9226011 -9512768 -9625885 -9556364 -9340814
42478 -9340814 -8997770 -8509281 -7906001 -7334907 -6971820 -6853257 -6835714 -6740034 -6519323 -6289728
42468 -6289728 -6234395 -6488605 -7073943 -7890696 -8760016 -9492948 -9949517 -10069345 -9879228 -9475181
42458 -9475181 -8972582 -8455590 -7975408 -7588337 -7364007 -7335404 -7452588 -7602207 -7666999 -7562463
42448 -7562463 -7247257 -6744922 -6165669 -5672001 -5387003 -5328156 -5430305 -5615222 -5820849 -5981661
42438 -5981661 -6033368 -5972865 -5894302 -5915704 -6046777 -6152578 -6077472 -5802631 -5464801 -5229923
42428 -5229923 -5175482 -5289246 -5527888 -5831883 -6101617 -6217093 -6116189 -5849535 -5547813 -5332795
42418 -5332795 -5248174 -5253904 -5282623 -5321147 -5445108 -5749067 -6219717 -6693842 -6974624 -6995837
42408f995837J37277J43058O9707R879J984M1190J01123J28009N9485j11578l03764
42397f719467m04198l64970k43705j55224j71184k38780k02330M9565M38218P34512
42387g277563P75714O13190M14787K63861J14575q1926k91104m46978n20148n01845
42377f937437l73436j36010J56848M28113O20818P00922O58405N35931M20022
42368c925824L64196L43151L07242K40812J29350p4832l78063o66742p91589p28876
42358e181175n80390m14856k04737N4029K60528L15333K44390J47892P5586K5170
42348e258230K0844J01609K40439L53596L94470L74402K91968J17587j33557l82538
42338c879410n69733o97091p58188o96853m94581k46537p2946K2993J36604L10404
$$ plain form
42408 -6995837 -6858560 -6715502 -6645795 -6635916 -6633932 -6592742 -6491619 -6363610 -6304125 -6415703 -6719467
42397 -6719467 -7123665 -7488635 -7732340 -7887564 -8058748 -8297528 -8499858 -8450293 -8012075 -7277563
42387 -7277563 -6501849 -5888659 -5473872 -5210011 -5095436 -5177362 -5468466 -5915444 -6435592 -6937437
42377 -6937437 -7310873 -7446883 -7290035 -6861922 -6241104 -5540182 -4881777 -4345846 -3925824
42368 -3925824 -3561628 -3218477 -2911235 -2670423 -2541073 -2615905 -2993968 -3660710 -4452299 -5181175
42358 -5181175 -5761565 -6176421 -6381158 -6327129 -6066601 -5751268 -5506878 -5358986 -5283400 -5258230
42348 -5258230 -5237386 -5135777 -4895338 -4541742 -4147272 -3772870 -3480902 -3363315 -3496872 -3879410
42338 -3879410 -4449143 -5146234 -5904422 -6601275 -7095856 -7342393 -7415339 -7392346 -7255742 -6945338
42328f945338M77724N70244O06461O29911O16906N14523L50339K33932K34953
42319b710345L10170L75091M00267L93799L29703J70792l8936j88013k39815k88948
42309a486235m10346n11580m39320k16303n7822j22760l43757n49651o58924o74309
42299e471007n78186l65294j43506n8064r3516p0809J07909L12695L60483K61814
42289e737481J94373K64275L93951M52902M15045L50607L19189L24033L51158
42280b671948M00983M62797M80195L74911J24807j86973m23724n11001m94855
42271b444808m78862n16382n77459o09213o03998o00042o24329o44230n82569
42262g681892l88968r9585J77259L35723L36661K20299Q0268J4144O0684J70431
$$ plain form
42328 -6945338 -6467614 -5897370 -5290909 -4660998 -4044092 -3529569 -3179230 -2945298 -2710345
42319 -2710345 -2400175 -2025084 -1624817 -1231018 -901315 -730523 -769459 -957472 -1197287 -1486235
42309 -1486235 -1896581 -2408161 -2847481 -3063784 -3121606 -3244366 -3588123 -4137774 -4796698 -5471007
42299 -5471007 -6049193 -6414487 -6557993 -6616057 -6709573 -6780382 -6672473 -6359778 -5999295 -5737481
42289 -5737481 -5543108 -5278833 -4884882 -4431980 -4016935 -3666328 -3347139 -3023106 -2671948
42280 -2671948 -2270965 -1808168 -1327973 -953062 -828255 -1015228 -1438952 -1949953 -2444808
42271 -2444808 -2923670 -3440052 -4017511 -4626724 -5230722 -5830764 -6455093 -7099323 -7681892
42262 -7681892 -8070860 -8170445 -7993186 -7657463 -7320802 -7100503 -7020235 -7006091 -6945407 -6774976
42252f774976K55178K67243K09229Q2398j15286l28071m49655m42418m02662m44023
42242h143043n41689n54990l90741q3020K79749O33459R27139J096064J089022
42233e688050R06615O06995K97575J05556R4050J88665K36002J57451M858j45642
42223c235925k86395m22632m87750l95404j64977O7716J75981J44716M3492p1931
42213d633109k12028m03110n83036n78781k54077K98982P77108R25849P49116
42204c913086M26629R1967k22166m68790n54991m60335k93535j75748j20995p0536
42194e761586J1340J24274K62982L96945M46951L47635J32633q4890k14666k41874
42184d580256j92686r5471J6125R6487J03163J2668j69867l97520n86408o60267
$$ plain form
42252 -6774976 -6519798 -6252555 -6043326 -5960928 -6076214 -6404285 -6853940 -7296358 -7699020 -8143043
42242 -8143043 -8684732 -9239722 -9630463 -9713483 -9433734 -8800275 -7873136 -6777072 -5688050
42233 -5688050 -4781435 -4174440 -3876865 -3771309 -3677259 -3488594 -3252592 -3095141 -3090283 -3235925
42223 -3235925 -3522320 -3944952 -4432702 -4828106 -4993083 -4925367 -4749386 -4604670 -4561178 -4633109
42213 -4633109 -4845137 -5248247 -5831283 -6410064 -6664141 -6365159 -5588051 -4662202 -3913086
42204 -3913086 -3486457 -3394490 -3616656 -4085446 -4640437 -5100772 -5394307 -5570055 -5691050 -5761586
42194 -5761586 -5750246 -5625972 -5362990 -4966045 -4519094 -4171459 -4038826 -4123716 -4338382 -4580256
42184 -4580256 -4772942 -4868413 -4852288 -4755801 -4652638 -4639970 -4809837 -5207357 -5793765 -6454032
42174f454032n97335m32549k34757r3582q7217k12685l62851m21186l72836k78149
42164i547179j57154K2458K35342L64940L28548J76282J3956j19505k36979l14854
42154i234145l03041k03161n9623J14980L22305M86850M81673K86376M4257r4123
42144h157652j32744j81020k86242l79308l68128k31168k7128J47632K23372K16614
42134i175772K12656K55109K77149J88536O406j62996k61283l25526l92263m26117
42124i804101l74530k42444q3850L6702N1691q2613l20048n23953n81581m97096
42114a2421823l40664j51097N1758J93608J75909P68j89040k24032m0849K95187
42104a2650275O53814R13384J021724J025446J020834J046035J031819Q79201
$$ plain form
42174 -6454032 -7051367 -7483916 -7718673 -7812255 -7899472 -8112157 -8475008 -8896194 -9269030 -9547179
42164 -9547179 -9704333 -9681875 -9446533 -9081593 -8753045 -8576763 -8562807 -8682312 -8919291 -9234145
42154 -9234145 -9537186 -9740347 -9799970 -9684990 -9362685 -8875835 -8394162 -8107786 -8063529 -8157652
42144 -8157652 -8290396 -8471416 -8757658 -9136966 -9505094 -9736262 -9763390 -9615758 -9392386 -9175772
42134 -9175772 -8963116 -8708007 -8430858 -8242322 -8235916 -8398912 -8660195 -8985721 -9377984 -9804101
42124 -9804101 -10178631 -10421075 -10504925 -10468223 -10416532 -10499145 -10819193 -11343146 -11924727 -12421823
42114 -12421823 -12762487 -12913584 -12861826 -12668218 -12492309 -12491541 -12680581 -12904613 -12945462 -12650275
42104 -12650275 -11996461 -11083077 -10061353 -9035907 -8015073 -6969038 -5937219 -5058018
42096e058018N73513K03639j12659k92353k95148j28091J29505L44842M28344
42087d206426M13210M02231M29959M18007K86728O7922j37488k83662l99977m96717
42077c506213n24702m51625l14713j55559M4514L03718N48210O54267N83595M24500
42067b394008K92651K33420K23385K14026J51565j161k19044m02633m44072l17074
42057b662945j04830N3878N3513j17905l90589o80883r35659j104956j108928
42048f999304q88486m94388q0076K17276L63775L88376L00441R2198j87495m05945
42038g693628m25198k22615O3295K25887J58067o8306l01698m68973n92247o60387
42028i985803n64373k16600K98234P50134R47312Q71639O48531M23033K70697
$$ plain form
42096 -5058018 -4484505 -4280866 -4393525 -4685878 -4981026 -5109117 -4979612 -4634770 -4206426
42087 -4206426 -3793216 -3390985 -2961026 -2543019 -2256291 -2188369 -2325857 -2609519 -3009496 -3506213
42077 -3506213 -4030915 -4482540 -4797253 -4952812 -4908298 -4604580 -4056370 -3402103 -2818508 -2394008
42067 -2394008 -2101357 -1867937 -1644552 -1430526 -1278961 -1280122 -1499166 -1901799 -2345871 -2662945
42057 -2662945 -2767775 -2713897 -2660384 -2778289 -3168878 -3849761 -4785420 -5890376 -6999304
42048 -6999304 -7887790 -8382178 -8462254 -8244978 -7881203 -7492827 -7192386 -7100188 -7287683 -7693628
42038 -7693628 -8118826 -8341441 -8278146 -8052259 -7894192 -7962498 -8264196 -8733169 -9325416 -9985803
42028 -9985803 -10550176 -10766776 -10468542 -9718408 -8771096 -7899457 -7250926 -6827893 -6557196
42019f557196J97224J95584K86521M88257P49301R43889R62787Q04158N64286
42010a365189L52413K23807J68516J34437O9202m0085j74858l35660n44833p65978
42000b278228q63905p21694m04633j43911j21665k98743m71133m62394k41153
41991f007459J01847M27591O00130N25960J97504k91215p89281j167996j367510
41982g770429j380641j221815r39021o36111m18248k80385r2673K47696O66392
41973a1825235R66009J021550Q69276O13312L28216P9959m2929L228J50751K82079
41963g553784L39047L27485K53788J34443N0298R4007K37616L31479K81294J66043
41953e338284J23829J70623K06966J77489J36064J44903J91505K44213L21522
$$ plain form
42019 -6557196 -6359972 -6164388 -5877867 -5389610 -4640309 -3696420 -2733633 -1929475 -1365189
42010 -1365189 -1012776 -788969 -620453 -486016 -416814 -456899 -631757 -967417 -1512250 -2278228
42000 -2278228 -3142133 -3863827 -4268460 -4412371 -4534036 -4832779 -5303912 -5766306 -6007459
41991 -6007459 -5905612 -5478021 -4877891 -4351931 -4154427 -4445642 -5234923 -6402919 -7770429
41982 -7770429 -9151070 -10372885 -11311906 -11948017 -12366265 -12646650 -12739323 -12491627 -11825235
41973 -11825235 -10859226 -9837676 -8968400 -8355088 -8026872 -7946913 -7989842 -7986614 -7835863 -7553784
41963 -7553784 -7214737 -6887252 -6633464 -6499021 -6448723 -6354716 -6117100 -5785621 -5504327 -5338284
41953 -5338284 -5214455 -5043832 -4836866 -4659377 -4523313 -4378410 -4186905 -3942692 -3621170
41944c621170M36275N06824M12148J50999j21115k55224k69345k99840m19170
41935c479618n57515n96046m73537j88652K26980O75758R79024R89925P48723
41926a674958M75764L71600M34817M86078L50020M404m18884p50793r11420r41157
41916b574529r15303q43984o82057m27222j56909M9612J76992K31182J85588L3780
41906d922850j32383j73933m2509J83084L97438N47319O04708N38177L60251J59141
41896b481557K7208k9967p8818j66052k73321l53154l78011l53187l02802k47679
41886d637340j89493j19699m5830L234K006n4577j54999k64447l11717k22487
41876e995349P603K91177N15311O13184N72680M20300K20283N0491n5482j22675
$$ plain form
41944 -3621170 -3184895 -2678071 -2265923 -2114924 -2236039 -2491263 -2760608 -3060448 -3479618
41935 -3479618 -4037133 -4633179 -5106716 -5295368 -5068388 -4392630 -3413606 -2423681 -1674958
41926 -1674958 -1199194 -827594 -392777 93301 443321 447725 28841 -721952 -1633372 -2574529
41916 -2574529 -3489832 -4333816 -5015873 -5443095 -5600004 -5550392 -5373400 -5142218 -4956630 -4922850
41906 -4922850 -5055233 -5229166 -5271675 -5088591 -4691153 -4143834 -3539126 -3000949 -2640698 -2481557
41896 -2481557 -2454349 -2484316 -2563134 -2729186 -3002507 -3355661 -3733672 -4086859 -4389661 -4637340
41886 -4637340 -4826833 -4946532 -4992362 -4989128 -4987122 -5041699 -5196698 -5461145 -5772862 -5995349
41876 -5995349 -5987746 -5696569 -5181258 -4568074 -3995394 -3575094 -3354811 -3304320 -3359802 -3482477
41866c482477j79032k23367k61899l17554l69575l47929k39378j34937j01549
41857e657697o7238P3341K82017M06366L54295J38638k08657o22952r21862r11676
41847g135425o34240l60245k59210k10679m3413J68667K02215M502k38210l32686
41837h838724k53694r4418M2547R3020O4364M0764Q8968J60632J60311J00313
41827h435917R7800K13927L88672N46748O63430O89850N24023J40718l13036o36437
41817f120222p61064p61039p11960o09056m14035j23632K12812N06403O65942
41808h115851O67696N94843N69584O28144O83512O23281M26433J72185m5451j84683
41798c980307k45711k36213j77410j22650j20095j46929j22914j3695J13636J65894
$$ plain form
41866 -3482477 -3661509 -3884876 -4146775 -4464329 -4833904 -5181833 -5421211 -5556148 -5657697
41857 -5657697 -5724935 -5651594 -5369577 -4963211 -4608916 -4470278 -4678935 -5301887 -6223749 -7135425
41847 -7135425 -7769665 -8129910 -8389120 -8599799 -8643212 -8474545 -8272330 -8267828 -8506038 -8838724
41837 -8838724 -9092418 -9186836 -9144289 -9051269 -8986905 -8946141 -8857173 -8696541 -8536230 -8435917
41827 -8435917 -8338117 -8124190 -7735518 -7188770 -6525340 -5835490 -5311467 -5170749 -5483785 -6120222
41817 -6120222 -6881286 -7642325 -8354285 -8963341 -9377376 -9501008 -9288196 -8781793 -8115851
41808 -8115851 -7448155 -6853312 -6283728 -5655584 -4972072 -4348791 -3922358 -3750173 -3795624 -3980307
41798 -3980307 -4226018 -4462231 -4639641 -4762291 -4882386 -5029315 -5152229 -5165924 -5052288 -4886394
41788d886394J19227M598j56317l36488m54142m24567k72189j23653o8155p5324
41778f673404o5524q879O0448P5269l0469k50979m48945m43653k08089Q3853K59684
41767g650688L35360M32690N70397O37808N56623L71937J71315r036j70750l01635
41757e055979l71435l56290k58583j25662m2244o5135j59537k27656j98001o1962
41747f922484J55155M05849O08821O85074O20300M52494K02232j22731m44007
41738d359297o10598n29910k61531N1166K94662L94969K85057l9835m41396o98861
41728e915574o92069m98663k96711j95766j68930j16065K9620K39594M09890M44847
41718f759827L36084J66165L7213n027J1252K5162j030n6861j02100r7318r244
$$ plain form
41788 -4886394 -4767167 -4762569 -4918886 -5255374 -5709516 -6134083 -6406272 -6529925 -6598080 -6673404
41778 -6673404 -6738928 -6747807 -6687359 -6612090 -6642559 -6893538 -7342483 -7786136 -7994225 -7910372 -7650688
41767 -7650688 -7315328 -6882638 -6312241 -5674433 -5117810 -4745873 -4574558 -4583594 -4754344 -5055979
41757 -5055979 -5427414 -5783704 -6042287 -6167949 -6210193 -6275328 -6434865 -6662521 -6860522 -6922484
41747 -6922484 -6767329 -6361480 -5752659 -5067585 -4447285 -3994791 -3792559 -3915290 -4359297
41738 -4359297 -4969895 -5499805 -5761336 -5710170 -5415508 -5020539 -4735482 -4775317 -5216713 -5915574
41728 -5915574 -6607643 -7106306 -7403017 -7598783 -7767713 -7883778 -7854158 -7614564 -7204674 -6759827
41718 -6759827 -6423743 -6257578 -6220365 -6225392 -6214140 -6188978 -6190008 -6246869 -6348969 -6446287 -6455531
41707f455531J92955N01256Q13015R58186Q38891N38310K45872O4999o9246k70713
41697b642006n42419p68770q45922p85834o95509o75664p33950p72980o63327
41688i126381l55402O1420M14244N73415N39217M20597L32765K95843K17010r770
41678f637042l56146o21155n87374k37476K12840N21596O36630O76750P27748
41669e663629P25388N64220K69927P66j21223j26152j13845r6157J2472K39983
41659d308250M60303N09680L69791J66229q690j85323l94222n39322m86770k55413
41649d671987l0144K5963q8600k65459m02880m44195l73137k28950q9333O208
41639f562514Q3733J51403J41112m146k25107m09085n38996o91807q85085j016264
$$ plain form
41707 -6455531 -6262576 -5761320 -4948305 -3990119 -3151228 -2612918 -2367046 -2302047 -2371293 -2642006
41697 -2642006 -3184425 -3953195 -4799117 -5584951 -6280460 -6956124 -7690074 -8463054 -9126381
41688 -9126381 -9481783 -9420363 -9006119 -8432704 -7893487 -7472890 -7140125 -6844282 -6627272 -6637042
41678 -6637042 -6993188 -7614343 -8201717 -8439193 -8226353 -7704757 -7068127 -6391377 -5663629
41669 -5663629 -4938241 -4374021 -4104094 -4103328 -4224551 -4350703 -4464548 -4560705 -4548233 -4308250
41659 -4308250 -3847947 -3338267 -2968476 -2802247 -2810937 -2996260 -3390482 -3929804 -4416574 -4671987
41649 -4671987 -4702131 -4676168 -4764768 -5030227 -5433107 -5877302 -6250439 -6479389 -6568722 -6562514
41639 -6562514 -6478781 -6327378 -6186266 -6190412 -6415519 -6824604 -7363600 -8055407 -8940492 -9956756
41629i956756r90382q40683o79146n76261n24302m65118l08834K1554M96982R59199
41619a2863747J247834J333010J277805J108691Q03361L97179J6084k23101k93706
41610g196590k28934o9593J35409L31284M93459O22224O79668N83846L05924o3321
41600d406624l78543n38116m99153k64966P8240L63359M66471M13008K98685J44207
41590d323432p5058k80482l09083j21365J23758K70259L45987M52276N57282N36195
41580b823663L90866K81767L00057L22583J77093j14631l58036m34752m36868
41571b695584n19038o76830p32403n28459r2644L85448O92085P02330M35969O9081
41561b960045j51488j00907R8125K01811J08489o3974j64553j72396j27582o118
$$ plain form
41629 -9956756 -10947138 -11787821 -12466967 -13043228 -13567530 -14032648 -14341482 -14319928 -13822946 -12863747
41619 -12863747 -11615913 -10282903 -9005098 -7896407 -7093046 -6695867 -6679783 -6902884 -7196590
41610 -7196590 -7425524 -7495117 -7359708 -7028424 -6534965 -5912741 -5233073 -4649227 -4343303 -4406624
41600 -4406624 -4785167 -5323283 -5822436 -6087402 -6009162 -5645803 -5179332 -4766324 -4467639 -4323432
41590 -4323432 -4398490 -4678972 -4988055 -5109420 -4985662 -4715403 -4369416 -3917140 -3359858 -2823663
41580 -2823663 -2432797 -2151030 -1850973 -1528390 -1351297 -1465928 -1823964 -2258716 -2695584
41571 -2695584 -3214622 -3891452 -4623855 -5152314 -5244958 -4859510 -4167425 -3465095 -3029126 -2960045
41561 -2960045 -3111533 -3212440 -3114315 -2912504 -2804015 -2867989 -3032542 -3204938 -3332520 -3338638
41551c338638K24276M76647N96434N36810L84204K08301q830k67759m74840n29939
41541b193334m36364k84023j75308j94545l71637o10372p11097n51879k33297
41532e761856J8152Q0800K4090j4168K9352J24071K04798K23416J79751J32005
41522d759589J59630K89270M55927N50449N15183L91698K62435J44553k5403k71243
41512b287090m77057m79534k64675r97J49196J85168J99906K34758K71935L13203
41502b155187L71284M03153L38155J73945k1782k00727l55091m50482m22282k71258
41492b590272j01882k5552o1810j60654k84772m39350o43720q91480j116744j196456
41482g512692j029583o42170j91890J51828L23096L64520L55880L43920L00990
$$ plain form
41551 -3338638 -3114362 -2637715 -2041281 -1504471 -1120267 -911966 -920796 -1188555 -1663395 -2193334
41541 -2193334 -2629698 -2913721 -3089029 -3283574 -3655211 -4265583 -4976680 -5528559 -5761856
41532 -5761856 -5743704 -5662904 -5638814 -5652982 -5623630 -5499559 -5294761 -5071345 -4891594 -4759589
41522 -4759589 -4599959 -4310689 -3854762 -3304313 -2789130 -2397432 -2134997 -1990444 -2015847 -2287090
41512 -2287090 -2764147 -3243681 -3508356 -3509353 -3360157 -3174989 -2975083 -2740325 -2468390 -2155187
41502 -2155187 -1783903 -1380750 -1042595 -868650 -890432 -1091159 -1446250 -1896732 -2319014 -2590272
41492 -2590272 -2692154 -2717706 -2779516 -2940170 -3224942 -3664292 -4308012 -5199492 -6316236 -7512692
41482 -7512692 -8542275 -9184445 -9376335 -9224507 -8901411 -8536891 -8181011 -7837091 -7536101
41473g536101J34983k23105p12620j141469j311726j151257p46599k87204L4434
41464a2940664J35464R4275O9504J54724L23872M90560N65321M78932K46970K9376
41454a0351666K4678K48243M89833N49552M46194L30878K80030K75475L24050
41445g382733M57506O17345O60081N11935K48350O639j14729p5214R0841K46778
41435d733201K32952L1124k04187l21258l25658l20196l54027l96214m13926l97235
41425g201826l20710j55404O5489K40909K85107J99663O3237k8596k1343O3779
41415f809695J43126J44421Q0178L0889M6890Q8065P9505J4067k7277L6809J98841
41404e974181L75058M90960N23170M57380K57185p2720m05562n41081l76054q067
$$ plain form
41473 -7536101 -7401118 -7624223 -8336843 -9478312 -10790038 -11941295 -12687894 -12975098 -12940664
41464 -12940664 -12805200 -12710925 -12641421 -12486697 -12162825 -11672265 -11106944 -10628012 -10381042 -10351666
41454 -10351666 -10326988 -10078745 -9588912 -9039360 -8593166 -8262288 -7982258 -7706783 -7382733
41445 -7382733 -6925227 -6307882 -5647801 -5135866 -4887516 -4880877 -4995606 -5070820 -4979979 -4733201
41435 -4733201 -4500249 -4469125 -4673312 -4994570 -5320228 -5640424 -5994451 -6390665 -6804591 -7201826
41425 -7201826 -7522536 -7677940 -7612451 -7371542 -7086435 -6886772 -6823535 -6852131 -6873474 -6809695
41415 -6809695 -6666569 -6522148 -6441970 -6411081 -6364191 -6276126 -6196621 -6182554 -6209831 -6173022 -5974181
41404 -5974181 -5599123 -5108163 -4584993 -4127613 -3870428 -3943148 -4348710 -4889791 -5265845 -5273912
41394e273912L57221N89825P05360P71483P91933P02845M59523R6913k94742o29607
41384a723158q50918r21827q33094o31448m08227k26997p2348J00484K73731L67885
41374d925917L47148K81184K62062K81158K42625J09640j2900J1871J77212L21825
41364b904092L09850J73944M0218m8702j64699l57794n74033p40149q52346r19987
41354f037790q86146p00322m43414k72720k25322j66288K6382K93709M63181M35306
41344g513424K52821K5964j49024k17528j80825j04205q4173j84840l90120n96698
41334i142052o61061n01387j79258J47048L66478M78956N09697M32586K35005
41325h313988P265j12392p1735O8212K16042L00011K65781J18431k2797J795K20551
$$ plain form
41394 -5273912 -4916691 -4326866 -3621506 -2850023 -2058090 -1355245 -895722 -798809 -1093551 -1723158
41384 -1723158 -2574076 -3495903 -4328997 -4960445 -5368672 -5595669 -5668017 -5567533 -5293802 -4925917
41374 -4925917 -4578769 -4297585 -4035523 -3754365 -3511740 -3402100 -3415000 -3403129 -3225917 -2904092
41364 -2904092 -2594242 -2420298 -2380080 -2428782 -2593481 -2951275 -3525308 -4265457 -5117803 -6037790
41354 -6037790 -6923936 -7624258 -8067672 -8340392 -8565714 -8732002 -8705620 -8411911 -7948730 -7513424
41344 -7513424 -7260603 -7234639 -7383663 -7601191 -7782016 -7886221 -7970394 -8155234 -8545354 -9142052
41334 -9142052 -9803113 -10304500 -10483758 -10336710 -9970232 -9491276 -8981579 -8548993 -8313988
41325 -8313988 -8306723 -8419115 -8490850 -8422638 -8206596 -7906585 -7640804 -7522373 -7545170 -7543375 -7322824
41314g322824M80505O01092N39943L86475K40158J31747L2194r4876k30082k73145
41304e508813j22195J84926M38068M14179Q0616l66035o51749o19616l22179L5158
41294f437640K50502K58150J27722m0453j85811k70691k63719j74425o1736K6492
41284f771609Q7586J11758N2424r1347k01596j31679J26308M17828N75520N54859
41274e269948M28889K98138K11718J38472J3590j52634k25819o6419K92278O38224
41264c693511P73709O77260M69022K77066J68387J53266J95539K34482K36802
41255e07978K18318J95228J45654N7811r630L1890K01087M27117O30804P88596
41245B178897R09135R84283R88274R08855P58268N58939L32496R9450j28467l66659
$$ plain form
41314 -7322824 -6842319 -6241227 -5701284 -5314809 -5074651 -4942904 -4910710 -5005586 -5235668 -5508813
41304 -5508813 -5631008 -5446082 -5008014 -4593835 -4513219 -4879254 -5531003 -6150619 -6472798 -6437640
41294 -6437640 -6187138 -5928988 -5801266 -5841719 -6027530 -6298221 -6561940 -6736365 -6798101 -6771609
41284 -6771609 -6684023 -6572265 -6519841 -6611188 -6812784 -6944463 -6818155 -6400327 -5824807 -5269948
41274 -5269948 -4841059 -4542921 -4331203 -4192731 -4179141 -4331775 -4557594 -4624013 -4331735 -3693511
41264 -3693511 -2919802 -2242542 -1773520 -1496454 -1328067 -1174801 -979262 -744780 -507978
41255 -507978 -289660 -94432 51222 109033 99403 131293 332380 759497 1390301 2178897
41245 2178897 3088032 4072315 5060589 5969444 6727712 7286651 7619147 7718597 7590130 7223471
41235G223471o54322j000444j320192j459077j325714r96641o50350m00004k38674
41226h21947j46829j68682l26256n14843n66327m09484j18258J80713L94072M77000
41216b020841M35636L16390J35080j70461o33286j099592j286822j057181n62459
41207e943536o6194K99869N35395O24170N27729L07216J20177O0435Q1178J00138
41197c353423J01401J00993Q9913O3738N2836P2880R2380R5806J26930K08935
41187b347611K66321K01324K1837j80851l60799n37320o91232p44966o86772o34619
41177e694688p09470q81524r90500q90329n42506k0359N09916Q43026Q59610O22237
41167f894587L04182J9783k23164m04290m17882j92091J61549M11301M41074L69515
$$ plain form
41235 7223471 6569149 5568705 4248513 2789436 1463722 467081 -183269 -583273 -821947
41226 -821947 -968776 -1137458 -1463714 -1978557 -2544884 -2954368 -3072626 -2891913 -2497841 -2020841
41216 -2020841 -1585205 -1268815 -1133735 -1304196 -1937482 -3037074 -4323896 -5381077 -5943536
41207 -5943536 -6009730 -5709861 -5174466 -4550296 -4022567 -3715351 -3595174 -3534739 -3453561 -3353423
41197 -3353423 -3252022 -3151029 -3061116 -2997378 -2944542 -2871662 -2779282 -2683476 -2556546 -2347611
41187 -2347611 -2081290 -1879966 -1858129 -2038980 -2399779 -2937099 -3628331 -4373297 -5060069 -5694688
41177 -5694688 -6404158 -7285682 -8276182 -9166511 -9709017 -9729376 -9219460 -8376434 -7516824 -6894587
41167 -6894587 -6590405 -6570622 -6793786 -7198076 -7615958 -7808049 -7646500 -7235199 -6794125 -6424610
41157f424610L99598N83372P80942Q39438P57199O48708N90644N55853M90570
41148g78286L95934L03172K11051J00901j211l7415p903K583p5897k06417l00929
41137c94417l52106m47493o32573q09570q20139o14001k96436j7354J39749J55435
41127d088905K9240k04430m41353n58596n19299l87723k27554l2279K11815M35101
41117e783983N15409L97441J47575j03072k39327k10409o7658L2198o9421l73721
41107e754968o99642q60779q40531p47172o31693m33787j11658K65463O00609
41098i214158Q70510J065226J082018Q10974L52476L1842R9502M57786P67445
41089c676379P99421N95356L04903M333k64452l93866k83652J1566L14011N04141
$$ plain form
41157 -6424610 -6025012 -5441640 -4660698 -3821260 -3064061 -2415353 -1824709 -1268856 -778286
41148 -778286 -382352 -79180 131871 232772 231561 194146 186243 188826 112929 -93488 -394417
41137 -394417 -746523 -1194016 -1826589 -2636159 -3456298 -4070299 -4366735 -4384089 -4244340 -4088905
41127 -4088905 -4059665 -4264095 -4705448 -5264044 -5783343 -6171066 -6398620 -6430899 -6219084 -5783983
41117 -5783983 -5268574 -4871133 -4723558 -4826630 -5065957 -5276366 -5344024 -5311826 -5381247 -5754968
41107 -5754968 -6454610 -7315389 -8155920 -8903092 -9534785 -9968572 -10080230 -9814767 -9214158
41098 -9214158 -8343648 -7278422 -6196404 -5385430 -5032954 -5001112 -4901610 -4443824 -3676379
41089 -3676379 -2876958 -2281602 -1976699 -1972366 -2236818 -2630684 -2914336 -2902770 -2588759 -2084618
41079b084618N80989N36159K83520k08866p75642j132126j102858p45340k70008
41070d918790J20759L28578L51642K21454l3111l46156n70592n53178k92056L7336
41060e654114K69678M18328N89073P71181Q24113O74806M17497J75387l9999k57044
41050a811094m08078l78297j76653L9523J31850J04462L6044m2969j49106k59467
41040b913785k96990k12849m5418J18293K15429K25494J39773m6787k95677m94980
41030c607497n06967k76494J00547M29549N52897M44071J84092j26308m16257
41021c222367o34231p38367p18205o05063m42621k60627q7761L8491J07013J60493
41011f403245K46290L42215L70931K94531J61437N7018M7476J70421M09616O42259
$$ plain form
41079 -2084618 -1503629 -967470 -683950 -892816 -1668458 -2800584 -3903442 -4648782 -4918790
41070 -4918790 -4798031 -4469453 -4117811 -3896357 -3929468 -4275624 -4846216 -5399394 -5691450 -5654114
41060 -5654114 -5384436 -4966108 -4377035 -3605854 -2781741 -2106935 -1689438 -1514051 -1554050 -1811094
41050 -1811094 -2219172 -2597469 -2774122 -2734599 -2602749 -2498287 -2462243 -2505212 -2654318 -2913785
41040 -2913785 -3210775 -3423624 -3469042 -3350749 -3135320 -2909826 -2770053 -2816840 -3112517 -3607497
41030 -3607497 -4114464 -4390958 -4290411 -3860862 -3307965 -2863894 -2679802 -2806110 -3222367
41021 -3222367 -3856598 -4594965 -5313170 -5918233 -6360854 -6621481 -6709242 -6670751 -6563738 -6403245
41011 -6403245 -6156955 -5814740 -5443809 -5149278 -4987841 -4930823 -4883347 -4712926 -4303310 -3661051
41001c661051O78782M33119L1933l08274m95783n91217o41717n89171l80518r1794
40991e615691J27764K08605K06399K06671K24896K02091P7027j36276l33695l97595
40981e229804l02159j28751L1108J58401K69397L30863K71653R2558p4182n8534
40971d639450J73246M41827M83893J99534k24394m73787m05518j56551N0599J47939
40961d402662K17409L03195L33229K41659Q4032k4605m3299k0486M569N4817J54264
40950c097878K54381K61038J36623m4170j52160j14561L1491J79423K30743J48155
40940b166915k4494j74261j82879k4303J93669L08481K39280M8046j27312j97252
40930b107940j92591k23436l55196n20979n80215m72443k75483q8675R1278L23673
$$ plain form
41001 -3661051 -2982269 -2549150 -2517217 -2825491 -3321274 -3912491 -4554208 -5143379 -5523897 -5615691
40991 -5615691 -5487927 -5279322 -5072923 -4866252 -4641356 -4439265 -4362238 -4498514 -4832209 -5229804
40981 -5229804 -5531963 -5660714 -5629606 -5471205 -5201808 -4870945 -4599292 -4506734 -4580916 -4639450
40971 -4639450 -4466204 -4024377 -3540484 -3340950 -3565344 -4039131 -4444649 -4601200 -4550601 -4402662
40961 -4402662 -4185253 -3882058 -3548829 -3307170 -3223138 -3247743 -3291042 -3311528 -3306959 -3252142 -3097878
40950 -3097878 -2843497 -2582459 -2445836 -2490006 -2642166 -2756727 -2725236 -2545813 -2315070 -2166915
40940 -2166915 -2191409 -2365670 -2548549 -2572852 -2379183 -2070702 -1831422 -1783376 -1910688 -2107940
40930 -2107940 -2300531 -2523967 -2879163 -3400142 -3980357 -4452800 -4728283 -4816958 -4725680 -4402007
40920d402007N93801Q12405R34461R89019R76608Q32779N45552K33616L2953n2245
40910A496942j19063k21822l29321l99194m16065l66846k61065j82263k35204
40901a033901m10991n72473o11743n62967n14610m68595l53415j40789J22738
40892d546746L83705O09740P51833P54181O31063M82024L91473L38531K30604
40883B6408J467l40776p22919j025615j128059r99324p52688n63235n10616n25867
40873f541224m97368l91019k46585r7799N2867J89831K66734K54166J80086J03238
40863f727073O1696O5004J21863K45066M19315N76416O14928M55665J00305l41239
40853d408054o84208p62306n24785o4387M38447Q03936R25684Q14900N97769M36649
$$ plain form
40920 -4402007 -3808206 -2995801 -2061340 -1072321 -95713 737066 1282618 1516234 1549187 1496942
40910 1496942 1377879 1156057 826736 427542 11477 -355369 -616434 -798697 -1033901
40901 -1033901 -1444892 -2017365 -2629108 -3192075 -3706685 -4175280 -4528695 -4669484 -4546746
40892 -4546746 -4163041 -3553301 -2801468 -2047287 -1416224 -934200 -542727 -204196 26408
40883 26408 27875 -312901 -1035820 -2061435 -3189494 -4188818 -4941506 -5504741 -6015357 -6541224
40873 -6541224 -7038592 -7429611 -7676196 -7773995 -7721128 -7531297 -7264563 -7010397 -6830311 -6727073
40863 -6727073 -6665377 -6600373 -6478510 -6233444 -5814129 -5237713 -4622785 -4167120 -4066815 -4408054
40853 -4408054 -5092262 -5854568 -6379353 -6443740 -6005293 -5201357 -4275673 -3460773 -2863004 -2426355
40843b426355M09184M56915M64216L77531K33429R7966K4284N6919K07354L95065
40833B96508M70298L57002J52475K5958J7865p352j89896m92835p16873o81991
40823g68841l87328j5884K06747J87061K9293p5375l8081N1670L6790j42465l99724
40812a316137n87053o06087m64119k60387j10931n5798m1519j6339k4765j58734
40802c641869m08640o14516o01728l43022L9239M00512O57649P68379P13971N53879
40792b476146M51505N56274Q28216J027377R30305N51147J14905j77589l08644
40783A497350l66170l83869l29055k24920j97801l57859o59518r12456r25846
40774b860144o40824j60966L06943N62059N27970L08273J12072Q6258K00708K98901
$$ plain form
40843 -2426355 -2017171 -1560256 -1096040 -718509 -485080 -387114 -362830 -305911 -98557 296508
40833 296508 766806 1123808 1276283 1302241 1320106 1312754 1122858 630023 -86850 -768841
40823 -768841 -1156169 -1172053 -965306 -778245 -748952 -824327 -862408 -810738 -773948 -916413 -1316137
40812 -1316137 -1903190 -2509277 -2973396 -3233783 -3344714 -3400512 -3442031 -3458370 -3483135 -3641869
40802 -3641869 -4050509 -4665025 -5266753 -5609775 -5570536 -5170024 -4512375 -3743996 -3030025 -2476146
40792 -2476146 -2024641 -1468367 -640151 387226 1317531 1868678 1983583 1805994 1497350
40783 1497350 1131180 747311 418256 193336 -4465 -362324 -1021842 -1934298 -2860144
40774 -2860144 -3500968 -3661934 -3354991 -2792932 -2264962 -1956689 -1844617 -1758359 -1557651 -1258750
40764a258750K60598J09199l3317p2582j0584Q6126J47749J27885J0775j71381
40754h04282l36082l96344l23625j66889j8808L5194l3782j63417k29935j65764
40744b603734o0677r4213l25804n82621o13167l54800m427J89361J63710M6393
40734d239979l5057q7375j89197l46659m54658l98588j73641R8294K62064K49160
40724e315636J24664J8719L532M1200N5868L1566O360j2022o3459j47680j73891
40713e430779n3085J76798L68274M12438L40008K74069L10189M45573N98700O88098
40703a869717P03805O99607P06863O81948N74115M21348L15299K68547J87468
40694B689283Q696j98430l16304l17987k55216j38927P9736L95512O91067Q43525
$$ plain form
40764 -1258750 -998152 -888953 -922270 -994852 -1005436 -919310 -771561 -643676 -632901 -804282
40754 -804282 -1140364 -1536708 -1860333 -2027222 -2046030 -2010836 -2044618 -2208035 -2437970 -2603734
40744 -2603734 -2664411 -2758624 -3084428 -3667049 -4280216 -4635016 -4639443 -4450082 -4286372 -4239979
40734 -4239979 -4275036 -4362411 -4551608 -4898267 -5352925 -5751513 -5925154 -5826860 -5564796 -5315636
40724 -5315636 -5190972 -5172253 -5168721 -5127521 -5071653 -5040087 -5033727 -5045749 -5109208 -5256888 -5430779
40713 -5430779 -5483864 -5307066 -4938792 -4526354 -4186346 -3912277 -3602088 -3156515 -2557815 -1869717
40703 -1869717 -1165912 -466305 240558 922506 1496621 1917969 2233268 2501815 2689283
40694 2689283 2697979 2499549 2183245 1865258 1610042 1471115 1550851 1946363 2637430 3480955
40684C480955Q61295Q76364J008156J252373J485990J556181J379655R97407N49562
40675A3447938J74588r1374l15196n59940p92807r26878r49029r59332j052436
40666G975534j191075j244759j142627r38322p26411n56721m50966m38559n19413
40657G66681o22393o55279n87214m47707k64830m8931J74630L62242M79769N03567
40647c39465M13640K31702M6077o5263j31224k34196l48707l15349k3425M35487
40637c30723Q50496J092129J180272J180847J096838Q72857M88284M6575k39517
40628F238058k08292P1773L29446L46426J54509o0929j94854k76178l29668l13613
40618E756678k25982j68568k32661l72233m54651m09301k77923j47735r1124j51195
$$ plain form
40684 3480955 4342250 5218614 6226770 7479143 8965133 10521314 11900969 12898376 13447938
40675 13447938 13622526 13531152 13215956 12656016 11863209 10936331 9987302 9027970 7975534
40666 7975534 6784459 5539700 4397073 3458751 2732340 2175619 1724653 1286094 766681
40657 766681 144288 -510991 -1098205 -1545912 -1810742 -1859673 -1685043 -1322801 -843032 -339465
40647 -339465 74175 305877 351954 286691 155467 -78729 -427436 -742785 -766210 -330723
40637 -330723 519773 1611902 2792174 3973021 5069859 5942716 6431000 6477575 6238058
40628 6238058 6029766 6101539 6430985 6777411 6931920 6870991 6676137 6399959 6070291 5756678
40618 5756678 5530696 5362128 5129467 4757234 4302583 3893282 3615359 3467624 3376500 3225305
40608C225305l14649m80488n08111l42013q2989Q8230O5894j01461k74816l49335
40598I25567l11861k03945p5697J1339j0502j44623k77110k61257p8952J24932
40588c02109J94357J15171k752n4407j7703N9463J02225N7571n5101j46850j43208
40577a93343n9227K6676M9423j6918j69523l57483m76662m54919l47204k86886
40567b286066l27288l77877l12113r7243J93359M50649N93940O07565N41891M56366
40557e56817L55875K13397M5842r2943k00052l27456m67074n11845l94898k06817
40547b142788r3421p0086j8907J41159L53097M91641M76630L15343Q4790j20312
40537e82854k58950l60918m46890m68290l87925k83659k68520l03228j99686J37414
$$ plain form
40608 3225305 2910656 2430168 1922057 1580044 1497055 1585285 1651179 1549718 1274902 925567
40598 925567 613706 409761 334064 345403 334901 190278 -86832 -348089 -427041 -302109
40588 -302109 -107752 7419 4667 -49740 -67443 -7980 94245 151816 96715 -50135 -193343
40577 -193343 -252570 -225894 -176471 -193389 -362912 -720395 -1197057 -1651976 -1999180 -2286066
40567 -2286066 -2613354 -2991231 -3303344 -3400587 -3207228 -2756579 -2162639 -1555074 -1013183 -556817
40557 -556817 -200942 12455 58297 -34646 -234698 -562154 -1029228 -1541073 -1935971 -2142788
40547 -2142788 -2236209 -2306295 -2325202 -2184043 -1830946 -1339305 -862675 -547332 -462542 -582854
40537 -582854 -841804 -1202722 -1649612 -2117902 -2505827 -2789486 -3058006 -3361234 -3560920 -3423506
40527c423506N54839Q03293P90189O16904M17312K48765J29433R2982J65161L16341
40517G11713M64687N26413M68757L26984J68920M0769m4998q1279o3042j4569
40507B504355L1067J03361K89585O02023Q78812Q84734N26048n5660n91197q61215
40497D311913p98085m76773l1419M27300Q13576J009701Q90473M67475m1502l82263
40487F190396n01462n41998o14045o71484o33337n12204l51785j27763J83818
40478B420136M88735O43745O42830O31834P10109Q03334P85334O65646N91429
40469H383132O94273R93978J429920J908356K299133K447551K246426J698301
40461B2101070Q99744j1780q83220j564322j965455k111937k113314k066641j997950
$$ plain form
40527 -3423506 -2868667 -2065374 -1275185 -658281 -240969 7796 137229 230211 395372 711713
40517 711713 1176400 1702813 2171570 2498554 2667474 2708243 2663245 2581966 2518924 2504355
40507 2504355 2535422 2638783 2928368 3530391 4409203 5293937 5819985 5764325 5173128 4311913
40497 4311913 3513828 3037055 3005636 3432936 4246512 5256213 6146686 6614161 6572659 6190396
40487 6190396 5688934 5146936 4532891 3861407 3228070 2715866 2364081 2236318 2420136
40478 2420136 2908871 3552616 4195446 4827280 5537389 6340723 7126057 7791703 8383132
40469 8383132 9077405 10071383 11501303 13409659 15708792 18156343 20402769 22101070
40461 22101070 23000814 22989034 22105814 20541492 18576037 16464100 14350786 12284145 10286195
40452A0286195j880577j672492j340150q99306m56543j68111j15019k27677l48506
40443C177814l48229j78933J25050M47026O28736N82703L64460R6898j51153l60169
40433D384203m75356m28804k55503r3009k8074j8836r067l4520j40005k52218
40423B648811k36070o6642J31593K19658J62496J9934j15687j65534j10202j4313
40413B474044L6553M3253J00664K79557N34291P44017Q09987O95934M21843O2820
40403F202963k74722n28870p29664r30477j095843j107739r04642n77254k88426
40394b34674j11823J3797J72887L59305M96595N38619N07144M40974L59964K92797
40384B835585K88562L57188M26773M13218L27154K62481K70136K88657K22695
$$ plain form
40452 10286195 8405618 6733126 5392976 4493670 4037127 3869016 3753997 3526320 3177814
40443 3177814 2829585 2650652 2775702 3222728 3851464 4434167 4798627 4895525 4744372 4384203
40433 4384203 3908847 3480043 3224540 3131531 3103457 3084621 3075554 3041034 2901029 2648811
40423 2648811 2412741 2346099 2477692 2697350 2859846 2879780 2764093 2598559 2488357 2474044
40413 2474044 2510597 2553850 2654514 2934071 3468362 4212379 5022366 5718300 6140143 6202963
40403 6202963 5928241 5399371 4669707 3739230 2643387 1535648 631006 53752 -234674
40394 -234674 -346497 -332700 -159813 199492 696087 1234706 1741850 2182824 2542788 2835585
40384 2835585 3124147 3481335 3908108 4321326 4648480 4910961 5181097 5469754 5692449
40375E692449N6584j36022k64929k74197j52918M7620K11811K34954J27768Q707
40365E551827l8213o6027j83257l91404n60444n70074m23201k05642N273J50611
40355C269449J68183M8019r8588j07412P1085L18991M85435N26633M92949M41388
40345E616132M14781M60735N91846P28477P41505N73199K91961K5315j41025k10721
40335I092205k60599l76692n75080p80675q98990q95913p89701o02266l71118
40326C541171j81022r9240o7380O2219L37737O09342O73934M92272K18995L7940
40316E625968J2818R1211K04428L34669M93125O55963P51003P27546O21776N13838
40306A0032345M19670K69366J1965k93295n17939n78368m93122l48072k22446
$$ plain form
40375 5692449 5749033 5613011 5348082 5073885 4920967 4968587 5180398 5415352 5543120 5551827
40365 5551827 5513614 5447587 5264330 4872926 4312482 3742408 3319207 3113565 3118838 3269449
40355 3269449 3437632 3485651 3387063 3279651 3350736 3669727 4155162 4681795 5174744 5616132
40345 5616132 6030913 6491648 7083494 7811971 8553476 9126675 9418636 9443951 9302926 9092205
40335 9092205 8831606 8454914 7879834 7099159 6200169 5304256 4514555 3912289 3541171
40326 3541171 3360149 3260909 3193529 3255748 3593485 4202827 4876761 5369033 5588028 5625968
40316 5625968 5638786 5729997 5934425 6269094 6762219 7418182 8169185 8896731 9518507 10032345
40306 10032345 10452015 10721381 10733346 10440051 9922112 9343744 8850622 8502550 8280104
40297H280104j35078n5484K1133K8328r4704k83653l71688k56776O964L07454
40287G446600N92045Q36989R73881R43980Q05206O98033O93786P34118P32797
40278A4457435O91854O95256Q02941R58624J013823Q80162O59354N53415O12991
40269B1325855O55621N01636K10943k1120j41534k69429m64053o11779n75158
40260B0610982l32308P0693N84878J112978J506343J696794J771155J856213K001389
40251C0879117K233384K631988L242756L962020M612098N114681N511830N821489
40243F4009363N917834N528756M334166K182238o52456l455664n465433o349040
40235F6049764o290221n680573m838982l987266l294971k822214k479965k134427
$$ plain form
40297 8280104 8145026 8089542 8110675 8139003 8044299 7760646 7388958 7132182 7139146 7446600
40287 7446600 8038645 8875634 9849515 10793495 11598701 12296734 12990520 13724638 14457435
40278 14457435 15149289 15844545 16647486 17606110 18619933 19500095 20159449 20712864 21325855
40269 21325855 21981476 22483112 22694055 22672935 22531401 22261972 21797919 21186140 20610982
40260 20610982 20278674 20349367 20934245 22047223 23553566 25250360 27021515 28877728 30879117
40251 30879117 33112501 35744489 38987245 42949265 47561363 52676044 58187874 64009363
40243 64009363 69927197 75455953 79790119 81972357 81319901 77864237 72398804 66049764
40235 66049764 59759543 54078970 49239988 45252722 41957751 39135537 36655572 34521145
40227C4521145j736914j321512r18407n17862j00573L27760P21518J009651J158096
40218C3142902J232183J362827J624262J952100K175784K113127J669498R21021
40210D6193704J07226n36242r77069j372273j832557k261962k471719k394871
40202C4454237k129366j809659j500912j199560q76942n22251j79104O9681J86936
40193B6493060K36260L16230M52091N86950O64071O75932O42794N89211N43188
40184C1199787N18881M94619M41011L76382L66233M62750O64692R26294J170626
40175C6621275J302966J265355J099072R18865Q08693P77372Q34054J059292J551207
40166D6238151K316859L255662M237664N161373N956048O589804P066964P313961
$$ plain form
40227 34521145 32784231 31462719 30544312 30026450 29925877 30253637 30975155 31984806 33142902
40218 33142902 34375085 35737912 37362174 39314274 41490058 43603185 45272683 46193704
40210 46193704 46300930 45764688 44787619 43415346 41582789 39320827 36849108 34454237
40202 34454237 32324871 30515212 29014300 27814740 26937798 26415547 26236443 26306124 26493060
40193 26493060 26729320 27045550 27497641 28084591 28748662 29424594 30067388 30656599 31199787
40184 31199787 31718668 32213287 32654298 33030680 33396913 33859663 34524355 35450649 36621275
40175 36621275 37924241 39189596 40288668 41207533 42016226 42793598 43627652 44686944 46238151
40166 46238151 48555010 51810672 56048336 61209709 67165757 73755561 80822525 88136486
40158H8136486P010946N649186K949270p03297m329598o971232q264540q450933
40150G5026288p961640p108563o098231n125206m329872l723719l230422k774784
40142C4673851k306819j809477j349210j067414j036298j140534j174435j050451
40134B3739213q51363o92017o09161n88443o03202n81531m13412p1635L02180
40125A9630629N06518M84795L79955L75437N14577O91031P86645P84653P51786
40116B4906026P45071P63531P82276Q02395Q52581R55393J103512J258093J363783
40107C3532661J385505J347272J315448J319277J303608J193696J004518Q55655
40099D3257640Q71566J086233J444546J868784K311316K759888L203514L577657
$$ plain form
40158 88136486 95147432 100796618 103745888 103042591 98712993 91741761 83477221 75026288
40150 75026288 67064648 59956085 53857854 48732648 44402776 40679057 37448635 34673851
40142 34673851 32367032 30557555 29208345 28140931 27104633 25964099 24789664 23739213
40134 23739213 22887850 22195833 21586672 20998229 20395027 19813496 19400084 19328449 19630629
40125 19630629 20137147 20621942 21001897 21377334 21891911 22582942 23369587 24154240 24906026
40116 24906026 25651097 26414628 27196904 27999299 28851880 29807273 30910785 32168878 33532661
40107 33532661 34918166 36265438 37580886 38900163 40203771 41397467 42401985 43257640
40099 43257640 44129206 45215439 46659985 48528769 50840085 53599973 56803487 60381144
40091F0381144L723709L412788K462394R06934r04886k432225l268939l403616
40083F0877303l129895k699283k135107j405429o46833q3975K22663M09861N98005
40074E2007310P74239R11095J072978J337832J697858K099930K518685K942152
40066F5362079L360261L824356M445303N266618O202520P161272Q156839R231773
40058A13011021J0358893J1522549J2834547J4471038J6553934J9177241K2436387
40051B20365610K6265781L0283847L3856479L6068477L5373230K9660597J7635767
40044D29509788P14366j6804136l0155581l7041875l8315966l6247567l2632150
40037B39026879k8393234k4123941k0326522j7207244j4633680j2389809j0357487
$$ plain form
40091 60381144 64104853 67517641 69980035 70886969 69982083 67549858 64280919 60877303
40083 60877303 57747408 55048125 52913018 51507589 50860756 50776781 50999444 51409305 52007310
40074 52007310 52781549 53692644 54765622 56103454 57801312 59901242 62419927 65362079
40066 65362079 68722340 72546696 76991999 82258617 88461137 95622409 103779248 113011021
40058 113011021 123369914 134892463 147727010 162198048 178751982 197929223 220365610
40051 220365610 246631391 276915238 310771717 346840194 382213424 411874021 429509788
40044 429509788 430224154 413420018 383264437 346222562 307906596 271659029 239026879
40037 239026879 210633645 186509704 166183182 148975938 134342258 121952449 111594962
40030A11594962q498171o830069n438529m389747l608626k911168k163342j369301
40022G6386009o38851j19050R8428Q0628J6769m711j26056n12760j049177j369536
40012G2761693j198042n62561L09411J176595J862553K303683K589227K856876
40004H2099435L094062L131699K883550K498161K216767K172228K386132K849510
39996A03331544L495313M165123M731552N245605N897978O863884Q231400J0019267
39988A51981666J2195460J4730059J7680123K1132195K4968689K8726608L1648469
39981C03063269L2624202L0028918K2196432Q888799p467910k2530614l2602364
39974C34200732l6680168l6190762l3200305k9142835k4806049k0712487j7162257
$$ plain form
40030 111594962 103096791 96266722 90828193 86438446 82829820 79918652 77755310 76386009
40022 76386009 75747158 75628108 75726536 75807164 75823933 75819222 75693166 75180406 74131229 72761693
40012 72761693 71563651 71001090 71310501 72487096 74349649 76653332 79242559 82099435
40004 82099435 85193497 88325196 91208746 93706907 95923674 98095902 100482034 103331544
39996 103331544 106826857 110991980 115723532 120969137 126867115 133730999 141962399 151981666
39988 151981666 164177126 178907185 196587308 217719503 242688192 271414800 303063269
39981 303063269 335687471 365716389 387912821 396801620 389333710 366803096 334200732
39974 334200732 297520564 261329802 228129497 198986662 174180613 153468126 136305869
39967A36305869j4170520j1639517r546877p892057o589478n539881m739138m227186
39959G1961215l986115l954414m073564m247203m319812m188035l903754l600729
39951C9687589l350121l140312k945932k739390k475497k151509j850963j631504
39943A9402361j392800r80501m40250m2693J5474j50367k56286j69977Q922J51443
39933A6145326K60042L98198N52758O38116O01413M58226K31066q3265m53538
39924A8748342p62125q78694q05003p03277p31914q62881r13507p70050n25945
39915A1794946l63534l47542l96333m23492m15332l58210j90815R3072L38285
39906I731045L17041m9249n86784r98553j085767q61280m92375j55295P1364K01120
$$ plain form
39967 136305869 122135349 110495832 100948955 93056898 86467420 80927539 76188401 71961215
39959 71961215 67975100 64020686 59947122 55699919 51380107 47192072 43288318 39687589
39951 39687589 36337468 33197156 30251224 27511834 25036337 22884828 21033865 19402361
39943 19402361 18009561 17029060 16588810 16546117 16561591 16411224 16154938 15984961 15993883 16145326
39933 16145326 16405368 16803566 17356324 17994440 18595853 19054079 19285145 19201880 18748342
39924 18748342 17986217 17107523 16302520 15599243 14867329 14004448 13090941 12320891 11794946
39915 11794946 11431412 11083870 10687537 10264045 9848713 9490503 9299688 9392760 9731045
39906 9731045 10048086 9998837 9412053 8413500 7327733 6466453 5974078 5818783 5890147 6091267
39896F091267K61003K49334J72351Q0692L5199N5091J27086K38643L59796M19725
39886H090187L73822L00546L57266N96120Q68942R69758Q57783O97276O78500
39877A3790200Q31388J022055J110234J094672J106077J264913J554569J838283
39869B3612391J991127K007121J995001K095856K395131K872636L413011L865307
39861D4247581M085692L926114L251326K069645O64090m98804j076481j072357
39853E5596806p49177l75330r3222K6228r4256n20588j229950k062032k761513
39844D7736966l123550l144117l006552k883725k775685k571280k218103j757184
39836B6256770j219370n91010R3109P02516J104443J262483J215552J014450P28285
$$ plain form
39896 6091267 6352270 6601604 6773955 6854647 6889846 6944937 7072023 7310666 7670462 8090187
39886 8090187 8464009 8764555 9121821 9717941 10586883 11556641 12414424 13111700 13790200
39877 13790200 14621588 15643643 16753877 17848549 18954626 20219539 21774108 23612391
39869 23612391 25603518 27610639 29605640 31701496 34096627 36969263 40382274 44247581
39861 44247581 48333273 52259387 55510713 57580358 58244448 57745644 56669163 55596806
39853 55596806 54847629 54472299 54379077 54405305 54311049 53790461 52560511 50498479 47736966
39844 47736966 44613416 41469299 38462747 35579022 32803337 30232057 28013954 26256770
39836 26256770 25037400 24446390 24539499 25242015 26346458 27608941 28824493 29838943 30567228
39827C0567228M69121L31604K93192K11646n8122n47042j157733j739694k171418
39818B6198782k390565k382407k178115j874473j612449j478516j422415j318218
39810A1541624j124511r43639q90916r35523r16748p15109l73751m3731J65578
39801E763274K66819L42317M40305N35128N71842N17012L63353J30463j04032
39792H826481k14627j41121Q131L7832j16836l03656l22567j45790O7818J43451
39782G839116L3196j75047l28619l08140j29003M0841K5648j61999l07207k08258
39772F320528J17478M68752O73778P30409P52977Q36967R94699J180208J324757
39763A3400553J344337J153270P09313N4170o96012j398031j922270k179247k151486
$$ plain form
39827 30567228 31036349 31367953 31661145 31872791 31814669 31267627 30109894 28370200 26198782
39818 26198782 23808217 21425810 19247695 17373222 15760773 14282257 12859842 11541624
39810 11541624 10417113 9473474 8582558 7647035 6730287 6015178 5641427 5597696 5763274
39801 5763274 6030093 6372410 6812715 7347843 7919685 8436697 8800050 8930513 8826481
39792 8826481 8611854 8470733 8478864 8516696 8399860 8096204 7773637 7627847 7695665 7839116
39782 7839116 7872312 7697265 7368646 7060506 6931503 6972344 6997992 6835993 6528786 6320528
39772 6320528 6438006 6906758 7580536 8310945 9063922 9900889 10895588 12075796 13400553
39763 13400553 14744890 15898160 16607473 16661643 15965631 14567600 12645330 10466083 8314597
39754H314597j908059j555257j155850p23239l10851o1054j01599l87885o92732
39745A418071p80001n87525k55073m315K0963j42086k96891k47445J7868L06514
39735e49920M09878L06809J67887J73570L45635N40104N83154M29490K10811J12175
39725B729593J77336K61504K08613L8861r9682j37634j52406k25590l32953m22381
39715B045261n13345o37762p34357o91889m81850j80908J23222L85171N80907
39706a05550P08080Q01520Q75982Q57126O51860K99857k6702k00966k46301k38430
39696C376476j88654p5267Q3245K53888M33941O04004O82795O02175M02053J92621
39686F367277M6013l0962o0994r2523j84629l20336l75063k59329o4196L0985
$$ plain form
39754 8314597 6406538 4851281 3695431 2972192 2661341 2600287 2498688 2110803 1418071
39745 1418071 638070 50545 -204528 -208843 -187880 -329966 -626857 -874302 -856434 -549920
39735 -549920 -140042 166767 334654 508224 853859 1393963 1977117 2406607 2617418 2729593
39725 2729593 2906929 3168433 3377046 3415907 3316225 3178591 3026185 2800595 2467642 2045261
39715 2045261 1531916 894154 159797 -532092 -1013942 -1194850 -1071628 -686457 -105550
39706 -105550 602530 1404050 2280032 3137158 3789018 4088875 4062173 3861207 3614906 3376476
39696 3376476 3187822 3112555 3195800 3449688 3883629 4487633 5170428 5772603 6174656 6367277
39686 6367277 6413290 6382328 6321334 6228811 6044182 5723846 5348783 5089454 5025258 5056243
39676E056243k2146j17803j87672k97590n17618p88405r64982r33774o66723k39719
39666C19811J67786L70153L25378J42421p1443k83912m37035m06882j67161R4522
39656E3638J55758K5782p5634Q307K21594M18257N26374N50951M98177L70003
39646B753207K11440J11573J43905L08763N28522O97926P47314O68162N02585
39637F673397L33895K60744L11777L77430L05179J00237m8027o491J04007M3355
39627H455503k61057o61091r84194j159011j150992r17016m90595k5987L13745
39618C119305M72667M76538L54475J32611j43520m26000o67685p86027o94250
39609A838114m28013j85346j56828l28224n06702n25018l68387j27896R1269K06928
$$ plain form
39676 5056243 5034097 4916294 4728622 4431032 3913414 3125009 2160027 1226253 559530 319811
39666 319811 487597 857750 1183128 1325549 1254106 970194 533159 126277 -40884 53638
39656 53638 209396 235178 159544 167851 389445 807702 1334076 1885027 2383204 2753207
39646 2753207 2964647 3076220 3220125 3528888 4057410 4755336 5502650 6170812 6673397
39637 6673397 7007292 7268036 7579813 7957243 8262422 8362659 8314632 8308141 8412148 8455503
39627 8455503 8194446 7533355 6549161 5390150 4239158 3322142 2831547 2805560 3119305
39618 3119305 3591972 4068510 4422985 4555596 4412076 3986076 3318391 2532364 1838114
39609 1838114 1410101 1224755 1067927 739703 233001 -292017 -660404 -788300 -697031 -490103
39599d90103J74955Q352k33233m73866o22111n72961k85227J23874M29887N03501
39589a436932M34413M04134M54513M48588K82046P9100J12042N14156J109178
39580B401238J554382J640454J429330J121803Q53302O43454M84577L96049L81688
39571A0906277L92573L68797K93890J84696N4779q0235j85508k42749k93682l89526
39561A1009312m83166m35847j87595J10112K02305j5966l94193o82642p53494
39552H368826o56192n10101l94401l23649k76901k33222j95276j84434k11316
39543E383334k68532l65457n40581p97127j034980j099457r25347o11063l26788
39534e85998j59418o6669K4529J07009J05149j1673j67527k61273k85557l13944
$$ plain form
39599 -490103 -315148 -306796 -540029 -1013895 -1636006 -2208967 -2494194 -2370320 -1940433 -1436932
39589 -1436932 -1002519 -598385 -143872 304716 586762 665862 777904 1292060 2401238
39580 2401238 3955620 5596074 7025404 8147207 9000509 9643963 10128540 10524589 10906277
39571 10906277 11298850 11667647 11961537 12146233 12201012 12120777 11935269 11692520 11398838 11009312
39561 11009312 10526146 10090299 9902704 10012816 10215121 10199155 9804962 9122320 8368826
39552 8368826 7712634 7202533 6808132 6484483 6207582 5974360 5779084 5594650 5383334
39543 5383334 5114802 4749345 4208764 3411637 2376657 1277200 351853 -259210 -585998
39534 -585998 -745416 -812085 -787556 -680547 -575398 -587071 -754598 -1015871 -1301428 -1615372
39524a615372l70564l74477k42694L800K77894N17887O79590O85972M86472J69749
39514B18257p0573j12961L714J76068L41098M55929M62917L53639K22081J75024
39504B225193K04542K11545J46790O8893N8609J25699K12813K51020J92778K0212
39494C718094k47533n49532p91940q80210p79135n59093l53514k38595j72919
39485h54377q4677Q933K0755p6441j94709k20608j25126K2729J14012O6201j13859
39474a437167l00869l28315j48726R2922J86167N8814j64262k88477k00292R2558
39464b437647N01393Q97598J152641J200752J077774Q75925O57025M30294K07942
39455D563697L6627n0460p9845j01307j27108j46747j80918k58053l30000k77774
$$ plain form
39524 -1615372 -1985936 -2360413 -2603107 -2599307 -2321413 -1803526 -1123936 -437964 48508 218257
39514 218257 147684 34723 38437 214505 555603 1011532 1474449 1828088 2050169 2225193
39504 2225193 2429735 2641280 2788070 2856963 2915572 3041271 3254084 3505104 3697882 3718094
39494 3718094 3470561 2921029 2129089 1248879 469744 -89349 -442863 -681458 -854377
39485 -854377 -939054 -930121 -909366 -985807 -1180516 -1401124 -1526250 -1503521 -1389509 -1323308 -1437167
39474 -1437167 -1738036 -2066351 -2215077 -2122155 -1935988 -1877174 -2041436 -2329913 -2530205 -2437647
39464 -2437647 -1936254 -1038656 113985 1314737 2392511 3268436 3925461 4355755 4563697
39455 4563697 4600324 4549864 4470019 4368712 4241604 4094857 3913939 3655886 3325886 3048112
39445C048112m4909K72369N14478O15767O28386O10225N53060M32640K72697J21262
39435G024087m504j05018j41146l9791K19653N44713P82201Q34959P22070N36188
39425A0373412L62200K31560J18630m0912l00455o28527q85051r08715o47969
39416G674173j99878K70072O21601P70509O91184M27683Q0339k47343m85302n90692
39406I012346n53977m32312l26672k80080k31728j18865J1290N8643J9153n514
39396G152284M5621J22440J79931K90641N61558R62119J308716J434879J337142
39387A3395331J144552R87273R19694R33283R84996J002206R07426O88691M48750
39378B1412202L52046N01326Q65661J317547J713296J944764J976550J887581
$$ plain form
39445 3048112 3003203 3275572 3790050 4405817 5034203 5644428 6197488 6630128 6902825 7024087
39435 7024087 7019583 6914565 6773419 6733628 6953281 7497994 8280195 9115154 9837224 10373412
39425 10373412 10735612 10967172 11085802 11044890 10744435 10115908 9230857 8322142 7674173
39416 7674173 7474295 7744367 8365968 9136477 9827661 10255344 10335683 10088340 9603038 9012346
39406 9012346 8458369 8026057 7699385 7419305 7187577 7068712 7080002 7138645 7157798 7152284
39396 7152284 7197905 7320345 7500276 7790917 8352475 9314594 10623310 12058189 13395331
39387 13395331 14539883 15527156 16446850 17380133 18365129 19367335 20274761 20963452 21412202
39378 21412202 21764248 22265574 23131235 24448782 26162078 28106842 30083392 31970973
39370C1970973J853937K022441K367983K692271K783006K582765K222437J915220
39362E0411033J814413J945403K254971K712420L335818M106250M892106N506109
39354G6978523N833432N866547N614916N020411L976833K418010L99744j866300
39346A04242116m062918n900935p230336q018400q256930p959933p246949o336495
39338D9229220n409782m536187l767406l221327k980299k943809k886526k678258
39330B0805626k381868k126599j960276j860774j824958j870186j959626j990711
39322D830628j885479j665714j409256j143050q19172m15397k5835J98565K01204
39313b133506O9519p5121j88433k80343l36388l20946k34328j08534M5100K31136
$$ plain form
39370 31970973 33824910 35847351 38215334 40907605 43690611 46273376 48495813 50411033
39362 50411033 52225446 54170849 56425820 59138240 62474058 66580308 71472414 76978523
39354 76978523 82811955 88678502 94293418 99313829 103290662 105708672 106108416 104242116
39346 104242116 100179198 94278263 87047927 79029527 70772597 62812664 55565715 49229220
39338 49229220 43819438 39283251 35515845 32294518 29314219 26370410 23483884 20805626
39330 20805626 18423758 16297159 14336883 12476109 10651151 8780965 6821339 4830628
39322 4830628 2945149 1279435 -129821 -1272871 -2092043 -2507440 -2533275 -2334710 -2133506
39313 -2133506 -2063987 -2139108 -2327541 -2607884 -2944272 -3265218 -3499546 -3608080 -3562980 -3331844
39303c331844M16740N38426N69489N31602M31892K46490q831k45140l79302m15169
39293a645647m13938m17173m34706m70909n07785m82781l45933j41556J9419Q1773
39283d759236J00158J57381K67219L77045M28913L87612K38153J83k57244m44755
39273c504571n04319m27941k44050r492J98042L17106L44663L27653L11778L11603
39263b879528L21119L25092L02544K55496K41942L37478N35646P17835P60457
39254I18081O58104N12743M23626M26080N10773O29993O75378N27783J90915j53468
39244E320008k82562j33047J55673L84558M47486L53963J63538n8536k42010l23320
39234E785751k85778j73849m0959J20110L74675P64261J243562J713700K102633
$$ plain form
39303 -3331844 -2915104 -2376678 -1807189 -1275587 -843695 -597205 -606036 -851176 -1230478 -1645647
39293 -1645647 -2059585 -2476758 -2911464 -3382373 -3890158 -4372939 -4718872 -4860428 -4841009 -4759236
39283 -4759236 -4659078 -4501697 -4234478 -3857433 -3428520 -3040908 -2802755 -2802572 -3059816 -3504571
39273 -3504571 -4008890 -4436831 -4680881 -4690373 -4492331 -4175225 -3830562 -3502909 -3191131 -2879528
39263 -2879528 -2558409 -2233317 -1930773 -1675277 -1433335 -1095857 -560211 157624 918081
39254 918081 1576185 2088928 2512554 2938634 3449407 4079400 4754778 5282561 5473476 5320008
39244 5320008 5037446 4904399 5060072 5444630 5892116 6246079 6409617 6351081 6109071 5785751
39234 5785751 5499973 5326124 5285165 5405275 5779950 6544211 7787773 9501473 11604106
39225A1604106K390721K570362K613146K475874K108921J462418N35069n52740
39217B5207877j564887k274336k597649k611891k458066k229693j922797j474388
39209H074170q74000k55657J53206K10319k7594l89590p54783j090510j364203
39200C681358j503884j471114j317788j127649r21682o51415k78403J57880N47932
39191b884765P80740Q15705P05400N58702M82215N36614P09146R09435J021123
39182C634315R91221Q59974O89301M96027K88979J27304O7133N9361k2525k32823
39172F958267m84636o41872o25414m23258p6658L05501N90065P32720P94136P96720
39162G925571O42299K63675j94814m69260m52003k82668j55263j27344j43415
$$ plain form
39225 11604106 13994827 16565189 19178335 21654209 23763130 25225548 25760617 25207877
39217 25207877 23642990 21368654 18771005 16159114 13701048 11471355 9548558 8074170
39209 8074170 7200170 6944513 7097719 7308038 7280444 6890854 6136071 5045561 3681358
39200 3681358 2177474 706360 -611428 -1739077 -2660759 -3312174 -3590577 -3432697 -2884765
39191 -2884765 -2104025 -1288320 -582920 -24218 457997 994611 1703757 2613192 3634315
39182 3634315 4625536 5485510 6174811 6670838 6959817 7087121 7154254 7213615 7191090 6958267
39172 6958267 6473631 5831759 5206345 4783087 4706429 5011930 5601995 6334715 7128851 7925571
39162 7925571 8567870 8831545 8636731 8167471 7715468 7432800 7277537 7150193 7006778
39153G006778j48947j21658o1376k1135j01653l39337o21427p75541p30630n39996
39143C545078k78904n711J83225J73971k6206k36227k67748j24653K3998N6427
39133C043250K0787M5189J90014M09593O00588O48404M76795J20945k56171m75265
39123D824129m82399l54387j71119P2586M15819Q31561J207450J418311J413214
39114I175165J249509J047898Q99318Q16818P93055Q77639J135951J522220J857429
39105A9375002J969862J812592J409332P49627j79792j279563k333997l138362
39097A8384701l589074l663572l393450k891570k343170j899763j576995j282426
39089b255319r46956o19565m31138m60015o27465p41056o62904m26762j72232
$$ plain form
39153 7006778 6857831 6736173 6674797 6653662 6552009 6212672 5591245 4815704 4085074 3545078
39143 3545078 3266174 3260463 3443688 3617659 3591453 3355226 3087478 2962825 2986823 3043250
39133 3043250 3064037 3109226 3299240 3708833 4309421 4957825 5434620 5555565 5299394 4824129
39123 4824129 4341730 3987343 3816224 3888810 4304629 5136190 6343640 7761951 9175165
39114 9175165 10424674 11472572 12371890 13188708 13981763 14859402 15995353 17517573 19375002
39105 19375002 21344864 23157456 24566788 25316415 25136623 23857060 21523063 18384701
39097 18384701 14795627 11132055 7738605 4847035 2503865 604102 -972893 -2255319
39089 -2255319 -3202275 -3821840 -4252978 -4712993 -5340458 -6081514 -6744418 -7171180 -7343412
39080g343412J1424J35189K24595K49678J56848p0743l92537p06324q64835p70331
39070i370448m91401k31801j35208j55915j56508p9859L3653J51960K87903M38209
39060i709415N58725O10941N83840M71240K84599R3764n664J1922Q1821J35743
39050f882484J58159J43201O5762n5622j20406m3278J24759K35170K09665J26227
39040f038847J26541K72897N13119P54026R32509J021239J009617R18267Q24375
39031C33743Q19374R00838R33910P85388N08867L37588M46713P45735R43648Q07638
39021G563442L36621k84966q47491j235959j452370j557848j586902j513160j301456
39012a880089r72144n90066k16473Q2924K07805Q6906k01096m39768m65192l13952
$$ plain form
39080 -7343412 -7331988 -7196799 -6972204 -6722526 -6565678 -6636421 -7028958 -7735282 -8600117 -9370448
39070 -9370448 -9861849 -10093650 -10228858 -10384773 -10541281 -10621140 -10587487 -10435527 -10147624 -9709415
39060 -9709415 -9150690 -8539749 -7955909 -7484669 -7200070 -7106306 -7111970 -7100048 -7018227 -6882484
39050 -6882484 -6724325 -6581124 -6515362 -6570984 -6691390 -6734668 -6609909 -6374739 -6165074 -6038847
39040 -6038847 -5912306 -5639409 -5126290 -4372264 -3439755 -2418516 -1408899 -490632 333743
39031 333743 1153117 2053955 2987865 3773253 4282120 4619708 5066421 5812156 6755804 7563442
39021 7563442 7900063 7615097 6767606 5531647 4079277 2521429 934527 -578633 -1880089
39012 -1880089 -2852233 -3442299 -3658772 -3575848 -3368043 -3281137 -3482233 -3922001 -4387193 -4701145
39002d701145j43364m4397J2346P8148J49743J91302J70846O8260r3278k11479
38992d523018j69846K0746J96864K10727Q9850k1721m8714m1382n6591o1479J1306
38981d393258J59925L05388L67190L20684J96544N0500p1165j53980k07560k41598
38971c667330k62962k85113l04594k68936j21371R7525K46258K29481J08020J641
38961d227381p9188k12012l81142m30021k43115J04451M37848O54094P31886O44113
38951c000467L85690P4001j04550q6997J1672O8268Q4356R9190P2283m1509j61929
38940b599992j62306p3182p9985k75796n14259n76377m21680k05108q6498r2918
38930e088101j43918j40649l3051J40748K73008K87741K25065J80725J66287R0892
$$ plain form
39002 -4701145 -4844509 -4888906 -4876560 -4798412 -4648669 -4457367 -4286521 -4218261 -4311539 -4523018
38992 -4523018 -4692864 -4672118 -4475254 -4264527 -4174677 -4196398 -4245112 -4286494 -4343085 -4404564 -4393258
38981 -4393258 -4233333 -3927945 -3560755 -3240071 -3043527 -2993027 -3064192 -3218172 -3425732 -3667330
38971 -3667330 -3930292 -4215405 -4519999 -4788935 -4910306 -4812781 -4566523 -4337042 -4229022 -4227381
38961 -4227381 -4306569 -4518581 -4899723 -5329744 -5572859 -5468408 -5030560 -4376466 -3644580 -3000467
38951 -3000467 -2614777 -2540776 -2645326 -2732323 -2720651 -2652383 -2568027 -2468837 -2396554 -2438063 -2599992
38940 -2599992 -2762298 -2835480 -2915465 -3191261 -3705520 -4281897 -4703577 -4908685 -4995183 -5088101
38930 -5088101 -5232019 -5372668 -5405719 -5264971 -4991963 -4704222 -4479157 -4298432 -4132145 -4041253
38920d041253j04076l55926n59274o78587p36224p36140o64536n41288m01548
38911h818852k31602Q779K86116M78538N00504M06675L32127L45127L87656L50891
38901e954041J86931m3541k11920k17420o8334J24536K42507K46739J75080P7092
38891e442371k2021j01287j21739m7897J04089K43706K47257N3195k60996n07307
38881e855371n19922k78023Q9923M06250N51652N16664L92263L08484L47629M97013
38871c543438O80762Q20324Q55255P44788N04247K34089N3464j8841q0002k18005
38861C2643m05854n49083o08645o37605p06501q22244r19923r23527q25192p03488
38851g069419o26241n25863k38059K74582P82678R66273P39145L35481P2717R4606
$$ plain form
38920 -4041253 -4145329 -4501255 -5060529 -5739116 -6475340 -7211480 -7876016 -8417304 -8818852
38911 -8818852 -9050454 -9041675 -8755559 -8277021 -7776517 -7369842 -7037715 -6692588 -6304932 -5954041
38901 -5954041 -5767110 -5810651 -6022571 -6239991 -6308325 -6183789 -5941282 -5694543 -5519463 -5442371
38891 -5442371 -5464392 -5565679 -5687418 -5735315 -5631226 -5387520 -5140263 -5087068 -5348064 -5855371
38881 -5855371 -6375293 -6653316 -6563393 -6157143 -5605491 -5088827 -4696564 -4388080 -4040451 -3543438
38871 -3543438 -2862676 -2042352 -1187097 -442309 61938 296027 349491 330650 250648 32643
38861 32643 -373211 -922294 -1530939 -2168544 -2875045 -3697289 -4617212 -5540739 -6365931 -7069419
38851 -7069419 -7695660 -8221523 -8459582 -8185000 -7402322 -6436049 -5696904 -5361423 -5288706 -5194100
38841e194100L40905O52795Q45780P79164M77526J56922J8488N801j33957n08881
38831b559557q87169r20152n27993N835L19959K98413J01735o0783j29609j74701
38821d534022k43868k93162k68823j99911j59745j55164j13318R020J50210K03480
38811e605303J16364r2312l62217n80560n83034k70405K43900O74650Q13498P11100
38801d934319N74638N22081M98600M17103K99948K47542L08914M20485M57299
38792a187709L28221M6226k66710m58104m59517l32620k02798j59667k19218l42368
38782c254264m57694m89459m09149k65583j41536q0043o6477o5778m7412J4201
38772e263194J25814K62211L96283N31371O63350P26610O48747M73551L55300
$$ plain form
38841 -5194100 -4853195 -4200400 -3354620 -2575456 -2097930 -1941008 -1922520 -1916719 -2050676 -2559557
38831 -2559557 -3446726 -4366878 -4894871 -4889036 -4569077 -4270664 -4168929 -4229712 -4359321 -4534022
38821 -4534022 -4777890 -5071052 -5339875 -5539786 -5699531 -5854695 -5968013 -5958993 -5808783 -5605303
38811 -5605303 -5488939 -5581251 -5943468 -6524028 -7107062 -7377467 -7133567 -6458917 -5645419 -4934319
38801 -4934319 -4359681 -3837600 -3339000 -2921897 -2621949 -2374407 -2065493 -1645008 -1187709
38792 -1187709 -859488 -813262 -1079972 -1538076 -1997593 -2330213 -2533011 -2692678 -2911896 -3254264
38782 -3254264 -3711958 -4201417 -4610566 -4876149 -5017685 -5097728 -5164205 -5229983 -5277395 -5263194
38772 -5263194 -5137380 -4875169 -4478886 -3947515 -3284165 -2557555 -1908808 -1435257 -1079957
38763a079957L84793M75811M79093L63073K13265Q5679n1793k30225m10864n32771
38753c03896n75727n48851m62838l46061k51009k04972j73532j05756n546O4812
38743b913376M4776p0483k14407k72418j54683J10990L64930M30544K54869p1657
38733b490915m13200o70680p81254p04479m55157j26290J68249L80199N30099
38724d563428O24662O13631M59526K23374K9704n9843r6446j52207k25465k79575
38714c426067l37205m57525o09475o41261m33058n6390K66462L62577K46361P3733
38704e011848k855O2494K00469K87495K36874P1081q3638r5248N7048K58811L63246
38693c656071L23283K14608J28644O6876l5837j98960l47495l84112k77800o5926
$$ plain form
38763 -1079957 -695164 -219353 259740 622813 836078 921757 869964 639739 228875 -303896
38753 -303896 -879623 -1428474 -1891312 -2237373 -2488382 -2693354 -2866886 -2972642 -2978188 -2913376
38743 -2913376 -2868600 -2939083 -3153490 -3425908 -3580591 -3469601 -3104671 -2674127 -2419258 -2490915
38733 -2490915 -2904115 -3574795 -4356049 -5060528 -5515685 -5641975 -5473726 -5093527 -4563428
38724 -4563428 -3938766 -3325135 -2865609 -2642235 -2612531 -2672374 -2768820 -2921027 -3146492 -3426067
38714 -3426067 -3763272 -4220797 -4830272 -5471533 -5904591 -5960981 -5694519 -5331942 -5085581 -5011848
38704 -5011848 -5014703 -4952209 -4751740 -4464245 -4227371 -4156290 -4239928 -4335176 -4278128 -4019317 -3656071
38693 -3656071 -3332788 -3118180 -2989536 -2922660 -2958497 -3157457 -3504952 -3889064 -4166864 -4232790
38683d232790J94684M40314N86218N57920L59145Q3780j59328l23212m19940m67346
38673c380555m65061m13610l27021k21307j16870o6317j48058l84720o63644p83784
38663f970947o18445k22928K32661O09112Q47615R16571P96819N42798K87328
38654c579416J22858K695j89183m83751p88485r91908j052165r79398p94086n39103
38644i271942k92820j21255k5238L7706R2856J38693J82028K38917K97417L19234
38634h404404K92693K50645K16990J69805Q7894L412l5880l6773m0378m2036K021
38623g536011P6679Q9825n541j30172j81133j74706k14853l40250m76854n35386
38613i428402m80292k99273P324L71884O69949Q43901R70541J147533J338377
$$ plain form
38683 -4232790 -4038106 -3597792 -3011574 -2453654 -2094509 -2010729 -2170057 -2493269 -2913209 -3380555
38673 -3380555 -3845616 -4259226 -4586247 -4807554 -4924424 -4990741 -5138799 -5523519 -6187163 -6970947
38663 -6970947 -7589392 -7812320 -7579659 -6970547 -6122932 -5206361 -4409542 -3866744 -3579416
38654 -3579416 -3456558 -3453863 -3643046 -4126797 -4915282 -5907190 -6959355 -7938753 -8732839 -9271942
38644 -9271942 -9564762 -9686017 -9711255 -9673549 -9580693 -9442000 -9259972 -9021055 -8723638 -8404404
38634 -8404404 -8111711 -7861066 -7644076 -7474271 -7386377 -7382965 -7418845 -7455618 -7495996 -7538032 -7536011
38623 -7536011 -7459332 -7369507 -7375048 -7505220 -7686353 -7861059 -8075912 -8416162 -8893016 -9428402
38613 -9428402 -9908694 -10207967 -10200643 -9828759 -9158810 -8314909 -7344368 -6196835 -4858458
38604d858458J380461J138682O28885J6680m80434p27498p52808o80390n72400
38595d907280l91082j38580O2402J20714J41395K99944N61740O68561M49840L5062
38585c097284l10877m71161n08615m89761m04679k53868j03163r473M7669J19390
38575e481822K11382K96211L78014M95137O50313P71906P68911O13689L52192
38566i44067M4892k69624n51666p47282q32896q49606q53431q41235p63405o05430
38556g213750m18751k68488j82148j43895r5416N3279L46754O87889Q74093P81850
38546e578583M92223J99569K8345j8400K6151J39175K59784K76987J28625j12865
38536d158989l04789l80156l85943l70752k92348r0396J73214L25051K64740R2098
$$ plain form
38604 -4858458 -3477997 -2339315 -1710430 -1693750 -2174184 -2901682 -3654490 -4334880 -4907280
38595 -4907280 -5298362 -5436942 -5374540 -5253826 -5112431 -4812487 -4250747 -3582186 -3132346 -3097284
38585 -3097284 -3408161 -3879322 -4387937 -4877698 -5282377 -5536245 -5639408 -5648881 -5601212 -5481822
38575 -5481822 -5270440 -4974229 -4596215 -4101078 -3450765 -2678859 -1909948 -1296259 -944067
38566 -944067 -899175 -1168799 -1720465 -2467747 -3300643 -4150249 -5003680 -5844915 -6608320 -7213750
38556 -7213750 -7632501 -7900989 -8083137 -8227032 -8322448 -8269169 -7922415 -7234526 -6360433 -5578583
38546 -5578583 -5086360 -4886791 -4858446 -4876846 -4850695 -4711520 -4451736 -4174749 -4046124 -4158989
38536 -4158989 -4463778 -4843934 -5229877 -5600629 -5892977 -5983373 -5810159 -5485108 -5220368 -5128270
38526e128270M547R5167K95315M83975N84019N61783M18876K19156O5560O330
38516b393542n284l5358r4539j63201k38490l10380l32764k76972j90898j47777
38506d189205j45574j08037J5211J90947L44172M21426M14339L57109L04960K85593
38496b109059K67461J97211O4044r7379k59616m25459n97519p51361q43576q34649
38486e389902p16725n36611l68360k33693p7880J28698K92912K80111J01875m9898
38476f569473L350K38897M70080N37324M29500K45850Q5404k2420j02745j68138
38466d852371j81859j04213L7283J60411K16017K29008K41199K48387K13453J14074
38456c678611l9442k03188k96146k32450N218L35554O41063Q43213R05657Q07638
$$ plain form
38526 -5128270 -5123723 -5028556 -4733241 -4249266 -3665247 -3103464 -2684588 -2465432 -2399872 -2393542
38516 -2393542 -2398826 -2434184 -2528723 -2691924 -2930414 -3240794 -3573558 -3850530 -4041428 -4189205
38506 -4189205 -4334779 -4442816 -4427605 -4236658 -3892486 -3471060 -3056721 -2699612 -2394652 -2109059
38496 -2109059 -1841598 -1644387 -1580343 -1677722 -1937338 -2362797 -2960316 -3711677 -4555253 -5389902
38486 -5389902 -6106627 -6643238 -7011598 -7245291 -7323171 -7194473 -6901561 -6621450 -6519575 -6569473
38476 -6569473 -6566123 -6327226 -5857146 -5319822 -4890322 -4644472 -4559068 -4581488 -4684233 -4852371
38466 -4852371 -5034230 -5138443 -5101160 -4940749 -4724732 -4495724 -4254525 -4006138 -3792685 -3678611
38456 -3678611 -3718053 -3921241 -4217387 -4449837 -4444619 -4109065 -3468002 -2624789 -1719132 -911494
38446i11494N61462K37308p8206l50179n92814q06047r50092r83724q97739p11633
38436e483158m72671k65391j81987k48797l87084m66617m09450k48919r0493n059
38426h259626M5667J62758L77868N91559O70627N83777L98916J69188j02758l73392
38416e735416n15439m34962j95713L8565J70164K17149K15129J56171N0928k6939
38406f060363k2871J1356k0548j24827k06532j94632j24290q3640j26787k52412
38396g205546m12736n12578m52410k27868L7924K07334K53989K39362K05435J61565
38386g705529J50484K25491L46843M00259L65577L76516N34583P35246P88008
38377c782522O75816N74298O04070O78146O42426M75250K74422J11315r474p3278
$$ plain form
38446 -911494 -350032 -112724 -190930 -541109 -1133923 -1939970 -2890062 -3873786 -4771525 -5483158
38436 -5483158 -5955829 -6221220 -6403207 -6652004 -7039088 -7505705 -7915155 -8164074 -8254567 -8259626
38426 -8259626 -8213959 -8051201 -7673333 -7081774 -6411147 -5827370 -5428454 -5259266 -5362024 -5735416
38416 -5735416 -6250855 -6685817 -6881530 -6842965 -6672801 -6455652 -6240523 -6084352 -6033424 -6060363
38406 -6060363 -6083234 -6071878 -6092426 -6217253 -6423785 -6618417 -6742707 -6826347 -6953134 -7205546
38396 -7205546 -7618282 -8130860 -8583270 -8811138 -8773214 -8565880 -8311891 -8072529 -7867094 -7705529
38386 -7705529 -7555045 -7329554 -6982711 -6582452 -6216875 -5840359 -5305776 -4570530 -3782522
38377 -3782522 -3106706 -2532408 -1928338 -1250192 -607766 -132516 141906 253221 243747 170469
38367A70469l5337J04185K70436L89862M55618M89933M76242L71396J80175j5649
38357B857330j20483j14030o7534o3272j01933j07125k7514Q7295J29217L0783
38347B502734j95161m81249p28017q27273p35862n39972l88336l35435k94642
38338b023213j66600L8162K30333L31714K89879P5189k53305n25184o02370n31294
38328c136689m60446m22328l16274j24819j1653j23996l88047n92772o15282m75759
38318f668065k32703N3048K71138L08756J77781Q727j10183k04971k92646k83094
38308f972212r2306J94628L72361L31890J62503K4417k2029k6383k7850J6870
38298f038111J73393M24350O48657P12207N80752L48948J59719Q5118P5737K9283
$$ plain form
38367 170469 135132 239317 509753 899615 1355233 1845166 2321408 2692804 2872979 2857330
38357 2857330 2736847 2622817 2555283 2492011 2390078 2282953 2255439 2342734 2471951 2502734
38347 2502734 2307573 1826324 1098307 271034 -464828 -1004800 -1393136 -1728571 -2023213
38338 -2023213 -2189813 -2151651 -1921318 -1589604 -1299725 -1224536 -1477841 -2003025 -2605395 -3136689
38328 -3136689 -3597135 -4019463 -4335737 -4460556 -4472209 -4596205 -4984252 -5577024 -6192306 -6668065
38318 -6668065 -6900768 -6847720 -6576582 -6267826 -6090045 -6081318 -6191501 -6396472 -6689118 -6972212
38308 -6972212 -7064518 -6869890 -6497529 -6165639 -6003136 -5978719 -6000748 -6027131 -6054981 -6038111
38298 -6038111 -5864718 -5440368 -4791711 -4079504 -3498752 -3149804 -2990085 -2904967 -2829230 -2799947
38288b799947q6154j86762j62380K3J97974K98805K12056r0667n39890r26429
38278d083371r85807o19560j9863M87166P17026P10128N86189M11192K13030L1424
38268b552446j04689k05652k85808l28785l12639k35784r6756J07626L31794M75446
38258c207693M80668M09425L73609M05589M51354M82461N49733P00966Q86427
38249A532539R82319Q97915O42624L01488l0073k87338m40384m85152m36353l18606
38239B358979j61284j0925N9718o356j75508l20618l34212k32846j15134l7073
38229A024741J9450O9992R2880Q3076P2630P5010P7829J21614L01669O19640Q95231
38218C453762R24571P13308M74262L94021M65954N55003N60943M95253M35551
$$ plain form
38288 -2799947 -2886101 -3072863 -3235243 -3235220 -3037246 -2738441 -2526385 -2617052 -3156942 -4083371
38278 -4083371 -5069178 -5688738 -5708601 -5221435 -4504409 -3794281 -3208092 -2796900 -2583870 -2552446
38268 -2552446 -2657135 -2862787 -3148595 -3477380 -3790019 -4025803 -4122559 -4014933 -3683139 -3207693
38258 -3207693 -2727025 -2317600 -1943991 -1538402 -1087048 -604587 -54854 646112 1532539
38249 1532539 2514858 3412773 4055397 4356885 4326812 4039474 3599090 3113938 2677585 2358979
38239 2358979 2197695 2186770 2246488 2240132 2064624 1744006 1409794 1176948 1061814 1024741
38229 1024741 1044191 1114183 1207063 1290139 1362769 1437779 1515608 1637222 1938891 2558531 3453762
38218 3453762 4378333 5091641 5565903 5959924 6425878 6980881 7541824 8037077 8472628
38209H472628M16534L43131L2916n96428j379392j998725k247239k161811j908601
38200a026987j602839j259099q55299m05664k751K02418J23193j27017k86007
38191e240052j92766M6362J94646J56541N0297L1101J18416K12897K27128J68636
38181d226794J21251J67156L15345M97054O33891O95133O73548N42575K99629
38172b81212M5871n7066M3628K08146K40826R2781j11958k32718k41279j96909
38162d89890j53425j25621j17365j39888j97547k70369l14460k83173j65711j2281
38152b269730R8914J33453J19677Q1839q637j69583l21466l40730k17994r3591
38142b987848q5979j36128r5803N3009J55801Q2167j11316k66717l23017l55807
$$ plain form
38209 8472628 8889162 9232293 9265209 8668781 7289389 5290664 3043425 881614 -1026987
38200 -1026987 -2629826 -3888925 -4744224 -5149888 -5152639 -4950221 -4827028 -4954045 -5240052
38191 -5240052 -5432818 -5386456 -5191810 -5035269 -4984972 -4953871 -4835455 -4622558 -4395430 -4226794
38181 -4226794 -4105543 -3938387 -3623042 -3125988 -2492097 -1796964 -1123416 -580841 -281212
38172 -281212 -235341 -292407 -248779 -40633 200193 292974 181016 -51702 -292981 -489890
38162 -489890 -643315 -768936 -886301 -1026189 -1223736 -1494105 -1808565 -2091738 -2257449 -2269730
38152 -2269730 -2170816 -2037363 -1917686 -1835847 -1844484 -2014067 -2335533 -2676263 -2894257 -2987848
38142 -2987848 -3073827 -3209955 -3305758 -3252749 -3096948 -3014781 -3126097 -3392814 -3715831 -4071638
38132d071638m32643n07222m90188l73857k30816j05343L0733J91375K91350K01553
38122e496696j09502n20715q49580r77510q96089o83184m58602l17004k50451
38113a0559333j49591P6002L87138O64255Q52457R96455J126889J186959J116753
38104d302016R59153Q22253P60762P47215P40763P21995O61357N17902K93823
38095A923207M6522j78603l90692o01861p68806q26412p61607o18224m44888k80566
38085b901930j83976k20057l85872n74119o42046n21175k59965K3288K19291K83832
38075e162729K53143K16867K57209L84591N15654N27363L70040J46599M8251J64201
38065b278811L60267L97878J89496j09247k84617k90396k43468k43295k77749
$$ plain form
38132 -4071638 -4504281 -5011503 -5501691 -5875548 -6106364 -6211707 -6180974 -5989599 -5698249 -5496696
38122 -5496696 -5606198 -6126913 -6976493 -7954003 -8850092 -9533276 -9991878 -10308882 -10559333
38113 -10559333 -10708924 -10632922 -10245784 -9581529 -8729072 -7732617 -6605728 -5418769 -4302016
38104 -4302016 -3342863 -2520610 -1759848 -1012633 -271870 450125 1111482 1629384 1923207
38095 1923207 1969729 1791126 1400434 798573 29767 -796645 -1558252 -2176476 -2621364 -2901930
38085 -2901930 -3085906 -3305963 -3691835 -4265954 -4908000 -5429175 -5689140 -5665852 -5446561 -5162729
38075 -5162729 -4909586 -4692719 -4435510 -4050919 -3535265 -3007902 -2637862 -2491263 -2443012 -2278811
38065 -2278811 -1918544 -1520666 -1331170 -1440417 -1725034 -2015430 -2258898 -2502193 -2779942
38056b779942k98892l03960l07581k94603k46690j77518r7948K2598K08835M08246
38046c867455N17201M82480L44638J81952M5669m5775q4992p0174j1933N8143
38036b450246Q0017j1081k11577m00478m14991k09770P7782K43381J85412m2722
38026c154273l04578m69828m72678l54963k58363l10033m76590n64117m05966
38017f771389m2393L13367M77829M40816L24973K51072K53268K83528K67241J75784
38007d025904P4554Q4612K61375N12300O66737O37291M91073L54771K75132J92081
37997d75978L2567j97799m21782n74476o66315p55095q58130r12373q42984o62708
37987f335073m71295l47889k71969j67217k50J84159L03031K85282J09061j64125
$$ plain form
38056 -2779942 -3078834 -3382794 -3690375 -3984978 -4231668 -4409186 -4507134 -4484536 -4275701 -3867455
38046 -3867455 -3350254 -2867774 -2523136 -2341184 -2295515 -2341290 -2426282 -2496456 -2508389 -2450246
38036 -2450246 -2370229 -2381310 -2592887 -2993365 -3408356 -3618126 -3540344 -3296963 -3111551 -3154273
38026 -3154273 -3458851 -3928679 -4401357 -4756320 -5014683 -5324716 -5801306 -6365423 -6771389
38017 -6771389 -6813782 -6500415 -6022586 -5581770 -5256797 -5005725 -4752457 -4468929 -4201688 -4025904
38007 -4025904 -3951350 -3866738 -3605363 -3093063 -2426326 -1789035 -1297962 -943191 -668059 -475978
37997 -475978 -443411 -641210 -1062992 -1637468 -2303783 -3058878 -3917008 -4829381 -5672365 -6335073
37987 -6335073 -6806368 -7154257 -7426226 -7593443 -7593693 -7409534 -7106503 -6821221 -6712160 -6876285
37977f876285l97994m71638l76342j97068k155J98884L78482M48572L65687K45504
37967f684353K85204N51109Q93666J088284J014611O90645K11600k82380o29438
37958b861052p25238n84132k82229J28339N80836R08179R25067O33912K46007
37949a030311o5366l43833o98825j060600j220360j090377p94546m88052k07579
37940f999849N6201K47568K96290K27159J40237J00406R8143J02605J09067J45376
37930e476797K64014N08197Q43350J127637J190140R59638N22908O8623k35311
37921b27601l51677l84752m57402n65972n93227m78237l16771k47589k78968k84531
37911d186727j52286J08857L91697N69974N71494M31460K76983K11713K04549
$$ plain form
37977 -6876285 -7274279 -7745917 -8122259 -8319327 -8321482 -8122598 -7744116 -7295544 -6929857 -6684353
37967 -6684353 -6399149 -5848040 -4954374 -3866090 -2851479 -2160834 -1949234 -2231614 -2861052
37958 -2861052 -3586290 -4170422 -4452651 -4324312 -3743476 -2835297 -1910230 -1276318 -1030311
37949 -1030311 -1095677 -1439510 -2138335 -3198935 -4419295 -5509672 -6304218 -6792270 -6999849
37940 -6999849 -6943648 -6696080 -6399790 -6172631 -6032394 -5931988 -5833845 -5731240 -5622173 -5476797
37930 -5476797 -5212783 -4704586 -3861236 -2733599 -1543459 -583821 -60913 7710 -227601
37921 -227601 -579278 -964030 -1421432 -1987404 -2580631 -3058868 -3375639 -3623228 -3902196 -4186727
37911 -4186727 -4339013 -4230156 -3838459 -3268485 -2696991 -2265531 -1988548 -1776835 -1572286
37902a572286J23728j16305m70511q17221j052653j125704j022740p48760l19026
37893g121478K29651Q05130J251051J414513J249966Q57216M19474J02774j9301
37884h11004P591N4296J038j75340l93478n37759n41233m27084k89498k21165
37874c333636k40480k92320l18848l07867k72609k24058j78263j48704j08567
37865e425352p312J41197K35562K00706Q6160m79k0778j1103k616o404m3685j04941
37853d959045r7354P1499L48640N56812N81825M73144L40859K20837P5677j18443
37843b505549l18619m27493l59757j34598J03311K02155J42964K7925m2710k3221
37833c335592J08110L26592N07716N04503L13973Q9535l6910o7930n9124k4194
$$ plain form
37902 -1572286 -1448558 -1564863 -2035374 -2852595 -3905248 -5030952 -6053692 -6802452 -7121478
37893 -7121478 -6891827 -6086697 -4835646 -3421133 -2171167 -1313951 -894477 -791703 -811004
37884 -811004 -803413 -749117 -748079 -923419 -1316897 -1854656 -2395889 -2822973 -3112471 -3333636
37874 -3333636 -3574116 -3866436 -4185284 -4493151 -4765760 -4989818 -5168081 -5316785 -5425352
37865 -5425352 -5432664 -5291467 -5055905 -4855199 -4769039 -4769518 -4790296 -4801399 -4804015 -4810419 -4854104 -4959045
37853 -4959045 -5056399 -4984900 -4636260 -4079448 -3497623 -3024479 -2683620 -2462783 -2387106 -2505549
37843 -2505549 -2824168 -3251661 -3611418 -3746016 -3642705 -3440550 -3297586 -3269661 -3312371 -3335592
37833 -3335592 -3227482 -2900890 -2393174 -1888671 -1574698 -1485163 -1522073 -1590003 -1649127 -1673321
37823a673321L1625O6286M5822k3000j36704k99272m51702m86589l81488k32465
37813c540808j05694M4122K36930L52750K57610k9096l87448p32944r80824r61813
37803e847215n60776N4193M95838N09424J82502k11918m85128o09140o16949n15973
37793g605142k99157j0509K18539K33088p250l63367o15643o19324l68316K2250
37783i414831L53964M48625L13832J70471K23658M28043N62003M99273L00102
37774f114860N8172k02885m52308n97460n76928m38298k71258j20383l439M8174
37764h671473K6175j2651R224J12097K37794K89148K05069M4275j8591J42868
37754g636065M32775O02287N30238L67629L51164N23381O96016O63000L99234
$$ plain form
37823 -1673321 -1641696 -1575410 -1529588 -1552588 -1689292 -1988564 -2440266 -2926855 -3308343 -3540808
37813 -3540808 -3646502 -3602380 -3365450 -3012700 -2755090 -2784186 -3171634 -3904578 -4885402 -5847215
37803 -5847215 -6407991 -6353798 -5857960 -5348536 -5166034 -5377952 -5863080 -6472220 -7089169 -7605142
37793 -7605142 -7904299 -7914808 -7696269 -7463181 -7470431 -7833798 -8449441 -9068765 -9437081 -9414831
37783 -9414831 -9060867 -8612242 -8298410 -8127939 -7904281 -7476238 -6914235 -6414962 -6114860
37774 -6114860 -6056688 -6259573 -6711881 -7309341 -7886269 -8324567 -8595825 -8716208 -8719647 -8671473
37764 -8671473 -8645298 -8657949 -8648725 -8536628 -8298834 -8009686 -7804617 -7760342 -7778933 -7636065
37754 -7636065 -7203290 -6601003 -6070765 -5703136 -5351972 -4828591 -4132575 -3469575 -3070341
37745c070341O2964j54902j79179p3460O0879J78830K71566L00577K19596N2785
37735b330685j12411k10408k19154j14254J07818L54265M88253M96088N08378
37726a032110O00519O64691N60813L18872Q9471o0074j91255l53219n04296n94850
37716e01438o44919o96214p35270p09329o02332m63888l59314l02557k51046j75592
37706e441899j22730j76486l50324n44732o30144n60948m06270k86154k67340
37697h787027k87797j93736R8364M77039P29884P65276O71767N50366L88635J54187
37687e433042p8842j88893j45308n933J86931M23067O52647P75170P09376M44708
37677b660119N6791k84635l81818j77820J54079L65408L66183K42019Q0829j04941
$$ plain form
37745 -3070341 -3007377 -3162279 -3341458 -3414918 -3354039 -3175209 -2903643 -2603066 -2383470 -2330685
37735 -2330685 -2443096 -2653504 -2872658 -2986912 -2879094 -2524829 -2036576 -1540488 -1032110
37726 -1032110 -431591 233100 793913 1112785 1202256 1142182 950927 597708 93412 -501438
37716 -501438 -1146357 -1842571 -2577841 -3287170 -3889502 -4353390 -4712704 -5015261 -5266307 -5441899
37706 -5441899 -5564629 -5741115 -6091439 -6636171 -7266315 -7827263 -8233533 -8519687 -8787027
37697 -8787027 -9074824 -9268560 -9170196 -8693157 -7963273 -7197997 -6526230 -5975864 -5587229 -5433042
37687 -5433042 -5511884 -5700777 -5846085 -5852018 -5665087 -5242020 -4589373 -3814203 -3104827 -2660119
37677 -2660119 -2603328 -2887963 -3269781 -3447601 -3293522 -2928114 -2561931 -2319912 -2239083 -2344024
37667b344024k88412l85595l48913k23475p8951L2650K5302j99689n95159r10731
37657e316997r06893o05903k48506k0157R5557J98862L14526M03118M70002N84063
37647e032328P79489R77748J033739Q63225N25081J80335l3669j03717j35716
37638i45813k55020m93794p57145r01557q57097o71940m40431k15922j3198J40682
37628e411235K18128K52975L29076M73347N94241N64565L52071M2475k51941m75080
37618c311378o23746o96862o70087n20557k72683j4435J46157J58151P1361M176
37608e729903N8188K41110M53945N61641N00883L26567J45259J3578p5394j18565
37598c622691o8191J01721L24281M71990M56106K80266J9819k15426l10378j95309
$$ plain form
37667 -2344024 -2632436 -3018031 -3366944 -3590419 -3669370 -3636720 -3611418 -3811107 -4406266 -5316997
37657 -5316997 -6223890 -6829793 -7078299 -7098456 -7002899 -6804037 -6489511 -6086393 -5616391 -5032328
37647 -5032328 -4252839 -3275091 -2241352 -1378127 -853046 -672711 -706380 -810097 -945813
37638 -945813 -1200833 -1694627 -2451772 -3353329 -4210426 -4882366 -5322797 -5538719 -5551917 -5411235
37628 -5411235 -5193107 -4940132 -4611056 -4137709 -3543468 -2978903 -2626832 -2584357 -2836298 -3311378
37618 -3311378 -3935124 -4631986 -5302073 -5822630 -6095313 -6109748 -5963591 -5805440 -5734079 -5729903
37608 -5729903 -5671715 -5430605 -4976660 -4415019 -3914136 -3587569 -3442310 -3428732 -3504126 -3622691
37598 -3622691 -3690882 -3589161 -3264880 -2792890 -2336784 -2056518 -2036699 -2252125 -2562503 -2757812
37588b757812R2088M04529N76111N38991L65607K04380J61962K20642K57149J56876
37578B20523p1144k92187l67514k77049j19566r639M037o4089j67282k33212j86613
37567a563735k3244J44943J70875J7890k03787l58248m13198m34708m84425n46049
37557c693686n32131l45982K9465M67744P49707P33333M81938J98435M0093K7680
37547a843404J13795K67656M63544O36238P00863O13150L93006J08400j43086
37538A310162k65448k26263r4767J1445K9599j2189n7970q8911j09051j02355
37528C94252n3238o937n5307k30126m42236n69784n89857n71899n46874m50950
37518c122956k27370P2933L41628N25077O30611O51590N59802L72729J65732K350
$$ plain form
37588 -2757812 -2665724 -2261195 -1685084 -1146093 -780486 -576106 -414144 -193502 63647 220523
37578 220523 149379 -142808 -510322 -787371 -906937 -916576 -912539 -976628 -1143910 -1377122 -1563735
37567 -1563735 -1586979 -1442036 -1271161 -1253271 -1457058 -1815306 -2228504 -2663212 -3147637 -3693686
37557 -3693686 -4225817 -4571799 -4542334 -4074590 -3324883 -2591550 -2109612 -1911177 -1871084 -1843404
37547 -1843404 -1729609 -1461953 -998409 -362171 338692 951842 1344848 1453248 1310162
37538 1310162 1044714 818451 723684 735129 764728 752539 694569 605658 496607 394252
37528 394252 341014 334077 278770 48644 -393592 -963376 -1553233 -2125132 -2672006 -3122956
37518 -3122956 -3350326 -3277393 -2935765 -2410688 -1780077 -1128487 -568685 -195956 -30224 -27874
37508b7874j03919j57759j68993j80398k42822l36625l80564l53497l39454l97126
37498b689031m52401m06664l04451k78787l32316k88881j0968M11107P41925Q21962
37488b788505O63900L93030J68403J25132K93230N48211P02575O82808N89189
37479A377973N62517O22408O61935N74807L49605M6827k73163n75274q24180r73069
37469A550386r95721r13852p70204n80992l42418q4565J19286K17115K19017J46950
37459a434998j3262k50071m42396m28355j86620J14644K90463L11832K66891K10627
37449a561245J32461M5747J4694O7717J44599J64535J16411O2884Q1351K08048
37439e22798M01017N41033N10755L06631M8707j46551k77254m10595n55084o28231
$$ plain form
37508 -27874 -131793 -289552 -458545 -638943 -881765 -1218390 -1598954 -1952451 -2291905 -2689031
37498 -2689031 -3141432 -3548096 -3852547 -4131334 -4463650 -4752531 -4763499 -4352392 -3610467 -2788505
37488 -2788505 -2124605 -1731575 -1563172 -1438040 -1144810 -596599 105976 788784 1377973
37479 1377973 1940490 2562898 3224833 3799640 4149245 4196072 3922909 3347635 2523455 1550386
37469 1550386 554665 -359187 -1129391 -1710383 -2052801 -2137366 -2018080 -1800965 -1581948 -1434998
37459 -1434998 -1448260 -1698331 -2140727 -2569082 -2755702 -2641058 -2350595 -2038763 -1771872 -1561245
37449 -1561245 -1428784 -1383037 -1368343 -1300626 -1156027 -991492 -875081 -812197 -730846 -522798
37439 -522798 -121781 419252 930007 1236638 1285345 1138794 861540 450945 -104139 -732370
37429g32370n50540l31155m8318K24250M48668N98465O41815N74765M62500M08816
37419A696896M53225N12385M59901K63240P715k09143l48797l80436k32717J28901
37409B351170O00666R89313J172232J162833J015198P27255K77684k74944p78522
37400G242885j079101j116587r46608o97464n07482m71688o05981q35297j020518
37391c7841j032113q37726n33055k74412j58874j52816j30075J2823K64014N11112
37381b368963O50059O73095O40904N87194M89957L42533K11590J93333L25065
$$ plain form
37429 -732370 -1282910 -1614065 -1662383 -1438133 -989465 -391000 250815 825580 1288080 1696896
37419 1696896 2150121 2662506 3122407 3385647 3393362 3184219 2835422 2454986 2222269 2351170
37409 2351170 2951836 3941149 5113381 6276214 7291412 8018667 8296351 8021407 7242885
37400 7242885 6163784 5047197 4100589 3403125 2895643 2423955 1817974 982677 -37841
37391 -37841 -1069954 -1907680 -2440735 -2715147 -2874021 -3026837 -3156912 -3144089 -2880075 -2368963
37381 -2368963 -1718904 -1045809 -404905 182289 672246 1014779 1226369 1419702 1744767
$$ [...]
##END NTUPLES=NMR SPECTRUM
##END=
