##TITLE=31Pdec_DE-26k
 6MSO-d6
 24 sc
 8.2.2024
##JCAMPDX= 6.0         $$ Bruker NMR JCAMP-DX V2.0
##DATA TYPE= NMR SPECTRUM
##DATA CLASS= NTUPLES
##ORIGIN= UXNMR, Bruker Analytische Messtechnik GmbH
##OWNER= root
$$ XWIN-NMR		Version 3.5
$$ Thu Feb  8 16:18:58 2024 Russian Standard Time (UT+4h)  she@DPX200
##.OBSERVE FREQUENCY= 81.013821
##.OBSERVE NUCLEUS= ^31P
##.ACQUISITION MODE= SIMULTANEOUS
##.ACQUISITION SCHEME= undefined
##.AVERAGES= 64
##.DIGITISER RES= 16
##SPECTROMETER/DATA SYSTEM= spect
##.PULSE SEQUENCE= zgpg30
##.SOLVENT NAME= CDCl3
##.SHIFT REFERENCE= (INTERNAL, CDCl3, 0, 248.564)
##AUDIT TRAIL= $$ (NUMBER, WHEN, WHO, WHERE, WHAT)
$$ ##TITLE= Audit trail, XWIN-NMR		Version 3.5
$$ ##JCAMPDX= 5.01
$$ ##ORIGIN= Bruker BioSpin GmbH
$$ ##OWNER= she
$$ F:/spectra/data/she/nmr/P31/1/pdata/1/auditp.txt
$$ ##AUDIT TRAIL=  $$ (NUMBER, WHEN, WHO, WHERE, WHAT)
(   1,<2024-02-08 16:18:02.54 +0400>,<she>,<DPX200>,
      <created by zg, POWCHK disabled, PULCHK disabled
       configuration hash MD5:
       00 E9 B6 7A A2 85 ED C7 34 08 36 98 17 FE 4E 26
       data hash MD5: 32K
       F3 35 5E 4E 98 3E 3E D9 13 65 FC EE 59 BD BF DB>)
(   2,<2024-02-08 16:18:04.84 +0400>,<she>,<DPX200>,
      <Start of raw data processing
       efp BC_mod = 2 LB = 10 FT_mod = 6 PKNL = 1 PHC0 = -12748.7 PHC1 = -242.5164 SI = 64K 
       data hash MD5: 64K
       1C E0 EC 47 64 1C 56 B7 6F FA 93 7A CA A7 D7 11>)
(   3,<2024-02-08 16:18:31.84 +0400>,<she>,<DPX200>,
      <pk PHC0 = -115.6342 PHC1 = 252.7993 
       data hash MD5: 64K
       41 6B A3 F5 02 A0 76 F3 29 CF F3 59 03 F4 7E 5E>)
$$ ##END=
$$ 
$$ hash MD5
$$ D2 15 1A EC 2A C3 6D 02 79 F9 B3 39 9F D0 F6 63
##$RELAX= 
##$RELAX= 
##$RELAX= 
##$RELAX= 
##$RELAX= 
##$RELAX= 
##$RELAX= 
##$RELAX= 
##$RELAX= 
$$ Bruker specific parameters
$$ --------------------------
##$DU= <F:/spectra>
##$EXPNO= 1
##$NAME= <P31>
##$PROCNO= 1
##$TYPE= <nmr>
##$USER= <she>
##$AMP= (0..31)
100 100 100 100 100 100 100 100 100 100 100 100 100 100 100 100 100 100 
100 100 100 100 100 100 100 100 100 100 100 100 100 100 
##$AQSEQ= 0
##$AQ_mod= 1
##$AUNM= <au_zg>
##$AUTOPOS= <>
##$BF1= 81.014009
##$BF2= 200.13
##$BF3= 200.13
##$BF4= 200.13
##$BF5= 200.13
##$BF6= 200.13
##$BF7= 200.13
##$BF8= 200.13
##$BYTORDA= 1
##$CFDGTYP= 0
##$CFRGTYP= 5
##$CHEMSTR= <none>
##$CNST= (0..31)
1 1 145 1 1 1 1 1 1 1 1 1 1 1 1 1 1 1 1 1 1 1 1 1 1 1 1 1 1 1 1 1 
##$CPDPRG= <waltz16>
##$CPDPRG1= <>
##$CPDPRG2= <waltz16>
##$CPDPRG3= <>
##$CPDPRG4= <mlev>
##$CPDPRG5= <mlev>
##$CPDPRG6= <mlev>
##$CPDPRG7= <mlev>
##$CPDPRG8= <mlev>
##$CPDPRGB= <>
##$CPDPRGT= <>
##$D= (0..31)
0 1 0 0 0 0 0 0 0 0 0 0.03 2e-05 3e-06 0 0 0 0 0 0 0 0 0 0 0 0 0 0 0 0 
0 0 
##$DATE= 1707394682
##$DBL= (0..7)
120 120 120 11 120 120 24 19 
##$DBP= (0..7)
150 150 150 150 150 150 150 150 
##$DBP07= 0
##$DBPNAM0= <>
##$DBPNAM1= <>
##$DBPNAM2= <>
##$DBPNAM3= <>
##$DBPNAM4= <>
##$DBPNAM5= <>
##$DBPNAM6= <>
##$DBPNAM7= <>
##$DBPOAL= (0..7)
0.5 0.5 0.5 0.5 0.5 0.5 0.5 0.5 
##$DBPOFFS= (0..7)
$$ [...]
##$SUBNAM2= <"">
##$SUBNAM3= <"">
##$SUBNAM4= <"">
##$SUBNAM5= <"">
##$SUBNAM6= <"">
##$SUBNAM7= <"">
##$SUBNAM8= <"">
##$SUBNAM9= <"">
##$SW= 501.771253377433
##$SWIBOX= (0..15)
0 1 3 0 0 0 0 0 0 0 0 0 0 0 0 0 
##$SW_h= 40650.406504065
##$TD= 32768
##$TD0= 1
##$TE= 0
##$TE2= 300
##$TE3= 300
##$TEG= 300
##$TL= (0..7)
0 120 53 12 22 120 120 120 
##$TP= (0..7)
150 150 150 150 150 150 150 150 
##$TP07= 0
##$TPNAME0= <>
##$TPNAME1= <>
##$TPNAME2= <>
##$TPNAME3= <>
##$TPNAME4= <>
##$TPNAME5= <>
##$TPNAME6= <>
##$TPNAME7= <>
##$TPOAL= (0..7)
0.5 0.5 0.5 0.5 0.5 0.5 0.5 0.5 
##$TPOFFS= (0..7)
0 0 0 0 0 0 0 0 
##$TUNHIN= 0
##$TUNHOUT= 0
##$TUNXOUT= 0
##$USERA1= <user>
##$USERA2= <user>
##$USERA3= <user>
##$USERA4= <user>
##$USERA5= <user>
##$V9= 5
##$VALIST= <valist>
##$VCLIST= <CCCCCCCCCCCCCCC>
##$VD= 0
##$VDLIST= <DDDDDDDDDDDDDDD>
##$VPLIST= <PPPPPPPPPPPPPPP>
##$VTLIST= <TTTTTTTTTTTTTTT>
##$WBST= 1024
##$WBSW= 4
##$XGAIN= (0..3)
0 0 0 0 
##$XL= 0
##$YL= 0
##$YMAX_a= 1824
##$YMIN_a= -3772
##$ZGOPTNS= <>
##$ZL1= 120
##$ZL2= 120
##$ZL3= 120
##$ZL4= 120
##$ABSF1= 0
##$ABSF2= 0
##$ABSG= 0
##$ABSL= 0
##$ALPHA= 0
##$AQORDER= 0
##$ASSFAC= 0
##$ASSFACI= 0
##$ASSFACX= 0
##$ASSWID= 0
##$AUNMP= <proc_1d>
##$AZFE= 0.1
##$AZFW= 0.5
##$BCFW= 0
##$BC_mod= 2
##$BYTORDP= 0
##$COROFFS= 0
##$CY= -3
##$DATMOD= 1
##$DC= 0
##$DFILT= <>
##$DTYPP= 0
##$F1P= 0
##$F2P= 0
##$FCOR= 1
##$FTSIZE= 65536
##$FT_mod= 6
##$GAMMA= 0
##$GB= 0
##$INTBC= 1
##$INTSCL= 6.047779e-11
##$ISEN= 30
##$LB= 10
##$LEV0= 0
##$LPBIN= 0
##$MAXI= 10000
##$MC2= 0
##$MEAN= 0
##$ME_mod= 0
##$MI= 50
##$NCOEF= 0
##$NC_proc= -11
##$NLEV= 6
##$NOISF1= 182.463
##$NOISF2= 159.3651
##$NSP= 0
##$NTH_PI= 0
##$NZP= 0
##$OFFSET= 248.5645
##$PC= 4
##$PHC0= -12864.33
##$PHC1= 10.2829
##$PH_mod= 1
##$PKNL= yes
##$PPARMOD= 0
##$PSCAL= 0
##$PSIGN= 0
##$REVERSE= no
##$SF= 81.0140089999694
##$SI= 65536
##$SIGF1= 159.3651
##$SIGF2= -187.1042
##$SINO= 113.3802
##$SIOLD= 16384
##$SREGLST= <1H.CDCl3>
##$SSB= 0
##$STSI= 65536
##$STSR= 0
##$SW_p= 40650.406504065
##$SYMM= 0
##$S_DEV= 0
##$TDeff= 32768
##$TDoff= 0
##$TI= <>
##$TILT= no
##$TM1= 0
##$TM2= 0
##$TOPLEV= 0
##$USERP1= <user>
##$USERP2= <user>
##$USERP3= <user>
##$USERP4= <user>
##$USERP5= <user>
##$WDW= 1
##$XDIM= 65536
##$YMAX_p= 522684364
##$YMIN_p= -80411828
$$ End of Bruker specific parameters
$$ ---------------------------------
##NTUPLES= NMR SPECTRUM
##VAR_NAME=  FREQUENCY,     SPECTRUM/REAL,   SPECTRUM/IMAG
##SYMBOL=    X,             R,               I
##VAR_TYPE=  INDEPENDENT,   DEPENDENT,       DEPENDENT
##VAR_FORM=  AFFN,          ASDF,            ASDF
##VAR_DIM=   65536,         65536,           65536
##UNITS=     HZ,            ARBITRARY UNITS, ARBITRARY UNITS
##FACTOR=    0.620285442955139, 1,           1
##FIRST=     20137.2065510682, 0,            0
##LAST=      -20513.1999529968, 0,           0
##MIN=       -20513.1999529968, -80411828,   0
##MAX=       20137.2065510682, 522684364,    0
$$ Real data points
##PAGE= N=1
##DATA TABLE= (X++(R..R)), XYDATA
$$ [...]
$$ plain form
41589 -22195454 -21965358 -21355222 -20554587 -19823843 -19440567 -19641820 -20570972 -22238416 -24507975
41580 -24507975 -27118376 -29738204 -32038230 -33757984 -34749098 -34989794 -34573451 -33677901 -32525314
41571 -32525314 -31344392 -30341920 -29681354 -29463029 -29708861 -30363114 -31317139 -32452222 -33683916
41562 -33683916 -34989494 -36405041 -37989814 -39773364 -41714342 -43692054 -45525971 -47002066
41554 -47002066 -47895963 -48003338 -47186430 -45421424 -42816174 -39582566 -35978070 -32246971
41546 -32246971 -28583287 -25118161 -21921708 -19009185 -16350187 -13887097 -11566382 -9375242
41538 -9375242 -7369048 -5679737 -4503287 -4064181 -4553610 -6052503 -8475515 -11576018
41530 -11576018 -15016353 -18460142 -21633076 -24335558 -26432608 -27851260 -28589197 -28719287
$$ packed form
41589b2195454K30096O10136Q00635P30744L83276k01253r29152j667444k269559
41580b4507975k610401k619828k300026j719754r91114k40696M16343Q95550J152587
41571c2525314J180922J002472O60566K18325k45832o54253r54025j135083j231694
41562c3683916j305578j415547j584773j783550j940978j977712j833917j476095
41554d7002066q93897j07375Q16908J765006K605250L233608L604496L731099
41546c2246971L663684L465126L196453K912523K658998K463090K320715K191140
41538i375242K006194J689311J176450M39106m89429j498893k423012l100503
41530a1576018l440335l443789l172934k702482k097050j418652p37937j30090
$$ plain form
41522 -28719287 -28380059 -27753465 -27030971 -26367060 -25830852 -25382143 -24893642 -24213787 -23238883
41513 -23238883 -21960886 -20474745 -18950051 -17584890 -16562208 -16020099 -16033487 -16599696 -17631318
41504 -17631318 -18972742 -20450868 -21944970 -23438513 -25019531 -26824915 -28956728 -31414847
41496 -31414847 -34080878 -36759697 -39253649 -41429894 -43250924 -44762355 -46053126 -47211662
41488 -47211662 -48297787 -49338889 -50344929 -51327654 -52311585 -53334769 -54444732 -55693224
41480 -55693224 -57129010 -58788990 -60691361 -62832624 -65185030 -67691853 -70264936 -72790753
41472 -72790753 -75143329 -77195565 -78825459 -79923899 -80411828 -80264375 -79529030 -78323234
41464 -78323234 -76804159 -75117670 -73348918 -71502049 -69521289 -67338634 -64916880 -62263447
$$ packed form
41522b8719287L39228O26594P22494O63911N36208M48709M88501O79855R74904
41513b3238883J277997J486141J524694J365161J022682N42109j3388n66209j031622
41504a7631318j341424j478126j494102j493543j581018j805384k131813k458119
41496c1414847k666031k678819k493952k176245j821030j511431j290771j158536
41488d7211662j086125j041102j006040r82725r83931j023184j109963j248492
41480e5693224j435786j659980j902371k141263k352406k506823k573083k525817
41472g2790753k352576k052236j629894j098440m87929J47453P35345J205796
41464g8323234J519075J686489J768752J846869J980760K182655K421754K653433
$$ plain form
41456 -62263447 -59411952 -56388420 -53188532 -49786597 -46174951 -42406931 -38611759 -34974007
41448 -34974007 -31698542 -28983370 -27001141 -25876800 -25659637 -26303637 -27668205 -29537659
41440 -29537659 -31652212 -33748293 -35606167 -37090617 -38160574 -38834135 -39124739 -38989412
41432 -38989412 -38327814 -37038324 -35096715 -32604610 -29773566 -26852022 -24035821 -21407896
41424 -21407896 -18932476 -16501541 -14009607 -11421947 -8804633 -6305155 -4101388 -2351670
41416 -2351670 -1165973 -592417 -604791 -1093725 -1881199 -2768739 -3601047 -4309851 -4914732
41407 -4914732 -5484863 -6083794 -6720086 -7318440 -7719726 -7714247 -7103458 -5769781 -3723959
41398 -3723959 -1110012 1825074 4772320 7398035 9385564 10491736 10605052 9774024
$$ packed form
41456f2263447K851495L023532L199888L401935L611646L768020L795172L637752
41448c4974007L275465K715172J982229J124341K17163o44000j364568j869454
41440b9537659k114553k096081j857874j484450j069957o73561k90604J35327
41432c8989412O61598J289490J941609K492105K831044K921544K816201K627925
41424b1407896K475420K430935K491934K587660K617314K499478K203767J749718
41416b351670J185697N73556j2374m88934p87474q87540q32308p08804o04881
41407d914732n70131n98931o36292n98354m01286N479O10789J333677K045822
41398c723959K613947K935086K947246K625715J987529J106172J13316q31028
$$ plain form
41390 9774024 8186507 6112826 3843274 1639831 -299214 -1869292 -3078822 -4040370
41382 -4040370 -4925221 -5898849 -7070950 -8481071 -10113072 -11918933 -13842656 -15845235
41374 -15845235 -17924200 -20109583 -22425965 -24835703 -27197473 -29270176 -30769539 -31456063
41366 -31456063 -31212666 -30073933 -28200283 -25826091 -23217684 -20650911 -18391375 -16662616
41358 -16662616 -15610064 -15281962 -15639545 -16589329 -18017309 -19805795 -21827716 -23932404
41350 -23932404 -25945330 -27692184 -29034943 -29896878 -30264418 -30173437 -29696540 -28940371 -28046636
41341 -28046636 -27180893 -26498734 -26097884 -25981721 -26056780 -26164737 -26129652 -25802056 -25094970 -24012010
41331 -24012010 -22659347 -21228014 -19943981 -19001916 -18507001 -18443154 -18674680 -18979430 -19104498
$$ packed form
41390I774024j587517k073681k269552k203443j939045j570078j209530r61548
41382d040370q84851r73628j172101j410121j632001j805861j923723k002579
41374a5845235k078965k185383k316382k409738k361770k072703j499363o86524
41366c1456063K43397J138733J873650K374192K608407K566773K259536J728759
41358a6662616J052552L28102l57583r49784j427980j788486k021921k104688
41350b3932404k012926j746854j342759q61935l67540R0981M76897P56169Q93735
41341b8046636Q65743O82159M00850J16163p5059j07957L5085L27596P07086J082960
41331b4012010J352663J431333J284033R42065M94915O3847k31526l04750j25068
$$ plain form
41322 -19104498 -18828867 -18014611 -16632113 -14753272 -12516101 -10072912 -7541935 -4984025
41314 -4984025 -2416390 145294 2644109 4968439 6979447 8565482 9695571 10447961
41306 10447961 11002309 11595894 12454798 13722116 15411234 17404560 19497955 21469746
41298 21469746 23142757 24414237 25249779 25660389 25687738 25404404 24912257 24320443 23707686
41289 23707686 23094242 22442862 21684120 20747492 19586902 18201888 16654388 15070379 13614542
41280 13614542 12443676 11664117 11316672 11388250 11828146 12551893 13438822 14342555 15122815
41271 15122815 15686706 16018148 16179287 16280353 16429614 16687324 17046157 17442271 17781466
41262 17781466 17963151 17898887 17531800 16857068 15932145 14863224 13764200 12699494 11635195
$$ packed form
41322a9104498K75631Q14256J382498J878841K237171K443189K530977K557910
41314d984025K567635K561684K498815K324330K011008J586035J130089P52390
41306A0447961N54348N93585Q58904J267318J689118J993326K093395J971791
41298B1469746J673011J271480Q35542M10610K7349k83334m92147n91814o12757
41289B3707686o13444o51380p58742r36628j160590j385014j547500j584009j455837
41280A3614542j170866p79559l47445P1578M39896P23747Q86929R03733P80260
41271A5122815N63891L31442J61139J01066J49261K57710L58833L96114L39195
41262A7781466J81685o4264l67087o74732r24923j068921j099024j064706j064299
$$ plain form
41253 11635195 10426243 8854467 6706480 3858069 328304 -3716985 -8008884 -12245522
41245 -12245522 -16163133 -19587099 -22449320 -24765942 -26582466 -27912539 -28707585 -28878808
41237 -28878808 -28355746 -27138839 -25312874 -23021878 -20429245 -17683105 -14892311 -12113428
41229 -12113428 -9352590 -6585008 -3786941 -970533 1785634 4316402 6371179 7648337
41221 7648337 7861964 6819995 4482967 981852 -3407169 -8317282 -13355609 -18161335
41213 -18161335 -22447946 -26026225 -28806797 -30782117 -31992848 -32491159 -32315536 -31484171
41205 -31484171 -30003968 -27887450 -25170497 -21925917 -18271161 -14372727 -10449184 -6766111
41197 -6766111 -3609297 -1230762 216721 726079 439108 -395258 -1487237 -2568488 -3429738
$$ packed form
41253A1635195j208952j571776k147987k848411l529765m045289m291899m236638
41245a2245522l917611l423966k862221k316622j816524j330073p95046j71223
41237b8878808N23062J216907J825965K290996K592633K746140K790794K778883
41229a2113428K760838K767582K798067K816408K756167K530768K054777J277158
41221G648337K13627j041969k337028l501115m389021m910113n038327m805726
41213a8161335m286611l578279k780572j975320j210731m98311J75623Q31365
41205c1484171J480203K116518K716953L244580L654756L898434L923543L683073
41197f766111L156814K378535J447483N09358k86971q34366j091979j081251q61250
$$ plain form
41188 -3429738 -3930265 -3990335 -3580616 -2715255 -1447427 136360 1926377 3806934 5681059
41179 5681059 7496344 9258828 11021343 12842140 14727041 16585850 18236783 19470329
41171 19470329 20145025 20262050 19976613 19544175 19235776 19264640 19749049 20713534 22115227
41162 22115227 23876701 25908934 28117266 30395672 32622381 34666895 36408504 37758397
41154 37758397 38676548 39178290 39329753 39234736 39017393 38803910 38702927 38783987 39058411 39472276
41144 39472276 39918449 40264262 40382898 40177697 39597290 38646124 37391729 35959686 34503399
41135 34503399 33149957 31947693 30850061 29748796 28534463 27147105 25595126 23946006
41127 23946006 22303754 20783640 19488262 18487578 17805565 17414722 17238904 17166613 17077317
$$ packed form
41188c429738n00527o0070M09719Q65361J267828J583787J790017J880557J874125
41179E681059J815285J762484J762515J820797J884901J858809J650933J233546
41171A9470329O74696J17025k85437m32438l08399K8864M84409R64485J401693
41162B2115227J761474K032233K208332K278406K226709K044514J741609J349893
41154C7758397R18151N01742J51463r5017k17343k13483j00983Q1060K74424M13865
41144C9472276M46173L45813J18636k05201n80407r51166j254395j432043j456287
41135C4503399j353442j202264j097632j101265j214333j387358j551979j649120
41127B3946006j642252j520114j295378j000684o82013l90843j75818p2291q9296
$$ plain form
41118 17077317 16878465 16541350 16117182 15720036 15481311 15498492 15804031 16366104 17114879
41109 17114879 17978006 18908558 19893469 20939154 22041941 23158821 24194296 25012361 25471633
41100 25471633 25469380 24972982 24023153 22709723 21134915 19381478 17498188 15509725 13449026
41091 13449026 11395273 9490954 7921985 6871032 6471913 6786230 7802380 9445469
41083 9445469 11593435 14105069 16860009 19790714 22877675 26101058 29379253 32539007
41075 32539007 35337297 37517607 38867581 39256111 38645182 37081693 34678399 31593272
41067 31593272 28010600 24121041 20100790 16098410 12236562 8622775 5354902 2514115
41059 2514115 150423 -1731695 -3184830 -4324351 -5318690 -6353089 -7568641 -9000196
$$ packed form
41118A7077317j98852l37115m24168l97146k38725J7181L05539N62073P48775
41109A7114879Q63127R30552R84911J045685J102787J116880J035475Q18065M59272
41100B5471633k253m96398r49829j313430j574808j753437j883290j988463k060699
41091A3449026k053753j904319j568969j050953l99119L14317J016150J643089
41083I445469K147966K511634K754940K930705L086961L223383L278195L159754
41075C2539007K798290K180310J349974L88530o10929j563489k403294l085127
41067C1593272l582672l889559m020251m002380l861848l613787l267873k840787
41059B514115k363692j882118j453135j139521r94339j034399j215552j431555
$$ plain form
41051 -9000196 -10549336 -12016643 -13183626 -13904322 -14164330 -14088783 -13905908 -13883757 -14260272
41042 -14260272 -15188077 -16708786 -18754596 -21163034 -23697169 -26076029 -28017697 -29284189
41034 -29284189 -29714301 -29242333 -27907859 -25854067 -23304778 -20518559 -17734335 -15128141
41026 -15128141 -12791613 -10731503 -8884565 -7143061 -5388375 -3529607 -1537472 543464
41018 543464 2615758 4572629 6333222 7844260 9052155 9874099 10194460 9892001 8886109
41009 8886109 7184118 4910418 2299330 -354876 -2775471 -4775593 -6295530 -7396077
41001 -7396077 -8220972 -8949851 -9757599 -10785107 -12118797 -13775220 -15691030 -17723389 -19667000
40992 -19667000 -21289030 -22373251 -22756018 -22338144 -21072231 -18943825 -15968473 -12209124
$$ packed form
41051i000196j549140j467307j166983p20696k60008P5547J82875K2151l76515
41042a4260272r27805j520709k045810k408438k534135k378860j941668j266492
41034b9284189m30112M71968J334474K053792K549289K786219K784224K606194
41026a5128141K336528K060110J846938J741504J754686J858768J992135K080936
41018E43464K072294J956871J760593J511038J207895Q21944L20361l02459j005892
41009H886109j701991k273700k611088k654206k420595k000122j519937j100547
41001g396077q24895p28879q07748j027508j333690j656423j915810k032359j943611
40992a9667000j622030j084221l82767M17874J265913K128406K975352L759349
$$ plain form
40984 -12209124 -7796375 -2930294 2141034 7153996 11859035 16042783 19544686 22268984
40976 22268984 24189211 25341188 25802530 25661740 24987052 23809189 22127377 19934787
40968 19934787 17245984 14105600 10569987 6676633 2432112 -2160317 -7045101 -12070865
40960 -12070865 -16995654 -21543969 -25483411 -28678029 -31092915 -32756716 -33715939 -34018662
40952 -34018662 -33738795 -33014064 -32055407 -31107875 -30381471 -29989733 -29923640 -30065469 -30230520
40943 -30230520 -30218462 -29858598 -29041932 -27740795 -26015369 -23999395 -21859954 -19743647 -17736741
40934 -17736741 -15859785 -14092222 -12404035 -10775206 -9200994 -7692509 -6278727 -5004954
40926 -5004954 -3917485 -3033809 -2316358 -1676457 -1018627 -302191 422852 1033487 1393095
$$ packed form
40984a2209124M412749M866081N071328N012962M705039M183748L501903K724298
40976B2268984J920227J151977M61342j40790o74688j177863j681812k192590
40968A9934787k688803l140384l535613l893354m244521m592429m884784n025764
40960a2070865m924789m548315l939442l194618k414886j663801r59223l02723
40952c4018662K79867P24731R58657R47532P26404L91738O6093j41829j65051
40943c0230520J2058L59864Q16666J301137J725426K015974K139441K116307K006906
40934a7736741J876956J767563J688187J628829J574212J508485J413782J273773
40926e004954J087469Q83676P17451O39901O57830P16436P25043O10635L59608
$$ plain form
40917 1393095 1411178 1066743 390549 -569432 -1771614 -3185033 -4784653 -6548776 -8457454
40908 -8457454 -10485045 -12587835 -14696191 -16716881 -18541363 -20054793 -21148437 -21740601
40900 -21740601 -21802274 -21375325 -20574374 -19571994 -18570243 -17762218 -17293834 -17243109 -17627200
40891 -17627200 -18426218 -19598220 -21068470 -22700388 -24273679 -25495081 -26051592 -25693631
40883 -25693631 -24316171 -22001989 -19008824 -15709785 -12512785 -9782702 -7781192 -6635903
40875 -6635903 -6347685 -6830434 -7959238 -9598244 -11598997 -13786500 -15959758 -17919591
40867 -17919591 -19514105 -20679530 -21456101 -21970032 -22387088 -22856255 -23466986 -24234464 -25108718
40858 -25108718 -25990724 -26743676 -27204278 -27207975 -26632506 -25444649 -23723974 -21645550 -19425708
$$ packed form
40917A393095J8083l44435o76194r59981j202182j413419j599620j764123j908678
40908h457454k027591k102790k108356k020690j824482j513430j093644n92164
40900b1740601o1673M26949Q00951J002380J001751Q08025M68384N0725l84091
40891a7627200p99018j172002j470250j631918j573291j221402n56511L57961
40883b5693631J377460K314182K993165L299039L197000K730083K001510J145289
40875f635903K88218m82749j128804j639006k000753k187503k173258j959833
40867a7919591j594514j165425p76571n13931m17056m69167o10731p67478q74254
40858b5108718q82006p52952m60602l697N75469J187857J720675K078424K219842
$$ plain form
40849 -19425708 -17256098 -15256952 -13466207 -11857073 -10361667 -8885356 -7318528 -5567234
40841 -5567234 -3611525 -1565560 311843 1690574 2303869 2070207 1131096 -209609 -1599328
40832 -1599328 -2742342 -3463036 -3724162 -3610870 -3293636 -2985346 -2905423 -3252580 -4178026
40823 -4178026 -5755915 -7961999 -10676469 -13715183 -16876246 -19981309 -22897070 -25534706
40815 -25534706 -27834680 -29746875 -31212673 -32151466 -32453721 -31985902 -30613362 -28240246
40807 -28240246 -24852291 -20540527 -15491900 -9953568 -4193408 1524169 6945532 11830737
40799 11830737 15965064 19183479 21401541 22636632 23001040 22661121 21780477 20479174
40791 20479174 18829443 16880508 14686716 12317669 9847761 7338621 4832173 2364004
$$ packed form
40849a9425708K169610J999146J790745J609134J495406J476311J566828J751294
40841e567234J955709K045965J877403J378731O13295k33662r39111j340705j389719
40832a599328j143014p20694k61126J13292L17234L08290P9923l47157r25446
40823d178026j577889k206084k714470l038714l161063l105063k915761k637636
40815b5534706k299974j912195j465798r38793l02255M67819J372540K373116
40807b8240246L387955M311764N048627N538332N760160N717577N421363M885205
40799A1830737M134327L218415K218062J235091L64408l39919q80644j301303
40791B0479174j649731j948935k193792k369047k469908k509140k506448k468169
$$ plain form
40783 2364004 -8492 -2182429 -4011242 -5339403 -6055811 -6137048 -5655499 -4748242 -3566274
40774 -3566274 -2233506 -834991 567523 1913354 3138676 4199936 5108422 5944317
40766 5944317 6831752 7888200 9180840 10713043 12441797 14314273 16307903 18452834
40758 18452834 20816284 23450717 26339468 29378927 32404723 35233727 37691015 39616276
40750 39616276 40864467 41312598 40870756 39489360 37160036 33915428 29834030 25047726
40742 25047726 19740210 14125792 8412717 2769820 -2685088 -7872512 -12728429 -17189859
40734 -17189859 -21197949 -24713236 -27729642 -30276916 -32410612 -34194293 -35678910 -36885376
40726 -36885376 -37799615 -38385652 -38607915 -38443430 -37873885 -36870139 -35393067 -33421971 -30998050
$$ packed form
40783B364004k372496k173937j828813j328161p16408q1237M81549R07257J181968
40774c566274J332768J398515J402514J345831J225322J061260R08486Q35895
40766E944317Q87435J056448J292640J532203J728754J872476J993630K144931
40758A8452834K363450K634433K888751L039459L025796K829004K457288J925261
40750C9616276J248191M48131m41842j381396k329324l244608m081398m786304
40742B5047726n307516n614418n713075n642897n454908n187424m855917m461430
40734a7189859m008090l515287l016406k547274k133696j783681j484617j206466
40726c6885376r14239n86037k22263J64485N69545J003746J477072J971096K423921
$$ plain form
40717 -30998050 -28256695 -25426653 -22790607 -20620269 -19110362 -18334874 -18238801 -18667491 -19425989
40708 -19425989 -20348597 -21348105 -22419357 -23598860 -24911631 -26340650 -27830066 -29306480
40700 -29306480 -30696779 -31933266 -32949051 -33670669 -34015500 -33901018 -33266912 -32100873 -30454916
40691 -30454916 -28446789 -26249912 -24073751 -22130012 -20585137 -19517564 -18908549 -18678887
40683 -18678887 -18750541 -19093278 -19731540 -20720779 -22121263 -23984734 -26344061 -29190083 -32439563
40674 -32439563 -35918336 -39378375 -42542417 -45152506 -47004828 -47970244 -48007861 -47172368 -45606088
40665 -45606088 -43506758 -41076058 -38471941 -35791653 -33092277 -30426408 -27860525 -25463136
40657 -25463136 -23278172 -21309212 -19527848 -17900900 -16419287 -15109694 -14019643 -13184856
$$ packed form
40717c0998050K741355K830042K636046K170338J509907P75488R6073m28690p58498
40708a9425989r22608r99508j071252j179503j312771j429019j489416j476414
40700b9306480j390299j236487j015785p21618l44831J14482O34106J166039J645957
40691c0454916K008127K196877K176161J943739J544875J067573O09015K29662
40683a8678887p1654l42737o38262r89239j400484j863471k359327k846022l249480
40674c2439563l478773l460039l164042k610089j852322r65416l7617Q35493J566280
40665d5606088K099330K430700K604117K680288K699376K665869K565883K397389
40657b5463136K184964J968960J781364J626948J481613J309593J090051Q34787
$$ plain form
40649 -13184856 -12600841 -12214486 -11932480 -11635043 -11194098 -10505192 -9531660 -8337762 -7083434
40640 -7083434 -5976221 -5203835 -4877760 -5004364 -5485147 -6143744 -6775957 -7209992 -7352814
40631 -7352814 -7201153 -6815144 -6272906 -5629772 -4897600 -4049059 -3043407 -1861926 -536105
40622 -536105 842720 2130222 3143897 3683902 3565189 2660083 936275 -1528878 -4564337
40613 -4564337 -7941597 -11414417 -14749608 -17743967 -20228993 -22070419 -23171763 -23486717
40605 -23486717 -23035466 -21912606 -20275618 -18312781 -16201942 -14078713 -12028164 -10098839
40597 -10098839 -8322322 -6719668 -5290749 -4001158 -2786023 -1576770 -337387 912349
40589 912349 2100688 3128783 3895377 4303799 4254166 3640372 2366456 377415 -2311591
$$ packed form
40649a3184856N84015L86355K82006K97437M40945O88906R73532J193898J254328
40640g083434J107213P72386L26075j26604m80783o58597o32213m34035j42822
40631g352814J51661L86009N42238O43134P32172Q48541J005652J181481J325821
40622e36105J378825J287502J013675N40005j18713r05106j723808k465153l035459
40613d564337l377260l472820l335191k994359k485026j841426j101344l14954
40605b3486717M51251J122860J636988J962837K110839K123229K050549J929325
40597a0098839J776517J602654J428919J289591J215135J209253J239383J249736
40589I12349J188339J028095P66594M08422m9633o13794j273916j989041k689006
$$ plain form
40580 -2311591 -5598099 -9290789 -13130347 -16840476 -20198969 -23093720 -25526910 -27562696
40572 -27562696 -29253261 -30590937 -31511865 -31939950 -31836171 -31221433 -30163981 -28744335 -27017118
40563 -27017118 -24984173 -22589646 -19745488 -16383838 -12511823 -8235091 -3734326 789530
40555 789530 5168834 9297745 13131581 16666038 19907996 22847711 25439502 27595581
40547 27595581 29195465 30111120 30244153 29566144 28149222 26173555 23903392 21634027
40539 21634027 19625677 18048159 16955854 16298505 15960595 15815612 15777982 15832700 16026407
40530 16026407 16419965 17024752 17757600 18441971 18859020 18824190 18248713 17152957 15629495
40521 15629495 13787015 11713918 9476367 7134790 4755779 2412961 185489 -1839931
$$ packed form
40580b311591l286508l692690l839558l710129l358493k894751k433190k035786
40572b7562696j690565j337676r20928m28085J03779O14738J057452J419646J727217
40563b7017118K032945K394527K844158L361650L872015M276732M500765M523856
40555G89530M379304M128911L833836L534457L241958K939715K591791K156079
40547B7595581J599884R15655J33033o78009j416922j975667k270163k269365
40539B1634027k008350j577518j092305o57349l37910j44983l7630N4718J93707
40530A6026407L93558O04787P32848O84371M17049l4830n75477j095756j523462
40521A5629495j842480k073097k237551k341577k379011k342818k227472k025420
$$ plain form
40513 -1839931 -3568148 -4902759 -5763382 -6110381 -5970151 -5446680 -4703907 -3918578 -3225590
40504 -3225590 -2683521 -2271778 -1912471 -1506068 -972988 -289888 495738 1282254 1953576
40495 1953576 2420595 2644569 2634269 2421912 2033220 1469643 711387 -266431 -1481076
40486 -1481076 -2941837 -4654339 -6612743 -8771962 -11012869 -13129325 -14860504 -15965583
40478 -15965583 -16308558 -15911393 -14950952 -13705677 -12479967 -11535175 -11041753 -11054431 -11512021
40469 -11512021 -12267298 -13144207 -14000994 -14771246 -15473333 -16202613 -17121020 -18437603 -20363720
40460 -20363720 -23045765 -26505280 -30619109 -35147787 -39793152 -44258236 -48293431 -51727288
40452 -51727288 -54484355 -56586388 -58130434 -59248553 -60069857 -60705191 -61254044 -61814111 -62476527
$$ packed form
40513a839931j728217j334611q60623l46999J40230N23471P42773P85329O92988
40504c225590N42069M11743L59307M06403N33080O83100P85626P86516O71322
40495A953576M67019K23974j0300k12357l88692n63577p58256r77818j214645
40486a481076j460761j712502j958404k159219k240907k116456j731179j105079
40478a5965583l42975L97165R60441J245275J225710R44792M93422j2678m57590
40469a1512021p55277q76909q56787p70252p02087p29280r18407j316583j926117
40460b0363720k682045l459515m113829m528678m645365m465084m035195l433857
40452e1727288k757067k102033j544046j118119q21304o35334n48853n60067o62416
$$ plain form
40443 -62476527 -63307079 -64325073 -65491050 -66711026 -67860454 -68821824 -69519638 -69936935 -70107703
40434 -70107703 -70088411 -69916908 -69575136 -68978013 -67998853 -66514741 -64442299 -61750793 -58462665
40425 -58462665 -54651964 -50435951 -45952993 -41334941 -36689421 -32095548 -27604821 -23244470
40417 -23244470 -19030858 -14995521 -11210564 -7794969 -4895544 -2651591 -1157644 -435608
40409 -435608 -423954 -988737 -1956485 -3161154 -4489218 -5904259 -7440439 -9170872 -11169241
40400 -11169241 -13480769 -16106778 -19000400 -22073895 -25219049 -28333823 -31340107 -34183100
40392 -34183100 -36818692 -39203706 -41296046 -43059332 -44464339 -45487825 -46114820 -46345364
40384 -46345364 -46198017 -45702127 -44881387 -43741640 -42273835 -40468302 -38323910 -35839749
$$ packed form
40443f2476527q30552j017994j165977j219976j149428r61370o97814m17297j70768
40434g0107703J9292J71503L41772N97123R79160J484112K072442K691506L288128
40425e8462665L810701M216013M482958M618052M645520M593873M490727M360351
40417b3244470M213612M035337L784957L415595K899425K243953J493947P22036
40409d35608J1654n64783r67748j204669j328064j415041j536180j730433j998369
40400a1169241k311528k626009k893622l073495l145154l114774l006284k842993
40392c4183100k635592k385014k092340j763286j405007j023486o26995k30544
40384d6345364J47347M95890Q20740J139747J467805J805533K144392K484161
$$ plain form
40376 -35839749 -32996268 -29748470 -26048898 -21894892 -17372501 -12666825 -8027373 -3703581
40368 -3703581 117825 3345168 5974456 8053323 9636817 10753325 11392322 11518652
40360 11518652 11108360 10189446 8865355 7306496 5711306 4253034 3035096 2075147
40352 2075147 1325056 714166 188684 -275856 -691985 -1090568 -1540623 -2141746 -2986373
40343 -2986373 -4107716 -5443769 -6843116 -8111572 -9071823 -9606590 -9676401 -9318962 -8634392
40334 -8634392 -7754425 -6801558 -5857563 -4958678 -4115473 -3339159 -2656652 -2107323 -1723906
40325 -1723906 -1508035 -1417441 -1377289 -1307955 -1144095 -829269 -300440 508713 1637653 3066305
40315 3066305 4708780 6435854 8103496 9566750 10679349 11295706 11291395 10603335 9270049
$$ packed form
40376c5839749K843481L247798L699572M154006M522391M705676M639452M323792
40368c703581L821406L227343K629288K078867J583494J116508O38997J26330
40360A1518652m10292r18914j324091j558859j595190j458272j217938r59949
40352B075147p50091o10890n25482m64540m16129l98583m50055o01123q44627
40343b986373j121343j336053j399347j268456r60251n34767o9811L57439O84570
40334h634392Q79967R52867R43995Q98885Q43205P76314O82507N49329L83417
40325a723906K15871R0594M0152O9334J63860L14826N28829Q09153J128940J428652
40315C066305J642475J727074J667642J463254J112599O16357m311o88060j333286
$$ plain form
40306 9270049 7440609 5333787 3163262 1071358 -894351 -2761755 -4598409 -6482403
40298 -6482403 -8483735 -10648807 -12984937 -15451331 -17965744 -20429038 -22758884 -24918223
40290 -24918223 -26927028 -28851817 -30771770 -32728534 -34682946 -36510465 -38047039 -39157196
40282 -39157196 -39777580 -39915525 -39624261 -38986167 -38108550 -37113292 -36110333 -35167952 -34299419
40273 -34299419 -33472738 -32636843 -31753014 -30819191 -29875433 -28986293 -28209687 -27570935 -27057829
40264 -27057829 -26640399 -26304423 -26077440 -26028370 -26239183 -26766810 -27616789 -28735283 -30011887
40255 -30011887 -31287602 -32372895 -33082737 -33284651 -32942551 -32133943 -31025271 -29809714 -28635725
40246 -28635725 -27564309 -26575353 -25609910 -24615290 -23567426 -22467029 -21321084 -20123617
$$ packed form
40306I270049j829440k106822k170525k091904j965709j867404j836654j883994
40298f482403k001332k165072k336130k466394k514413k463294k329846k159339
40290b4918223k008805j924789j919953j956764j954412j827519j536574j110157
40282c9157196o20384j37945K91264O38094Q77617R95258J002959R42381Q68533
40273c4299419Q26681Q35895Q83829R33823R43758Q89140P76606O38752N13106
40264b7057829M17430L35976K26983M9070k10813n27627q49979j118494j276604
40255c0011887j275715j085293p09842k01914L42100Q08608J108672J215557J173989
40246b8635725J071416R88956R65443R94620J047864J100397J145945J197467
$$ plain form
40238 -20123617 -18845760 -17439377 -15850550 -14033324 -11955947 -9599646 -6955549 -4025182
40230 -4025182 -828475 2577845 6073916 9457055 12452030 14765145 16167868 16570074
40222 16570074 16043499 14784091 13034120 10998142 8781215 6367480 3648138 492819
40214 492819 -3163542 -7259734 -11604852 -15933873 -19990668 -23590437 -26625440 -29016638
40206 -29016638 -30655882 -31393363 -31090273 -29705761 -27363770 -24362521 -21123877 -18105312
40198 -18105312 -15706773 -14201919 -13709433 -14201266 -15532897 -17481603 -19783611 -22163296
40190 -22163296 -24352685 -26111036 -27258946 -27725539 -27581673 -27025625 -26312844 -25658349 -25158363
40181 -25158363 -24764253 -24310070 -23569503 -22314888 -20365904 -17628919 -14125680 -9999621
$$ packed form
40238b0123617J277857J406383J588827J817226K077377K356301K644097K930367
40230d025182L196707L406320L496071L383139K994975K313115J402723M02206
40222A6570074n26575j259408j749971k035978k216927k413735k719342l155319
40214D92819l656361m096192m345118m329021m056795l599769l035003k391198
40206b9016638j639244p37481L03090J384512K341991L001249L238644L018565
40198a8105312K398539J504854M92486m91833j331631j948706k302008k379685
40190b2163296k189389j758351j147910m66593J43866N56048P12781O54495M99986
40181b5158363L94110M54183P40567J254615J948984K736985L503239M126059
$$ plain form
40173 -9999621 -5488574 -868710 3609758 7773850 11554539 14984624 18166935 21220452
40165 21220452 24224865 27188144 30048624 32703447 35046042 37000081 38544813 39727761
40157 39727761 40659136 41485464 42347923 43337882 44464855 45650285 46752577 47613290 48099773
40148 48099773 48120579 47610930 46509235 44750126 42282439 39101694 35282392 31001183
40140 31001183 26543439 22282732 18627724 15947896 14504195 14408550 15620133 17970187
40132 17970187 21198931 24987613 28977112 32781060 36013797 38345930 39574961 39677893
40124 39677893 38816050 37286533 35442089 33615941 32080439 31040449 30635418 30926631
40116 30926631 31877835 33360272 35196350 37219090 39312134 41417662 43523453 45641083
$$ packed form
40173i999621M511047M619864M478468M164092L780689L430085L182311L053517
40165B1220452L004413K963279K860480K654823K342595J954039J544732J182948
40157C9727761R31375Q26328Q62459R89959J126973J185430J102292Q60713M86483
40148D8099773K0806n09649j101695j759109k467687l180745l819302m281209
40140C1001183m457744m260707l655008k679828j443701r5645J211583K350054
40132A7970187L228744L788682L989499L803948L232737K332133J229031J02932
40124C9677893q61843j529517j844444j826148j535502j039990m05031K91213
40116C0926631R51204J482437J836078K022740K093044K105528K105791K117630
$$ plain form
40108 45641083 47778747 49916161 51997554 53952079 55730471 57333130 58808498 60215359
40100 60215359 61560746 62742751 63534849 63633408 62755588 60743602 57626820 53617910 49053379
40091 49053379 44308585 39715916 35505207 31779918 28535936 25711946 23240754 21073361
40083 21073361 19173927 17506615 16033037 14723443 13576872 12643128 12031718 11889290
40075 11889290 12345844 13459665 15196901 17453752 20098146 23004518 26074072 29245813
40067 29245813 32499670 35845265 39294247 42829257 46390874 49891417 53240037 56355215
40059 56355215 59161174 61589714 63605057 65240239 66615963 67925834 69394626 71224749
40051 71224749 73545011 76379690 79657665 83265387 87119620 91220293 95652676 100533938
$$ packed form
40108D5641083K137664K137414K081393J954525J778392J602659J475368J406861
40100F0215359J345387J182005P92098R8559q77820k011986l116782m008910m564531
40091D9053379m744794m592669m210709l725289l243982k823990k471192k167393
40083B1073361j899434j667312j473578j309594j146571r33744o11410j42428
40075A1889290M56554J113821J737236K256851K644394K906372L069554L171741
40067B9245813L253857L345595L448982L535010L561617L500543L348620L115178
40059E6355215K805959K428540K015343J635182J375724J309871J468792J830123
40051G1224749K320262K834679L277975L607722L854233M100673M432383M881262
$$ plain form
40043 100533938 105928610 111777717 117882348 123949384 129665901 134753004 138972370 142099070
40035 142099070 143900892 144159135 142732660 139629266 135036496 129289727 122796341 115954998
40027 115954998 109097849 102462378 96189259 90341115 84933177 79962677 75427992 71338903
40019 71338903 67723505 64631011 62122070 60240024 58968241 58191647 57685499 57147176
40011 57147176 56269219 54830747 52770061 50203620 47379035 44581599 42035566 39840423
40003 39840423 37963782 36289788 34701789 33162183 31749140 30629950 29988606 29953930
39995 29953930 30570551 31822511 33685460 36171402 39341212 43281428 48060056 53684981
39987 53684981 60085855 67126170 74633034 82421392 90298164 98053264 105456484 112267516
$$ packed form
40043A00533938N394672N849107O104631O067036N716517N087103M219366L126700
40035A42099070J801822K58243j426475l103394m592770n746769o493386o841343
40027A15954998o857149o635471o273119n848144n407938m970500m534685m089089
40019G1338903l615398l092494k508941j882046j271783p76594n06148n38323
40011E7147176q77957j438472k060686k566441k824585k797436k546033k195143
40003C9840423j876641j673994j587999j539606j413043j119190o41344l4676
39995B9953930O16621J251960J862949K485942L169810L940216M778628N624925
39987E3684981O400874P040315P506864P788358P876772P755100P403220O811032
$$ plain form
39979 112267516 118244720 123135298 126653523 128479355 128305906 125929190 121337759 114754284
39971 114754284 106608347 97456215 87883515 78422828 69500458 61409416 54298246 48169183
39963 48169183 42889199 38223567 33895241 29658323 25363204 20993011 16660886 12567465
39955 12567465 8928744 5897829 3511646 1683744 240774 -1018790 -2267691 -3609650
39947 -3609650 -5061268 -6556204 -7969770 -9160172 -10017239 -10500938 -10650530 -10559506 -10332914
39938 -10332914 -10051448 -9753762 -9431978 -9032460 -8462043 -7605150 -6354362 -4650044 -2516932
39929 -2516932 -81308 2442708 4795151 6725946 8047628 8670868 8610341 7956843 6831307
39920 6831307 5350953 3626553 1779865 -46714 -1704036 -3064125 -4039908 -4581863
$$ packed form
39979A12267516N977204M890578L518225J825832j73449k376716m591431o583475
39971A14754284q145937r152132r572700r460687q922370q091042p111170o129063
39963D8169183n279984m665632m328326m236918m295119m370193m332125m093421
39955A2567465l638721l030915k386183j827902j442970j259564j248901j341959
39947c609650j451618j494936j413566j190402q57067m83699j49592R1024K26592
39938a0332914K81466K97686L21784L99518N70417Q56893J250788J704318K133112
39929b516932K435624K524016K352443J930795J321682O23240o0527o53498j125536
39920F831307j480354j724400j846688j826579j657322j360089r75783n41955
$$ plain form
39912 -4581863 -4655669 -4221390 -3235333 -1676238 425853 2981643 5857054 8892656 11915536
39903 11915536 14747748 17218227 19173939 20482760 21033334 20747599 19612170 17713705
39895 17713705 15252756 12519738 9835485 7474564 5597907 4222332 3244667 2514484
39887 2514484 1922101 1457429 1211765 1327762 1929124 3066884 4705020 6744183 9061154
39878 9061154 11536935 14063095 16538345 18872228 20996863 22872973 24480602 25800296
39870 25800296 26798538 27426680 27633325 27382002 26661788 25483609 23868992 21847024 19466387
39861 19466387 16811239 14003606 11185987 8491250 6011140 3774758 1749505 -128007
39853 -128007 -1900914 -3549478 -4986400 -6097490 -6805789 -7122376 -7156538 -7083321 -7089148 -7323128
$$ packed form
39912d581863p3806M34279R86057J559095K102091K555790K875411L035602L022880
39903A1915536K832212K470479J955712J308821N50574k85735j135429j898465
39895A7713705k460949k733018k684253k360921j876657j375575r77665p30183
39887B514484n92383m64672k45664J15997O01362J137760J638136K039163K316971
39878I061154K475781K526160K475250K333883K124635J876110J607629J319694
39870B5800296R98242O28142K06645k51323p20214j178179j614617k021968k380637
39861A9466387k655148k807633k817619k694737k480110k236382k025253j877512
39853a28007j772907j648564j436922j111090p08299l16587l4162P3217n827k33980
$$ plain form
39843 -7323128 -7873812 -8777516 -10050302 -11723170 -13854314 -16501547 -19661906 -23210358
39835 -23210358 -26878182 -30295009 -33082804 -34956620 -35782466 -35574632 -34457086 -32627337
39827 -32627337 -30336429 -27866521 -25484486 -23378102 -21609782 -20121299 -18790676 -17505600
39819 -17505600 -16207633 -14886953 -13546237 -12170743 -10727907 -9192461 -7576665 -5945654
39811 -5945654 -4407064 -3076659 -2035342 -1300220 -825429 -531689 -349748 -258623 -302020
39802 -302020 -573989 -1178499 -2181718 -3579051 -5288739 -7170625 -9062720 -10826640 -12388265
39793 -12388265 -13755150 -14998004 -16202714 -17417921 -18624425 -19735604 -20618746 -21121874
39785 -21121874 -21098939 -20434871 -19071316 -17027475 -14407614 -11391019 -8207728 -5108216
$$ packed form
39843g323128n50684r03704j272786j672868k131144k647233l160359l548452
39835b3210358l667824l416827k787795j873816q25846K07834J117546J829749
39827c2627337K290908K469908K382035K106384J768320J488483J330623J285076
39819a7505600J297967J320680J340716J375494J442836J535446J615796J631011
39811e945654J538590J330405J041317P35122M74791K93740J81941R1125m3397
39802c02020k71969o04510j003219j397333j709688j881886j892095j763920j561625
39793a2388265j366885j242854j204710j215207j206504j111179q83142n03128
39785b1121874K2935O64068J363555K043841K619861L016595L183291L099512
$$ plain form
39777 -5108216 -2334494 -95488 1453689 2226980 2212410 1464504 88418 -1777585 -3979700
39768 -3979700 -6368146 -8815665 -11225959 -13527708 -15661833 -17573548 -19211047 -20522941
39760 -20522941 -21451071 -21928982 -21900128 -21353923 -20356077 -19046491 -17601146 -16183427 -14916679
39751 -14916679 -13887894 -13164943 -12802001 -12822209 -13187522 -13778216 -14403258 -14847160 -14935793
39742 -14935793 -14588711 -13832633 -12774842 -11555876 -10304732 -9111948 -8027146 -7079855
39734 -7079855 -6311755 -5798303 -5638449 -5909314 -6609048 -7625796 -8758653 -9784216 -10534079
39725 -10534079 -10944894 -11061653 -10999114 -10881922 -10788727 -10721094 -10605474 -10321730 -9743663 -8778991
39715 -8778991 -7401487 -5669799 -3727031 -1778064 -49505 1254638 1986608 2069884 1498754
$$ packed form
39777e108216K773722K239006J549177P73291j4570p47906j376086j866003k202115
39768c979700k388446k447519k410294k301749k134125j911715j637499j311894
39760b0522941r28130m77911K8854N46205R97846J309586J445345J417719J266748
39751a4916679J028785P22951L62942k0208l65313n90694o25042m43902q8633
39742a4935793L47082P56078J057791J218966J251144J192784J084802R47291
39734g079855P68100N13452J59854k70865o99734j016748j132857j025563p49863
39725a0534079m10815j16759O2539J17192R3195O7633J15620K83744N78067R64672
39715h778991J377504J731688J942768J948967J728559J304143P31970Q3276n71130
$$ plain form
39706 1498754 332016 -1312688 -3264617 -5310633 -7215425 -8752452 -9739368 -10063320
39698 -10063320 -9683076 -8611666 -6899173 -4629807 -1925959 1056772 4144535 7156283
39690 7156283 9906684 12217887 13956957 15087828 15701045 15990911 16183158 16448151 16841557
39681 16841557 17295469 17654398 17731182 17357262 16415330 14856150 12704878 10056783 7058373
39672 7058373 3875671 662160 -2458018 -5387106 -8041154 -10341446 -12214069 -13591701
39664 -13591701 -14410690 -14602535 -14086308 -12774342 -10601824 -7575920 -3818808 426621
39656 426621 4838966 9089617 12913086 16156768 18803816 20966258 22845833 24667856
39648 24667856 26605950 28723158 30951630 33119100 35010705 36439703 37300669 37592517
$$ packed form
39706A498754j166738j644704j951929k046016j904792j537027r86916l23952
39698a0063320L80244J071410J712493K269366K703848K982731L087763L011748
39690G156283K750401K311203J739070J130871O13217K89866J92247K64993L93406
39681A6841557M53912L58929P6784l73920r41932j559180k151272k648095k998410
39672G058373l182702l213511l120178k929088k654048k300292j872623j377632
39664a3591701q18989j91845N16227J311966K172518L025904L757112M245429
39656D26621M412345M250651L823469L243682K647048K162442J879575J822023
39648B4667856J938094K117208K228472K167470J891605J428998Q60966K91848
$$ plain form
39640 37592517 37413223 36933465 36356080 35870271 35613633 35654371 35997228 36604433 37415004
39631 37415004 38348255 39290626 40080675 40511278 40355634 39406238 37510835 34598965 30702002
39622 30702002 25966405 20650481 15094969 9670919 4721957 519214 -2762847 -5051641
39614 -5051641 -6368309 -6811091 -6534402 -5727577 -4595181 -3336351 -2117254 -1034105 -76343
39605 -76343 887712 2081863 3750164 6069570 9084246 12684503 16630017 20602525 24270530
39596 24270530 27349459 29641628 31045978 31540735 31155922 29955361 28035151 25528149
39588 25528149 22599026 19427556 16193370 13073629 10247506 7890372 6151213 5126657
39580 5126657 4851248 5311125 6470920 8295498 10751676 13787404 17302242 21132316
$$ packed form
39640C7592517j79294m79758n77385m85809k56638M0738L42857O07205Q10571
39631C7415004R33251R42371P90049M30603j55644r49396j895403k911870l896963
39622C0702002m735597n315924n555512n424050m948962m202743l282061k288794
39614e051641j316668m42782K76689Q06825J132396J258830J219097J083149R57762
39605g6343R64055J194151J668301K319406L014676L600257L945514L972508L668005
39596B4270530L078929K292169J404350M94757l84813j200561j920210k507002
39588B5528149k929123l171470l234186l119741k826123k357134j739159j024556
39580E126657k75409M59877J159795J824578K456178L035728L514838L830074
$$ plain form
39572 21132316 25064546 28872781 32353277 35344370 37736001 39484387 40633808 41325702
39564 41325702 41770736 42180531 42685377 43277834 43810188 44047232 43751849 42769511 41081441
39555 41081441 38812122 36197156 33531104 31115776 29221181 28060903 27775636 28416421
39547 28416421 29926363 32132090 34760672 37485885 39989183 42013300 43394087 44067759
39539 44067759 44057353 43446516 42352846 40910632 39260519 37532790 35817012 34131397
39531 34131397 32417838 30575807 28519031 26220618 23721930 21107199 18465887 15865503
39523 15865503 13345738 10931424 8652644 6557615 4710756 3181688 2038810 1354182
39515 1354182 1210570 1692898 2854882 4671918 7007145 9615600 12190403 14430938
$$ packed form
39572B1132316L932230L808235L480496K991093K391631J748386J149421O91894
39564D1325702M45034M09795N04846N92457N32354K37044k95383r82338j688070
39555D1081441k269319k614966k666052k415328j894595j160278k85267O40785
39547B8416421J509942K205727K628582K725213K503298K024117J380787O73672
39539D4067759j0406o10837j093670j442214j650113j727729j715778j685615
39531C4131397j713559j842031k056776k298413k498688k614731k641312k600384
39523A5865503k519765k414314k278780k095029j846859j529068j142878o84628
39515A354182j43612M82328J161984J817036K335227K608455K574803K240535
$$ plain form
39507 14430938 16105593 17093313 17402558 17168750 16627259 16062200 15742075 15860496 16498533
39498 16498533 17618893 19093187 20750434 22423703 23974059 25288363 26265422 26809155
39490 26809155 26837933 26305312 25217851 23635999 21655469 19380967 16907973 14317703
39482 14317703 11678240 9045212 6465587 3992627 1711299 -239819 -1667776 -2353965
39474 -2353965 -2106834 -823137 1462782 4563249 8168699 11918770 15482158 18610236
39466 18610236 21151298 23039361 24278956 24935493 25128900 25026209 24828694 24746316 24954707
39457 24954707 25543723 26481378 27616436 28723861 29573337 29989796 29884382 29254593 28164799
39448 28164799 26715950 25009804 23120786 21095457 18984215 16879298 14922314 13270073
$$ packed form
39507A4430938J674655R87720L09245k33808n41491n65059l20125J18421O38037
39498A6498533J120360J474294J657247J673269J550356J314304R77059N43733
39490B6809155K8778n32621j087461j581852j980530k274502k472994k590270
39482A4317703k639463k633028k579625k472960k281328j951118j427957o86189
39474b353965K47131J283697K285919L100467L605450L750071L563388L128078
39466A8610236K541062J888063J239595O56537J93407j02691j97515q2378K08391
39457B4954707N89016R37655J135058J107425Q49476M16459j05414o29789j089794
39448B8164799j448849j706146j889018k025329k111242k104917j956984j652241
$$ plain form
39440 13270073 12043682 11295694 11009783 11122780 11550619 12207362 13018300 13933813 14945416
39431 14945416 16095267 17468635 19169123 21286319 23863696 26869379 30177215 33575232
39423 33575232 36812838 39673008 42032578 43876392 45259716 46246948 46868949 47126760
39415 47126760 47036673 46684179 46250047 45989177 46167121 46977564 48472669 50535588 52909432
39406 52909432 55272979 57330948 58879504 59823265 60151028 59900787 59140715 57967162 56501741
39397 56501741 54875464 53206086 51581488 50053509 48638811 47325360 46086442 44899974
39389 44899974 43762489 42685338 41671161 40686658 39657712 38500250 37169556 35690344
39381 35690344 34142838 32614994 31153209 29736811 28281454 26665061 24768262 22518093
$$ packed form
39440A3270073j226391p47988k85911J12997M27839O56743Q10938R15513J011603
39431A4945416J149851J373368J700488K117196K577377L005683L307836L398017
39423C3575232L237606K860170K359570J843814J383324R87232O22001K57811
39415D7126760r0087l52494m34132k60870J77944Q10443J495105K062919K373844
39406E2909432K363547K057969J548556R43761L27763k50241p60072j173553j465421
39397E6501741j626277j669378j624598j527979j414698j313451j238918j186468
39389D4899974j137485j077151j014177r84503j028946j157462j330694j479212
39381C5690344j547506j527844j461785j416398j455357j616393j896799k250169
$$ plain form
39373 22518093 19918005 17048724 14038120 11015820 8076409 5267742 2604154 91652
39365 91652 -2249178 -4371146 -6202487 -7661772 -8678825 -9211974 -9257109 -8851102 -8071116
39356 -8071116 -7024456 -5824541 -4560076 -3272928 -1955226 -565026 945655 2597207
39348 2597207 4352232 6100557 7667919 8847252 9443373 9319804 8438943 6888513 4886227
39339 4886227 2753792 858248 -465093 -979193 -575007 741594 2889553 5753207
39331 5753207 9201662 13078187 17171919 21203645 24855084 27840091 29979697 31236313
39323 31236313 31692187 31495149 30808630 29788161 28582074 27339875 26212209 25335535 24805740
39314 24805740 24654870 24848437 25309324 25951098 26690376 27425034 28000806 28205610 27809237
$$ packed form
39373B2518093k600088k869281l010604l022300k939411k808667k663588k512502
39365I1652k340830k121968j831341j459285j017053n33149m5135M06007P79986
39356h071116J046660J199915J264465J287148J317702J390200J510681J651552
39348B597207J755025J748325J567362J179333N96121j23569q80861j550430k002286
39339D886227k132435j895544j323341n14100M04186J316601K147959K863654
39331E753207L448455L876525M093732M031726L651439K985007K139606J256616
39323C1236313M55874j97038o86519j020469j206087j242199j127666q76674n29795
39314B4805740j50870J93567M60887O41774P39278P34658N75772K04804l96373
$$ plain form
39305 27809237 26629388 24588546 21736434 18230813 14284078 10097528 5815830 1527496
39297 1527496 -2688981 -6702116 -10288158 -13146512 -14973491 -15563799 -14888539 -13110259
39289 -13110259 -10532799 -7515321 -4385380 -1374687 1408493 3964138 6349735 8615120
39281 8615120 10746692 12637774 14095785 14890883 14835852 13866780 12087008 9753433 7213113
39272 7213113 4820682 2871982 1575743 1060162 1391334 2580786 4577443 7255922
39264 7255922 10416119 13803785 17155372 20258989 23006268 25404180 27536442 29498438
39256 29498438 31344823 33071884 34627826 35931935 36892946 37430481 37503879 37140269 36443049
39247 36443049 35568222 34678296 33901270 33316362 32964116 32862925 33020984 33446755 34160620
$$ packed form
39305B7809237j179849k040842k852112l505621l946735m186550m281698m288334
39297A527496m216477m013135l586042k858354j826979n90308O75260J778280
39289a3110259K577460L017478L129941L010693K783180K555645K385597K265385
39281H615120K131572J891082J458011P95098n5031r69072j779772k333575k540320
39272G213113k392431j948700j296239n15581L31172J189452J996657K678479
39264G255922L160197L387666L351587L103617K747279K397912K132262J961996
39256B9498438J846385J727061J555942J304109R61011N37535P3398l63610o97220
39247C6443049q74827q89926p77026n84908l52246j01191J58059M25771P13865
$$ plain form
39238 34160620 35198503 36595993 38355943 40416619 42636356 44800496 46651265 47940196
39230 47940196 48494347 48272473 47382473 46048660 44545212 43127795 41988306 41238476 40913288
39221 40913288 40982355 41363859 41943336 42600699 43240186 43807820 44284251 44659606 44913132
39212 44913132 45015234 44949216 44737921 44464562 44282288 44403297 45058743 46438815 48644073
39203 48644073 51677785 55481637 59989729 65170121 71036292 77628063 84974777 93060735
39195 93060735 101811339 111107580 120822853 130866896 141219207 151939012 163150234
39188 163150234 175012536 187694460 201359504 216167630 232287882 249910419 269239830
39181 269239830 290455482 313642608 338716097 365361079 393001370 420794819 447653749
$$ packed form
39238C4160620J037883J397490J759950K060676K219737K164140J850769J288931
39230D7940196N54151k21874q90000j333813j503448j417417j139489p49830l25188
39221D0913288O9067L81504N79477O57363O39487N67634M76431L75355K53526
39212D4913132J02102o6018k11295k73359j82274J21009O55446J380072K205258
39203D8644073L033712L803852M508092N180392N866171O591771P346714Q085958
39195I3060735Q750604R296241R715273J0044043J0352311J0719805J1211222
39188A63150234J1862302J2681924J3665044J4808126J6120252J7622537J9329411
39181B69239830K1215652K3187126K5073489K6644982K7640291K7793449K6858930
$$ plain form
39174 447653749 472295630 493334968 509425226 519443777 522684364 518996443 508813421
39167 508813421 493051133 472913843 449681589 424547083 398530600 372458577 346973381
39160 346973381 322550359 299514268 278054348 258238023 240026583 223300367 207897322
39153 207897322 193657734 180460845 168241431 156981527 146679695 137309259 128785280
39146 128785280 120958459 113638714 106634642 99792109 93025617 86344183 79868567 73825157
39138 73825157 68500012 64154236 60929391 58786219 57505204 56742943 56112018 55252984
39130 55252984 53886177 51845007 49091380 45708128 41866149 37775263 33637078 29616964
39122 29616964 25840651 22406090 19392271 16851094 14784911 13129280 11762085 10541869
$$ packed form
39174D47653749K4641881K1039338J6090258J0018551L240587l687921j0183022
39167E08813421j5762288k0137290k3232254k5134506k6016483k6072023k5485196
39160C46973381k4423022k3036091k1459920j9816325j8211440j6726216j5403045
39153B07897322j4239588j3196889j2219414j1259904j0301832r370436q523979
39146A28785280p826821p319745p004072o842533o766492o681434o475616o043410
39138G3825157n325145m345776l224845k143172j281015p62261o30925q59034
39130E5252984j366807k041170k753627l383252l841979m090886m138185m020114
39122B9616964l776313l434561l013819k541177k066183j655631j367195j220216
$$ plain form
39114 10541869 9354238 8137723 6877256 5579163 4253475 2920058 1635240 519512
39106 519512 -238357 -416405 174074 1624247 3904524 6895712 10450134 14441586 18779362
39097 18779362 23391637 28200487 33107746 37998366 42756866 47285661 51513062 55386350
39089 55386350 58858048 61880017 64412086 66437066 67968020 69041710 69703254 69989692
39081 69989692 69917237 69477434 68649103 67425469 65841046 63978137 61947890 59860771 57804994
39072 57804994 55838728 53990934 52265974 50650821 49123080 47657112 46228044 44814940
39064 44814940 43401351 41971190 40504839 38984875 37411770 35815547 34248008 32755338
39056 32755338 31346203 29973022 28537204 26919967 25028223 22832485 20373899 17737516
$$ packed form
39114A0541869j187631j216515j260467j298093j325688j333417j284818j115728
39106E19512p57869j78048N90479J450173K280277K991188L554422L991452M337776
39097A8779362M612275M808850M907259M890620M758500M528795M227401L873288
39089E5386350L471698L021969K532069K024980J530954J073690O61544K86438
39081F9989692p2455m39803q28331j223634j584423j862909k030247k087119k055777
39072E7804994j966266j847794j724960j615153j527741j465968j429068j413104
39064D4814940j413589j430161j466351j519964j573105j596223j567539j492670
39056C2755338j409135j373181j435818j617237j891744k195738k458586k636383
$$ plain form
39048 17737516 15012952 12267084 9535673 6825619 4122804 1409065 -1313316 -4005002
39040 -4005002 -6596006 -9009976 -11184099 -13070414 -14628864 -15833006 -16692192 -17268810
39032 -17268810 -17665536 -17980959 -18259074 -18464087 -18494421 -18227075 -17571625 -16513563 -15132193
39023 -15132193 -13586163 -12071116 -10765955 -9787780 -9167093 -8843003 -8674408 -8467199 -8018504
39014 -8018504 -7170662 -5857908 -4128862 -2138674 -115848 1686896 3048802 3833982
39006 3833982 4026719 3734655 3155259 2517817 2025183 1816936 1961353 2470037 3323743
38997 3323743 4498171 5979764 7765423 9848738 12203126 14772130 17470171 20191463
38989 20191463 22823546 25262165 27424975 29263819 30775587 32005521 33031715 33928810
$$ packed form
39048A7737516k724564k745868k731411k710054k702815k713739k722381k691686
39040d005002k591004k413970k174123j886315j558450j204142q59186n76618
39032a7268810l96726l15423k78115k05013l0334K67346O55450J058062J381370
39023a5132193J546030J515047J305161R78175O20687L24090J68595K07209M48695
39014h018504Q47842J312754J729046J990188K022826J802744J361906P85180
39006C833982J92737k92064n79396o37442m92634k08247J44417N08684Q53706
38997C323743J174428J481593J785659K083315K354388K569004K698041K721292
38989B0191463K632083K438619K162810J838844J511768J229934J026194Q97095
$$ plain form
38981 33928810 34729891 35415008 35937513 36270723 36444958 36555651 36741123 37140986 37852813
38972 37852813 38906107 40263327 41840978 43534572 45237798 46856862 48320543 49578964
38964 49578964 50586548 51280951 51582859 51431791 50843169 49946320 48967221 48155768 47698416
38955 47698416 47668339 48036238 48720606 49633982 50695697 51813510 52858599 53658876 54021732
38946 54021732 53780391 52845385 51238253 49091457 46614045 44037638 41562883 39321538
38938 39321538 37359989 35642540 34069910 32509182 30832629 28959594 26887485 24694359
38930 24694359 22507164 20453556 18629865 17104915 15946336 15232749 15025512 15310758
38922 15310758 15954437 16710502 17285805 17425514 16974387 15895301 14256770 12206545 9934415
$$ packed form
38981C3928810Q01081O85117N22505L33210J74235J10693J85472L99863P11827
38972C7852813J053294J357220J577651J693594J703226J619064J463681J258421
38964D9578964J007584O94403L01908j51068n88622q96849r79099q11453m57352
38955D7698416l0077L67899O84368R13376J061715J117813J045089Q00277L62856
38946E4021732k41341r35006j607132k146796k477412k576407k474755k241345
38938C9321538j961549j717449j572630j560728j676553j873035k072109k193126
38930B4694359k187195k053608j823691j524950j158579p13587k07237K85246
38922A5310758O43679P56065N75303J39709m51127j079086j638531k050225k272130
$$ plain form
38913 9934415 7622751 5398709 3315108 1374513 -419883 -2023668 -3351321 -4319984
38905 -4319984 -4909554 -5196694 -5333269 -5477373 -5720808 -6058636 -6411824 -6676248 -6762763 -6612767
38895 -6612767 -6195487 -5500061 -4530287 -3302802 -1844378 -183704 1661115 3691148 5924330
38886 5924330 8384462 11088674 14035693 17193192 20489068 23818233 27067263 30139897
38878 30139897 32962798 35472323 37604557 39304480 40542336 41310522 41592250 41325752
38870 41325752 40400151 38697856 36161798 32844470 28904991 24552062 19963496 15228949
38862 15228949 10352842 5321254 195498 -4826332 -9419738 -13208984 -15863033 -17168920
38854 -17168920 -17066227 -15648657 -13142782 -9870668 -6202730 -2507453 897096 3784404
$$ packed form
38913I934415k311664k224042k083601j940595j794396j603785j327653r68663
38905d319984n89570k87140j36575j44104k43435l37828l53188k64424q6515J49996
38895f612767M17280O95426R69774J227485J458424J660674J844819K030033K233182
38886E924330K460132K704212K947019L157499L295876L329165L249030L072634
38878C0139897K822901K509525K132234J699923J237856P68186K81728k66498
38870D1325752r25601j702295k536058l317328l939479m352929m588566m734547
38862A5228949m876107n031588n125756n021830m593406l789246k654049j305887
38854a7168920J02693J417570K505875L272114L667938L695277L404549K887308
$$ plain form
38846 3784404 6043095 7672577 8750703 9387469 9684743 9716528 9532019 9172018 8684124
38837 8684124 8127330 7567027 7066505 6677784 6430865 6322934 6312980 6325516 6261596 6012996
38827 6012996 5478036 4580974 3297125 1680281 -120613 -1873439 -3310454 -4195744 -4382448
38818 -4382448 -3837581 -2633045 -915845 1127943 3305705 5443138 7401582 9088005
38810 9088005 10454637 11488678 12204309 12652067 12940011 13235518 13722136 14526244 15662330
38801 15662330 17035067 18491721 19883492 21098015 22056507 22696670 22964488 22819172 22238709
38792 22238709 21215897 19749187 17838717 15490500 12724996 9589113 6173062 2626202
38784 2626202 -841784 -3983147 -6553563 -8361342 -9312158 -9435497 -8877985 -7858817 -6602052
$$ packed form
38846C784404K258691J629482J078126O36766K97274L1785j84509l60001m87894
38837H684124n56794n60303n00522l88721k46919j07931r954J2536o3920k48600
38827F012996n34960q97062j283849j616844j800894j752826j437015q85290j86704
38818d382448N44867J204536J717200K043788K177762K137433J958444J686423
38810I088005J366632J034041P15631M47758K87944K95507M86618Q04108J136086
38801A5662330J372737J456654J391771J214523R58492O40163K67818j45316n80463
38792B2238709j022812j466710j910470k348217k765504l135883l416051l546860
38784B626202l467986l141363k570416j807779r50816j23339N57512J019168J256765
$$ plain form
38775 -6602052 -5274026 -3951143 -2628922 -1265835 160666 1617441 3021000 4281107
38767 4281107 5352473 6259085 7075528 7878790 8701749 9514533 10237614 10769485 11008522
38758 11008522 10861715 10246399 9094433 7364962 5067708 2291001 -783297 -3899884
38750 -3899884 -6790640 -9252763 -11205754 -12700692 -13883629 -14936355 -16020138 -17236187
38742 -17236187 -18604252 -20057791 -21459216 -22639524 -23453889 -23827084 -23761902 -23307776 -22515894
38733 -22515894 -21413542 -20010485 -18325235 -16409334 -14353898 -12274839 -10284897 -8468093
38725 -8468093 -6870683 -5511477 -4402117 -3564002 -3032609 -2846222 -3022982 -3537907 -4314182
38716 -4314182 -5234501 -6164799 -6978722 -7578770 -7915648 -8001414 -7904623 -7720975 -7529431 -7355126
$$ packed form
38775f602052J328026J322883J322221J363087J426501J456775J403559J260107
38767D281107J071366R06612Q16443Q03262Q22959Q12784P23081N31871K39037
38758A1008522j46807o15316j151966j729471k297254k776707l074298l116587
38750c899884k890756k462123j952991j494938j182937j052726j083783j216049
38742a7236187j368065j453539j401425j180308q14365l73195O5182M54126P91882
38733b2515894J102352J403057J685250J915901K055436K079059J989942J816804
38725h468093J597410J359206J109360Q38115N31393J86387j76760n14925p76275
38716d314182r20319r30298q13923o00048l36878q5766R6791J83648J91544J74305
$$ plain form
38706 -7355126 -7156450 -6839543 -6290812 -5413912 -4161960 -2561880 -728106 1143042 2808508
38697 2808508 4041363 4700486 4777099 4397003 3775712 3140829 2649359 2334738 2110250
38688 2110250 1828353 1364633 683816 -139861 -950308 -1567713 -1849212 -1722595 -1177324
38679 -1177324 -226055 1125852 2871220 4956195 7236939 9475652 11383585 12687062
38671 12687062 13183501 12768229 11433385 9252083 6360081 2938981 -800533 -4636086
38663 -4636086 -8349411 -11739078 -14631512 -16892527 -18440650 -19263390 -19434471 -19119983 -18553740
38654 -18553740 -17974183 -17546079 -17311274 -17197908 -17076996 -16827272 -16376551 -15715666 -14898309
38645 -14898309 -14035008 -13275340 -12769353 -12612634 -12798124 -13203173 -13623630 -13838905 -13675830
$$ packed form
38706g355126J98676L16907N48731Q76900J251952J600080J833774J871148J665466
38697B808508J232855O59123P6613l80096o21291o34883m91470l14621k24488
38688B110250k81897m63720o80817q23677q10447o17405k81499J26617N45271
38679a177324R51269J351907J745368K084975K280744K238713J907933J303477
38671A2687062M96439m15272j334844k181302k892002l421100l739514l835553
38663d636086l713325l389667k892434k261015j548123q22740j71081L14488N66243
38654a8553740N79557M28104K34805J13366J20912K49724M50721O60885Q17357
38645a4898309Q63301P59668N05987J56719j85490m05049m20457k15275J63075
$$ plain form
38636 -13675830 -13047101 -11961121 -10512409 -8858399 -7182614 -5649559 -4368537 -3384928
38628 -3384928 -2701268 -2310211 -2215819 -2432741 -2970899 -3820758 -4949055 -6305416 -7834897
38619 -7834897 -9490534 -11240709 -13068030 -14960270 -16898434 -18848305 -20758689 -22564927
38611 -22564927 -24194696 -25575153 -26642780 -27356009 -27706812 -27725860 -27480459 -27071462 -26635364
38602 -26635364 -26346545 -26402807 -26981865 -28179460 -29960451 -32150978 -34476643 -36632364 -38365398
38593 -38365398 -39551744 -40237415 -40615569 -40937301 -41395946 -42044295 -42781785 -43405769 -43691613
38584 -43691613 -43463755 -42634650 -41209238 -39270031 -36962330 -34486452 -32085754 -30014504
38576 -30014504 -28483352 -27599701 -27330275 -27507352 -27881284 -28199292 -28278034 -28043753 -27532667
$$ packed form
38636a3675830O28729J085980J448712J654010J675785J533055J281022R83609
38628c384928O83660L91057R4392k16922n38158q49859j128297j356361j529481
38619g834897j655637j750175j827321j892240j938164j949871j910384j806238
38611b2564927j629769j380457j067627p13229l50803j9048K45401M08997M36098
38602b6635364K88819n6262n79058j197595j780991k190527k325665k155721j733034
38593c8365398j186346o85671l78154l21732m58645o48349p37490o23984k85844
38584d3691613K27858Q29105J425412J939207K307701K475878K400698K071250
38576c0014504J531152Q83651K69426j77077l73932l18008p8742K34281N11086
$$ plain form
38567 -27532667 -26860022 -26171571 -25591779 -25184610 -24941507 -24800972 -24687700 -24547168 -24354377
38558 -24354377 -24094118 -23732629 -23207382 -22445291 -21395033 -20050255 -18452063 -16674436 -14801693
38549 -14801693 -12906321 -11034855 -9205195 -7409259 -5612230 -3751816 -1752880 437025
38541 437025 2810946 5294263 7773781 10142757 12331094 14306562 16055038 17556815
38533 17556815 18770534 19626695 20028394 19859907 19007926 17397669 15035343 12037708 8629035
38524 8629035 5098987 1735932 -1233612 -3670913 -5511582 -6736634 -7360187 -7444823 -7125082
38515 -7125082 -6608244 -6137308 -5927603 -6105392 -6675911 -7532422 -8496158 -9363376 -9940894
38506 -9940894 -10070489 -9654178 -8682968 -7252791 -5547962 -3791371 -2182431 -848050 179002
$$ packed form
38567b7532667O72645O88451N79792M07169K43103J40535J13272J40532J92791
38558b4354377K60259L61489N25247P62091J050258J344778J598192J777627J872743
38549a4801693J895372J871466J829660J795936J797029J860414J998936K189905
38541D37025K373921K483317K479518K368976K188337J975468J748476J501777
38533A7556815J213719Q56161M01699j68487q51981j610257k362326k997635l408673
38524H629035l530048l363055k969544k437301j840669j225052o23553q4636L19741
38515g125082N16838M70936K09705j77789n70519q56511r63736q67218n77518
38506i940894j29595M16311R71210J430177J704829J756591J608940J334381J027052
$$ plain form
38497 179002 949645 1555900 2065847 2462731 2621842 2341076 1409069 -325303 -2912861
38488 -2912861 -6302735 -10368599 -14942395 -19839793 -24874304 -29866499 -34652815 -39091680
38480 -39091680 -43066039 -46488855 -49315521 -51552909 -53250379 -54475674 -55296623 -55780786
38472 -55780786 -55999899 -56019704 -55877211 -55565427 -55035170 -54202443 -52949735 -51130287 -48595398
38463 -48595398 -45248795 -41104679 -36315582 -31152270 -25946554 -21027065 -16675146 -13108628
38455 -13108628 -10482610 -8892028 -8368919 -8876924 -10309987 -12502092 -15252438 -18364642
38447 -18364642 -21689467 -25152815 -28751537 -32513330 -36438587 -40456470 -44419999 -48137320
38439 -48137320 -51410781 -54055025 -55891168 -56742335 -56459448 -54979314 -52382428 -48907922
$$ packed form
38497A79002P70643O06255N09947L96884J59111k80766r32007j734372k587558
38488b912861l389874m065864m573796m897398n034511m992195m786316m438865
38480c9091680l974359l422816k826666k237388j697470j225295q20949m84163
38472e5780786k19113j9805J42493L11784N30257Q32727J252708J819448K534889
38463d8595398L346603M144116M789097N163312N205716M919489M351919L566518
38455a3108628K626018J590582N23109n08005j433063k192105k750346l112204
38447a8364642l324825l463348l598722l761793l925257m017883l963529l717321
38439d8137320l273461k644244j836143q51167K82887J480134K596886L474506
$$ plain form
38431 -48907922 -44909770 -40778565 -36869902 -33462743 -30743419 -28801724 -27634267 -27156833
38423 -27156833 -27223223 -27643281 -28196095 -28640905 -28731064 -28235565 -26969896 -24831601 -21828378
38414 -21828378 -18085817 -13831145 -9359914 -4995152 -1044749 2239223 4693683 6262670
38406 6262670 6994573 7017938 6503613 5628684 4558148 3449099 2464993 1777703 1542910
38397 1542910 1856003 2714255 4010330 5563200 7172804 8678534 10005555 11185590
38389 11185590 12341316 13635119 15200950 17085635 19216765 21401206 23353826 24753941
38381 24753941 25317284 24860765 23339418 20848225 17592263 13832727 9821241 5741747
38373 5741747 1679261 -2376003 -6493976 -10752758 -15186297 -19748590 -24304654 -28648431
$$ packed form
38431d8907922L998152M131205L908663L407159K719324J941695J167457M77434
38423b7156833o6390m20058n52814m44810r0159M95499J265669K138295L003223
38414b1828378L742561M254672M471231M364762L950403L283972K454460J568987
38406F262670P31903K3365n14325q74929j070536j109049r84106o87290k34793
38397A542910L13093Q58252J296075J552870J609604J505730J327021J180035
38389A1185590J155726J293803J565831J884685K131130K184441J952620J400115
38381B4753941N63343m56519j521347k491193l255962l759536m011486m079494
38373E741747m062486m055264m117973m258782m433539m562293m556064m343777
$$ plain form
38365 -28648431 -32542764 -35776856 -38231243 -39926946 -41030851 -41807909 -42540824 -43453331
38357 -43453331 -44664691 -46184901 -47946572 -49860003 -51869074 -53983055 -56270430 -58819100
38349 -58819100 -61679745 -64811510 -68048758 -71106995 -73636374 -75307168 -75888293 -75281687
38341 -75281687 -73506467 -70660464 -66891835 -62388810 -57370735 -52064062 -46667983 -41330404
38333 -41330404 -36149193 -31192627 -26516918 -22162741 -18134473 -14385818 -10832851 -7390727
38325 -7390727 -4008649 -682259 2553727 5635486 8473730 10957202 12964323 14382597
38317 14382597 15130264 15175704 14549262 13339498 11671005 9673854 7461564 5126019 2743223
38308 2743223 377761 -1921375 -4132399 -6272302 -8398994 -10598547 -12959636 -15541724
$$ packed form
38365b8648431l894333l234092k454387j695703j103905p77058p32915r12507
38357d3453331j211360j520210j761671j913431k009071k113981k287375k548670
38349e8819100k860645l131765l237248l058237k529379j670794n81125O06606
38341g5281687J775220K846003L768629M503025N018075N306673N396079N337579
38333d1330404N181211M956566M675709M354177M028268L748655L552967L442124
38325g390727L382078L326390L235986L081759K838244K483472K007121J418274
38317A4382597P47667M5440o26442j209764j668493j997151k212290k335545k382796
38308B743223k365462k299136k211024k139903k126692k199553k361089k582088
$$ plain form
38300 -15541724 -18342495 -21270696 -24136824 -26676099 -28604836 -29691139 -29813657 -28992794
38292 -28992794 -27391704 -25288053 -23019185 -20912441 -19222350 -18094207 -17559998 -17560184 -17979712
38283 -17979712 -18685077 -19549573 -20460267 -21312273 -22004163 -22444755 -22569645 -22355865 -21821791
38274 -21821791 -21007001 -19940095 -18614618 -16994159 -15051552 -12822369 -10438780 -8119648
38266 -8119648 -6119209 -4659231 -3873398 -3780607 -4288446 -5218850 -6346772 -7446177 -8338816
38257 -8338816 -8935422 -9252102 -9390899 -9495291 -9708699 -10155286 -10935115 -12112047 -13687998
38248 -13687998 -15580922 -17627419 -19613423 -21319379 -22563023 -23228496 -23277275 -22743072 -21717441
38239 -21717441 -20331188 -18731778 -17057508 -15415869 -13875045 -12469111 -11208999 -10093781
$$ packed form
38300a5541724k800771k928201k866128k539275j928737j086303j22518Q20863
38292b8992794J601090K103651K268868K106744J690091J128143N34209j86m19528
38283a7979712p05365q64496r10694q52006o91890m40592j24890K13780N34074
38274b1821791Q14790J066906J325477J620459J942607K229183K383589K319132
38266h119648K000439J459978P85833R2791n07839r30404j127922j099405q92639
38257h338816n96606l16680j38797j04392k13408m46587p79829j176932j575951
38248a3687998j892924k046497j986004j705956j243644o65473m8779N34203J025631
38239b1717441J386253J599410J674270J641639J540824J405934J260112J115218
$$ plain form
38231 -10093781 -9124079 -8318788 -7726997 -7422660 -7477712 -7923223 -8716966 -9735559 -10800595
38222 -10800595 -11731387 -12398764 -12750404 -12797722 -12583440 -12159697 -11589426 -10958657 -10379663
38213 -10379663 -9976052 -9854419 -10073306 -10622858 -11428120 -12378507 -13367876 -14321152 -15196149
38204 -15196149 -15970292 -16629484 -17166210 -17581007 -17878984 -18060155 -18110693 -18004561 -17718668
38195 -17718668 -17253254 -16643223 -15952642 -15257274 -14625537 -14103833 -13706955 -13415310 -13182940
38186 -13182940 -12956138 -12693105 -12369779 -11963288 -11421227 -10640463 -9478365 -7798354 -5526034
38177 -5526034 -2684135 610221 4178904 7825893 11368925 14646609 17500895 19749731
38169 19749731 21174190 21539372 20649099 18412421 14890420 10301026 4980836 -679080
$$ packed form
38231a0093781R69702Q05291N91791L04337n5052m45511p93743j018593j065036
38222a0800595r30792o67377l51640m7318K14282M23743N70271O30769N78994
38213a0379663M03611J21633k18887n49552q05262r50387r89369r53276q74997
38204a5196149p74143o59192n36726m14797k97977j81171n0538J06132K85893
38195a7718668M65414O10031O90581O95368O31737N21704L96878K91645K32370
38186a3182940K26802K63033L23326M06491N42061P80764J162098J680011K272320
38177e526034K841899L294356L568683L646989L543032L277684K854286K248836
38169A9749731J424459L65182q90273k236678l522001m589394n320190n659916
$$ plain form
38161 -679080 -6301680 -11581145 -16319875 -20439209 -23960704 -26962881 -29529115 -31707810
38153 -31707810 -33499728 -34870212 -35768306 -36135464 -35905243 -35012003 -33419474 -31153907 -28311493
38144 -28311493 -25026451 -21419847 -17566529 -13502340 -9261583 -4913372 -570438 3632178
38136 3632178 7568923 11142344 14278820 16909719 18955096 20323811 20934137 20748443
38128 20748443 19808472 18255775 16325000 14305642 12480931 11066805 10178161 9835518
38120 9835518 10001117 10618779 11635908 13000435 14639083 16433834 18218968 19812637
38112 19812637 21073197 21949069 22492909 22835012 23134366 23531687 24119390 24931000 25944829
38103 25944829 27095850 28293701 29447157 30490508 31398932 32180421 32846230 33379110 33721685
$$ packed form
38161f79080n622600n279465m738730m119334l521495l002177k566234k178695
38153c1707810j791918j370484q98094l67158K30221Q93240J592529K265567K842414
38144b8311493L285042L606604L853318M064189M240757M348211M342934M202616
38136C632178L936745L573421L136476K630899K045377J368715O10326j85694
38128B0748443r39971j552697j930775k019358j824711j414126q88644l42643
38120I835518J65599O17662J017129J364527J638648J794751J785134J593669
38112A9812637J260560Q75872N43840L42103K99354L97321N87703Q11610J013829
38103B5944829J151021J197851J153456J043351R08424P81489O65809N32880L42575
$$ plain form
38094 33721685 33791827 33511271 32827213 31719057 30199557 28321855 26190080 23959127 21814110
38085 21814110 19935280 18462490 17469939 16956614 16856306 17066892 17488526 18053659 18737443
38076 18737443 19549683 20516867 21662555 22992798 24491991 26128441 27859979 29629734
38068 29629734 31355120 32924652 34210697 35087888 35440987 35162299 34156767 32367523
38060 32367523 29810305 26590546 22888644 18922607 14908300 11029703 7417875 4132301
38052 4132301 1145203 -1660015 -4463462 -7457266 -10786969 -14510319 -18585940 -22888954
38044 -22888954 -27244201 -31466545 -35394609 -38904733 -41903601 -44312381 -46057351 -47072756
38036 -47072756 -47314572 -46781538 -45534280 -43696995 -41433144 -38905932 -36245376 -33534905
$$ packed form
38094C3721685P0142k80556o84058j108156j519500j877702k131775k230953k145017
38085B1814110j878830j472790r92551n13325j00308K10586M21634N65133O83784
38076A8737443Q12240R67184J145688J330243J499193J636450J731538J769755
38068B9629734J725386J569532J286045Q77191L53099k78688j005532j789244
38060C2367523k557218l219759l701902l966037m014307l878597l611828l285574
38052D132301k987098k805218k803447k993804l329703l723350m075621m303014
38044b2888954m355247m222344l928064l510124k998868k408780j744970j015405
38036d7072756k41816N33034J247258J837285K263851K527212K660556K710471
$$ plain form
38028 -33534905 -30816231 -28107430 -25429161 -22827238 -20375151 -18151911 -16209336 -14547039
38020 -14547039 -13102270 -11755222 -10354216 -8761990 -6906524 -4807530 -2562628 -304486
38012 -304486 1845456 3808111 5557612 7113965 8522020 9825447 11047658 12189864
38004 12189864 13248220 14240634 15224305 16285788 17501146 18886416 20370094 21808125
37996 21808125 23035219 23923300 24414181 24511709 24246825 23646557 22730604 21534088 20135920
37987 20135920 18673548 17337706 16348900 15919256 16207861 17284074 19111395 21553772
37979 21553772 24398556 27390487 30269876 32801911 34785356 36046254 36438940 35869309
37971 35869309 34327677 31900972 28746344 25037424 20913158 16454633 11696536 6662187
$$ packed form
38028c3534905K718674K708801K678269K601923K452087K223240J942575J662297
38020a4547039J444769J347048J401006J592226J855466K098994K244902K258142
38012c04486K149942J962655J749501J556353J408055J303427J222211J142206
38004A2189864J058356R92414R83671J061483J215358J385270J483678J438031
37996B1808125J227094Q88081M90881R7528k64884o00268r15953j196516j398168
37987B0135920j462372j335842r88806m29644K88605J076213J827321K442377
37979B1553772K844784K991931K879389K532035J983445J260898L92686n69631
37971C5869309j541632k426705l154628l708920m124266m458525m758097n034349
$$ plain form
37963 6662187 1404187 -3964059 -9254454 -14213631 -18558765 -22033073 -24459418 -25765265
37955 -25765265 -25967693 -25133406 -23343223 -20681348 -17247437 -13174113 -8633753 -3829679
37947 -3829679 1023786 5725600 10111742 14075409 17581177 20669526 23446043 26050477
37939 26050477 28609409 31189820 33776774 36287407 38612437 40662201 42395736 43823644
37931 43823644 44989085 45941009 46716963 47346463 47871864 48370353 48957461 49762600 50885580
37922 50885580 52358152 54133580 56107945 58154814 60149830 61976164 63518630 64658794
37914 64658794 65277959 65269405 64557950 63120308 60995252 58274146 55071437 51486249 47573826
37905 47573826 43343829 38790103 33938935 28890626 23829674 18991266 14592749 10761520
$$ packed form
37963F662187n258000n368246n290395m959177m345134l474308k426345j305847
37955b5765265k02428Q34287J790183K661875L433911M073324M540360M804074
37947c829679M853465M701814M386142L963667L505768L088349K776517K604434
37939B6050477K558932K580411K586954K510633K325030K049764J733535J427908
37931D3823644J165441R51924P75954O29500N25401M98489N87108Q05139J122980
37922E0885580J472572J775428J974365K046869J995016J826334J542466J140164
37914F4658794O19165q554p11455j437642k125056k721106l202709l585188l912423
37905D7573826m229997m553726m851168n048309n060952m838408m398517l831229
$$ plain form
37897 10761520 7500544 4714450 2279981 116598 -1780666 -3355115 -4535072 -5291228
37889 -5291228 -5679341 -5844632 -5981604 -6270837 -6827004 -7677740 -8770692 -9999168 -11241096
37880 -11241096 -12403657 -13456521 -14436039 -15417930 -16474839 -17643208 -18916687 -20265230
37872 -20265230 -21661202 -23090683 -24544213 -26001115 -27424179 -28766925 -29983314 -31032388
37864 -31032388 -31879072 -32494643 -32857650 -32956445 -32796486 -32412517 -31879108 -31311988 -30859084
37855 -30859084 -30686322 -30962928 -31846706 -33466758 -35900576 -39144999 -43087896 -47496992
37847 -47496992 -52043060 -56359073 -60113319 -63064214 -65078964 -66123907 -66246731 -65560213
37839 -65560213 -64220048 -62388148 -60190413 -57694774 -54931011 -51948361 -48879000 -45965050
$$ packed form
37897A0761520l260976k786094k434469k163383j897264j574449j179957p56156
37889e291228l88113j65291j36972k89233n56167q50736j092952j228476j241928
37880a1241096j162561j052864r79518r81891j056909j168369j273479j348543
37872b0265230j395972j429481j453530j456902j423064j342746j216389j049074
37864c1032388q46684o15571l63007r8795J59959L83969N33409N67120M52904
37855c0859084J72762k76606q83778j620052k433818l244423l942897m409096
37847d7496992m546068m316013l754246k950895k014750j044943j22824O86518
37839f5560213J340165J831900K197735K495639K763763K982650L069361K913950
$$ plain form
37831 -45965050 -43521142 -41837139 -41061066 -41121011 -41731159 -42483505 -42978299 -42926755 -42183615
37822 -42183615 -40715532 -38547459 -35729189 -32335302 -28481400 -24331366 -20084721 -15951542
37814 -15951542 -12127248 -8772316 -5996541 -3850254 -2326563 -1371854 -895274 -773933
37806 -773933 -862894 -1019558 -1137825 -1175818 -1163687 -1186676 -1344609 -1698726 -2233430 -2863736
37796 -2863736 -3490310 -4062601 -4601708 -5171785 -5833397 -6618614 -7536386 -8586130 -9757131
37787 -9757131 -11013863 -12285313 -13473147 -14476285 -15218471 -15670304 -15866297 -15914517 -15985715
37778 -15985715 -16271544 -16923575 -18004406 -19477498 -21239261 -23177174 -25229474 -27419936
37770 -27419936 -29846644 -32624079 -35806286 -39332209 -43019432 -46603292 -49798802 -52362320
$$ packed form
37831d5965050K443908J684003P76073n9945o10148p52346m94794N1544P43140
37822d2183615J468083K168073K818270L393887L853902M150034M246645M133179
37814a5951542L824294L354932K775775K146287J523691R54709M76580J21341
37806g73933q8961j56664j18267l7993J2131k2989j57933l54117n34704o30306
37796b863736o26574n72291n39107n70077o61612p85217r17772j049744j171001
37787i757131j256732j271450j187834j003138p42186m51833j95993m8220p1198
37778a5985715k85829o52031j080831j473092j761763j937913k052300k190462
37770b7419936k426708k777435l182207l525923l687223l583860l195510k563518
$$ plain form
37762 -52362320 -54139610 -55093300 -55302085 -54924621 -54133069 -53041221 -51661402 -49910345 -47658600
37753 -47658600 -44802189 -41333178 -37385366 -33231149 -29220135 -25681172 -22833032 -20742644
37745 -20742644 -19341380 -18484237 -18025087 -17878447 -18042679 -18575980 -19540303 -20943449 -22706055
37736 -22706055 -24664867 -26608052 -28327358 -29666171 -30545035 -30958020 -30948170 -30577098 -29899389
37727 -29899389 -28944113 -27703205 -26130587 -24157666 -21724572 -18816744 -15492594 -11891615
37719 -11891615 -8219015 -4710508 -1589015 972163 2873218 4103639 4753355 5008045
37711 5008045 5111485 5295649 5706531 6362551 7164819 7950426 8559883 8886019 8884621 8550481
37701 8550481 7881477 6854817 5426930 3554812 1228456 -1501464 -4517221 -7655109
$$ packed form
37762e2362320j777290r53690k08785L77464P91552J091848J379819J751057K251745
37753d7658600K856411L469011L947812M154217M011014L538963K848140K090388
37745b0742644J401264Q57143M59150J46640j64232n33301r64323j403146j762606
37736b2706055j958812j943185j719306j338813q78864m12985R850L71072O77709
37727b9899389R55276J240908J572618J972921K433094K907828L324150L600979
37719a1891615L672600L508507L121493K561178J901055J230421O49716K54690
37711E008045J03440J84164M10882O56020Q02268P85607O09457L26136j398l34140
37701H550481o69004j026660j427887j872118k326356k729920l015757l137888
$$ plain form
37693 -7655109 -10742641 -13632151 -16219976 -18455180 -20345444 -21958241 -23406360 -24811802
37685 -24811802 -26260404 -27774167 -29320121 -30845259 -32303699 -33650884 -34813593 -35669532
37677 -35669532 -36062753 -35851247 -34958494 -33398816 -31265124 -28692708 -25825967 -22806312
37669 -22806312 -19777581 -16890998 -14296736 -12124783 -10468237 -9380561 -8888288 -9009169
37661 -9009169 -9761228 -11155471 -13178256 -15775349 -18844357 -22235142 -25757752 -29199960
37653 -29199960 -32353993 -35046059 -37159651 -38646200 -39521616 -39852717 -39740372 -39303309 -38660594
37644 -38660594 -37910096 -37106626 -36248641 -35280947 -34116645 -32676696 -30936357 -28957851 -26892405
37635 -26892405 -24954084 -23381820 -22399292 -22170595 -22756218 -24090309 -25997501 -28241291
$$ packed form
37693g655109l087532k889510k587825k235204j890264j612797j448119j405442
37685b4811802j448602j513763j545954j525138j458440j347185j162709q55939
37677c5669532l93221K11506Q92753J559678K133692K572416K866741L019655
37669b2806312L028731K886583K594262K171953J656546J087676M92273j20881
37661i009169p52059j394243k022785k597093l069008l390785l522610l442208
37653b9199960l154033k692066k113592j486549q75416l31101J12345M37063O42715
37644c8660594P50498Q03470Q57985R67694J164302J439949J740339J978506K065446
37635b6892405J938321J572264R82528K28697n85623j334091j907192k243790
$$ plain form
37627 -28241291 -30575359 -32775752 -34653662 -36062499 -36912060 -37192237 -36993697 -36502280 -35951966
37618 -35951966 -35549045 -35404663 -35509598 -35756746 -35989882 -36051179 -35812068 -35186963 -34136145
37609 -34136145 -32662031 -30799430 -28601822 -26130428 -23453214 -20653518 -17838732 -15136493
37601 -15136493 -12672370 -10536947 -8763494 -7337258 -6236687 -5479147 -5135301 -5297711
37593 -5297711 -6021369 -7269621 -8891782 -10641110 -12226260 -13379112 -13917501 -13783293 -13043046
37584 -13043046 -11849776 -10380190 -8775710 -7113742 -5414095 -3661906 -1824589 143973
37576 143973 2303136 4717463 7436136 10463933 13736487 17115393 20409832 23415994
37568 23415994 25958676 27925855 29293888 30138456 30622504 30959074 31359994 31987103 32918129
$$ packed form
37627b8241291k334068k200393j877910j408837q49561k80177J98540M91417N50314
37618c5951966M02921J44382j04935k47148k33136o1297K39111O25105J050818
37609c4136145J474114J862601K197608K471394K677214K799696K814786K702239
37601a5136493K464123K135423J773453J426236J100571P57540L43846j62410
37593e297711p23658j248252j622161j749328j585150j152852n38389J34208P40247
37584a3043046J193270J469586J604480J661968J699647J752189J837317J968562
37576A43973K159163K414327K718673L027797L272554L378906L294439L006162
37568B3415994K542682J967179J368033Q44568M84048L36570M00920O27109R31026
$$ plain form
37559 32918129 34133442 35527090 36941309 38214983 39228873 39930054 40325726 40449057
37551 40449057 40313179 39877448 39046227 37704256 35772763 33258465 30270906 27000277
37543 27000277 23667423 20468553 17535691 14926492 12649158 10716129 9202110 8269193
37535 8269193 8132330 8972639 10841098 13605255 16970122 20565468 24056294 27220522
37527 27220522 29957672 32236004 34024430 35260200 35870552 35823423 35163546 34007979 32510560
37518 32510560 30825607 29090521 27419399 25886421 24494403 23152309 21693139 19938785
37510 19938785 17783009 15249607 12500430 9798573 7448664 5730618 4831744 4784605
37502 4784605 5432282 6446105 7399282 7869300 7530712 6214566 3930148 850903 -2734120
$$ packed form
37559C2918129J215313J393648J414219J273674J013890P01181L95672J23331
37551D0449057j35878m35731q31221j341971j931493k514298k987559l270629
37543B7000277l332854l198870k932862k609199k277334j933029j514019r32917
37535H269193j36863Q40309J868459K764157L364867L595346L490826L164228
37527B7220522K737150K278332J788426J235770O10352m7129o59877j155567j497419
37518C2510560j684953j735086j671122j532978j392018j342094j459170j754354
37510A9938785k155776k533402k749177k701857k349909j718046q98874m7139
37502D784605O47677J013823R53177M70018l38588j316146k284418l079245l585023
$$ plain form
37493 -2734120 -6493266 -10124992 -13403706 -16189757 -18415481 -20063951 -21147473 -21686059
37485 -21686059 -21690524 -21161204 -20107984 -18581853 -16696822 -14625318 -12566680 -10704479 -9173187
37476 -9173187 -8046275 -7342424 -7035060 -7052309 -7268996 -7506995 -7560439 -7245109 -6450071 -5162833
37466 -5162833 -3455250 -1445862 728874 2914407 4921392 6525834 7505964 7701394
37458 7701394 7059678 5646081 3618069 1182155 -1448586 -4084155 -6570594 -8792217
37450 -8792217 -10673711 -12184553 -13335400 -14157294 -14673952 -14893396 -14834940 -14575714 -14277060
37441 -14277060 -14159030 -14425543 -15176928 -16356802 -17761832 -19109326 -20128841 -20635278 -20555657
37432 -20555657 -19909682 -18767500 -17213175 -15328882 -13195250 -10892590 -8493259 -6051388
$$ packed form
37493b734120l759146l631726l278714k786051k225724j648470j083522n38586
37485b1686059m465N29320J053220J526131J885031K071504K058638J862201J531292
37476i173187J126912P03851L07364j7249k16687k37999n3444L15330P95038J287238
37466e162833J707583K009388K174736K185533K006985J604442R80130J95430
37458G701394o41716j413597k028012k435914k630741k635569k486439k221623
37450h792217j881494j510842j150847q21894n16658k19444N8456K59226K98654
37441a4277060J18030k66513p51385j179874j405030j347494j019515n06437P9621
37432b0555657O45975J142182J554325J884293K133632K302660K399331K441871
$$ plain form
37424 -6051388 -3606862 -1211998 1033912 2972884 4418723 5218235 5309433 4747480 3690136
37415 3690136 2351779 942392 -388347 -1581723 -2665938 -3727043 -4875788 -6223778
37407 -6223778 -7866523 -9865743 -12232939 -14925169 -17857955 -20924847 -24007393 -26971733
37399 -26971733 -29664848 -31924740 -33603289 -34587565 -34808834 -34241406 -32899259 -30834679
37391 -30834679 -28139060 -24945094 -21426424 -17785901 -14227480 -10922868 -7996597 -5543612
37383 -5543612 -3665896 -2494888 -2175454 -2818225 -4452689 -7011504 -10350977 -14287544
37375 -14287544 -18626279 -23173299 -27740640 -32154595 -36268838 -39974860 -43202533 -45910034
37367 -45910034 -48067958 -49643793 -50592138 -50855328 -50377692 -49131696 -47146160 -44520736
$$ packed form
37424f051388K444526K394864K245910J938972J445839P99512R1198n61953j057344
37415C690136j338357j409387j330739j193376j084215j061105j148745j347990
37407f223778j642745j999220k367196k692230k932786l066892l082546k964340
37399b6971733k693115k259892j678549r84276k21269N67428J342147K064580
37391c0834679K695619L193966L518670L640523L558421L304612K926271K452985
37383e543612J877716J171008L19434o42771j634464k558815l339473l936567
37375a4287544m338735m547020m567341m413955m114243l706022l227673k707501
37367d5910034k157924j575835r48345k63190M77636J245996J985536K625424
$$ plain form
37359 -44520736 -41414100 -38006855 -34456588 -30869850 -27306560 -23811636 -20450339 -17321049
37351 -17321049 -14533678 -12164552 -10215844 -8607775 -7211687 -5904081 -4609433 -3314950
37343 -3314950 -2065970 -957384 -120868 303184 207693 -445432 -1615304 -3198080 -5055876
37334 -5055876 -7046502 -9045946 -10956461 -12699631 -14205860 -15413321 -16275235 -16763453
37326 -16763453 -16865032 -16582949 -15948655 -15035915 -13958260 -12848007 -11833358 -11028624 -10533734
37317 -10533734 -10427202 -10746969 -11474118 -12539270 -13851295 -15324455 -16882145 -18442077
37309 -18442077 -19907029 -21174774 -22156312 -22784634 -23011652 -22805278 -22155340 -21084845 -19657200
37300 -19657200 -17972479 -16151043 -14309358 -12539455 -10903424 -9443592 -8196338 -7195488
$$ packed form
37359d4520736L106636L407245L550267L586738L563290L494924L361297L129290
37351a7321049K787371K369126J948708J608069J396088J307606J294648J294483
37343c314950J248980J108586Q36516M24052r5491o53125j169872j582776j857796
37334e055876j990626j999444j910515j743170j506229j207461q61914m88218
37326a6763453j01579K82083O34294R12740J077655J110253J014649Q04734M94890
37317a0533734J06532l19767p27149j065152j312025j473160j557690j559932
37309a8442077j464952j267745r81538o28322k27018K06374O49938J070495J427645
37300a9657200J684721J821436J841685J769903J636031J459832J247254J000850
$$ plain form
37292 -7195488 -6460654 -5976959 -5677812 -5442444 -5115705 -4546753 -3628824 -2316738 -612726
37283 -612726 1463238 3888359 6619798 9557368 12516066 15229997 17386950 18679454
37275 18679454 18859430 17786602 15456867 11995903 7617347 2567024 -2917062 -8615196
37267 -8615196 -14317854 -19820547 -24933044 -29498207 -33408675 -36613836 -39116595 -40963426
37259 -40963426 -42231444 -43013601 -43399917 -43453265 -43185909 -42551402 -41463633 -39837766 -37630749
37250 -37630749 -34859083 -31589533 -27917319 -23950058 -19805265 -15617145 -11543787 -7766967
37242 -7766967 -4479533 -1859890 -40966 912752 1009690 318716 -1049291 -2956631 -5249512
37233 -5249512 -7767082 -10350475 -12853802 -15160608 -17204411 -18981010 -20537334 -21936571
$$ packed form
37292g195488P34834M83695K99147K35368L26739N68952R17929J312086J704012
37283f12726K075964K425121K731439K937570K958698K713931K156953J292504
37275A8679454J79976j072828k329735l460964m378556n050323n484086n698134
37267h615196n702658n502693n112497m565163l910468l205161k502759j846831
37259d0963426j268018p82157l86316n3348K67356O34507J087769J625867K207017
37250c7630749K771666L269550L672214L967261M144793M188120M073358L776820
37242g766967L287434K619643J818924R53718R6938o90974j368007j907340k292881
37233e249512k517570k583393k503327k306806k043803j776599j556324j399237
$$ plain form
37225 -21936571 -23220398 -24394034 -25441957 -26358268 -27167005 -27918542 -28665917 -29435691 -30208720
37216 -30208720 -30921474 -31490044 -31845577 -31957679 -31826777 -31451882 -30804877 -29837748 -28517706
37207 -28517706 -26861413 -24946868 -22904050 -20895121 -19090633 -17646425 -16688414 -16306607
37199 -16306607 -16548374 -17404330 -18799180 -20607579 -22694799 -24956284 -27331250 -29792161
37191 -29792161 -32331896 -34963678 -37726578 -40676118 -43847511 -47202589 -50592895 -53771397
37183 -53771397 -56458672 -58433424 -59599974 -59999900 -59769500 -59074039 -58056090 -56817521
37175 -56817521 -55428256 -53940027 -52389647 -50792666 -49137223 -47384250 -45474846 -43346820
37167 -43346820 -40963828 -38351977 -35623623 -32964065 -30575739 -28605141 -27092282 -25965515
$$ packed form
37225b1936571j283827j173636j047923r16311q08737p51537p47375p69774p73029
37216c0208720p12754n68570l55533j12102J30902L74895O47005R67129J320042
37207b8517706J656293J914545K042818K008929J804488J444208R58011L81807
37199a6306607k41767q55956j394850j808399k087220k261485k374966k460911
37191b9792161k539735k631782k762900k949540l171393l355078l390306l178502
37183e3771397k687275j974752j166550l99926K30400O95461J017949J238569
37175e6817521J389265J488229J550380J596981J655443J752973J909404K128026
37167d3346820K382992K611851K728354K659558K388326J970598J512859J126767
$$ plain form
37159 -25965515 -25072227 -24220918 -23222538 -21934610 -20304758 -18390319 -16331211 -14284101
37151 -14284101 -12357003 -10581129 -8925217 -7330709 -5745815 -4150744 -2572457 -1081457
37143 -1081457 237295 1331238 2216744 2977882 3726608 4552844 5496265 6548188 7668517
37134 7668517 8801569 9889769 10892656 11809715 12690637 13614632 14637270 15727740 16732039
37125 16732039 17387331 17385759 16460881 14462010 11391895 7401721 2754120 -2226734 -7201493
37116 -7201493 -11851812 -15907764 -19167643 -21507273 -22876840 -23290063 -22814838 -21570751
37108 -21570751 -19730518 -17516483 -15183325 -12984215 -11128569 -9749443 -8898563 -8572903
37100 -8572903 -8757173 -9456564 -10701419 -12523854 -14922432 -17835669 -21138648 -24664686
$$ packed form
37159b5965515Q93288Q51309R98380J287928J629852J914439K059108K047110
37151a4284101J927098J775874J655912J594508J584894J595071J578287J491000
37143a081457J318752J093943Q85506P61138P48726Q26236R43421J051923J120329
37134G668517J133052J088200J002887R17059Q80922R23995J022638J090470J004299
37125A6732039O55292j572r24878j998871l070115l990174m647601m980854m974759
37116g201493m650319m055952l259879k339630j369567m13223M75225J244087
37108b1570751J840233K214035K333158K199110J855646J379126Q50880L25660
37100h572903j84270o99391j244855j822435k398578k913237l302979l526038
$$ plain form
37092 -24664686 -28240964 -31717710 -34971472 -37878809 -40280395 -41967793 -42712170 -42324912
37084 -42324912 -40719958 -37951767 -34221484 -29856624 -25269811 -20899550 -17141342 -14287378
37076 -14287378 -12495599 -11797264 -12133082 -13395469 -15457415 -18182557 -21424375 -25026810
37068 -25026810 -28833594 -32704247 -36526522 -40213996 -43686813 -46847624 -49571442 -51719804
37060 -51719804 -53172690 -53859904 -53775282 -52969330 -51529532 -49563983 -47198240 -44580858 -41881098
37051 -41881098 -39265017 -36853729 -34686087 -32710426 -30812622 -28864461 -26765976 -24464830
37043 -24464830 -21953756 -19257301 -16416562 -13474457 -10463677 -7403775 -4313552 -1235381
37035 -1235381 1743865 4492725 6860303 8713010 9963094 10579927 10588453 10059828 9092191
$$ packed form
37092b4664686l576278l476746l253762k907337k401586j687398p44377L87258
37084d2324912J604954K768191L730283M364860M586813M370261L758208K853964
37076a4287378J791779O98335l35818j262387k061946k725142l241818l602435
37068b5026810l806784l870653l822275l687474l472817l160811k723818k148362
37060e1719804j452886o87214Q4622Q05952J439798J965549K365743K617382K699760
37051d1881098K616081K411288K167642J975661J897804J948161K098485K301146
37043b4464830K511074K696455K840739K942105L010780L059902L090223L078171
37035a235381K979246K748860K367578J852707J250084O16833Q526n28625r67637
$$ plain form
37026 9092191 7782369 6204049 4412837 2478862 519435 -1301183 -2812572 -3894693
37018 -3894693 -4514409 -4723292 -4625974 -4343966 -3992997 -3673323 -3463107 -3412365 -3545705 -3879441
37008 -3879441 -4445191 -5303197 -6532351 -8195547 -10293355 -12731493 -15327655 -17861328
37000 -17861328 -20138888 -22034469 -23488843 -24482694 -25015424 -25106714 -24813187 -24238168 -23516961
36991 -23516961 -22777645 -22095145 -21462265 -20792679 -19955431 -18827660 -17346295 -15540628 -13535292
36982 -13535292 -11523145 -9714883 -8277486 -7281121 -6678926 -6333718 -6079753 -5787551 -5404197
36973 -5404197 -4962125 -4562354 -4336702 -4393067 -4758732 -5347533 -5970658 -6388810 -6382286 -5809870
36963 -5809870 -4637855 -2937207 -859224 1397098 3616649 5593821 7149419 8138540
$$ packed form
37026I092191j309822j578320j791212j933975j959427j820618j511389j082121
37018c894693o19716k08883R7318K82008L50969L19674K10216N0742j33340l33736
37008c879441n65750q58006j229154j663196k097808k438138k596162k533673
37000a7861328k277560j895581j454374r93851n32730r1290K93527N75019P21207
36991b3516961P39316O82500O32880O69586Q37248J127771J481365J805667K005336
36982a3535292K012147J808262J437397R96365O02195L45208K53965K92202L83354
36973e404197M42072L99771K25652n6365l65665n88801o23125m18152O524N72416
36963e809870J172015J700648K077983K256322K219551J977172J555598R89121
$$ plain form
36955 8138540 8454426 8037698 6896402 5128329 2924293 535022 -1792196 -3876966
36947 -3876966 -5637446 -7081590 -8275173 -9310679 -10288623 -11307508 -12453342 -13785182
36939 -13785182 -15322997 -17049904 -18934866 -20965506 -23167694 -25594699 -28291669 -31259770
36931 -31259770 -34440462 -37719707 -40937471 -43893774 -46359221 -48103792 -48944135 -48790240
36923 -48790240 -47667340 -45702822 -43088125 -40036434 -36752961 -33421095 -30195586 -27192778
36915 -27192778 -24477831 -22057323 -19882234 -17856673 -15847118 -13696440 -11250702 -8396009
36907 -8396009 -5090009 -1374197 2634202 6762997 10811722 14582483 17914908 20721413
36899 20721413 23011238 24887227 26507781 28026319 29535210 31038111 32460105 33690894
$$ packed form
36955H138540L15886m16728j141296j768073k204036k389271k327218k084770
36947c876966j760480j444144j193583j035506r77944j018885j145834j331840
36939a3785182j537815j726907j884962k030640k202188k427005k696970k968101
36931c1259770l180692l279245l217764k956303k465447j744571q40343J53895
36923d8790240J122900J964518K614697L051691L283473L331866L225509L002808
36915b7192778K714947K420508K175089K025561K009555K150678K445738K854693
36907h396009L306000L715812M008399M128795M048725L770761L332425K806505
36899B0721413K289825J875989J620554J518538J508891J502901J421994J230789
$$ plain form
36891 33690894 34643095 35295546 35694401 35912598 36000211 35960568 35758131 35337910 34637672 33591228
36881 33591228 32130681 30194309 27743289 24785624 21396666 17720775 13947756 10274849
36873 10274849 6872908 3867046 1327883 -735627 -2383058 -3739216 -4970221 -6241549
36865 -6241549 -7674148 -9313550 -11115113 -12943490 -14590978 -15821457 -16433282 -16318065
36857 -16318065 -15491128 -14083351 -12299697 -10359872 -8442418 -6652418 -5021810 -3535936
36849 -3535936 -2171366 -929653 146361 982862 1509430 1699304 1591099 1278792 877698
36840 877698 488905 182235 338 -31178 96244 364578 726345 1121270 1506643 1882080
36830 1882080 2292490 2807256 3487319 4357922 5399644 6557096 7754320 8908052 9938682
$$ packed form
36891C3690894R52201O52451L98855K18197Q7613l9643k02437m20221p00238j046444
36881C3591228j460547j936372k451020k957665l388958l675891l773019l672907
36873A0274849l401941l005862k539163k063510j647431j356158j231005j271328
36865f241549j432599j639402j801563j828377j647488j230479o11825J15217
36857a6318065Q26937J407777J783654J939825J917454J790000J630608J485874
36849c535936J364570J241713J076014Q36501N26568J89874j08205l12307m01094
36840H77698l88793l06670j81897l1516J27422K68334L61767L94925L85373L75437
36830A882080M10410N14766O80063Q70603J041722J157452J197224J153732J030630
$$ plain form
36821 9938682 10780341 11385336 11717783 11741401 11414138 10696816 9571431 8059111 6228032
36812 6228032 4182764 2032465 -149655 -2350520 -4606967 -6967570 -9451185 -12022588
36804 -12022588 -14588768 -17009708 -19119445 -20755840 -21793055 -22164504 -21865839 -20939504
36796 -20939504 -19455596 -17504697 -15203143 -12694029 -10129087 -7639058 -5317431 -3231140
36788 -3231140 -1442837 -16685 1003459 1629593 1956125 2160527 2469918 3099149 4187069
36779 4187069 5767609 7789980 10162979 12783973 15538566 18289635 20879065 23147195
36771 23147195 24961287 26244145 26995798 27300344 27313068 27229512 27240482 27477512 27962035
36762 27962035 28583334 29125454 29336897 29012622 28058212 26523337 24601943 22594729 20833771
$$ packed form
36821I938682Q41659O04995L32447K3618l27263p17322j125385j512320j831079
36812F228032k045268k150299k182120k200865k256447k360603k483615k571403
36804a2022588k566180k420940k109737j636395j037215l71449K98665R26335
36796b0939504J483908J950899K301554K509114K564942K490029K321627K086291
36788c231140J788303J426152J020144O26134L26532K04402L09391O29231J087920
36779D187069J580540K022371K372999K620994K754593K751069K589430K268130
36771B3147195J814092J282858P51653L04546J2724q3556J0970K37030M84523
36762B7962035O21299N42120K11443l24275r54410j534875j921394k007214j760958
$$ plain form
36753 20833771 19589775 19002108 19064514 19665198 20647722 21855974 23149724 24401429 25491477
36744 25491477 26311320 26774760 26832819 26486178 25790659 24854857 23830056 22889215 22191483
36735 22191483 21838878 21846036 22144973 22626880 23195434 23795232 24397581 24961649 25411166 25652318
36725 25652318 25618322 25299569 24731583 23950921 22952923 21678518 20036449 17952621 15430245
$$ packed form
36753B0833771j243996n87667O2406O00684R82524J208252J293750J251705J090048
36744B5491477Q19843M63440N8059l46641o95519r35802j024801r40841o97732
36735B2191483l52605P158K98937M81907N68554N99798O02349N64068M49517K41152
36725B5652318l3996l18753n67986p80662r97998j274405j642069k083828k522376
$$ [...]
##END NTUPLES=NMR SPECTRUM
##END=
