##TITLE=31Pdec_DE-26b_TFA
 DMSO-d6
 128 sc
 12.1.2024
##JCAMPDX= 6.0         $$ Bruker NMR JCAMP-DX V2.0
##DATA TYPE= NMR SPECTRUM
##DATA CLASS= NTUPLES
##ORIGIN= UXNMR, Bruker Analytische Messtechnik GmbH
##OWNER= root
$$ XWIN-NMR		Version 3.5
$$ Fri Jan 12 14:51:54 2024 Russian Standard Time (UT+4h)  she@DPX200
##.OBSERVE FREQUENCY= 81.013821
##.OBSERVE NUCLEUS= ^31P
##.ACQUISITION MODE= SIMULTANEOUS
##.ACQUISITION SCHEME= undefined
##.AVERAGES= 128
##.DIGITISER RES= 16
##SPECTROMETER/DATA SYSTEM= spect
##.PULSE SEQUENCE= zgpg30
##.SOLVENT NAME= DMSO
##.SHIFT REFERENCE= (INTERNAL, DMSO, 0, 248.564)
##AUDIT TRAIL= $$ (NUMBER, WHEN, WHO, WHERE, WHAT)
$$ ##TITLE= Audit trail, XWIN-NMR		Version 3.5
$$ ##JCAMPDX= 5.01
$$ ##ORIGIN= Bruker BioSpin GmbH
$$ ##OWNER= she
$$ F:/spectra/data/she/nmr/P31/1/pdata/1/auditp.txt
$$ ##AUDIT TRAIL=  $$ (NUMBER, WHEN, WHO, WHERE, WHAT)
(   1,<2024-01-12 14:50:47.71 +0400>,<she>,<DPX200>,
      <created by zg, POWCHK disabled, PULCHK disabled
       configuration hash MD5:
       00 E9 B6 7A A2 85 ED C7 34 08 36 98 17 FE 4E 26
       data hash MD5: 32K
       9D 31 52 A6 07 6A 02 BF 83 E2 91 41 FF D9 B0 D3>)
(   2,<2024-01-12 14:50:50.18 +0400>,<she>,<DPX200>,
      <Start of raw data processing
       efp BC_mod = 2 LB = 10 FT_mod = 6 PKNL = 1 PHC0 = -12289.51 PHC1 = 391.0886 SI = 64K 
       data hash MD5: 64K
       6B 41 7F D6 84 74 E9 68 B5 94 EB 1C 49 0A 30 0F>)
(   3,<2024-01-12 14:51:06.26 +0400>,<she>,<DPX200>,
      <pk PHC0 = -4.972034 PHC1 = 0 
       data hash MD5: 64K
       74 46 22 9E F8 84 09 B6 FA E4 E5 66 98 11 BD DC>)
(   4,<2024-01-12 14:51:11.67 +0400>,<she>,<DPX200>,
      <abs ABSG = 5 
       data hash MD5: 64K
       E6 E0 C0 9D 3D D0 51 39 09 2E C4 1C 26 1E 85 33>)
$$ ##END=
$$ 
$$ hash MD5
$$ 4D AF 7F 65 B1 11 AF 15 00 CE 09 9A 5A 16 0F 7C
##$RELAX= 
##$RELAX= 
##$RELAX= 
##$RELAX= 
##$RELAX= 
##$RELAX= 
##$RELAX= 
##$RELAX= 
##$RELAX= 
$$ Bruker specific parameters
$$ --------------------------
##$DU= <F:/spectra>
##$EXPNO= 1
##$NAME= <P31>
##$PROCNO= 1
##$TYPE= <nmr>
##$USER= <she>
##$AMP= (0..31)
100 100 100 100 100 100 100 100 100 100 100 100 100 100 100 100 100 100 
100 100 100 100 100 100 100 100 100 100 100 100 100 100 
##$AQSEQ= 0
##$AQ_mod= 1
##$AUNM= <au_zg>
##$AUTOPOS= <>
##$BF1= 81.014009
##$BF2= 200.13
##$BF3= 200.13
##$BF4= 200.13
##$BF5= 200.13
##$BF6= 200.13
##$BF7= 200.13
##$BF8= 200.13
##$BYTORDA= 1
##$CFDGTYP= 0
##$CFRGTYP= 5
##$CHEMSTR= <none>
##$CNST= (0..31)
1 1 145 1 1 1 1 1 1 1 1 1 1 1 1 1 1 1 1 1 1 1 1 1 1 1 1 1 1 1 1 1 
##$CPDPRG= <waltz16>
##$CPDPRG1= <>
##$CPDPRG2= <waltz16>
##$CPDPRG3= <>
##$CPDPRG4= <mlev>
##$CPDPRG5= <mlev>
##$CPDPRG6= <mlev>
##$CPDPRG7= <mlev>
##$CPDPRG8= <mlev>
##$CPDPRGB= <>
##$CPDPRGT= <>
##$D= (0..31)
0 1 0 0 0 0 0 0 0 0 0 0.03 2e-05 3e-06 0 0 0 0 0 0 0 0 0 0 0 0 0 0 0 0 
0 0 
##$DATE= 1705056647
##$DBL= (0..7)
120 120 120 11 120 120 24 19 
##$DBP= (0..7)
150 150 150 150 150 150 150 150 
##$DBP07= 0
##$DBPNAM0= <>
##$DBPNAM1= <>
$$ [...]
##$SUBNAM3= <"">
##$SUBNAM4= <"">
##$SUBNAM5= <"">
##$SUBNAM6= <"">
##$SUBNAM7= <"">
##$SUBNAM8= <"">
##$SUBNAM9= <"">
##$SW= 501.771253377433
##$SWIBOX= (0..15)
0 1 3 0 0 0 0 0 0 0 0 0 0 0 0 0 
##$SW_h= 40650.406504065
##$TD= 32768
##$TD0= 1
##$TE= 0
##$TE2= 300
##$TE3= 300
##$TEG= 300
##$TL= (0..7)
0 120 53 12 22 120 120 120 
##$TP= (0..7)
150 150 150 150 150 150 150 150 
##$TP07= 0
##$TPNAME0= <>
##$TPNAME1= <>
##$TPNAME2= <>
##$TPNAME3= <>
##$TPNAME4= <>
##$TPNAME5= <>
##$TPNAME6= <>
##$TPNAME7= <>
##$TPOAL= (0..7)
0.5 0.5 0.5 0.5 0.5 0.5 0.5 0.5 
##$TPOFFS= (0..7)
0 0 0 0 0 0 0 0 
##$TUNHIN= 0
##$TUNHOUT= 0
##$TUNXOUT= 0
##$USERA1= <user>
##$USERA2= <user>
##$USERA3= <user>
##$USERA4= <user>
##$USERA5= <user>
##$V9= 5
##$VALIST= <valist>
##$VCLIST= <CCCCCCCCCCCCCCC>
##$VD= 0
##$VDLIST= <DDDDDDDDDDDDDDD>
##$VPLIST= <PPPPPPPPPPPPPPP>
##$VTLIST= <TTTTTTTTTTTTTTT>
##$WBST= 1024
##$WBSW= 4
##$XGAIN= (0..3)
0 0 0 0 
##$XL= 0
##$YL= 0
##$YMAX_a= 3541
##$YMIN_a= -5432
##$ZGOPTNS= <>
##$ZL1= 120
##$ZL2= 120
##$ZL3= 120
##$ZL4= 120
##$ABSF1= 248.5645
##$ABSF2= -253.2056
##$ABSG= 5
##$ABSL= 3
##$ALPHA= 0
##$AQORDER= 0
##$ASSFAC= 0
##$ASSFACI= 0
##$ASSFACX= 0
##$ASSWID= 0
##$AUNMP= <proc_1d>
##$AZFE= 0.1
##$AZFW= 0.5
##$BCFW= 0
##$BC_mod= 2
##$BYTORDP= 0
##$COROFFS= 0
##$CY= -3
##$DATMOD= 1
##$DC= 0
##$DFILT= <>
##$DTYPP= 0
##$F1P= 0
##$F2P= 0
##$FCOR= 1
##$FTSIZE= 65536
##$FT_mod= 6
##$GAMMA= 0
##$GB= 0
##$INTBC= 1
##$INTSCL= 6.047779e-11
##$ISEN= 30
##$LB= 10
##$LEV0= 0
##$LPBIN= 0
##$MAXI= 10000
##$MC2= 0
##$MEAN= 0
##$ME_mod= 0
##$MI= 50
##$NCOEF= 0
##$NC_proc= -9
##$NLEV= 6
##$NOISF1= 182.463
##$NOISF2= 159.3651
##$NSP= 0
##$NTH_PI= 0
##$NZP= 0
##$OFFSET= 248.5645
##$PC= 4
##$PHC0= -12294.48
##$PHC1= 391.0886
##$PH_mod= 1
##$PKNL= yes
##$PPARMOD= 0
##$PSCAL= 0
##$PSIGN= 0
##$REVERSE= no
##$SF= 81.0140089999694
##$SI= 65536
##$SIGF1= 159.3651
##$SIGF2= -187.1042
##$SINO= 113.3802
##$SIOLD= 16384
##$SREGLST= <1H.CDCl3>
##$SSB= 0
##$STSI= 65536
##$STSR= 0
##$SW_p= 40650.406504065
##$SYMM= 0
##$S_DEV= 0
##$TDeff= 32768
##$TDoff= 0
##$TI= <>
##$TILT= no
##$TM1= 0
##$TM2= 0
##$TOPLEV= 0
##$USERP1= <user>
##$USERP2= <user>
##$USERP3= <user>
##$USERP4= <user>
##$USERP5= <user>
##$WDW= 1
##$XDIM= 65536
##$YMAX_p= 277995146
##$YMIN_p= -34068745
$$ End of Bruker specific parameters
$$ ---------------------------------
##NTUPLES= NMR SPECTRUM
##VAR_NAME=  FREQUENCY,     SPECTRUM/REAL,   SPECTRUM/IMAG
##SYMBOL=    X,             R,               I
##VAR_TYPE=  INDEPENDENT,   DEPENDENT,       DEPENDENT
##VAR_FORM=  AFFN,          ASDF,            ASDF
##VAR_DIM=   65536,         65536,           65536
##UNITS=     HZ,            ARBITRARY UNITS, ARBITRARY UNITS
##FACTOR=    0.620285442955139, 1,           1
##FIRST=     20137.2065510682, 0,            0
##LAST=      -20513.1999529968, 0,           0
##MIN=       -20513.1999529968, -34068745,   0
##MAX=       20137.2065510682, 277995146,    0
$$ Real data points
##PAGE= N=1
##DATA TABLE= (X++(R..R)), XYDATA
$$ [...]
41151B666633p77595p28314o17308m72406l32009k28737j76330j66191j75248
41142a007505j80385j70587j50638j36775j48566k00676k96801m28243n77591
41133c297767p24048q46457r25191r47191r13110q38952p47483o55072n64408
41124a0459679m67374l53796k19733p2011P1994J89416K60255K75821K44037J89553
41114a0341517J47693J53166K27604L71699N65803P78448R77995J140881J252278
41105d725950J301718J281068J188683J034371Q37224O17245L90092J69736k7302
41096B066885j84748k95031l64220m08247m44582m85931n38358o02248o74746
41087a931226p52588q33521r14565r87666j035840j033824r55518p86667n36220
$$ y = [2666633, 1889038, 1160724, 543416, 71010, -260999, -489736, -666066, -832257, -1007505, -1187890, -1358477, -1509115, -1645890, -1794456, -1995132, -2291933, -2720176, -3297767, -4021815, -4868272, -5793463, -6740654, -7653764, -8492716, -9240199, -9895271, -10459679, -10927053, -11280849, -11500582, -11572593, -11500599, -11311183, -11050928, -10775107, -10531070, -10341517, -10193824, -10040658, -9813054, -9441355, -8875552, -8097104, -7119109, -5978228, -4725950, -3424232, -2143164, -954481, 79890, 917114, 1534359, 1924451, 2094187, 2066885, 1882137, 1587106, 1222886, 814639, 370057, -115874, -654232, -1256480, -1931226, -2683814, -3517335, -4431900, -5419566, -6455406, -7489230, -8444748, -9231415, -9767635]
41078i767635k38175N9236L11423M92260N99041O47828O63242O67135O70068O69178
41068e226399O53432O12838N45886M61362L74895L03219K59184K48524K67519
41059a499540L00909L22455L02174K19959P7404j01908k84481m41675n56562o21077
41049b282342o29889n78158m65632l03969j20476M7703J68196K27814K36709K19931
41039c480113K03242K02181K18810K44644K65633K66720K36898J75939R9171L3732
41029a533143N390K5100Q5987J71325K64478L53638M32212M98397N54249O02460
41019A460093O41353O61067O44378N74021M44027K67205P1124j15881k77603m12243
41009C957541n25250o20839o97975p51347p75088p66305p25329o52551n46130
$$ y = [-9767635, -10005810, -9946574, -9635151, -9142891, -8543850, -7896022, -7232780, -6565645, -5895577, -5226399, -4572967, -3960129, -3414243, -2952881, -2577986, -2274767, -2015583, -1767059, -1499540, -1198631, -876176, -574002, -354043, -276639, -378547, -663028, -1104703, -1661265, -2282342, -2912231, -3490389, -3956021, -4259990, -4380466, -4332763, -4164567, -3936753, -3700044, -3480113, -3276871, -3074690, -2855880, -2611236, -2345603, -2078883, -1841985, -1666046, -1566875, -1533143, -1527753, -1502653, -1416666, -1245341, -980863, -627225, -195013, 303384, 857633, 1460093, 2101446, 2762513, 3406891, 3980912, 4424939, 4692144, 4763268, 4647387, 4369784, 3957541, 3432291, 2811452, 2113477, 1362130, 587042, -179263, -904592, -1557143, -2103273]
41000b103273m04830k34476n2290J14644K36210K88846K64656J75275M6413r5389
40990a764214k35611l74980n20226o68768p99621q79498q81039p98760o49723
40981g572440m59673k47592k0684K18649M61480O86726Q67158R83905J037799
40972d044672J046789J031162R99767R48276Q67963P55523O17929M72385L42614
40963C037736K51126K09103K09202K27161K32661K03307J33247L2243q2111j92634
40953D261041k87376l61301m15896m56567m87781n08020n07220m68036l71354
40944C97490k05147K6864L02369N85841Q38053J024156J119077J112189J010409
40935F211301Q35453O15018L74638J37311p0558k16817k72931k32106j22065J050
$$ y = [-2103273, -2508103, -2742579, -2794869, -2680225, -2444015, -2155169, -1890513, -1715238, -1668825, -1764214, -1999825, -2374805, -2895031, -3563799, -4363420, -5242918, -6123957, -6922717, -7572440, -8032113, -8279705, -8300389, -8081740, -7620260, -6933534, -6066376, -5082471, -4044672, -2997883, -1966721, -966954, -18678, 849285, 1604808, 2222737, 2695122, 3037736, 3288862, 3497965, 3707167, 3934328, 4166989, 4370296, 4503543, 4535786, 4453675, 4261041, 3973665, 3612364, 3196468, 2739901, 2252120, 1744100, 1236880, 768844, 397490, 192343, 219207, 521576, 1107417, 1945470, 2969626, 4088703, 5200892, 6211301, 7046754, 7661772, 8036410, 8173721, 8103163, 7886346, 7613415, 7381309, 7259244, 7260294]
40925G260294P7900P4556m693j26499k49583l42611l91477l97612l71857l27065
40915E201353k72131k09903j39285n9374K6934J11051J79097K15044K06299J50066
40905E409151N7599m6640j33119j80243j84691j61259j32591j17512j26301j62725
40895D221669k27623l21018m43112n93278p65279r41609j093831j191783j215421
40886b571285j160967j039258q70099o75666m73863k74138p9417J06183K69994
40877f768516L90163M42779M13041L04625J41623l9777k05982l36923m25548m68390
40867f552905m58175l87033k58073r4104O6669J87827K53147K72749K73663K84340
40857f411895L24829M05207N26121O77270Q36995R77845J076807J123430J120594
$$ y = [7260294, 7338194, 7412750, 7408057, 7281558, 7031975, 6689364, 6297887, 5900275, 5528418, 5201353, 4929222, 4719319, 4580034, 4520660, 4547594, 4658645, 4837742, 5052786, 5259085, 5409151, 5466750, 5420110, 5286991, 5106748, 4922057, 4760798, 4628207, 4510695, 4384394, 4221669, 3994046, 3673028, 3229916, 2636638, 1871359, 929750, -164081, -1355864, -2571285, -3732252, -4771510, -5641609, -6317275, -6791138, -7065276, -7144693, -7038510, -6768516, -6378353, -5935574, -5522533, -5217908, -5076285, -5116062, -5322044, -5658967, -6084515, -6552905, -7011080, -7398113, -7656186, -7750290, -7683621, -7495794, -7242647, -6969898, -6696235, -6411895, -6087066, -5681859, -5155738, -4478468, -3641473, -2663628, -1586821, -463391, 657203]
40848F57203J078628J007535R12210P92625O47620M78540K89804Q6942j25112
40839E825995l41967n58770p69188r63807j127874j240734j279869j229235j087450
40830b772899q71151o12073l49493j20385N0219J55080K03272K11650J95070J62461
40820c748249J20033P5843L9968K0987K4200N3381J11724J98342L03543M09281
40810b390947M95642N47532N56732N20928M43950L37396K19901J11702K6227l6488
40800H32575q9981j52969k36103l32843m22179m81155m96544m67123l98245k97077
40790b541644j72828l8630Q9951J99742K83910L42056L77652L95454L99607L91694
40780b73036L69034L25209K53609J51927K4535j18165k62016l91963m95634n67256
$$ y = [657203, 1735831, 2743366, 3655576, 4448201, 5095821, 5574361, 5864165, 5951107, 5825995, 5484028, 4925258, 4156070, 3192263, 2064389, 823655, -456214, -1685449, -2772899, -3644050, -4256123, -4605616, -4726001, -4675782, -4520702, -4317430, -4105780, -3910710, -3748249, -3628216, -3552373, -3512405, -3491418, -3467218, -3413837, -3302113, -3103771, -2800228, -2390947, -1895305, -1347773, -791041, -270113, 173837, 511233, 731134, 842836, 869063, 832575, 742594, 589625, 353522, 20679, -401500, -882655, -1379199, -1846322, -2244567, -2541644, -2714472, -2753102, -2663151, -2463409, -2179499, -1837443, -1459791, -1064337, -664730, -273036, 95998, 421207, 674816, 826743, 851278, 733113, 471097, 79134, -416500, -983756]
40770i83756o09815o33328o49583o65874o80741o84089o62196o05508n14553m00244
40760g089687k79065j67140p6351j2689K3779L6577K7665p167p6982j87161l29866
40749h138087m82158o14046p00354p28097o96481o12799m88686l38655j79849
40740a2979212l0524R4467J90091K64759L36712M23651N31949O52171P62852Q39810
40730h913274Q67059Q45487P95431P50487P43993P94161Q95062J017835J121871
40721a081888J170901J145937J048096Q91245O92205M67285K36298K6429j31837
40712D464671k16394k25089j79322j17140p8551q9403j51740k46299l45061m24931
40702B390741m74574m94553m95462m95531n14601n64183o39444p19572p76296
$$ y = [-983756, -1593571, -2226899, -2876482, -3542356, -4223097, -4907186, -5569382, -6174890, -6689443, -7089687, -7368752, -7535892, -7612243, -7624932, -7601153, -7564576, -7536911, -7544078, -7621060, -7808221, -8138087, -8620245, -9234291, -9934645, -10662742, -11359223, -11972022, -12460708, -12799363, -12979212, -13009736, -12915269, -12725178, -12460419, -12123707, -11700056, -11168107, -10515936, -9753084, -8913274, -8046215, -7200728, -6405297, -5654810, -4910817, -4116656, -3221594, -2203759, -1081888, 89013, 1234950, 2283046, 3174291, 3866496, 4333781, 4570079, 4596508, 4464671, 4248277, 4023188, 3843866, 3726726, 3648175, 3558772, 3407032, 3160733, 2815672, 2390741, 1916167, 1421614, 926152, 430621, -83980, -648163, -1287607, -2007179, -2783475]
40693b783475p84641p30379o12314m40156k29661K408K41443M76011O97639Q99361
40683c263764J072771J204913J278117J274500J183720J010179P75886N16879
40675E053201K74244Q3827l1114o3023k0083P6848K01517L32101M57680N76356
40665F941554O86815P80232Q37962Q35400P49826N69632L01516k8809l84185p28009
40655A0561934j033014j282061j462487j560541j561846j458637j258492r86803
40647d1947o79535l70941q5007J64595L69499N23135O21201O63459O54343O03096
40637B421898N24536M38628L65892L19160K96950K83961K59636K10235J37319
40628E258215N7144r462n1328p6256j08226j72576k78028m07998n27967o03838
$$ y = [-2783475, -3568116, -4298495, -4910809, -5350965, -5580626, -5578218, -5336775, -4860764, -4163125, -3263764, -2190993, -986080, 292037, 1566537, 2750257, 3760436, 4536322, 5053201, 5327445, 5411272, 5380158, 5317135, 5297052, 5373900, 5575417, 5907518, 6365198, 6941554, 7628369, 8408601, 9246563, 10081963, 10831789, 11401421, 11702937, 11674128, 11289943, 10561934, 9528920, 8246859, 6784372, 5223831, 3661985, 2203348, 944856, -41947, -721482, -1092423, -1177430, -1012835, -643336, -120201, 501000, 1164459, 1818802, 2421898, 2946434, 3385062, 3750954, 4070114, 4367064, 4651025, 4910661, 5120896, 5258215, 5315359, 5305897, 5254569, 5178313, 5070087, 4897511, 4619483, 4211485, 3683518, 3079680]
40618C079680o18227n74547m89169l79914k58549j30050K386J29668K31745K80656
40608A273679K52115J38445m6423k72862n06839p18521q84571r86266j008155
40599b759398r40288p83482n53818k82437r652K24288L88470M68650M71239M22470
40589c353958L61391L28386L53630M50318O14131Q26755J060518J283197J463940
40580C388308J579806J620152J586723J490516J348016J177106R91625P96739
40572A3978991N90136L69984J42764p6758k72616m34331n58686o49274p16190
40563A2374020p73219q30132q84481r20249r14911q49944p20387n41938l52758
40554E586001k05285j48050k06574l74189o16214q82279j119960j285910j353122
$$ y = [3079680, 2461453, 1886906, 1397737, 1017823, 759274, 629224, 631610, 761278, 993023, 1273679, 1525794, 1664239, 1617816, 1344954, 838115, 119594, -764977, -1751243, -2759398, -3699686, -4483168, -5036986, -5319423, -5329075, -5104787, -4716317, -4247667, -3776428, -3353958, -2992567, -2664181, -2310551, -1860233, -1246102, -419347, 641171, 1924368, 3388308, 4968114, 6588266, 8174989, 9665505, 11013521, 12190627, 13182252, 13978991, 14569127, 14939111, 15081875, 15005117, 14732501, 14298170, 13739484, 13090210, 12374020, 11600801, 10770669, 9886188, 8965939, 8051028, 7201084, 6480697, 5938759, 5586001, 5380716, 5232666, 5026092, 4651903, 4035689, 3153410, 2033450, 747540, -605582]
40545f05582j314205j181706r86075p70008n77708m41673l73373l62613l84789
40536f997732m11265m18263l91482l25601k20511p8409R5599K90900M91306O79339
40526g286119Q42036R73523J072607J137926J165039J147987J084316R79871Q49725
40517A966911P14023N90435M86651L96779L04119J89223L9084j47031l56266n64305
40507C619623p40811q58954r06515q90993q33182p53379o61735n59445m45600
40498c030991l20045j80358k0428J63351L62262N51663O98337P74166P68063O91560
40488D57580N77452M71297M15640M31049N04095N91404O39447O08427M86914K92163
40478E475468O1029j61253l30808m13744l94202k79964j02406R1810K55939L59275
$$ y = [-605582, -1919787, -3101493, -4087568, -4857576, -5435284, -5876957, -6250330, -6612943, -6997732, -7408997, -7827260, -8218742, -8544343, -8764854, -8843263, -8747664, -8456764, -7965458, -7286119, -6444083, -5470560, -4397953, -3260027, -2094988, -947001, 137315, 1117186, 1966911, 2680934, 3271369, 3758020, 4154799, 4458918, 4648141, 4687225, 4540194, 4183928, 3619623, 2878812, 2019858, 1113343, 222350, -610832, -1364211, -2025946, -2585391, -3030991, -3351036, -3531394, -3551822, -3388471, -3026209, -2474546, -1776209, -1002043, -233980, 457580, 1035032, 1506329, 1921969, 2353018, 2857113, 3448517, 4087964, 4696391, 5183305, 5475468, 5536497, 5375244, 5044436, 4630692, 4236490, 3956526, 3854120, 3945930, 4201869, 4561144]
40468D561144L96031L82497L45087L07139K81740K72509K78591K98429L29820
40459G452987L68168M06044M34752M46262M34418L95704L29389K36468J18434
40450A0622626k1704j76643l34903m86694o31227p77300r34388j100442j255628
40441D903697j366799j400685j339051j187724r74451p37164n09893l13647j55266
40432c080983l2967N5205J05236J08301N9482l2354j41945k35248k82475k69086
40422c746834k00524j00939p372M0127J1875r8106k65871m44178n80880o39911
40412f032613o13535n19942l88741k43071q8128Q7365K97322N40324P89586R98793
40402e172640J121312J130911J031287Q50535O27194L97776J90605K4116r3578
$$ y = [4561144, 4957175, 5339672, 5684759, 5991898, 6273638, 6546147, 6824738, 7123167, 7452987, 7821155, 8227199, 8661951, 9108213, 9542631, 9938335, 10267724, 10504192, 10622626, 10600922, 10424279, 10089376, 9602682, 8971455, 8194155, 7259767, 6159325, 4903697, 3536898, 2136213, 797162, -390562, -1365013, -2102177, -2612070, -2925717, -3080983, -3113950, -3058745, -2953509, -2845208, -2785726, -2818080, -2960025, -3195273, -3477748, -3746834, -3947358, -4048297, -4055669, -4015542, -4003667, -4101773, -4367644, -4811822, -5392702, -6032613, -6646148, -7166090, -7554831, -7797902, -7886030, -7798665, -7501343, -6961019, -6171433, -5172640, -4051328, -2920417, -1889130, -1038595, -411401, -13625, 176980, 201096, 107518]
40393A07518j64200j96375j99899j79509j32023n0154O7778K08491L42524M33251
40383B37402M50349L80105K29083K1237k11190m40373o51848q42180j007065j131142
40373b965622j189085j156310j020250p86106m77754j36142J85774M33917N68980
40364f542598N81128M95265L61929K37144J61387J48127J85337K45453K96733
40355c830095L12409K77836J95833Q7592j3550p3653o8585J1535J62205L64204
40345b574269N83611P77648R07884R53122R12524P98606O28556M20864J96502
40336C605048k0051k02684l28654l85617l77528l24474k54980j95768j65775j74888
40326A174629k22396k93385l59298l88931l65992k99968k20594j59668j34121
$$ y = [107518, -56682, -253057, -452956, -632465, -764488, -814642, -746864, -538373, -195849, 237402, 687751, 1067856, 1296939, 1318176, 1106986, 666613, 14765, -827415, -1834480, -2965622, -4154707, -5311017, -6331267, -7117373, -7595127, -7731269, -7545495, -7111578, -6542598, -5961470, -5466205, -5104276, -4867132, -4705745, -4557618, -4372281, -4126828, -3830095, -3517686, -3239850, -3044017, -2956425, -2969975, -3043628, -3112213, -3100678, -2938473, -2574269, -1990658, -1213010, -305126, 647996, 1560520, 2359126, 2987682, 3408546, 3605048, 3584997, 3382313, 3053659, 2668042, 2290514, 1966040, 1711060, 1515292, 1349517, 1174629, 952233, 658848, 299550, -89381, -455373, -755341, -975935, -1135603, -1269724]
40317a269724j41121j64952j87605j96300j86209j59327j20735p4157j9797M4368
40307b475559J20107K08401L10458M27068N54886O82488P90734Q59695Q80005
40298B358283Q62224Q36552Q39639Q94493R96065J111703J195381J207064J129008
40289A1430412R73721P79859N94954M51246L48479K55157J27357o7103l32213
40280A4561869o40533r41883j180070j312279j323528j229564j067769q83263
40272E982980p18298o07063n71875o17196p24125q52006r50954r81020r27742
40263i67299q05375o46754m86848l49231k40908j55253p9398j756Q3948J79684
40253c469190K87519M12853N62887P40869R40313J143221J323630J455328J521216
$$ y = [-1269724, -1410845, -1575797, -1763402, -1959702, -2145911, -2305238, -2425973, -2500130, -2519927, -2475559, -2355452, -2147051, -1836593, -1409525, -854639, -172151, 618583, 1478278, 2358283, 3220507, 4057059, 4896698, 5791191, 6787256, 7898959, 9094340, 10301404, 11430412, 12404133, 13183992, 13778946, 14230192, 14578671, 14833828, 14961185, 14894082, 14561869, 13921336, 12979453, 11799383, 10487104, 9163576, 7934012, 6866243, 5982980, 5264682, 4657619, 4085744, 3468548, 2744423, 1892417, 941463, -39557, -967299, -1772674, -2419428, -2906276, -3255507, -3496415, -3651668, -3731066, -3732822, -3648874, -3469190, -3181671, -2768818, -2205931, -1465062, -524749, 618472, 1942102, 3397430, 4918646]
40244D918646J520471J469024J391972J311759J239240J171809J097287R99698
40236A5119906Q65196O88075M75344K46494K7357j58362k94369l71620l85552
40227A6212469l35083k25282p1389J00221K56562L65418M00929L46103J96473
40218A7246421l2432k99610n45329p12023p67189p12684n76162l94058j97712
40209A3009222o744J72213L43232N15050O92530Q69554J027625J141826J191861
40200A8956369J172409J096142R86430Q64097P37292O00980M45351K66652P3851
40191B5199573j11870k63712l58235l82838l39907k47766j37857m6729l974k2122
40181B3284563r5208k06010l34823m63513n75226o54297o88648o73269o12481
$$ y = [4918646, 6439117, 7908141, 9300113, 10611872, 11851112, 13022921, 14120208, 15119906, 15985102, 16673177, 17148521, 17395015, 17422372, 17264010, 16969641, 16598021, 16212469, 15877386, 15652104, 15580715, 15680936, 15937498, 16302916, 16703845, 17049948, 17246421, 17213989, 16914379, 16369050, 15657027, 14889838, 14177154, 13600992, 13206934, 13009222, 13002478, 13174691, 13517923, 14032973, 14725503, 15595057, 16622682, 17764508, 18956369, 20128778, 21224920, 22211350, 23075447, 23812739, 24413719, 24859070, 25125722, 25199573, 25087703, 24823991, 24465756, 24082918, 23743011, 23495245, 23357388, 23310659, 23306685, 23284563, 23189355, 22983345, 22648522, 22185009, 21609783, 20955486, 20266838, 19593569, 18981088]
40172A8981088n19494m12379l07328k13307j31923o1446K94N6860J15044J83369
40162A7690778K67328L64896M64994N49573N99223O01011N54091M68226L55262
40153B1915382K20274O0133j29146l42671n63277p67981r39297j071740j167688
40144A7213989j226305j235999j178155j040390q29836n77520l31132j40257m0803
40135A0613592m4814j39090k92005m64494o20073p31446p84107p77192p20095
40126F040276o24531m96365l33491j31716J05922L62677O08048Q05397R26676
40117G262893R68713R59844R48457R78185J066105J197926J340179J458576J531685
40108A7712563J555674J540873J503244J455228J400581J334689J247841J128418
$$ y = [18981088, 18461594, 18049215, 17741887, 17528580, 17396657, 17335211, 17335505, 17392365, 17507409, 17690778, 17958106, 18323002, 18787996, 19337569, 19936792, 20537803, 21091894, 21560120, 21915382, 22135656, 22195789, 22066643, 21723972, 21160695, 20392714, 19453417, 18381677, 17213989, 15987684, 14751685, 13573530, 12533140, 11703304, 11125784, 10794652, 10654395, 10613592, 10568778, 10429688, 10137683, 9673189, 9053116, 8321670, 7537563, 6760371, 6040276, 5415745, 4919380, 4585889, 4454173, 4560095, 4922772, 5530820, 6336217, 7262893, 8231606, 9191450, 10139907, 11118092, 12184197, 13382123, 14722302, 16180878, 17712563, 19268237, 20809110, 22312354, 23767582, 25168163, 26502852, 27750693, 28879111]
40100B8879111R66309P58634N16525K67324M7772j09116j85676j84294j25375
40091C0831214m0860L5475P8633P8557L7952l5116j31994k41975l48883m32218
40081B9830785m74408m69881m30061l80707l52040l66598m31092n35316o56170
40072B5734512p63688q28004q26910p51487o07111m10355j84847M3316K52715
40063B1658141M35989O05595P89730J019271J313594J672797K077932K496645
40055C2069694K892000L232840L502376L700565L839292L933987L996445M030421
40047F1197620M029625L978197L853703L630490L281530K781520K116632J300137
40039H6169454L83226n51041j411471k127071k663410l019694l212943l263118
$$ y = [28879111, 29845420, 30604054, 31120579, 31387903, 31435675, 31326559, 31140883, 30956589, 30831214, 30790354, 30825829, 30904462, 30983019, 31020971, 30985855, 30853861, 30611886, 30263003, 29830785, 29356377, 28886496, 28456435, 28075728, 27723688, 27357090, 26925998, 26390682, 25734512, 24970824, 24142820, 23315910, 22564423, 21957312, 21546957, 21362110, 21405426, 21658141, 22094130, 22699725, 23489455, 24508726, 25822320, 27495117, 29573049, 32069694, 34961694, 38194534, 41696910, 45397475, 49236767, 53170754, 57167199, 61197620, 65227245, 69205442, 73059145, 76689635, 79971165, 82752685, 84869317, 86169454, 86552680, 86001639, 84590168, 82463097, 79799687, 76779993, 73567050, 70303932]
40031G0303932l189143l014410k771462k497542k223836j968781j741721j551627
40023E1345410j410003j323832j285771j272137j251309j194990j084023r07972
40015D1615373o64077l59107j1944L47173O81753R56803J147585J247426J271027
40006D6232012J249995J221531J215859J248263J318064J413156J517355J617508
39998E7033743J707850J790541J874113J972808K107557K304864K588402K963250
39990G4343128L401183L837793M184903M350877M257982L851815L106079K028005
39982A03361765O65781q86927k496563m009531n282111o209627o744253o897546
39974G1500988o729894o330967n796008n205026m612313m048314l528362l060337
$$ y = [70303932, 67114789, 64100379, 61328917, 58831375, 56607539, 54638758, 52897037, 51345410, 49935407, 48611575, 47325804, 46053667, 44802358, 43607368, 42523345, 41615373, 40951296, 40592189, 40580245, 40927418, 41609171, 42565974, 43713559, 44960985, 46232012, 47482007, 48703538, 49919397, 51167660, 52485724, 53898880, 55416235, 57033743, 58741593, 60532134, 62406247, 64379055, 66486612, 68791476, 71379878, 74343128, 77744311, 81582104, 85767007, 90117884, 94375866, 98227681, 101333760, 103361765, 104027546, 103140619, 100644056, 96634525, 91352414, 85142787, 78398534, 71500988, 64771094, 58440127, 52644119, 47439093, 42826780, 38778466, 35250104, 32189767]
39966C2189767k647806k290211j982748j716584j479287j256044j032581p99488
39958A8985018n56295l13149q8785R5319K23436K93354L18287L19363L11593K93128
39948A9881269K47467J58620K7761j22554k60983l67755m47318n23752o22464
39939A7970291p51408q94326j019260j095885j111629j078803j029985j003983
39931I985012j028529j106925j214077j303906j326420j247920j064723q02781
39923H89731n04210k09721N3703K76235M61119O15789P42580Q35310Q85434Q93124
39913D939094Q72943Q48586Q41194Q59746Q97015R29776R23114Q41025O61862
39904A2614355L90903O2156k71750n56042p49724q35240q17840p14558n40207
$$ y = [32189767, 29541961, 27251750, 25269002, 23552418, 22073131, 20817087, 19784506, 18985018, 18428723, 18115574, 18026789, 18122108, 18345544, 18638898, 18957185, 19276548, 19588141, 19881269, 20128736, 20287356, 20315117, 20192563, 19931580, 19563825, 19116507, 18592755, 17970291, 17218883, 16324557, 15305297, 14209412, 13097783, 12018980, 10988995, 9985012, 8956483, 7849558, 6635481, 5331575, 4005155, 2757235, 1692512, 889731, 385521, 175800, 229503, 505738, 966857, 1582646, 2325226, 3160536, 4045970, 4939094, 5812037, 6660623, 7501817, 8361563, 9258578, 10188354, 11111468, 11952493, 12614355, 13005258, 13067414, 12795664, 12239622, 11489898, 10654658, 9836818, 9122260, 8582053]
39895H582053l01521m562L31623O68149R53711J142085J208670J156834J012377
39886A4749419Q10891N84839L54906J27829r8773l26812n49434p50832r14902
39877A3987131j035640j120199j182006j228821j253779j235342j147100r72637
39869D811607p17441m12122j06291J44776K98490L43242L06360K42959K09241
39860E120821K36567L22192M38696N51467O32149O63978O42251N74040M77234
39851I659395L76422K95671K52215K54581L03340L90588M98383O00859O71775
39842A3303229O92822O57058N67032M31192K61195P0611j25066l08301m62103
39833A5087669n76304o53058p04944p44756p74097p79699p40105o37690m67955
$$ y = [8582053, 8280532, 8275970, 8607593, 9275742, 10229453, 11371538, 12580208, 13737042, 14749419, 15560310, 16145149, 16500055, 16627884, 16529111, 16202299, 15652865, 14902033, 13987131, 12951491, 11831292, 10649286, 9420465, 8166686, 6931344, 5784244, 4811607, 4094166, 3682044, 3575753, 3720529, 4019019, 4362261, 4668621, 4911580, 5120821, 5357388, 5679580, 6118276, 6669743, 7301892, 7965870, 8608121, 9182161, 9659395, 10035817, 10331488, 10583703, 10838284, 11141624, 11532212, 12030595, 12631454, 13303229, 13996051, 14653109, 15220141, 15651333, 15912528, 15983139, 15858073, 15549772, 15087669, 14511365, 13858307, 13153363, 12408607, 11634510, 10854811, 10114706, 9477016, 9009061]
39824I009061k41168K2932L02509N78512Q36291J065848J261917J422847J546924
39815A5805673J627133J647969J588559J433273J185452Q75437N55660K83003
39807B5002159R7029N525j5213o387p333m0972j09552j99494k90446l64544m13431
39796B3657341m41037m61028m90236n41438o18020p11283q00837q59482q62744
39787A7871236p99590o78412n24687l72158k52761j88625j85890k30693k91302
39778A4347118l30122l21253k61713j67986o1510M5060J52570K71470M14056N86487
39768A4674177P82756R82828J156212J269993J298297J229808J070830Q42983
39760B3307884N76933L04367M9992j74627l71989n51951p20667q73625r98171
$$ y = [9009061, 8767893, 8790825, 9093334, 9671846, 10508137, 11573985, 12835902, 14258749, 15805673, 17432806, 19080775, 20669334, 22102607, 23288059, 24163496, 24719156, 25002159, 25099188, 25104713, 25089500, 25083113, 25075780, 25034808, 24925256, 24725762, 24435316, 24070772, 23657341, 23216304, 22755276, 22265040, 21723602, 21105582, 20394299, 19593462, 18733980, 17871236, 17071646, 16393234, 15868547, 15496389, 15243628, 15055003, 14869113, 14638420, 14347118, 14016996, 13695743, 13434030, 13266044, 13204534, 13249594, 13402164, 13673634, 14087690, 14674177, 15456933, 16439761, 17595973, 18865966, 20164263, 21394071, 22464901, 23307884, 23884817, 24189184, 24239176, 24064549, 23692560, 23140609, 22419942, 21546317, 20548146]
39751B0548146j081616j116547j100437j034521r26643p95656o71147n86422n68675
39742A2666482o30791p66023r45542j121121j235627j240194j111838q63269n39043
39733D213034j98227J08229L52269N27439O36410O81237O64485N95492M90530
39724H070898L64528K23390O6062j04835k73829m13490m95143n01047m29776k94334
39714F212424j18872O2494K08954K83341K65981J61837l957j96630l80760n26690
39704E968122o16952o50767o41096o04344n50936m84610m08586l29656k54738
39695A426437j84032j09311k0609Q3954J93299K87092L45637L60797L42338L15309
39685C040911L08032L36802L96438M61810M98214M75310L79930K23314L8523j32164
$$ y = [20548146, 19466530, 18349983, 17249546, 16215025, 15288382, 14492726, 13821579, 13235157, 12666482, 12035691, 11269668, 10324126, 9203005, 7967378, 6727184, 5615346, 4752077, 4213034, 4014807, 4123036, 4475305, 5002744, 5639154, 6320391, 6984876, 7580368, 8070898, 8435426, 8658816, 8724878, 8620043, 8346214, 7932724, 7437581, 6936534, 6506758, 6212424, 6093552, 6156046, 6365000, 6648341, 6914322, 7076159, 7072202, 6875572, 6494812, 5968122, 5351170, 4700403, 4059307, 3454963, 2904027, 2419417, 2010831, 1681175, 1426437, 1242405, 1133094, 1112485, 1196439, 1389738, 1676830, 2022467, 2383264, 2725602, 3040911, 3348943, 3685745, 4082183, 4543993, 5042207, 5517517, 5897447, 6120761, 6159284, 6027120]
39675F027120k53705l10636l11877k88181k81985l30282m46697o13261p87549
39666B402947r20342r72933r26242p80800n51999k65588M5031L42713N95225P85985
39656b46003R18647J010099J076237J121059J135680J105400J018478Q71862O72930
39647H684389M38533J92827l5597k17817l29867l58035l02617j79222j6608J50375
39637H026361K91847L93054M57706N03089N50460O15098O98713P87307Q57523
39628A3181158Q89250Q75308Q20389P32081O14666M71238L08238J33333n3792
39619A7971869k68362n36060q76767j285808j725254k132984k445648k621485
39611F079501k649348k542369k326884k037042j714539j404971j146539r57326
$$ y = [6027120, 5773415, 5462779, 5150902, 4862721, 4580736, 4250454, 3803757, 3190496, 2402947, 1482605, 509672, -416570, -1197370, -1749369, -2014957, -1969926, -1627213, -1031988, -246003, 672644, 1682743, 2758980, 3880039, 5015719, 6121119, 7139597, 8011459, 8684389, 9122922, 9315749, 9280152, 9062335, 8732468, 8374433, 8071816, 7892594, 7875986, 8026361, 8318208, 8711262, 9168968, 9672057, 10222517, 10837615, 11536328, 12323635, 13181158, 14070408, 14945716, 15766105, 16498186, 17112852, 17584090, 17892328, 18025661, 17971869, 17703507, 17167447, 16290680, 15004872, 13279618, 11146634, 8700986, 6079501, 3430153, 887784, -1439100, -3476142, -5190681, -6595652, -7742191, -8699517]
39603h699517q31242p45378o72013n86722m70755l12346j10574J20978L56652
39594a1950917N68206P35154Q48464R06974R12860Q71817P96125P04000O12670
39585d994647N31131M60849M04701L74981L91344M69514O10593P99523J012739
39576F0728J228227J431055J611943J761351J864878J904623J866184J746218
39568A3475207J556143J321781J079958Q70989P25743O51949O28607O13867N62705
39559B1486949M45708K61061L4603j93247l87778n34398o37339p06457p46361
39550A9022741p56791p39504p01474o51659n96354n37584m74127m04095l29274
39541A3831879k59627k13045k07479k49223l25424m06445m57842m56429m01789
$$ y = [-8699517, -9530759, -10276137, -10948150, -11534872, -12005627, -12317973, -12428547, -12307569, -11950917, -11382711, -10647557, -9799093, -8892119, -7979259, -7107442, -6311317, -5607317, -4994647, -4463516, -4002667, -3597966, -3222985, -2831641, -2362127, -1751534, -952011, 60728, 1288955, 2720010, 4331953, 6093304, 7958182, 9862805, 11728989, 13475207, 15031350, 16353131, 17433089, 18304078, 19029821, 19681770, 20310377, 20924244, 21486949, 21932657, 22193718, 22228321, 22035074, 21647296, 21112898, 20475559, 19769102, 19022741, 18265950, 17526446, 16824972, 16173313, 15576959, 15039375, 14565248, 14161153, 13831879, 13572252, 13359207, 13151728, 12902505, 12577081, 12170636, 11712794, 11256365, 10854576]
39532A0854576l15753k29583j67364j36407j28683j29685j28793j26462j34320
39523I357526j66541k27346l04061l71049m00220l69967k69797j03098J10788
39514G256235L38201N38745O76352P28661O91236N75780M03416J96004l0177k64593
39504A1109860m96427p06994q67674r47979r30583q22698o54081m62875k81087
39495D939462j30282k5947J9727L288o0835j37977j83222j59528n4004J16107
39485D326789L09674M76298N73465N80917N07148L83893K49431J29579K9011o1690
39475G504515j50740k35025l01439l34656l22758k58704j42193J5297J86742L34097
39465F295136M21890M31810L68418K53487J15616j6721j16987j62491j40393n4767
$$ y = [10854576, 10538823, 10309240, 10141876, 10005469, 9876786, 9747101, 9618308, 9491846, 9357526, 9190985, 8963639, 8659578, 8288529, 7888309, 7518342, 7248545, 7145447, 7256235, 7594436, 8133181, 8809533, 9538194, 10229430, 10805210, 11208626, 11404630, 11374453, 11109860, 10613433, 9906439, 9038765, 8090786, 7160203, 6337505, 5683424, 5220549, 4939462, 4809180, 4783233, 4802960, 4806248, 4745413, 4607436, 4424214, 4264686, 4210682, 4326789, 4636463, 5112761, 5686226, 6267143, 6774291, 7158184, 7407615, 7537194, 7566205, 7504515, 7353775, 7118750, 6817311, 6482655, 6159897, 5901193, 5759000, 5774297, 5961039, 6295136, 6717026, 7148836, 7517254, 7770741, 7886357, 7869636, 7752649, 7590158, 7449765, 7394998]
39455G394998P2871K12906L41473M49625N42686O32237P27103Q28703R32479J033147
39445A3168228J128789J219616J302322J366405J398109J389900J346991J284713
39437B3605073J219723J163653J124236J110752J136892J217291J360085J560703
39429C3498408J800786K052362K283961K464610K564263K553260K405300K106120
39421E1729070J664983J122385N47275K1102l87128o44304p63383p95075q06530
39412E1688395q59110r94075j226613j544210j908545k264683k558489k754705
39404C7577965k843939k834491k737916k561840k314507k012780j683351j356346
39396A9232795j058938q13345o35509n30070m85718m78995m86675m96471n07091
$$ y = [7394998, 7467869, 7680775, 8022248, 8471873, 9014559, 9646796, 10373899, 11202602, 12135081, 13168228, 14297017, 15516633, 16818955, 18185360, 19583469, 20973369, 22320360, 23605073, 24824796, 25988449, 27112685, 28223437, 29360329, 30577620, 31937705, 33498408, 35299194, 37351556, 39635517, 42100127, 44664390, 47217650, 49622950, 51729070, 53394053, 54516438, 55063713, 55084815, 54697687, 54053383, 53290000, 52494925, 51688395, 50829285, 49835210, 48608597, 47064387, 45155842, 42891159, 40332670, 37577965, 34734026, 31899535, 29161619, 26599779, 24285272, 22272492, 20589141, 19232795, 18173857, 17360512, 16725003, 16194933, 15709215, 15230220, 14743545, 14247074, 13739983]
39387A3739983n20109n33327n40450n34223n09391m65540m09758l55742l16881
39378I554562k97484k90425k84395k74585k66748k70371k86992l05210l08173
39369F970179k86935k46055j95043j34331n1080O9902K29864M08953N73067O87841
39359H026362P29678O89551N72086L94206J84076k2648j91623l00954l47724l45524
39349I387486l15767k79944k56878k62131l04415l78643m61831n18564n15612
39340F093701m37031k90304j01485R4746K63660L76770M17987L88649L06710J97952
39330G311355Q4443k1562j15385j94221k54661k95065l19252l37256l62109m04752
39320E091535m70263n57442o61088p73996q86901r88056j064998j107078j104494
$$ y = [13739983, 13219874, 12686547, 12146097, 11611874, 11102483, 10636943, 10227185, 9871443, 9554562, 9257078, 8966653, 8682258, 8407673, 8140925, 7870554, 7583562, 7278352, 6970179, 6683244, 6437189, 6242146, 6107815, 6056735, 6126637, 6356501, 6765454, 7338521, 8026362, 8756040, 9445591, 10017677, 10411883, 10595959, 10573311, 10381688, 10080734, 9733010, 9387486, 9071719, 8791775, 8534897, 8272766, 7968351, 7589708, 7127877, 6609313, 6093701, 5656670, 5366366, 5264881, 5359627, 5623287, 6000057, 6418044, 6806693, 7113403, 7311355, 7395798, 7374236, 7258851, 7064630, 6809969, 6514904, 6195652, 5858396, 5496287, 5091535, 4621272, 4063830, 3402742, 2628746, 1741845, 753789, -311209, -1418287, -2522781]
39311b522781j043246r02869o63942l23139R5052N38905R41920J240111J387786
39302a252203J368503J199119R25633O11878L24630J19116K7630N3209J70002
39293C547517L30823M80222N69396N68731M74994L11829J23517l7548j27319j25090
39283F117072m0237R2710K27974L24865L60625L36069K71457J93291J18490M6315
39273H048631l6109j39387k59817l77489m63684m91584m45256l24307j43281P3842
39263E441559L01250N17602P09308Q71376J006132J119927J219102J307759J387871
39254A3881886J459351J518307J555803J560335J523521J444589J331080J197090
39246B5471962J060836R40541Q47074P75844P04593O02360M47127K41678J6335
$$ y = [-2522781, -3566027, -4468896, -5132838, -5455977, -5360925, -4822020, -3880100, -2639989, -1252203, 116300, 1315419, 2241052, 2852930, 3177560, 3296676, 3324306, 3377515, 3547517, 3878340, 4358562, 4927958, 5496689, 5971683, 6283512, 6407029, 6369481, 6242162, 6117072, 6076835, 6169545, 6397519, 6722384, 7083009, 7419078, 7690535, 7883826, 8002316, 8048631, 8012522, 7873135, 7613318, 7235829, 6772145, 6280561, 5835305, 5510998, 5367717, 5441559, 5742809, 6260411, 6969719, 7841095, 8847227, 9967154, 11186256, 12494015, 13881886, 15341237, 16859544, 18415347, 19975682, 21499203, 22943792, 24274872, 25471962, 26532798, 27473339, 28320413, 29096257, 29800850, 30403210, 30850337, 31092015, 31108350]
39237C1108350j83842l18222l63677l16381j86101J1114K58738N42240Q46338
39228C1398557J148658J416291J610809J700365J672114J539740J344361J147647
39220D2978542J016572J003892J133728J400261J778870K240693K760659L316362
39212E7629579L883810M438038M959877N441949N887425O303259O694855P065398
39204A02304190P416145P744187Q038834Q280197Q440715Q487524Q383588Q086266
39196A67181646P544081O696746N486619L884394J918967l06744k626111m842095
39188A84937503o769609q272951r289006r830958r971198r810142r445072q952145
39180A12596422q383605p772109p134363o474552n791541n088658m378996l682044
$$ y = [31108350, 30924508, 30606286, 30242609, 29926228, 29740127, 29751241, 30009979, 30552219, 31398557, 32547215, 33963506, 35574315, 37274680, 38946794, 40486534, 41830895, 42978542, 43995114, 44999006, 46132734, 47532995, 49311865, 51552558, 54313217, 57629579, 61513389, 65951427, 70911304, 76353253, 82240678, 88543937, 95238792, 102304190, 109720335, 117464522, 125503356, 133783553, 142224268, 150711792, 159095380, 167181646, 174725727, 181422473, 186909092, 190793486, 192712453, 192405709, 189779598, 184937503, 178167894, 169894943, 160605937, 150774979, 140803781, 130993639, 121548567, 112596422, 104212817, 96440708, 89306345, 82831793, 77040252, 71951594, 67572598, 63890554]
39172F3890554l015339k388527j803835j262050p70462l48035k3052J77490K40977
39163E4697721J76231J0411k20757m83174p50953j009037j252596j483390j703154
39154D7981302j905792k073145k179292k203565k144569k024417j878379j736578
39146C1835565j610930j496116j382235j268134j165464j092016j060689j071628
39138B1688353j111265j157647j188979j191182j160901j104173j034151r69284
39130A2770771r28686r21931r38578r47591r10131p97140n99513l27076j751L48563
39120F746937O93267J000485J238774J381952J417948J356956J230765J080607
39112A6147691R41447Q33893P66773P43514P64406Q23732R06103R86135J032605
$$ y = [63890554, 60875215, 58486688, 56682853, 55420803, 54650341, 54302306, 54279254, 54456744, 54697721, 54873952, 54884363, 54663606, 54180432, 53429479, 52420442, 51167846, 49684456, 47981302, 46075510, 44002365, 41823073, 39619508, 37474939, 35450522, 33572143, 31835565, 30224635, 28728519, 27346284, 26078150, 24912686, 23820670, 22759981, 21688353, 20577088, 19419441, 18230462, 17039280, 15878379, 14774206, 13740055, 12770771, 11842085, 10920154, 9981576, 9033985, 8123854, 7326714, 6727201, 6400125, 6398374, 6746937, 7440204, 8440689, 9679463, 11061415, 12479363, 13836319, 15067084, 16147691, 17089138, 17923031, 18689804, 19433318, 20197724, 21021456, 21927559, 22913694, 23946299]
39103B3946299J016051R17245P33000M76662J73335j47483m58932p41222r82090
39094B4932865j173190j304962j364702j340951j232399j054416q36677o12123
39086A6013445m05574k30907r6747j1460K0160M967l6305p8016j03620j13975
39076A4961968j24434j53644k11581k93652l83437m60774n09064n18340m85639
39067A1821403m15374l19213k13436j14275l4340J8421M0893L5866J2962j2825
39057A0820082k5815j5909J6599O0890J01365J26383J33921J30131J23015J17891
39047A1588553J18498J30936J64710K29273L29729M65289O29263Q07589R77055
39038A5440895J108177J174801J165099J085646R55455P94616O15716M23579K22751
$$ y = [23946299, 24962350, 25879595, 26612595, 27089257, 27262592, 27115109, 26656177, 25914955, 24932865, 23759675, 22454713, 21090011, 19749060, 18516661, 17462245, 16625568, 16013445, 15607871, 15376964, 15280217, 15268757, 15288917, 15293884, 15257579, 15179563, 15075943, 14961968, 14837534, 14683890, 14472309, 14178657, 13795220, 13334446, 12825382, 12307042, 11821403, 11406029, 11086816, 10873380, 10759105, 10724765, 10743186, 10784079, 10819945, 10832907, 10820082, 10794267, 10778358, 10794957, 10855847, 10957212, 11083595, 11217516, 11347647, 11470662, 11588553, 11707051, 11837987, 12002697, 12231970, 12561699, 13026988, 13656251, 14463840, 15440895, 16549072, 17723873, 18888972, 19974618, 20930073, 21724689, 22340405, 22763984, 22986735]
39029B2986735K6070j43931k63659l21005l21736k84840k30946j71963j07348
39020B1167377k7753P6078K03209L37164M50050N15061N18840M64499L63801K27118
39010B4295444O0739j28062l26911n22062p06540q83163j057754j227610j374710
39001A8129371j469590j484411j407258j248152j033656p96567n70028l87068
38993I732641k77322k56043l12655m11404n07214n66762n81410n65835n45127
38984E708869n38562n49333n65599n69963n48388m92524l98202k66480j08162
38975A671656N4191J91788K80565L10594K88675K33542J66763J03919N0409L290
38965C355392m3689r6330j58567k30685l05475l65452l86054l45374k35224o6998
$$ y = [22986735, 23012805, 22868874, 22605215, 22284210, 21962474, 21677634, 21446688, 21274725, 21167377, 21139624, 21215702, 21418911, 21756075, 22206125, 22721186, 23240026, 23704525, 24068326, 24295444, 24356183, 24228121, 23901210, 23379148, 22672608, 21789445, 20731691, 19504081, 18129371, 16659781, 15175370, 13768112, 12519960, 11486304, 10689737, 10119709, 9732641, 9455319, 9199276, 8886621, 8475217, 7968003, 7401241, 6819831, 6253996, 5708869, 5170307, 4620974, 4055375, 3485412, 2937024, 2444500, 2046298, 1779818, 1671656, 1725847, 1917635, 2198200, 2508794, 2797469, 3031011, 3197774, 3301693, 3352102, 3355392, 3311703, 3215373, 3056806, 2826121, 2520646, 2155194, 1769140, 1423766, 1188542, 1121544]
38955A121544J31069L24030M82806N92592O52849O70922O55856O16794N64291
38946E812753N10061M63789M29463M03958L78694L43911K94075K31614J66235
38937I034553J09942P1221N2048M8713N4843O4402P3337Q0063Q5777R4896J14295
38926I884090J50401K05575K76790L57704M41650N22120N89974O30237O22725
38917A3681266N48830M01883J94291m4872k81392m89024o55975p82468q73497
38908A1699042r31898r54446r31240q48810o97235m79363k17058N1229K82108
38899F972329M41753N14574N02934M21846K94162J47644J1993q5653j26391j05686
38889H989505l8393M0904Q5976N4926p2734k86687n48819q06257j006982j110766
$$ y = [1121544, 1252613, 1576643, 2059449, 2652041, 3304890, 3975812, 4631668, 5248462, 5812753, 6322814, 6786603, 7216066, 7620024, 7998718, 8342629, 8636704, 8868318, 9034553, 9144495, 9215716, 9267764, 9316477, 9371320, 9435722, 9509059, 9589122, 9674899, 9769795, 9884090, 10034491, 10240066, 10516856, 10874560, 11316210, 11838330, 12428304, 13058541, 13681266, 14230096, 14631979, 14826270, 14781398, 14500006, 14010982, 13355007, 12572539, 11699042, 10767144, 9812698, 8881458, 8032648, 7335413, 6856050, 6638992, 6690221, 6972329, 7414082, 7928656, 8431590, 8853436, 9147598, 9295242, 9307235, 9221582, 9095191, 8989505, 8951112, 8992016, 9077992, 9132918, 9060184, 8773497, 8224678, 7418421, 6411439, 5300673]
38879E300673j093687r50535o99448l85819p6843J57503K69093K47127J15899
38870B883963q0714k96987m97456o61514p81780q58593q94816q94945q67270q23025
38860c773137p69494p02976o10389m79982l11803j19684P4165K45853L75245M51325
38850e620877M76190M62923M26361L73198L00298K03712R1838q467o0435l7716
38840c392975N6838J88210L04874L61671L34943K24054M4302j80924m25169o61998
38830c146174q67878j024714j120382j146198j093600r54906p30938m41528j29805
38821a0656123J46719L36411M14532L92422L09079K10647J30560Q0549N3564L2703
38811h548937K44n5270j34131k23342k98485l29961k92864j77652L610K19992
$$ y = [5300673, 4206986, 3256451, 2557003, 2171184, 2094341, 2251844, 2520937, 2768064, 2883963, 2803249, 2506262, 2008806, 1347292, 565512, -293081, -1187897, -2082842, -2950112, -3773137, -4542631, -5245607, -5855996, -6335978, -6647781, -6767465, -6693300, -6447447, -6072202, -5620877, -5144687, -4681764, -4255403, -3882205, -3581907, -3378195, -3286357, -3294824, -3355259, -3392975, -3336137, -3147927, -2843053, -2481382, -2146439, -1922385, -1878083, -2059007, -2484176, -3146174, -4014052, -5038766, -6159148, -7305346, -8398946, -9353852, -10084790, -10526318, -10656123, -10509404, -10172993, -9758461, -9366039, -9056960, -8846313, -8715753, -8635204, -8581640, -8548937, -8548693, -8603963, -8738094, -8961436, -9259921, -9589882, -9882746, -10060398, -10056788, -9836796]
38801i836796M33186O11259P37244Q09245Q34624Q23154P83596P24866O58928
38792c420694O00314N60037N37961N20816M89003M27616L33825K16615R1760k2502
38782C34751j07175j44620j24617n2475M7559J38757J86172J70702R6195j2099
38772E33150j15978j77260j71556r6540L0404J82745L34353M61675N42059N56510
38762B079562M97872L76267K14870L9478j28859k74869l87995m63384n02851n12158
38752I37933m95909m55114l89577l01903j98850q9379J7904J16013K00133K68457
38742c90292L22340L64128L93409M04946L90314L41568K54374J30245k1477j83401
38732B006154l33656m51696n22257n36501m93255m01212k77802j41857m703J32233
$$ y = [-9836796, -9403610, -8792351, -8055107, -7245862, -6411238, -5588084, -4804488, -4079622, -3420694, -2820380, -2260343, -1722382, -1201566, -712563, -284947, 48878, 265493, 357253, 334751, 227576, 82956, -41661, -94136, -46577, 92180, 278352, 449054, 545249, 533150, 417172, 239912, 68356, -28184, 2220, 184965, 519318, 980993, 1523052, 2079562, 2577434, 2953701, 3168571, 3208049, 3079190, 2804321, 2416326, 1952942, 1450091, 937933, 442024, -13090, -402667, -704570, -903420, -992799, -974895, -858882, -658749, -390292, -67952, 296176, 689585, 1094531, 1484845, 1826413, 2080787, 2211032, 2189555, 2006154, 1672498, 1220802, 698545, 162044, -331211, -732423, -1010225, -1152082, -1156785, -1024552]
38722a024552K71173M09219N34302O28356O75258O68682O14797N27917M22355
38713C727507L06413J81346M4134j07934k72257m38178n89462p10665p91719q27628
38703E21557q16713p61769o72127n61507m41937l20370k02156r6913j8795K0765
38693c349965K1460m419l9154o8973q7678r2810q0397m4804J6810J01750K04829
38682c423351L24252M63985O29730Q20824J023186J208136J339722J388630J345656
38673E120770J226052J061115Q81739P04231N26590L36227J22760j11981l50962
38664I516541n65348p22174p95004p75284o79212n44327m15424l26677k89301
38655D403790k89829k98381k82934k23982j22794J752J25604K31829L13764L69127
$$ y = [-1024552, -753379, -344160, 190142, 818498, 1493756, 2162438, 2777235, 3305152, 3727507, 4033920, 4215266, 4259400, 4151466, 3879209, 3441031, 2851569, 2140904, 1349185, 521557, -295156, -1056925, -1729052, -2290559, -2732496, -3052866, -3255022, -3351935, -3370730, -3349965, -3328505, -3332924, -3372078, -3441051, -3528729, -3621539, -3701936, -3746740, -3729930, -3628180, -3423351, -3099099, -2635114, -2005384, -1184560, -161374, 1046762, 2386484, 3775114, 5120770, 6346822, 7407937, 8289676, 8993907, 9520497, 9856724, 9979484, 9867503, 9516541, 8951193, 8229019, 7434015, 6658731, 5979519, 5435192, 5019768, 4693091, 4403790, 4113961, 3815580, 3532646, 3308664, 3185870, 3187622, 3313226, 3545055, 3858819, 4227946]
38645D227946L93249L78871L22051K28319J14121K476q4968j35924j51073j40784
38635E154284j16815q4500m0139K5837J22901K54863M16318N91369P54577Q74896
38625G953591R23436Q83592P58319N69145L47263J23662p5432k29143l24373l61243
38615A0568817l55055l28591k97528k58938j91299o6319J33950M03704P10551
38606A0319292J005146J238551J378825J419296J376002J276884J148821J009553
38598B0172370Q68719P35661O26015N59731N50699N95704O71644P44172P82814
38589B6307529P73211P19508O37416N44967M57766L89601L54391L66381M39285
38580C0990055N85827Q16268J133313J524453J957554K385441K759161L043140
$$ y = [4227946, 4621195, 5000066, 5322117, 5550436, 5664557, 5667033, 5582065, 5446141, 5295068, 5154284, 5037469, 4952969, 4912830, 4938667, 5061568, 5316431, 5732749, 6324118, 7078695, 7953591, 8877027, 9760619, 10518938, 11088083, 11435346, 11559008, 11483576, 11254433, 10930060, 10568817, 10213762, 9885171, 9587643, 9328705, 9137406, 9071087, 9205037, 9608741, 10319292, 11324438, 12562989, 13941814, 15361110, 16737112, 18013996, 19162817, 20172370, 21041089, 21776750, 22402765, 22962496, 23513195, 24108899, 24780543, 25524715, 26307529, 27080740, 27800248, 28437664, 28982631, 29440397, 29829998, 30184389, 30550770, 30990055, 31575882, 32392150, 33525463, 35049916, 37007470, 39392911, 42152072, 45195212]
38572D5195212L224385L312756L335348L329747L338178L401479L552106L808336
38564G2497547M172964M637229N187084N807669O484426P202089P943738Q691057
38556A22623803R425791J0131561J0794057J1396709J1910832J2283805J2433032
38549B00999590J2253243J1639541J0522229Q903510O881976M650090K458064
38542B58308243N54399q71455j719612j977019j695323r68303Q2208J313958K569394
38533B55596490L679989M472011M777854M454520L406214J608068q70686l851365
38525B73273095p055160j0150539j2828675j4872812j6188818j6791490j6767518
38518A78618083j6239657j5342201j4204966j2941829j1643606j0376202r182445
$$ y = [45195212, 48419597, 51732353, 55067701, 58397448, 61735626, 65137105, 68689211, 72497547, 76670511, 81307740, 86494824, 92302493, 98786919, 105989008, 113932746, 122623803, 132049594, 142181155, 152975212, 164371921, 176282753, 188566558, 200999590, 213252833, 224892374, 235414603, 244318113, 251200089, 255850179, 258308243, 258862642, 257991187, 256271575, 254294556, 252599233, 251630930, 251713138, 253027096, 255596490, 259276479, 263748490, 268526344, 272980864, 276387078, 277995146, 277124460, 273273095, 266217935, 256067396, 243238721, 228365909, 212177091, 195385601, 178618083, 162378426, 147036225, 132831259, 119889430, 108245824, 97869622, 88687177]
38511H8687177q085060p090144o192750n384986m663329m030138l488366l034683
38503D6717721k657514k341364k073024j845180j656392j508415j401142j326011
38495C1908679j262065j180138j055800q84228o87105n06708l90208l71645m58222
38486B5112560o25552q24462r97940j100685j111306j032692q84880o97407n03299
38477A7334337l32432k03768j20787p4503n3391n4057q5574j64217l01701m94281
38467A5449626p19114r38641j109484j192565j163123j018680p80918m88814j85863
38458G852424R1567L19161M83654N81461O20968O25764O30879O68289P48609Q52769
38448A3475545R41271R74987R33160Q18041O46618M38062K06199l9245k85937
$$ y = [88687177, 80602117, 73511973, 67319223, 61934237, 57270908, 53240770, 49752404, 46717721, 44060207, 41718843, 39645819, 37800639, 36144247, 34635832, 33234690, 31908679, 30646614, 29466476, 28410676, 27526448, 26839343, 26332635, 25942427, 25570782, 25112560, 24487008, 23662546, 22664606, 21563921, 20452615, 19419923, 18535043, 17837636, 17334337, 17001905, 16798137, 16677350, 16602847, 16549456, 16495399, 16409825, 16245608, 15943907, 15449626, 14730512, 13791871, 12682387, 11489822, 10326699, 9308019, 8527101, 8038287, 7852424, 7943991, 8263152, 8746806, 9328267, 9949235, 10574999, 11205878, 11874167, 12622776, 13475545, 14416816, 15391803, 16324963, 17143004, 17789622, 18227684, 18433883, 18394638, 18108701]
38439A8108701n14072o98709q18810q66979q53355q01415p39371o93018o82681
38430A1440291p21996q15484r55642j123224j291902j434682j528663j557508
38422B011190j512416j392589j205364r65833o94185m10031j27013J46663M01354
38413c748224O20539P84425Q80240R09288Q84384Q21560P34495O35551N39850
38404C062108M65363M25890M21342M34838M41776M24782L82478L25921K68294
38395F652792K17147J72427J27485P0704j0981j26678k77905m60141o67252q92469
38385D805129j122919j332683j482702j531502j452404j248087r54263o29253
38377d948684l33299j07374L7921J18761J64533K03680K55659L29597M26297N40265
$$ y = [18108701, 17594629, 16895920, 16077110, 15210131, 14356776, 13555361, 12815990, 12122972, 11440291, 10718295, 9902811, 8947169, 7823945, 6532043, 5097361, 3568698, 2011190, 498774, -893815, -2099179, -3065012, -3759197, -4169228, -4296241, -4149578, -3748224, -3127685, -2343260, -1463020, -553732, 330652, 1152212, 1886707, 2522258, 3062108, 3527471, 3953361, 4374703, 4809541, 5251317, 5676099, 6058577, 6384498, 6652792, 6869939, 7042366, 7169851, 7240555, 7229574, 7102896, 6824991, 6364850, 5697598, 4805129, 3682210, 2349527, 866825, -664677, -2117081, -3365168, -4319431, -4948684, -5281983, -5389357, -5351436, -5232675, -5068142, -4864462, -4608803, -4279206, -3852909, -3312644]
38367c312644O60972P74362Q65531R21373R31425Q87512P85021O26556M24502
38358C564610J99071k6426k28291l82105m63607m54422l50683j69034N3504K65472
38348B008089M11363M45944L50585J44898j15823l60417n28956n90469n43456
38339A221758m06634k11675j03J82089K94795L13820K34637P0118j54754m09072
38329A134979o61457q82924j048126j138971j150955j096129r97634q79071p56272
38320g476560o34440n08414l65284j90972K0361K59676N03436P20036Q78562R57342
38310e836257R50570Q70991P46830O13116M99758M21306L74506L45992L24647
38301f88541L08543L01754L05713L13382L09746K76580J98755P0544r9697k89046
$$ y = [-3312644, -2651672, -1877310, -1011779, -90406, 841019, 1728531, 2513552, 3140108, 3564610, 3763681, 3737255, 3508964, 3126859, 2663252, 2208830, 1858147, 1689113, 1742617, 2008089, 2419452, 2865396, 3215981, 3360879, 3245056, 2884639, 2355683, 1765214, 1221758, 815124, 603449, 603346, 785435, 1080230, 1394050, 1628687, 1698805, 1544051, 1134979, 473522, -409402, -1457528, -2596499, -3747454, -4843583, -5841217, -6720288, -7476560, -8111000, -8619414, -8984698, -9175670, -9155309, -8895633, -8392197, -7672161, -6793599, -5836257, -4885687, -4014696, -3267866, -2654750, -2154992, -1733686, -1359180, -1013188, -688541, -379998, -78244, 227469, 540851, 850597, 1127177, 1325932, 1396476, 1296779, 1007733]
38291A007733m65020n94367o52534o30683n38537m01917k55035j29307m3145J768
38281b701044J5566J0873l409k1814l8966m8852m7718l6998k2924j3171j2834
38270b921291k1526l2311l3036j0503M3278J25096K18249K96616L34343L16221
38260a684864K42519J25592j8433j76275l37733m90508o15735o90514o98172o39714
38250d983837n36844m22515l24350k51834j95379j36909o4374J9101R6860J49572
38240f650509J67927J58834J41366J35635J51843J85749K22442K45379K44769
38231d996565K20070J76048J16604M1723n0696j60405k81477m02595n11826o03991
38221f453110o85135p68171q59672r46958r97385r73145q51921o38620l61159
$$ y = [1007733, 542713, -51654, -704188, -1334871, -1873408, -2275325, -2530360, -2659667, -2702812, -2701044, -2685478, -2674605, -2678014, -2699828, -2738794, -2787646, -2835364, -2872362, -2895286, -2908457, -2921291, -2942817, -2975128, -3008164, -3018667, -2975389, -2850293, -2632044, -2335428, -2001085, -1684864, -1442345, -1316753, -1335186, -1511461, -1849194, -2339702, -2955437, -3645951, -4344123, -4983837, -5520681, -5943196, -6267546, -6519380, -6714759, -6851668, -6916042, -6896941, -6800081, -6650509, -6482582, -6323748, -6182382, -6046747, -5894904, -5709155, -5486713, -5241334, -4996565, -4776495, -4600447, -4483843, -4442120, -4492816, -4653221, -4934698, -5337293, -5849119, -6453110, -7138245, -7906416, -8766088, -9713046, -10710431, -11683576, -12535497, -13174117, -13535276]
38212a3535276n6562K41076N04920P15648Q62950R47611R79290R68816R20626
38203g450901Q31693O97538N20437L14561J05535p5803k03785k68344k79670k62750
38193f071489k42717k28915k08445j54748m5539J22628L31891N51155P47337Q94325
38183d304517R77791R95432R53277Q60959P28897N67347L86295J97000J5723j34465
38173A243739k29226k53762k08957j06504M1341K25999M37235O55740Q53119J001226
38163C659950J084145J104285J079143J032338R85097R51360R35408R31221R25200
38154A2688147R02822Q55936P85846P01202O13442N32261M61848L99208L36981
38145A8277693K70845K06256J57147J34475J32233J23226P0366n3598k51314m98637
$$ y = [-13535276, -13591838, -13350762, -12845842, -12130194, -11267244, -10319633, -9340343, -8371527, -7450901, -6619208, -5921670, -5401233, -5086672, -4981137, -5056940, -5260725, -5529069, -5808739, -6071489, -6314206, -6543121, -6751566, -6906314, -6951853, -6829225, -6497334, -5946179, -5198842, -4304517, -3326726, -2331294, -1378017, -517058, 211839, 779186, 1165481, 1362481, 1378204, 1243739, 1014513, 760751, 551794, 445290, 486631, 712630, 1149865, 1805605, 2658724, 3659950, 4744095, 5848380, 6927523, 7959861, 8944958, 9896318, 10831726, 11762947, 12688147, 13590969, 14446905, 15232751, 15933953, 16547395, 17079656, 17541504, 17940712, 18277693, 18548538, 18754794, 18911941, 19046416, 19178649, 19301875, 19372241, 19318643, 19067329, 18568692]
38135A8568692p52995r67559j108236j168191j170302j152614j145765j158737
38127I944293j180546j191555j174574j121838j038288r40517q51321p92962p82501
38118H70191q29023r31017j074834j236277j385022j489668j523095j468924j327280
38109a0394949j115845q64798o08817l80144k03895r4685n3923o8367j11553j49766
38099a4046742j51858r8600J3708J76429L74839N92882Q14929J025051J204978
38090a0094384J333295J389024J359031J243220J051895P97777M91527J45695
38082b282920k17587n63691q50218j035429j086495r87602p48104m06508k4148
38073h202702L32195O11096P90074Q76345Q96980Q85387Q70196Q69369Q88713
$$ y = [18568692, 17815697, 16848138, 15739902, 14571711, 13401409, 12248795, 11103030, 9944293, 8763747, 7572192, 6397618, 5275780, 4237492, 3296975, 2445654, 1652692, 870191, 41168, -889849, -1964683, -3200960, -4585982, -6075650, -7598745, -9067669, -10394949, -11510794, -12375592, -12984409, -13364553, -13568448, -13663133, -13717056, -13785423, -13896976, -14046742, -14198600, -14297200, -14283492, -14107063, -13732224, -13139342, -12324413, -11299362, -10094384, -8761089, -7372065, -6013034, -4769814, -3717919, -2920142, -2428615, -2282920, -2500507, -3064198, -3914416, -4949845, -6036340, -7023942, -7772046, -8178554, -8202702, -7870507, -7259411, -6469337, -5592992, -4696012, -3810625, -2940429, -2071060, -1182347]
38064a182347R22544R55238R64811R30034Q39395O96530N18166L27273J48020
38055E119664M561q2121j04276p8319m3241m1511r4868j93794l07437m03800m65163
38044C309695m91882m96339m92440m86524m75129m50405m07132l44368k62364
38035e96888j61740m8289O2017J45000J77498J47573N9929o5204j98707l11768
38025g90579l82708l97950l49412k34946o4568J33003L11771M20297M18473K91452
38015f45167N5900k42993n43298p83903r22101r44289q65542p18704n38396l47748
38005f496241j54348M3493K45291M39989O06481P22639P76678P72718P26560O55573
37995a661167N71314M80245L88753L04363K30399J60148P8080l1624j75391l45339
$$ y = [-1182347, -259803, 695435, 1660246, 2590280, 3429675, 4126205, 4644371, 4971644, 5119664, 5124225, 5042104, 4937828, 4859509, 4816268, 4774757, 4679889, 4486095, 4178658, 3774858, 3309695, 2817813, 2321474, 1829034, 1342510, 867381, 416976, 9844, -334524, -596888, -758628, -806917, -744900, -599900, -422402, -274829, -214900, -280104, -478811, -790579, -1173287, -1571237, -1920649, -2155595, -2220163, -2087160, -1775389, -1355092, -936619, -645167, -589267, -832260, -1375558, -2159461, -3081562, -4025851, -4891393, -5610097, -6148493, -6496241, -6650589, -6607096, -6361805, -5921816, -5315335, -4592696, -3816018, -3043300, -2316740, -1661167, -1089853, -609608, -220855, 83508, 313907, 474055, 552135, 520511, 345120, -219]
37985b19n20867o75572p87051q45265q55049q32238p97511p71731p72266q07540
37975g665309q70533r36100r66444r24437p89165n65808k83933J5674K98224N45771
37965a2142060P55763R29960J062436J135421J126393J022712Q34683N98410L65335
37956d310947J83639Q1427O0460J02449J82101K77478L72532M54628N13356N42919
37946a539958N44485N25128M94459M62262M38011M30429M46008M87201N51234
37937B839259O29461P08054P71088Q06094Q09606P89246P60187P36715P23482
37928I573192P12533O88675O38984N59245M54520L36782K22784J31047P6279O3479
37918A3457520Q6453J31828J85307K36545K81211L19840L53540L79005L87047
$$ y = [-219, -521086, -1196658, -1983709, -2828974, -3684023, -4516261, -5313772, -6085503, -6857769, -7665309, -8535842, -9471942, -10438386, -11362823, -12151988, -12717796, -13001729, -12986055, -12687831, -12142060, -11386297, -10456337, -9393901, -8258480, -7132087, -6109375, -5274692, -4676282, -4310947, -4127308, -4045881, -3985421, -3882972, -3700871, -3423393, -3050861, -2596233, -2082877, -1539958, -995473, -470345, 24114, 486376, 924387, 1354816, 1800824, 2288025, 2839259, 3468720, 4176774, 4947862, 5753956, 6563562, 7352808, 8112995, 8849710, 9573192, 10285725, 10974400, 11613384, 12172629, 12627149, 12963931, 13186715, 13317762, 13394041, 13457520, 13543973, 13675801, 13861108, 14097653, 14378864, 14698704, 15052244, 15431249, 15818296]
37909A5818296L66249L08271K10272P3905r5598k88012m86324o68342q12786r06222
37899A3519709r45721r35776q83584p97599o89076n71779m57638l52333k55756
37890G630447j66200q3127o436O4613J30133J87305K29753K49165K38707J98506
37880H672866J41390R3385Q4263J31695K29838L50665M55964N10864M92214L92327
37870A1555471K21488Q785k03177l72129m73282n09209n04905m90797m85319m88615
37860H258311m89584m77978m50476m07045l43902k51854j22513M2543K26297L97536
37850F381335N18739N58249N01659L56036J44529j03677l59860n95474p79609
37841F621927q81440q80239p78010o05375m13977k57272j70037j57806k00245
$$ y = [15818296, 16184545, 16492816, 16703088, 16776993, 16681395, 16393383, 15907059, 15238717, 14425931, 13519709, 12573988, 11638212, 10754628, 9957029, 9267953, 8696174, 8238536, 7886203, 7630447, 7464247, 7381120, 7374684, 7439297, 7569430, 7756735, 7986488, 8235653, 8474360, 8672866, 8814256, 8907641, 8991904, 9123599, 9353437, 9704102, 10160066, 10670930, 11163144, 11555471, 11776959, 11785744, 11582567, 11210438, 10737156, 10227947, 9723042, 9232245, 8746926, 8258311, 7768727, 7290749, 6840273, 6433228, 6089326, 5837472, 5714959, 5757502, 5983799, 6381335, 6900074, 7458323, 7959982, 8316018, 8460547, 8356870, 7997010, 7401536, 6621927, 5740487, 4860248, 4082238, 3476863, 3062886, 2805614, 2635577, 2477771, 2277526]
37832B277526k64220l18887l46287l43979l20325k87598k58586k47256k68675
37823c78287l34406m45634n89532p42241q76998r73118j020822j019585r72685
37814g353308q84134p60940o16396m67951l29632k06232r4912P665R9436J72456
37804a0433948K16883K26093K00458J49126Q9684M5230L7685P7822J56369K43152
37794h991446K97689K86544J97668M4657j38624l08134m20413m42423l59629j80633
37784a0014744O3282L24304N49158O92460P28135O54826M94148K83891O9164j06673
37774f262049k10261k24451j51478j2411J57887L20728M45860N19981N47014N41774
37764d327406N22410N04176M93699M85047M62513M11185L27539K20409J02186
$$ y = [2277526, 2013306, 1694419, 1348132, 1004153, 683828, 396230, 137644, -109612, -378287, -712693, -1158327, -1747859, -2490100, -3367098, -4340216, -5361038, -6380623, -7353308, -8237442, -8998382, -9614778, -10082729, -10412361, -10618593, -10713505, -10705840, -10606404, -10433948, -10217065, -9990972, -9790514, -9641388, -9551704, -9506474, -9468789, -9390967, -9234598, -8991446, -8693757, -8407213, -8209545, -8164888, -8303512, -8611646, -9032059, -9474482, -9834111, -10014744, -9951462, -9627158, -9078000, -8385540, -7657405, -7002579, -6508431, -6224540, -6155376, -6262049, -6472310, -6696761, -6848239, -6860650, -6702763, -6382035, -5936175, -5416194, -4869180, -4327406, -3804996, -3300820, -2807121, -2322074, -1859561, -1448376, -1120837, -900428, -798242]
37755g98242k0028j44572k67936l78015m54285m75408m30025l24586j83161l8897
37745c515155P7905J48769J70745J56371J31342J28367J75953K84733M38301N95426
37735a207243P04954P26895O48400M85862K73460M7019j66985l53877n07834o27845
37725B2806p14276p66328p80940p53666o80595n60233l95233j93968K9031K54537
37715d538865M60739O24607P24061P43599O81933N55299L91832K20194O0425p7714
37705a53890j90182k72797l18681l20913k79155k05841j26659p2923o8836j20940
37695b130817k16511l31976m45386n44868o29388p04511p77450q53128r31235
37686g565270j004557j058739j073231j024648q95181o84660m17657j37059J13381
$$ y = [-798242, -818270, -962842, -1230778, -1608793, -2063078, -2538486, -2968511, -3293097, -3476258, -3515155, -3437250, -3288481, -3117736, -2961365, -2830023, -2701656, -2525703, -2240970, -1802669, -1207243, -502289, 224606, 873006, 1358868, 1632328, 1679347, 1512362, 1158485, 650651, 22806, -691470, -1457798, -2238738, -2992404, -3672999, -4233232, -4628465, -4822433, -4793402, -4538865, -4078126, -3453519, -2729458, -1985859, -1303926, -748627, -356795, -136601, -76176, -153890, -344072, -616869, -935550, -1256463, -1535618, -1741459, -1868118, -1941041, -2009877, -2130817, -2347328, -2679304, -3124690, -3669558, -4298946, -5003457, -5780907, -6634035, -7565270, -8569827, -9628566, -10701797, -11726445, -12621626, -13306286, -13723943, -13861002, -13747621]
37677a3747621L04945M28611M90153N03343M85558M55369M31250M30918M69321
37668i748153N53571O77148Q18909R50157J047002J100697J118796J115436J097750
37659a268687J060080R91815Q91800P75982O72394O09733O08777O79122Q17441
37650E838457J004815J205880J374539J467405J459487J352706J171174R47331
37642A5821794P10008M81419K79275J15854p214j01676j87370k81902l92981n18025
37632A5919182o49215p78856r00655j006370j081553j105804j059877r36229p46628
37623G653995n22102l05171j37718m9313m9743j27233k51781l82946m81230n20367
37613D826391m94829m18201l13324k00805r2758N613Q9753J51434J81957J81840
$$ y = [-13747621, -13442676, -13014065, -12523912, -12020569, -11535011, -11079642, -10648392, -10217474, -9748153, -9194582, -8517434, -7698525, -6748368, -5701366, -4600669, -3481873, -2366437, -1268687, -208607, 783208, 1675008, 2450990, 3123384, 3733117, 4341894, 5021016, 5838457, 6843272, 8049152, 9423691, 10891096, 12350583, 13703289, 14874463, 15821794, 16531802, 17013221, 17292496, 17408350, 17401136, 17299460, 17112090, 16830188, 16437207, 15919182, 15269967, 14491111, 13590456, 12584086, 11502533, 10396729, 9336852, 8400623, 7653995, 7131893, 6826722, 6689004, 6639691, 6589948, 6462715, 6210934, 5827988, 5346758, 4826391, 4331562, 3913361, 3600037, 3399232, 3306474, 3312087, 3401840, 3553274, 3735231, 3917071]
37603C917071J68218J70821K16489L12552M40824N65442O48163O61499N93777
37594G694856M46771K31188l5315l27444o12282q52017j008715j050730r61590
37585C524722p49294m49037j13725K04399M70009O69707Q05676Q85202R14270
37576F161929Q98806Q50326P88525P36007P07908P03966P07964O93826O35038
37567A2884295N14438L31062J00693j50255l93366o04335p65403q66168r04164
37558A0146797q84707q19234p23416o16729n22872m67171m67980n25336o16308
37549D503044p03783p54396p53035p05018o28084n42568m65154m06082l68407
37540h23483l49371l43517l45568l50812l53218l44296l15188k61274j85268r5800
$$ y = [3917071, 4085289, 4256110, 4472599, 4785151, 5225975, 5791417, 6439580, 7101079, 7694856, 8141627, 8372815, 8337500, 8010056, 7397774, 6545757, 5537042, 4486312, 3524722, 2775428, 2326391, 2212666, 2417065, 2887074, 3556781, 4362457, 5247659, 6161929, 7060735, 7911061, 8699586, 9435593, 10143501, 10847467, 11555431, 12249257, 12884295, 13398733, 13729795, 13830488, 13680233, 13286867, 12682532, 11917129, 11050961, 10146797, 9262090, 8442856, 7719440, 7102711, 6579839, 6112668, 5644688, 5119352, 4503044, 3799261, 3044865, 2291830, 1586812, 958728, 416160, -48994, -455076, -823483, -1172854, -1516371, -1861939, -2212751, -2565969, -2910265, -3225453, -3486727, -3671995, -3767795]
37530c767795k310Q9971J81903K78763L86081N04966O29552P47873Q44283R00622
37520G93909Q97113Q16899O54971M25746J62446r3236l06453m61877n66773o41587
37510A681158p03272p52416p72195p37544o26815m30591j56409J71329N16801
37501a809954Q40914J106979J281815J335828J247311J011860O51960K18822k18783
37492E666752n95162q65958j012873j035406r41164p45410m78827j92570M9379
37483a51239J90132K00971Q9837j07972l49391n99921q38181j049903j218645
37474c834312j321043j331181j232805j031499p57697m57906j79597M2384J92973
37465i910683K75690L04247K92751K52480J96815J45826J21118J32586J69692
$$ y = [-3767795, -3770105, -3680134, -3498231, -3219468, -2833387, -2328421, -1698869, -950996, -106713, 793909, 1691022, 2507921, 3162892, 3588638, 3751084, 3657848, 3351395, 2889518, 2322745, 1681158, 977886, 225470, -546725, -1284269, -1911084, -2341675, -2498084, -2326755, -1809954, -969040, 137939, 1419754, 2755582, 4002893, 5014753, 5666713, 5885535, 5666752, 5071590, 4205632, 3192759, 2157353, 1216189, 470779, -8048, -200618, -151239, 38893, 239864, 329701, 221729, -127662, -727583, -1565764, -2615667, -3834312, -5155355, -6486536, -7719341, -8750840, -9508537, -9966443, -10146040, -10103656, -9910683, -9634993, -9330746, -9037995, -8785515, -8588700, -8442874, -8321756, -8189170, -8019478]
37456h019478K07640K25172K20005K09627K17703K57452L23788L96729M50217
37447e511145M60752M15402L19252J98262R2473M0450O2541J51720K76319L93326
37437c100648M65867M75949M26753L36028K27474J24875M8328J0194J1175L9342
37427i34663P3883R2077P6149J7242q4094k19360l73682n27278o57985p45967
37417c283678p79731p60310o99865o14064n13110l98777k69648j28184J8676J65903
37407g262788L15668M74441O43773Q13316R62728J071770J131772J150644J147770
37398D49094J141827J139173J129794J092902J008897Q71167O90891M91734K98001
37389H313480J25053k1799j41929k34922l01111l44456l73051l96421m22328m55020
$$ y = [-8019478, -7811838, -7586666, -7366661, -7157034, -6939331, -6681879, -6358091, -5961362, -5511145, -5050393, -4634991, -4315739, -4117477, -4025004, -3984554, -3922013, -3770293, -3493974, -3100648, -2634781, -2158832, -1732079, -1396051, -1168577, -1043702, -995374, -985180, -974005, -934663, -860780, -768703, -692554, -675312, -759406, -978766, -1352448, -1879726, -2537711, -3283678, -4063409, -4823719, -5523584, -6137648, -6650758, -7049535, -7319183, -7447367, -7428691, -7262788, -6947120, -6472679, -5828906, -5015590, -4052862, -2981092, -1849320, -698676, 449094, 1590921, 2730094, 3859888, 4952790, 5961687, 6832854, 7523745, 8015479, 8313480, 8438533, 8416734, 8274805, 8039883, 7738772, 7394316, 7021265, 6624844, 6202516, 5747496]
37379E747496m94390n35241n67246n76815n51157m83365l76391k43309j02902
37370A816680K7076J34523K13196K60570K76915K66290K36836J98424J58936J22212
37360C711658Q9267O1555M3505M1831O1271R8908J41035J66130J54620J01471
37350D671251K3401m6514p6305n3761P432P8719J35700J70329J88373J97003J94657
37339E490285J71500J19039L9951m9752j27251j73153j79508j51728j03496m7490
37329D988397J1454P5118J43704K08410K51649K54642K06886J12083j2247j41857
37319F098239k56593l48916m24982m98739n83789o86823q03547r18116j008432
37310E68302j057378j063664j043218j017788r98788r80015r45944q88205q15255
$$ y = [5747496, 5253106, 4717865, 4150619, 3573804, 3022647, 2539282, 2162891, 1919582, 1816680, 1843756, 1978279, 2191475, 2452045, 2728960, 2995250, 3232086, 3430510, 3589446, 3711658, 3800925, 3862480, 3905985, 3947816, 4009087, 4107995, 4249030, 4415160, 4569780, 4671251, 4694652, 4648138, 4571833, 4518072, 4525504, 4604223, 4739923, 4910252, 5098625, 5295628, 5490285, 5661785, 5780824, 5820775, 5771023, 5643772, 5470619, 5291111, 5139383, 5035887, 4988397, 4999851, 5074969, 5218673, 5427083, 5678732, 5933374, 6140260, 6252343, 6240096, 6098239, 5841646, 5492730, 5067748, 4569009, 3985220, 3298397, 2494850, 1576734, 568302, -489076, -1552740, -2595958, -3613746, -4612534, -5592549, -6538493, -7426698, -8241953]
37301h241953p47450p03283o88771o96435p11331p17983p03912o59349n76234
37292a4446701m50710k89526j14629M0779J44691J79596J48527P1490k4528j16431
37282a4857442j91167k44131k72285k68871k24928j36878j4312J18540K30890
37273a5860584L00090L23617L19082L12226L23494L63638M37751N48103O90087
37264a2242496Q46263R88389J090555J145118J168306J189032J227870J281220
37256c305743J321547J312264J226871J062032Q39786N99489L84099K27442J47204
37247C814991J43480K00335K90576L85583M67515N35807O02678O81395P75930
37238G898290Q76670R61760J003709R81545Q93919P63047O23207N00529L99405
$$ y = [-8241953, -8989403, -9692686, -10381457, -11077892, -11789223, -12507206, -13211118, -13870467, -14446701, -14897411, -15186937, -15301566, -15260787, -15116096, -14936500, -14787973, -14716483, -14741011, -14857442, -15048609, -15292740, -15565025, -15833896, -16058824, -16195702, -16210014, -16091474, -15860584, -15560494, -15236877, -14917795, -14605569, -14282075, -13918437, -13480686, -12932583, -12242496, -11396233, -10407844, -9317289, -8172171, -7003865, -5814833, -4586963, -3305743, -1984196, -671932, 554939, 1616971, 2456757, 3056246, 3440345, 3667787, 3814991, 3958471, 4158806, 4449382, 4834965, 5302480, 5838287, 6440965, 7122360, 7898290, 8774960, 9736720, 10740429, 11721974, 12615893, 13378940, 14002147, 14502676, 14902081]
37229A4902081L05152J98553O9520p9044k36316l90781n34195o62295p75260q79150
37219A1918265r85612j106414j243894j383986j498030j553271j525411j406455
37211A215192j205874r47396o64079l92337j65018m682Q0168R4006M9536l6886
37201a977370j46418k56523l41766l79533l57964k79582j57255o401J58925L22976
37191c420911M63863N55948N80532N36479M40789L17542J84208M6262r7131k43410
37181f35829l82334m99444n81808o19946o06690n38318m19826k69140j14125J7207
37171d650253J06561J49307J51916J26041Q2826K9524l0945r8058j70501k42862
37161d546444l03342l34332l16660k36514r2245J01796L17066N19608O82817P96210
$$ y = [14902081, 15207233, 15405786, 15475306, 15396262, 15159946, 14769165, 14234970, 13572675, 12797415, 11918265, 10932653, 9826239, 8582345, 7198359, 5700329, 4147058, 2621647, 1215192, 9318, -938078, -1602157, -1994494, -2159512, -2164194, -2084026, -1990020, -1940484, -1977370, -2123788, -2380311, -2722077, -3101610, -3459574, -3739156, -3896411, -3902812, -3743887, -3420911, -2957048, -2401100, -1820568, -1284089, -843300, -525758, -341550, -295288, -392419, -635829, -1018163, -1517607, -2099415, -2719361, -3326051, -3864369, -4284195, -4553335, -4667460, -4650253, -4543692, -4394385, -4242469, -4116428, -4033602, -4004078, -4035023, -4133081, -4303582, -4546444, -4849786, -5184118, -5500778, -5737292, -5829537, -5727741, -5410675, -4891067, -4208250, -3412040]
37151c412040Q63457Q91745Q81732Q25022P08233N19317K54300p6623m47045q19585
37141A88513j156237j427745j618222j725810j760831j741352j686369j609229
37133a2537282j513925j395124j241440j040964p87202m82691j39142K24355N83327
37124a8330088R10267J178352J365863J459038J452644J350054J164311R18930
37116h530629O45499L77510J43498l7413j57857k24221k56714k82928l24256l83322
37106i030833m43084m79712m79711m48546m05246l67725l39108l04190k38893
37097a2537048j26927K7283J97884L49047M50761M89808M71603M14593L42247
37088i920749K76332K32521K17842K30553K62842L04429L43261L62564L38868
$$ y = [-3412040, -2548583, -1656838, -775106, 49916, 758149, 1277466, 1531766, 1455143, 1008098, 188513, -967724, -2395469, -4013691, -5739501, -7500332, -9241684, -10928053, -12537282, -14051207, -15446331, -16687771, -17728735, -18515937, -18998628, -19137770, -18913415, -18330088, -17419821, -16241469, -14875606, -13416568, -11963924, -10613870, -9449559, -8530629, -7885130, -7507620, -7364122, -7401535, -7559392, -7783613, -8040327, -8323255, -8647511, -9030833, -9473917, -9953629, -10433340, -10881886, -11287132, -11654857, -11993965, -12298155, -12537048, -12663975, -12636692, -12438808, -12089761, -11639000, -11149192, -10677589, -10262996, -9920749, -9644417, -9411896, -9194054, -8963501, -8700659, -8396230, -8052969, -7690405, -7351537]
37079g351537K47232P3947j70621m48691p05140q85865r53850q95071p14657m30248
37069a2234501o8462L35566P39603J099336J376553J548035J611906J587624J507671
37060b496669J404155J297194J190377J073736R32008P55382N48770L33713J39852
37051E178518r288j06097j57829j77358j73582j47012r1022K914J37658L02935
37041D759837M71962O05916O65941O27477M89426K73281J3125k57543n14944p46243
37031F388235r44243j100610j202786j236670j193484j077061r07114p15200n33507
37022b522440l81827k61644j62323p4659n98M8296O0594L3856k3734r8545j78930
37011c561954k60194l44610m37482n42756o60321p83853q98138r79446j003082
$$ y = [-7351537, -7104305, -7030358, -7200979, -7649670, -8354810, -9240675, -10194525, -11089596, -11804253, -12234501, -12302963, -11967397, -11227794, -10128458, -8751905, -7203870, -5591964, -4004340, -2496669, -1092514, 204680, 1395057, 2468793, 3400801, 4156183, 4704953, 5038666, 5178518, 5169230, 5063133, 4905304, 4727946, 4554364, 4407352, 4316330, 4319244, 4456902, 4759837, 5231799, 5837715, 6503656, 7131133, 7620559, 7893840, 7906965, 7649422, 7134478, 6388235, 5443992, 4343382, 3140596, 1903926, 710442, -366619, -1273733, -1988933, -2522440, -2904267, -3165911, -3328234, -3402893, -3403491, -3355195, -3294601, -3260745, -3284479, -3383024, -3561954, -3822148, -4166758, -4604240, -5146996, -5807317, -6591170, -7489308, -8468754, -9471836]
37002i471836r55273q39902o74678m81999k83041r6541O2349J85351K73226L34162
36992a1948182L79853M21388M65301N10828N52068N86101O21007O74815P63665
36983f973156Q87839J027010J148534J222935J237249J199926J136058J075343
36975A961738J037869J024955J020731J003866R61592Q96718Q24031P59785P11474
36966A0202759O73548O30539N64674M63254L22975J51224l5688k18327l82500
36957A2372458n24011o44967p45256q18118q53585q44578p89763o93511n66258
36948E892411m25042k91476j86920j27477j20461j62710k41840l41306m47075
36939C548104n51490o51993p45917q24136q67298q49069p48355n64554l24725
$$ y = [-9471836, -10427109, -11267011, -11941689, -12423688, -12706729, -12803270, -12740921, -12555570, -12282344, -11948182, -11568329, -11146941, -10681640, -10170812, -9618744, -9032643, -8411636, -7736821, -6973156, -6085317, -5058307, -3909773, -2686838, -1449589, -249663, 886395, 1961738, 2999607, 4024562, 5045293, 6049159, 7010751, 7907469, 8731500, 9491285, 10202759, 10876307, 11506846, 12071520, 12534774, 12857749, 13008973, 12973285, 12754958, 12372458, 11848447, 11203480, 10458224, 9640106, 8786521, 7941943, 7152180, 6458669, 5892411, 5467369, 5175893, 4988973, 4861496, 4741035, 4578325, 4336485, 3995179, 3548104, 2996614, 2344621, 1598704, 774568, -92730, -941799, -1690154, -2254708, -2579433]
36930b579433p5746J34387K74853L40673L49777L32703L21077L38994L97505M90867
36920C25657N95913O78086P04391O57116N39969L73776J85821n32j71797l24965
36910C563435m63777n92463p09571q05163q63996q74151q36521p68588o99133
36901c049928o55956o52634o80860p12339p09847o41988m94230k72290O65K90155
36891g579252N59062P78244R34919J033557J088807J116199J126733J126706J120216
36882A305191J111242J103654J098995J093508J077235J037229R64252Q60017
36874I651323P40639O32433N59472N29450N28694N32424N23595N05255M96464
36865A4699749N15955N67183O35558O98153P37618P51090P50035P53529P80369
$$ y = [-2579433, -2655179, -2520792, -2245939, -1905266, -1555489, -1222786, -901709, -562715, -165210, 325657, 921570, 1599656, 2304047, 2961163, 3501132, 3874908, 4060729, 4060197, 3888400, 3563435, 3099658, 2507195, 1797624, 992461, 128465, -745686, -1582207, -2350795, -3049928, -3705884, -4358518, -5039378, -5751717, -6461564, -7103552, -7597782, -7870072, -7869407, -7579252, -7020190, -6241946, -5307027, -4273470, -3184663, -2068464, -941731, 184975, 1305191, 2416433, 3520087, 4619082, 5712590, 6789825, 7827054, 8791306, 9651323, 10391962, 11024395, 11583867, 12113317, 12642011, 13174435, 13698030, 14203285, 14699749, 15215704, 15782887, 16418445, 17116598, 17854216, 18605306, 19355341, 20108870, 20889239]
36856B0889239Q43233R44679J074422J210567J327677J409347J456962J488197
36848C0644323J527664J598264J718441J902506K158685K484491K864181L271507
36840D8170062L675558M045399M352487M573308M693197M707501M615165M405679
36832H3238356M048972L499669K718469J700220M91846q11086k087458l221293
36824H9577695m126217m755864n100998n180094n030585m703431m258468l756975
36816E2665063l251860k780373k363722k012518j732358j525437j389466j317247
36808C6292082j297443j314478j347688j373417j372008j335425j268656j183190
36800B5799777j088501r88486q83933p76064o66209n52060m25645k77296j03925
$$ y = [20889239, 21732472, 22677151, 23751573, 24962140, 26289817, 27699164, 29156126, 30644323, 32171987, 33770251, 35488692, 37391198, 39549883, 42034374, 44898555, 48170062, 51845620, 55891019, 60243506, 64816814, 69510011, 74217512, 78832677, 83238356, 87287328, 90786997, 93505466, 95205686, 95697532, 94886446, 92798988, 89577695, 85451478, 80695614, 75594616, 70414522, 65383937, 60680506, 56422038, 52665063, 49413203, 46632830, 44269108, 42256590, 40524232, 38998795, 37609329, 36292082, 34994639, 33680161, 32332473, 30959056, 29587048, 28251623, 26982967, 25799777, 24711276, 23722790, 22838857, 22062793, 21396584, 20844524, 20418879, 20141583, 20037658]
36791B0037658Q4982K69097M25286N35611N90569N88461N34746M42655L32283
36782B3841348K25300J36799P0092J9104k3944o3290j01897j47629k14435l14738
36772B3426710m48454n97649p31356q17889q38513p96280p15764o33277n81639
36763A7265889n76534o10618o57832o85962o71428o09302n14515m14797l38706
36754A2186195l02958l04505l23125l34891l28105l09728k98261l10135l49891
36745I324596m08149m65190m97356m85182m21369l14707j87644o9366J1359L1540
36735F518532k1338j44340l16594n03594o68585p84996q42705q46227q08822p46971
36725H34360o76051o06429n40656m74086m00050l17724k37881j81785j72177k21570
$$ y = [20037658, 20122640, 20391737, 20817023, 21352634, 21943203, 22531664, 23066410, 23509065, 23841348, 24066648, 24203447, 24273539, 24292643, 24268699, 24205409, 24103512, 23955883, 23741448, 23426710, 22978256, 22380607, 21649251, 20831362, 19992849, 19196569, 18480805, 17847528, 17265889, 16689355, 16078737, 15420905, 14734943, 14063515, 13454213, 12939698, 12524901, 12186195, 11883237, 11578732, 11255607, 10920716, 10592611, 10282883, 9984622, 9674487, 9324596, 8916447, 8451257, 7953901, 7468719, 7047350, 6732643, 6544999, 6475633, 6486992, 6518532, 6497194, 6352854, 6036260, 5532666, 4864081, 4079085, 3236380, 2390153, 1581331, 834360, 158309, -448120, -988776, -1462862, -1862912, -2180636, -2418517, -2600302, -2772479, -2994049]
36715b994049l25655m65758o16924p55281q61023r18057r13396q38588o93191
36706i381922m87641k42661J4588K54365M46614N64015N87879N14063L54308J33202
36696g243190j14886l47931n22192o04459n84512m77606l13921j22677P7851K78865
36686i974658M71683O39214P55722P95643P45625O11818M18408J99612r390j78351
36676e524674k84553l14341k64933j44877K8859K35694M53879O58800Q21372R12864
36666c421910R16334Q36713P00147N41007L84795K38194R2175o4875k32676l92008
36656d02104n09150n49736m94778l50294j45245Q0654K91636M64372N86874O52085
36646c75686O54316N92311M74527L19355J48467k0437j75082l05080l99722m50754
$$ y = [-2994049, -3319704, -3785462, -4402386, -5157667, -6018690, -6936747, -7850143, -8688731, -9381922, -9869563, -10112224, -10097636, -9843271, -9396657, -8832642, -8244763, -7730700, -7376392, -7243190, -7358076, -7706007, -8228199, -8832658, -9417170, -9894776, -10208697, -10331374, -10253523, -9974658, -9502975, -8863761, -8108039, -7312396, -6566771, -5954953, -5536545, -5336933, -5346323, -5524674, -5809227, -6123568, -6388501, -6533378, -6504519, -6268825, -5814946, -5156146, -4334774, -3421910, -2505576, -1668863, -968716, -427709, -42914, 195280, 287455, 222580, -10096, -402104, -911254, -1460990, -1955768, -2306062, -2451307, -2370653, -2079017, -1614645, -1027771, -375686, 278630, 870941, 1345468, 1664823, 1813290, 1792853, 1617771, 1312691, 912969, 462215]
36636D62215m57552m29805l85278l43501l18086l11294l14042l11276k89057k39490
36626b937166j62807o7925K8450J05539J45574J42462J08065P1842P1384J36394
36616b358188K73996M64099O67761Q43698R64637J027104J051922J075467J134308
36607E144804J248727J412351J592505J740724J808592J763463J599650J340994
36599A7651810J032070P20622M40411K03983O690j64775l25479m86763o50250
36590A8428319q03582r22958r82892r67749q79114p37367n78197m44224l71989
36581A1740247l78379m53836n67864o84470p77365q35201q56235q41322p92981
36572E552594p18798o31700n44560m64659l93682l32099k82944k52471k48406
$$ y = [462215, 4663, -425142, -810420, -1153921, -1472007, -1783301, -2097343, -2408619, -2697676, -2937166, -3099973, -3167898, -3139448, -3033909, -2888335, -2745873, -2637808, -2565966, -2494582, -2358188, -2084192, -1620093, -952332, -108634, 856003, 1883107, 2935029, 4010496, 5144804, 6393531, 7805882, 9398387, 11139111, 12947703, 14711166, 16310816, 17651810, 18683880, 19404502, 19844913, 20048896, 20055586, 19890811, 19565332, 19078569, 18428319, 17624737, 16701779, 15718887, 14751138, 13872024, 13134657, 12556460, 12112236, 11740247, 11361868, 10908032, 10340168, 9655698, 8878333, 8043132, 7186897, 6345575, 5552594, 4833796, 4202096, 3657536, 3192877, 2799195, 2467096, 2184152, 1931681, 1683275]
36563A683275k76865l38662m27158n29899o32873p23913p93839q37303q54320
36554c731557q50179q31466q00308p51101o71559n46830l65729j28888J44072
36545h533545M14247O33525P61141P78133O93048N37273L51791J69933L903j56711
36535d347262l32629n36553p60886r78190j152229j251913j260924j179732j020904
36526a2821222q01477n36495k36563Q9532M28685P58168J046142J259357J373907
36517i439966J382826J297070J140511R42419P31665N35601L81917K97689L01482
36508b428786L92109N43117P09122Q42028R09029R03233Q41533P51666O57684
36499D120735N72976N01943M44221L96921L56121L19335K86692K57998K27719
$$ y = [1683275, 1406410, 1067748, 640590, 110691, -522182, -1246095, -2039934, -2877237, -3731557, -4581736, -5413202, -6213510, -6964611, -7636170, -8183000, -8548729, -8677617, -8533545, -8119298, -7485773, -6724632, -5946499, -5253451, -4716178, -4364387, -4194454, -4190551, -4347262, -4679891, -5216444, -5977330, -6955520, -8107749, -9359662, -10620586, -11800318, -12821222, -13622699, -14159194, -14395757, -14306225, -13877540, -13119372, -12073230, -10813873, -9439966, -8057140, -6760070, -5619559, -4677140, -3945475, -3409874, -3027957, -2730268, -2428786, -2036677, -1493560, -784438, 57590, 966619, 1869852, 2711385, 3463051, 4120735, 4693711, 5195654, 5639875, 6036796, 6392917, 6712252, 6998944, 7256942, 7484661]
36490G484661J82687J05002k1112k01239m25281o68759r01652j099554j250217
36481C204536j353535j417526j452398j463575j446838j390127j281959j120529
36473g721951r17509o95579m81964k99798j59397n3197M2406J58664L23133N49256
36463i255936Q30146J139077J437419J687331J864079J962688J996028J985058
36455C645890J946449J884980J794673J666359J495192J283443J038796P71412
36447A5527194M92672K15832m3246k67154m39754n49246n90191n64183m79178
36438A3302746l47859j86477j5422J39733K50204K90465K46335J20184o8589k86772
36428A3444548m93070o46438p16410o92846n90748m46476l05454k07011j74062
$$ y = [7484661, 7667348, 7772350, 7751238, 7549999, 7124718, 6455959, 5554307, 4454753, 3204536, 1851001, 433475, -1018923, -2482498, -3929336, -5319463, -6601422, -7721951, -8639460, -9335039, -9817003, -10116801, -10276198, -10329395, -10286989, -10128325, -9805192, -9255936, -8425790, -7286713, -5849294, -4161963, -2297884, -335196, 1660832, 3645890, 5592339, 7477319, 9271992, 10938351, 12433543, 13716986, 14755782, 15527194, 16019866, 16235698, 16192452, 15925298, 15485544, 14936298, 14346107, 13781924, 13302746, 12954887, 12768410, 12752988, 12892721, 13142925, 13433390, 13679725, 13799909, 13731320, 13444548, 12951478, 12305040, 11588630, 10895784, 10305036, 9858560, 9553106, 9346095, 9172033]
36419I172033k11458l10145m52133o14285p71800r01825r87095j020184j007755
36410B895353r70468r33971r14138r07706q97195q66583q14200p52059o93437
36401d854404o41075n87257n24969m57932l98019l51706l08952k46240j42376
36392h512930N067J74168L26664M24078M43545L86928K80482J65425Q2096N3434
36382f171043P6289J26916J77770K13988K38781K66506L10145L70434M31222M64384
36372c494608M44223L64328K45158J26149M7901L6054R4522K07728L47602M81974
36362a098969N82984O34809O39009O14430N89476N89076O23931O89192P72421
36353D636359Q63430R58581J059100J168003J288171J419362J552146J662931
$$ y = [9172033, 8960575, 8650430, 8198297, 7584012, 6812212, 5910387, 4923292, 3903108, 2895353, 1924885, 990914, 76776, -830930, -1728125, -2594708, -3408908, -4160967, -4854404, -5495479, -6082736, -6607705, -7065637, -7463656, -7815362, -8124314, -8370554, -8512930, -8507863, -8333695, -8007031, -7582953, -7139408, -6752480, -6471998, -6306573, -6224477, -6171043, -6094754, -5967838, -5790068, -5576080, -5337299, -5070793, -4760648, -4390214, -3958992, -3494608, -3050385, -2686057, -2440899, -2314750, -2266849, -2230795, -2136273, -1928545, -1580943, -1098969, -515985, 118824, 757833, 1372263, 1961739, 2550815, 3174746, 3863938, 4636359, 5499789, 6458370, 7517470, 8685473, 9973644, 11393006, 12945152, 14608083]
36345A4608083J717244J682640J543259J306424R99178O59721L28211L8203j89856
36336B2693107l49695m44478m81515m72147m35966m03140m09614m84956o36963
36327A8574633q40824j041652j173603j187061j068292q41217n53960k60751p939
36318A1599334J73306K69103K82282K30202J40107M0844m6560j14035j64351k05048
36308A2205184k44173k89434l47703m22661n12172o08162o99166p73834q23984
36299G483895q46733q45132q26713q00658p75760p60528p63812p92354q44331
36290B27874r03738r42742r33507q62284p35848n76266m08233k46898r2506O5903
36280e408245K40802M37256O49519Q61336J045671J165465J182957J078692Q67495
$$ y = [14608083, 16325327, 18007967, 19551226, 20857650, 21856828, 22516549, 22844760, 22882963, 22693107, 22343412, 21898934, 21417419, 20945272, 20509306, 20106166, 19696552, 19211596, 18574633, 17733809, 16692157, 15518554, 14331493, 13263201, 12421984, 11868024, 11607273, 11599334, 11772640, 12041743, 12324025, 12554227, 12694334, 12735178, 12688618, 12574583, 12410232, 12205184, 11961011, 11671577, 11323874, 10901213, 10389041, 9780879, 9081713, 8307879, 7483895, 6637162, 5792030, 4965317, 4164659, 3388899, 2628371, 1864559, 1072205, 227874, -675864, -1618606, -2552113, -3414397, -4150245, -4726511, -5134744, -5381642, -5474148, -5408245, -5167443, -4730187, -4080668, -3219332, -2173661, -1008196, 174761, 1253453, 2120948]
36271B120948N95853L20124Q2607r7744k19365k88476l14426l08606k82582k45357
36261A362976k02237j55612j06191n4638m282L6999N8457N0859Q723p1132j90167
36250G33755l43043n10111o55972p38171p21924n93596l68446q9590J84147L99159
36240b703792N26358N67271N44841M88478M23909L69999L37899L29507L36970
36231A221440L45097L35107K86929J81010L786k41786n26739p97716r94543j076361
36221a263776j040443r21077p69853o31281n28663m64388m27840m02296l68864
36212f818481l11224k23464j17795k5187J5502k2675j36545k88979m24909m98846
36202h852603m96400m36470l55145k84590k40907k25864k36301k70835l28366
$$ y = [2120948, 2716801, 3036925, 3119532, 3021788, 2802423, 2513947, 2199521, 1890915, 1608333, 1362976, 1160739, 1005127, 898936, 844298, 840016, 877015, 935472, 986331, 995054, 923922, 733755, 390712, -119399, -775371, -1513542, -2235466, -2829062, -3197508, -3287098, -3102951, -2703792, -2177434, -1610163, -1065322, -576844, -152935, 217064, 554963, 884470, 1221440, 1566537, 1901644, 2188573, 2369583, 2373369, 2131583, 1604844, 807128, -187415, -1263776, -2304219, -3225296, -3995149, -4626430, -5155093, -5619481, -6047321, -6449617, -6818481, -7129705, -7353169, -7470964, -7496151, -7480649, -7503324, -7639869, -7928848, -8353757, -8852603, -9349003, -9785473, -10140618, -10425208, -10666115, -10891979, -11128280, -11399115, -11727481]
36193a1727481m02637m81163n51187o06114o45243o68243o72040o53329o11383
36184a7018820n45760m51890l22350j55469L6864K31002M02499N36932O32584
36175a6654408O95835P35966P63301P87820Q14092Q34638Q29709P78413O75446
36166i739188N40178M09466L18616K84505L01725L50599M07463M49815M57612
36157f219209M16378L23835J95312O1796m0707q5379o5033O107R9432J84316K40840
36146d882312K68044K83436L12814L75166M71282N82540O79401P34161P32309
36137d43159O77885N89651M88975L87108K81798J65881L9900q1673j74288k13347
36127A718731j84680r1723M2608J80249K77975L00756K34187R0493r6146k83521
$$ y = [-11727481, -12130118, -12611281, -13162468, -13768582, -14413825, -15082068, -15754108, -16407437, -17018820, -17564580, -18016470, -18338820, -18494289, -18457425, -18226423, -17823924, -17286992, -16654408, -15958573, -15222607, -14459306, -13671486, -12857394, -12022756, -11193047, -10414634, -9739188, -9199010, -8789544, -8470928, -8186423, -7884698, -7534099, -7126636, -6676821, -6219209, -5802831, -5478996, -5283684, -5221888, -5262595, -5347974, -5413007, -5406900, -5307468, -5123152, -4882312, -4614268, -4330832, -4018018, -3642852, -3171570, -2589030, -1909629, -1175468, -443159, 234726, 824377, 1313352, 1700460, 1982258, 2148139, 2188039, 2106366, 1932078, 1718731, 1534051, 1442328, 1484936, 1665185, 1943160, 2243916, 2478103, 2568596, 2472450, 2188929]
36117B188929m36572n35383n73770n52996m76711l50364j84325L078J86839L41087
36107c90188M44641M82161M43313L25761J42492p3857k76568m19139m70725m25408
36097b17517l02033j34998L9796J97031L26797M32057N22551O08091O92411P69531
36087B933717Q25806Q47600Q29194P74264O90068N80396M44268K80812R4482j04721
36077H195886l05005m94815o60724p85168q49781q44189p73464o57270n20484
36068B304986l82312k51926j32516k8045N4728J10226J38233J42827J27658R4018
36058B177877M4503j1957o0133q4672p7488m0655J6380Q1525J42644J87944K07520
36047B583488J97775J65335J25394R4084Q0306Q2295Q9216Q5128N4014j3814j16215
$$ y = [2188929, 1752357, 1216974, 643204, 90208, -386503, -736867, -921192, -918114, -731275, -390188, 54453, 536614, 979927, 1305688, 1448180, 1374323, 1097755, 678616, 207891, -217517, -519550, -654548, -614752, -417721, -90924, 341133, 863684, 1471775, 2164186, 2933717, 3759523, 4607123, 5436317, 6210581, 6900649, 7481045, 7925313, 8206125, 8300607, 8195886, 7890881, 7396066, 6735342, 5950174, 5100393, 4256204, 3482740, 2825470, 2304986, 1922674, 1670748, 1538232, 1510187, 1564915, 1675141, 1813374, 1956201, 2083859, 2177877, 2222380, 2210423, 2150290, 2065618, 1988130, 1947475, 1963855, 2045380, 2188024, 2375968, 2583488, 2781263, 2946598, 3071992, 3166076, 3246382, 3328677, 3417893, 3503021, 3557035, 3543221, 3427006]
36036C427006k38821l61265m65679n41613n86066o02095n98711n90075n90257
36027a147576o03817o18217o05124n32175l79215j49674J29001M14632O63111
36018b829054Q38826R20913R06421Q10934O65115N05847L63491K50126J54798
36009B587417M9220r7640l02770n58410q32600j080104j258263j340970j325567
36000d159687j230642j086486r23235p62643o16622m90925l88997l12237k57798
35991a0229272k18632j88113j65784j58297j74109k16744k82007l59878m38134
35982a2430970n05430n53172n75502n67425n23680m41521l26273j93699o5170
35973a6182842M1010J14842J53911J61313J47259J32356J45331K11819L40418
$$ y = [3427006, 3188185, 2826920, 2361241, 1819628, 1233562, 631467, 32756, -557319, -1147576, -1751393, -2369610, -2974734, -3506909, -3886124, -4035798, -3906797, -3492165, -2829054, -1990228, -1069315, -162894, 648040, 1313155, 1819002, 2182493, 2432619, 2587417, 2636637, 2538997, 2236227, 1677817, 845217, -234887, -1493150, -2834120, -4159687, -5390329, -6476815, -7400050, -8162693, -8779315, -9270240, -9659237, -9971474, -10229272, -10447904, -10636017, -10801801, -10960098, -11134207, -11350951, -11632958, -11992836, -12430970, -12936400, -13489572, -14065074, -14632499, -15156179, -15597700, -15923973, -16117672, -16182842, -16141832, -16026990, -15873079, -15711766, -15564507, -15432151, -15286820, -15075001, -14734583]
35964a4734583N16448P07829Q77887R96614J046284J022120R29552P79095N81162
35955g277592L43708P3551k20611n25191q19698j077364j270036j375231j380161
35946a3528625j281028j082023p98146m58834j05839K15832M68484O28893O91519
35937a5249767O68409N85011M72496L60236K71336K19963K08185K23718K42342
35928a1998071K35705J81227P0278q7163k62948m17963n15347n34074m75390l58493
35918a4162239k09023m8379J09861K56284L79929M66220N00316M73592L89591
35909a1843848K66393J33639K4391l5232l3748K4378J24063K48013L83268N22175
35899a0186508O58162P80723Q74958R26957R30955Q92322Q24292P41438O54956
$$ y = [-14734583, -14218135, -13510306, -12632419, -11635805, -10589521, -9567401, -8637849, -7858754, -7277592, -6933884, -6860333, -7080944, -7606135, -8425833, -9503197, -10773233, -12148464, -13528625, -14809653, -15891676, -16689822, -17148656, -17254495, -17038663, -16570179, -15941286, -15249767, -14581358, -13996347, -13523851, -13163615, -12892279, -12672316, -12464131, -12240413, -11998071, -11762366, -11581139, -11510861, -11598024, -11860972, -12278935, -12794282, -13328356, -13803746, -14162239, -14371262, -14419641, -14309780, -14053496, -13673567, -13207347, -12707031, -12233439, -11843848, -11577455, -11443816, -11419425, -11454657, -11488405, -11464027, -11339964, -11091951, -10708683, -10186508, -9528346, -8747623, -7872665, -6945708, -6014753, -5122431, -4298139, -3556701, -2901745]
35890b901745N72078M97632M34007L78427L20988K48177J51832L7384p5658j61999
35880d98877k02010j89633j33658n3576K6954Q5672J04641P1902j5170j44948
35870i48703k90213m15250m89291m98144m47743l59783k63307j84739j38165j19820
35860d155158j11667r4035n9711j9189P482O252k0053n3792p4465o9512l6017
35849d679865K4435J09664K16101L37041M64140N90095P07481Q03616Q57803Q46439
$$ y = [-2901745, -2329667, -1832035, -1398028, -1019601, -698613, -450436, -298604, -261220, -336878, -498877, -700887, -890520, -1024178, -1077754, -1050800, -965128, -860487, -788585, -803755, -948703, -1238916, -1654166, -2143457, -2641601, -3089344, -3449127, -3712434, -3897173, -4035338, -4155158, -4266825, -4360860, -4420571, -4439760, -4432278, -4426026, -4446079, -4499871, -4574336, -4643848, -4679865, -4655430, -4545766, -4329665, -3992624, -3528484, -2938389, -2230908, -1427292, -569489, 276950]
$$ [...]
##END NTUPLES=NMR SPECTRUM
##END=
