##TITLE=31Pdec_DE-26_oil
 
  24 sc
 1.12.2023
##JCAMPDX= 6.0         $$ Bruker NMR JCAMP-DX V2.0
##DATA TYPE= NMR SPECTRUM
##DATA CLASS= NTUPLES
##ORIGIN= UXNMR, Bruker Analytische Messtechnik GmbH
##OWNER= root
$$ XWIN-NMR		Version 3.5
$$ Fri Dec  1 14:47:46 2023 Russian Standard Time (UT+4h)  she@DPX200
##.OBSERVE FREQUENCY= 81.013821
##.OBSERVE NUCLEUS= ^31P
##.ACQUISITION MODE= SIMULTANEOUS
##.ACQUISITION SCHEME= undefined
##.AVERAGES= 24
##.DIGITISER RES= 16
##SPECTROMETER/DATA SYSTEM= spect
##.PULSE SEQUENCE= zgpg30
##.SOLVENT NAME= D2O
##.SHIFT REFERENCE= (INTERNAL, D2O, 0, 248.564)
##AUDIT TRAIL= $$ (NUMBER, WHEN, WHO, WHERE, WHAT)
$$ ##TITLE= Audit trail, XWIN-NMR		Version 3.5
$$ ##JCAMPDX= 5.01
$$ ##ORIGIN= Bruker BioSpin GmbH
$$ ##OWNER= she
$$ F:/spectra/data/she/nmr/P31/1/pdata/1/auditp.txt
$$ ##AUDIT TRAIL=  $$ (NUMBER, WHEN, WHO, WHERE, WHAT)
(   1,<2023-12-01 14:46:28.40 +0400>,<she>,<DPX200>,
      <created by zg, POWCHK disabled, PULCHK disabled
       configuration hash MD5:
       00 E9 B6 7A A2 85 ED C7 34 08 36 98 17 FE 4E 26
       data hash MD5: 32K
       04 D7 67 16 8C 95 EE 57 86 82 81 25 97 8A 60 D0>)
(   2,<2023-12-01 14:46:59.00 +0400>,<she>,<DPX200>,
      <Start of raw data processing
       efp BC_mod = 2 LB = 10 FT_mod = 6 PKNL = 1 PHC0 = -11668.83 PHC1 = -67.90641 SI = 64K 
       data hash MD5: 64K
       F3 E8 A2 D0 72 53 45 63 FA A9 9E 0B FB 64 9B A7>)
(   3,<2023-12-01 14:47:14.90 +0400>,<she>,<DPX200>,
      <pk PHC0 = -16.97296 PHC1 = 0 
       data hash MD5: 64K
       17 87 2E 9C 4F EE 4C 92 B4 E1 7E 4A CA 6C 8A F1>)
$$ ##END=
$$ 
$$ hash MD5
$$ C8 EB AE 7D 3C D0 EC BA 11 80 2F C0 80 94 44 43
##$RELAX= 
##$RELAX= 
##$RELAX= 
##$RELAX= 
##$RELAX= 
##$RELAX= 
##$RELAX= 
##$RELAX= 
##$RELAX= 
$$ Bruker specific parameters
$$ --------------------------
##$DU= <F:/spectra>
##$EXPNO= 1
##$NAME= <P31>
##$PROCNO= 1
##$TYPE= <nmr>
##$USER= <she>
##$AMP= (0..31)
100 100 100 100 100 100 100 100 100 100 100 100 100 100 100 100 100 100 
100 100 100 100 100 100 100 100 100 100 100 100 100 100 
##$AQSEQ= 0
##$AQ_mod= 1
##$AUNM= <au_zg>
##$AUTOPOS= <>
##$BF1= 81.014009
##$BF2= 200.13
##$BF3= 200.13
##$BF4= 200.13
##$BF5= 200.13
##$BF6= 200.13
##$BF7= 200.13
##$BF8= 200.13
##$BYTORDA= 1
##$CFDGTYP= 0
##$CFRGTYP= 5
##$CHEMSTR= <none>
##$CNST= (0..31)
1 1 145 1 1 1 1 1 1 1 1 1 1 1 1 1 1 1 1 1 1 1 1 1 1 1 1 1 1 1 1 1 
##$CPDPRG= <waltz16>
##$CPDPRG1= <>
##$CPDPRG2= <waltz16>
##$CPDPRG3= <>
##$CPDPRG4= <mlev>
##$CPDPRG5= <mlev>
##$CPDPRG6= <mlev>
##$CPDPRG7= <mlev>
##$CPDPRG8= <mlev>
##$CPDPRGB= <>
##$CPDPRGT= <>
##$D= (0..31)
0 1 0 0 0 0 0 0 0 0 0 0.03 2e-05 3e-06 0 0 0 0 0 0 0 0 0 0 0 0 0 0 0 0 
0 0 
##$DATE= 1701427587
##$DBL= (0..7)
120 120 120 11 120 120 24 19 
##$DBP= (0..7)
150 150 150 150 150 150 150 150 
##$DBP07= 0
##$DBPNAM0= <>
##$DBPNAM1= <>
##$DBPNAM2= <>
##$DBPNAM3= <>
##$DBPNAM4= <>
##$DBPNAM5= <>
##$DBPNAM6= <>
##$DBPNAM7= <>
##$DBPOAL= (0..7)
0.5 0.5 0.5 0.5 0.5 0.5 0.5 0.5 
##$DBPOFFS= (0..7)
$$ [...]
##$SUBNAM2= <"">
##$SUBNAM3= <"">
##$SUBNAM4= <"">
##$SUBNAM5= <"">
##$SUBNAM6= <"">
##$SUBNAM7= <"">
##$SUBNAM8= <"">
##$SUBNAM9= <"">
##$SW= 501.771253377433
##$SWIBOX= (0..15)
0 1 3 0 0 0 0 0 0 0 0 0 0 0 0 0 
##$SW_h= 40650.406504065
##$TD= 32768
##$TD0= 1
##$TE= 0
##$TE2= 300
##$TE3= 300
##$TEG= 300
##$TL= (0..7)
0 120 53 12 22 120 120 120 
##$TP= (0..7)
150 150 150 150 150 150 150 150 
##$TP07= 0
##$TPNAME0= <>
##$TPNAME1= <>
##$TPNAME2= <>
##$TPNAME3= <>
##$TPNAME4= <>
##$TPNAME5= <>
##$TPNAME6= <>
##$TPNAME7= <>
##$TPOAL= (0..7)
0.5 0.5 0.5 0.5 0.5 0.5 0.5 0.5 
##$TPOFFS= (0..7)
0 0 0 0 0 0 0 0 
##$TUNHIN= 0
##$TUNHOUT= 0
##$TUNXOUT= 0
##$USERA1= <user>
##$USERA2= <user>
##$USERA3= <user>
##$USERA4= <user>
##$USERA5= <user>
##$V9= 5
##$VALIST= <valist>
##$VCLIST= <CCCCCCCCCCCCCCC>
##$VD= 0
##$VDLIST= <DDDDDDDDDDDDDDD>
##$VPLIST= <PPPPPPPPPPPPPPP>
##$VTLIST= <TTTTTTTTTTTTTTT>
##$WBST= 1024
##$WBSW= 4
##$XGAIN= (0..3)
0 0 0 0 
##$XL= 0
##$YL= 0
##$YMAX_a= 6955
##$YMIN_a= -7803
##$ZGOPTNS= <>
##$ZL1= 120
##$ZL2= 120
##$ZL3= 120
##$ZL4= 120
##$ABSF1= 0
##$ABSF2= 0
##$ABSG= 0
##$ABSL= 0
##$ALPHA= 0
##$AQORDER= 0
##$ASSFAC= 0
##$ASSFACI= 0
##$ASSFACX= 0
##$ASSWID= 0
##$AUNMP= <proc_1d>
##$AZFE= 0.1
##$AZFW= 0.5
##$BCFW= 0
##$BC_mod= 2
##$BYTORDP= 0
##$COROFFS= 0
##$CY= -3
##$DATMOD= 1
##$DC= 0
##$DFILT= <>
##$DTYPP= 0
##$F1P= 0
##$F2P= 0
##$FCOR= 1
##$FTSIZE= 65536
##$FT_mod= 6
##$GAMMA= 0
##$GB= 0
##$INTBC= 1
##$INTSCL= 6.047779e-11
##$ISEN= 30
##$LB= 10
##$LEV0= 0
##$LPBIN= 0
##$MAXI= 10000
##$MC2= 0
##$MEAN= 0
##$ME_mod= 0
##$MI= 50
##$NCOEF= 0
##$NC_proc= -8
##$NLEV= 6
##$NOISF1= 182.463
##$NOISF2= 159.3651
##$NSP= 0
##$NTH_PI= 0
##$NZP= 0
##$OFFSET= 248.5645
##$PC= 4
##$PHC0= -11685.8
##$PHC1= -67.90641
##$PH_mod= 1
##$PKNL= yes
##$PPARMOD= 0
##$PSCAL= 0
##$PSIGN= 0
##$REVERSE= no
##$SF= 81.0140089999694
##$SI= 65536
##$SIGF1= 159.3651
##$SIGF2= -187.1042
##$SINO= 113.3802
##$SIOLD= 16384
##$SREGLST= <1H.CDCl3>
##$SSB= 0
##$STSI= 65536
##$STSR= 0
##$SW_p= 40650.406504065
##$SYMM= 0
##$S_DEV= 0
##$TDeff= 32768
##$TDoff= 0
##$TI= <>
##$TILT= no
##$TM1= 0
##$TM2= 0
##$TOPLEV= 0
##$USERP1= <user>
##$USERP2= <user>
##$USERP3= <user>
##$USERP4= <user>
##$USERP5= <user>
##$WDW= 1
##$XDIM= 65536
##$YMAX_p= 276237162
##$YMIN_p= -36632652
$$ End of Bruker specific parameters
$$ ---------------------------------
##NTUPLES= NMR SPECTRUM
##VAR_NAME=  FREQUENCY,     SPECTRUM/REAL,   SPECTRUM/IMAG
##SYMBOL=    X,             R,               I
##VAR_TYPE=  INDEPENDENT,   DEPENDENT,       DEPENDENT
##VAR_FORM=  AFFN,          ASDF,            ASDF
##VAR_DIM=   65536,         65536,           65536
##UNITS=     HZ,            ARBITRARY UNITS, ARBITRARY UNITS
##FACTOR=    0.620285442955139, 1,           1
##FIRST=     20137.2065510682, 0,            0
##LAST=      -20513.1999529968, 0,           0
##MIN=       -20513.1999529968, -36632652,   0
##MAX=       20137.2065510682, 276237162,    0
$$ Real data points
##PAGE= N=1
##DATA TABLE= (X++(R..R)), XYDATA
$$ [...]
42960a276485M5059O1382P7514R3048J06136J13491J11312R6872P0270L5582L47
$$ -1276485 -1231426 -1170044 -1092530 -999482 -893346 -779855 -668543 -571671 -501401 -465819 -465472
42949d65472k6843l9579l5788j7559J1047M6409Q6190J28063J67844J99125K15251
$$ -465472 -492315 -531894 -567682 -585241 -574194 -527785 -441595 -313532 -145688 53437 268688
42938B68688K12305J90858J55432J12407O7814K6057j0284l9927o2288p7505q7149
$$ 268688 480993 671851 827283 939690 1007504 1033561 1023277 983350 921062 843557 756408
42927G56408r4766j05078j21590j43957j67149j83381j85834j71900j44129j08437
$$ 756408 661642 556564 434974 291017 123868 -59513 -245347 -417247 -561376 -669813
42917f69813p0827l4753q32L1053N9199P9350Q6580P8382N6658K7102l526l0332
$$ -669813 -740640 -775393 -776225 -745172 -685973 -606623 -520043 -441661 -385003 -357901 -361427 -391759
42905c91759n1396o6698p6349p9991p7683p0806o1754n2592m3987l5292k5493
$$ -391759 -443155 -509853 -586202 -666193 -743876 -814682 -876436 -929028 -973015 -1008307 -1033800
42894a033800j4198j843J0948K4030L7497N0477O0225O2848N5567L8772J6002
$$ -1033800 -1047998 -1049841 -1038893 -1014863 -977366 -926889 -866664 -803816 -748249 -709477 -693475
42883f93475q349l1718n4038p5725r5003j07298j07361r2170o2345k1724K3906
$$ -693475 -701824 -733542 -787580 -863305 -958308 -1065606 -1172967 -1265137 -1327482 -1349206 -1325300
42872a325300O8130J05159J30717J42305J39108J22178R4763O1947K9272J018
$$ -1325300 -1257170 -1152011 -1021294 -878989 -739881 -617703 -522940 -460993 -431721 -430703
42862d30703k0936l7267n0269o1987p2225p7914p4408n7983k7796J3639O1525
$$ -430703 -451639 -488906 -539175 -601162 -673387 -751301 -825709 -883692 -911488 -897849 -836324
42851h36324J10584J56361J95185K23256K36376K31214K07059J66560J14908N8503
$$ -836324 -725740 -569379 -374194 -150938 85438 316652 523711 690271 805179 863682
42841H63682L715m4339q2907j11738j31956j44556j49860j48203j40802j29898
$$ 863682 867397 823058 740151 628413 496457 351901 202041 53838 -86964 -216862
42831b16862j17872j06188r4925q3426p1521o0165n0913m4768m1439l9343l5972
$$ -216862 -334734 -440922 -535847 -619273 -690794 -750959 -801872 -846640 -888079 -927422 -963394
42820i63394k8681j6107L34J6387K7055K9271K2916R765p850k7316m5508n9236
$$ -963394 -992075 -1008182 -1007848 -991461 -964406 -935135 -912219 -902454 -910304 -937620 -983128 -1042364
42808a042364o6104o4771n4543l5280q051K4457N8592R0965J19114J41232J55628
$$ -1042364 -1108468 -1173239 -1227782 -1263062 -1271113 -1246656 -1188064 -1097099 -977985 -836753 -681125
42797f81125J60678J55459J40856J20300R9267Q3266P5294P4406P6178P4604O4255
$$ -681125 -520447 -364988 -224132 -103832 -4565 78701 153995 228401 304579 379183 443438
42786D43438M1793O591l9351r1673j44045j89062k19949k32528k26229k03658
$$ 443438 485231 491822 452471 360798 216753 27691 -192258 -424786 -651015 -854673
42776h54673j69268j28128q4971m3344n100K9208N9266Q4319J03570J16877J24388
$$ -854673 -1023941 -1152069 -1237040 -1280384 -1285484 -1256276 -1197010 -1112691 -1009121 -892244 -767856
42765g67856J25282J17432R9074P1194L8001M837k4335m7503o3417p0974p0326
$$ -767856 -642574 -525142 -426068 -354874 -316873 -312036 -336371 -383874 -447291 -518265 -588591
42754e88591o4280n7824n5511n8870o5856p2555p5524p3240o6075n5285m1848
$$ -588591 -652871 -710695 -766206 -825076 -890932 -963487 -1039011 -1112251 -1178326 -1233611 -1275459
42743a275459k5841o424J7718M7703Q3325J21500J55446J76143J76252J54235
$$ -1275459 -1301300 -1307724 -1290006 -1242303 -1158978 -1037478 -882032 -705889 -529637 -375402
42733c75402J15590P0247K8227l519k1767k6023j7181L354L3820P1653J12932
$$ -375402 -259812 -189565 -161338 -164857 -186624 -212647 -229828 -226474 -192654 -121001 -8069
42722h069J52397J84255K03358K06383J92725J64833J27443Q5763M3555K399l7529
$$ -8069 144328 328583 531941 738324 931049 1095882 1223325 1309088 1352643 1355042 1317513
42711A317513p5846j10617j37909j52441j49336j26463q6225l5337J7657O5790
$$ 1317513 1241667 1131050 993141 840700 691364 564901 478676 443339 460996 526786
42701E26786J05717J37473J62864J84098K03079K20699K35888K45256K44168K28843
$$ 526786 632503 769976 932840 1116938 1320017 1540716 1776604 2021860 2266028 2494871
42691B494871J98302J55269J05537N5753J0284l0880p1342j14873j61909k08690
$$ 2494871 2693173 2848442 2953979 3009732 3020016 2989136 2917794 2802921 2641012 2432322
42681B432322k49273k78432k93379k93705k80540k56071k23732j88410j55612
$$ 2432322 2183049 1904617 1611238 1317533 1036993 780922 557190 368780 213168
42672B13168j29442j10506r5522p9448n9094l5747j4864k912l667j6273l5879
$$ 213168 83726 -26780 -122302 -201750 -260844 -296591 -311455 -314367 -318034 -334307 -370186
42661c70186n5835p0014p4294o6920m8014j9006J7288N6210R1623J17724J31299
$$ -370186 -426021 -496035 -570329 -637249 -685263 -704269 -686981 -630771 -539148 -421424 -290125
42650b90125J32625J24548J10616R3683P5329N5903L4937J1965j2218l4424m9095
$$ -290125 -157500 -32952 77664 171347 246676 302579 337516 349481 337263 302839 253744
42639B53744n0206l4429l377L6914P8977J17081J48477J72422J88343J94812J90217
$$ 253744 203538 169109 165732 202646 281623 398704 547181 719603 907946 1102758 1292975
42628A292975J74703J51608J26766J05886R2095Q5513Q4729Q8476R6272J08027
$$ 1292975 1467678 1619286 1746052 1851938 1944033 2029546 2114275 2202751 2299023 2407050
42618B407050J23156J39740J54313J62708J61563J49471J26932R5391N6297J1018
$$ 2407050 2530206 2669946 2824259 2986967 3148530 3298001 3424933 3520324 3576621 3587639
42608C587639l8323q7947j32643j67426j89666j99962k01088j95921j86060j71970
$$ 3587639 3549316 3461369 3328726 3161300 2971634 2771672 2570584 2374663 2188603 2016633
42598B016633j53971j32895j09662q4502n6998k7251K833K9581M9141N9589O2208
$$ 2016633 1862662 1729767 1620105 1535603 1478605 1451354 1454187 1483768 1532909 1592498 1654706
42587A654706O1207O1839O7696P8611R0422R6801R2123P4053M4949J1368j8471
$$ 1654706 1715913 1777752 1845448 1924059 2014481 2111282 2203405 2277458 2322407 2333775 2315304
42576B315304l8182m5461m1772l0279j4098M219K2577L9479N3965O4594O7892
$$ 2315304 2277122 2231661 2189889 2159610 2145512 2149731 2172308 2211787 2265752 2330346 2398238
42565B398238N8074K9374j9966q4990j54727k15783k56288k68471k49980k04548
$$ 2398238 2456312 2485686 2465720 2380730 2226003 2010220 1753932 1485461 1235481 1030933
42555A030933j41611p3896j3445L1978O0241P3671P6504P2421O3338M9827L2903
$$ 1030933 889322 815426 801981 833959 894200 967871 1044375 1116796 1180134 1229961 1262864
42544A262864J5884M888O899K5991N9966R9952J33754J50965J46883J23406Q7064
$$ 1262864 1278748 1283636 1290535 1316526 1376492 1476444 1610198 1761163 1908046 2031452 2118516
42533B118516M5438L745l6617p6749j17451j57445j93881k23975k45953k58908
$$ 2118516 2163954 2167699 2131082 2054333 1936882 1779437 1585556 1361581 1115628 856720
42523H56720k62467k56824k42741k21146j92644j57665j17338p4298l2403M782
$$ 856720 594253 337429 94688 -126458 -319102 -476767 -594105 -668403 -700806 -696024
42513f96024L5580O0443Q0667R6957J08969J15699J15931J08567R3188P0594M2836
$$ -696024 -660444 -600001 -519334 -422377 -313408 -197709 -81778 26789 119977 190571 233407
42502B33407J2741j6456m1460n9801p1006p6794p9503p9923p6447o6208m7330
$$ 233407 246148 229692 188232 128431 57425 -19369 -98872 -178795 -255242 -321450 -368780
42491c68780k0781R377L7755O0492P6945Q8724R7052J01138R8840Q8318O8960
$$ -368780 -389561 -380184 -342429 -281937 -204992 -116268 -19216 81922 180762 269080 338040
42480C38040M1507Q364k5969n5491p4717q0856p4637n9424l9507j8593J005J8363
$$ 338040 379547 387911 361942 306451 231734 150878 76241 16817 -22690 -41283 -40278 -21915
42468b1915L3554M7270O0520P4168Q8259J01689J12489J18471J17741J09079R2512
$$ -21915 11639 58909 119429 193597 281856 383545 496034 614505 732246 841325 933837
42457I33837O9766M3925J8159n475k6175m3501n6567o4155o5541o1002n1513l8052
$$ 933837 1003603 1047528 1065687 1060212 1034037 990536 933969 869814 804273 743271 691758 653706
42445F53706k1385k631J6022L1202L9233L7439K5174M054k2431m9308p0389p8913
$$ 653706 632321 629690 645712 676914 716147 753586 778760 782814 760383 711075 640686 561773
42433E61773o9315l9577P268O3723J20133J67379J98877K11457K05007J81258
$$ 561773 492458 452881 460149 523872 644005 811384 1010261 1221718 1426725 1607983
42423A607983J42667R2302L4303k6286q4699j37483j82219k16274k36227k38944
$$ 1607983 1750650 1842952 1877255 1850969 1766270 1628787 1446568 1230294 994067 755123
42413G55123k23785j94456j58915j26838j05569r6888r6534r6895r1106p6292
$$ 755123 531338 336882 177967 51129 -54440 -151328 -247862 -344757 -435863 -512155
42403e12155n4497l1068j1688L83N665Q176J4025K9374N8178J00250J50592K00680
$$ -512155 -566652 -597720 -609408 -609025 -603360 -595184 -581159 -551785 -493607 -393357 -242765 -42085
42391d2085K41331K65892K72116K61978K39845K10264J76556J40612J03500O6260
$$ -42085 199246 465138 737254 999232 1239077 1449341 1625897 1766509 1870009 1936269
42381A936269L0296k853l2049n7036p8639r8681j19485j42782j68494j94633k18814
$$ 1936269 1966565 1963712 1931663 1874627 1795988 1697307 1577822 1435040 1266546 1071913 853099
42370H53099k40181k59805k79087k97598l12083l17284l08160k82702k43955j99733
$$ 853099 612918 353113 74026 -223572 -535655 -852939 -1161099 -1443801 -1687756 -1887489
42360a887489j59516j30228j13551j06278j02879r8306q9390p4677n3672k6581
$$ -1887489 -2047005 -2177233 -2290784 -2397062 -2499941 -2598247 -2687637 -2762314 -2815986 -2842567
42350b842567N217L8829P0350R6025J13334J21595J22223J18386J13630J09996
$$ -2842567 -2837350 -2798521 -2728171 -2632146 -2518812 -2397217 -2274994 -2156608 -2042978 -1932982
42340a932982J07035J02652R4919Q3333O9095N5088M5761M6204O0062Q7389J24053
$$ -1932982 -1825947 -1723295 -1628376 -1545043 -1475948 -1420860 -1375099 -1328895 -1268833 -1181444 -1057391
42329a057391J63111J97075K19971K28706K23691K08472J88206J67403J48133
$$ -1057391 -894280 -697205 -477234 -248528 -24837 183635 371841 539244 687377
42320F87377J29649J09553Q5620N6976K4132j1522m7809q1442j08247j24417j28088
$$ 687377 817026 926579 1012199 1069175 1093307 1081785 1033976 952534 844287 719870 591782
42309E91782j20036j03274q2255o2022m7006l9507l8783m1651m4209m3340l7141
$$ 591782 471746 368472 286217 224195 177189 137682 98899 57248 13039 -30301 -67442
42298f7442k4626n586J8924M5998P1016Q9096R7262R6063Q9301Q1895P7054P4384
$$ -67442 -92068 -97654 -78730 -32732 38284 127380 224642 320705 410006 491901 568955 643339
42286F43339O9872N7882L4379j97m0245p7260j03875j17128j18950j13879j05852
$$ 643339 713211 771093 805472 805275 765030 687770 583895 466767 347817 233938 128086
42275A28086r6246q4194o8595n0278l2840k1503k0777l2454n5121q4991j16763
$$ 128086 31840 -52354 -120949 -171227 -204067 -225570 -246347 -278801 -333922 -418913 -535676
42264e35676j44019j59872j58941j39989j07334o9725l7309j8158j5497k6406
$$ -535676 -679695 -839567 -998508 -1138497 -1245831 -1315556 -1352865 -1371023 -1386520 -1412926
42254a412926m2824n4999n5801m3348k0687O805L4443O0295Q5324J11582J39677
$$ -1412926 -1455750 -1510749 -1566550 -1609898 -1630585 -1623780 -1589337 -1529042 -1443718 -1332136 -1192459
42243a192459J67561J91549K08414K16615K16151K07928J93543J75237J55542
$$ -1192459 -1024898 -833349 -624935 -408320 -192169 15759 209302 384539 540081
42234E40081J36473J18630J00770Q0316N4833K3669j1303m6155p6030r6416j04507
$$ 540081 676554 795184 895954 976270 1031103 1054772 1043469 997314 921284 824868 720361
42223G20361j00383q7220o9889n2493l6538k1051m586J2596K8091L9147M5058
$$ 720361 619978 532758 462869 410376 373838 352787 348201 360797 388888 428035 473093
42212D73093M7910N1152N7533O8067Q2218R8459J14568J27817J35327J35020J27149
$$ 473093 521003 572155 629688 697755 779973 878432 993000 1120817 1256144 1391164 1518313
42201A518313J15527J06798J07253J19127J39381J61895J81081J94074K00631
$$ 1518313 1633840 1740638 1847891 1967018 2106399 2268294 2449375 2643449 2844080
42192B844080K01729J98265J90323J76901J56125J26123Q6415L9143j0901n7725
$$ 2844080 3045809 3244074 3434397 3611298 3767423 3893546 3979961 4019104 4008203 3950478
42182C950478r6288j24036j40985j48475j47554j38005j18810q9753n2900j2728
$$ 3950478 3854190 3730154 3589169 3440694 3293140 3155135 3036325 2946572 2893672 2880944
42172B880944K5147N5650P5409Q3271Q0389O9759N5226M0296K7254J6840Q511
$$ 2880944 2906091 2961741 3037150 3120421 3200810 3270569 3325795 3366091 3393345 3410185 3418696
42161C418696J297m910q399n871O047K8994O1991J01966J44781J85641K18968
$$ 3418696 3419993 3415083 3406684 3400813 3406860 3435854 3497845 3599811 3744592 3930233 4149201
42150D149201K38917K41143K24835J93161J51784J06549O1530J7806k6924p7324
$$ 4149201 4388118 4629261 4854096 5047257 5199041 5305590 5367120 5384926 5358002 5280678
42140E280678j38141k11745k96660l87257m74399n46994n94464o09029n86827
$$ 5280678 5142537 4930792 4634132 4246875 3772476 3225482 2631018 2021989 1435162
42131A435162n28038m37155l23497k00554q3328J5300Q7173J29423J43421J33166
$$ 1435162 907124 469969 146472 -54082 -137410 -122110 -34937 94486 237907 371073
42121C71073J03987O1867J3445l4057p3608r9901j10797j07690r4473p5718n4986
$$ 371073 475060 536927 550372 516315 442707 342806 232009 124319 29846 -45872 -100858
42110a00858l3917j2242J1313L7704O6483R5793J23474J48306J70255J89371K04171
$$ -100858 -134775 -147017 -135704 -98000 -31517 64276 187750 336056 506311 695682 899853
42099H99853K10722K03359J77064J30539O8096j223o7241j22896j66495k00643
$$ 899853 1110575 1313934 1490998 1621537 1689633 1688410 1621169 1498273 1331778 1131135
42089A131135k28752k51682k66806k69901k58180k32183j95535j53392j10852
$$ 1131135 902383 650701 383895 113994 -144186 -376369 -571904 -725296 -836148
42080h36148p1858l8424r998J6479M5186P9056J17844J57936J93892K20326K33094
$$ -836148 -908006 -946430 -956428 -939949 -894763 -815707 -697863 -539927 -346035 -125709 107385
42069A07385K30005K11643J82087J48437J18859R9888R4237R9987J11676J23093
$$ 107385 337390 549033 731120 879557 998416 1098304 1192541 1292528 1404204 1527297
42059A527297J30406J33537J34826J36360J38398J39823J39645J37688J33944
$$ 1527297 1657703 1791240 1926066 2062426 2200824 2340647 2480292 2617980 2751924
42050B751924J27385J15560R5458O5259K5772j9280o4432j04480j36226j58937
$$ 2751924 2879309 2994869 3090327 3155586 3181358 3162078 3097646 2993166 2856940 2698003
42040B698003j73503j81221j83361j81519j77817j74205j71173j67006j58343
$$ 2698003 2524500 2343279 2159918 1978399 1800582 1626377 1455204 1288198 1129855
42031A129855j42047j17420q7303n7047l1921j4969o737o493j3222k5580m1344
$$ 1129855 987808 870388 783085 726038 694117 679148 672411 665918 652696 627116 585772
42020E85772n7349p0150p7029p6829p0203n9131m5947l2594k0376j0075j931M478
$$ 585772 528423 458273 381244 304415 234212 175081 129134 96540 76164 66089 64158 68636
42008F8636J0092J5605K0515K2755J9467Q546j0124l4488o1098q6164j06378j19402
$$ 68636 78728 94333 114848 137603 157070 165616 155492 121004 59906 -26258 -132636 -252038
41996b52038j23990j19792j07225q7765o4448m1650k3754j3292r850j0439j0971
$$ -252038 -376028 -495820 -603045 -690810 -755258 -796908 -820662 -833954 -843804 -854243 -865214
41985h65214p754J783J9147M4802P7692J14796J51647J83910K08898K25949K35652
$$ -865214 -872968 -871185 -852038 -807236 -729544 -614748 -463101 -279191 -70293 155656 391308
41974C91308K38696K35059K23771K03439J73446J34996R1203M6196M126l1349
$$ 391308 630004 865063 1088834 1292273 1465719 1600715 1691918 1738114 1742240 1710891
41964A710891n7584p3951q2755q8958r8338j15039j39914j70334k01359k27479
$$ 1710891 1653307 1579356 1496601 1407643 1309305 1194266 1054352 884018 682659 455180
41954D55180k44224k49141k42097k25014k00966j72725j41537j07168o9344k9229
$$ 455180 210956 -38185 -280282 -505296 -706262 -878987 -1020524 -1127692 -1197036 -1226265
41944a226265J0507M7012P8545J04633J25315J40350J48971J50178J43483J29852
$$ -1226265 -1215758 -1168746 -1090201 -985568 -860253 -719903 -570932 -420754 -277271 -147419
41934a47419J12115R4133P8831O6367N3734L6296J0455k3800o1797r5275j15458
$$ -147419 -35304 58829 137660 204027 257761 294057 304512 280712 218915 123640 8182
41923H182j16742r9128o8114l2308j38K2753L4661L7496L5337L2586L2410L6054
$$ 8182 -108560 -207688 -275802 -308110 -308248 -285495 -250834 -213338 -178001 -145415 -113005 -76951
41911g6951M2844N0560N6359N8501N8321O0703P1993R6355J33051J76273K17288
$$ -76951 -34107 16453 72812 131313 189634 250337 322330 418685 551736 728009 945297
41900I45297K47272K59519K50411K19322J68208J01571K6579m7396j10429j54289
$$ 945297 1192569 1452088 1702499 1921821 2090029 2191600 2218179 2170783 2060354 1906065
41890A906065j74156j69331j43028j01405n1808p00M7663R0968J27361J54092
$$ 1906065 1731909 1562578 1419550 1318145 1266337 1265637 1313300 1404268 1531629 1685721
41880A685721J67407J63736J41311J01262M7870j1854o8971j13855j38117j37088
$$ 1685721 1853128 2016864 2158175 2259437 2307307 2295453 2226482 2112627 1974510 1837422
41870A837422j11703o8507j7409L1437O9897R2604R7107Q4278N8699K8028R11
$$ 1837422 1725719 1657212 1639803 1671240 1741137 1833741 1930848 2015126 2073825 2101853 2102764
41859B102764j5706j8604q687J0104L2436N2589O4780O3829M7086J6643k0327
$$ 2102764 2087058 2068454 2059767 2069871 2102307 2154896 2219676 2283505 2330591 2347234 2326907
41848B326907n4227p7321q6920q5722p9484p3627p0556o9057o5906n8503m6656
$$ 2326907 2272680 2195359 2108439 2022717 1943233 1869606 1799050 1729993 1664087 1605584 1558928
41837A558928l2493j8928q192j466O64k060r340k0211l3709m9642o8378q9819
$$ 1558928 1526435 1507507 1499315 1497849 1498513 1496453 1487113 1466902 1433193 1383551 1315173 1225354
41825A225354j12990j36901j61500j87303k13942k39233k59434k69954k65847
$$ 1225354 1112364 975463 813963 626660 412718 173485 -85949 -355903 -621750
41816f21750k42681j98363j35220o0532J5575Q3912J39474J82021K13871K36888
$$ -621750 -864431 -1062794 -1198014 -1258546 -1242971 -1159059 -1019585 -837564 -623693 -386805
41806c86805K50989K55063K49114K35670K19395K05041J95080J88542J81916J71357
$$ -386805 -135816 119247 368361 604031 823426 1028467 1223547 1412089 1594005 1765362
41796A765362J54414J30231R8653N9437J2235m2669j03056j63651k16313k52243
$$ 1765362 1919776 2050007 2148660 2208097 2220332 2177663 2074607 1910956 1694643 1442400
41786A442400k65071k52813k17666j64721j00893l4136K7900P9761J19271J46781
$$ 1442400 1177329 924516 706850 542129 441236 407100 435000 514761 634032 780813
41776G80813J63233J68877J63601J48104J24526R6202O7378M3284K9794L1745
$$ 780813 944046 1112923 1276524 1424628 1549154 1645356 1712734 1756018 1785812 1817557
41766A817557N0557Q3006J22255J60274J89903K05612K03357J80582J36882P5252
$$ 1817557 1868114 1951120 2073375 2233649 2423552 2629164 2832521 3013103 3149985 3225237
41756C225237K843o9900j32181j76725k02166k12433k13610k10570k05628j99448
$$ 3225237 3228080 3158180 3025999 2849274 2647108 2434675 2221065 2010495 1804867 1605419
41746A605419j92655j86263j80518j73593j61761j41504j12079p6546m0371q666
$$ 1605419 1412764 1226501 1045983 872390 710629 569125 457046 380500 340129 331463
41736C31463J6087L4507M9213O3296P9192R8077J19643J42246J63481J80783J91515
$$ 331463 347550 382057 431270 494566 573758 671835 791478 933724 1097205 1277988 1469503
41725A469503J92599J80650J53471J12355O3138J4519k5731n4023p1442q1661
$$ 1469503 1662102 1842752 1996223 2108578 2171716 2186235 2160504 2106481 2035039 1953378
41715A953378q8121r2268r3406q9789q0235o5432m8225l2746k3127k2318l1265
$$ 1953378 1865257 1772989 1679583 1589794 1509559 1444127 1395902 1363156 1340029 1317711 1286446
41704A286446m8417p0018r1411j08780j20131j25074j24088j18331j10095j03208
$$ 1286446 1238029 1168011 1076600 967820 847689 722615 598527 480196 370101 266893
41694B66893j02332j11055j29794j55177j81708k04765k22571k35787k45631k52514
$$ 266893 164561 53506 -76288 -231465 -413173 -617938 -840509 -1076296 -1321927 -1574441
41684a574441k56158k56273k52632k44476k30041k06664j71324j21548n6642K1135
$$ -1574441 -1830599 -2086872 -2339504 -2583980 -2814021 -3020685 -3192009 -3313557 -3370199 -3349064
41674c349064J06356J91632K69502L33959L81107M09309M19134M13090L95002
$$ -3349064 -3242708 -3051076 -2781574 -2447615 -2066508 -1657199 -1238065 -824975 -429973
41665d29973L69050L38624L05349K68985K28716J85140J41373J02078P1051M9221
$$ -429973 -60923 277701 583050 852035 1080751 1265891 1407264 1509342 1580393 1629614
41655A629614L4310K2077Q207j0064l2823n7023p7016q6530q1672o3295l6736
$$ 1629614 1663924 1686001 1694208 1684144 1651321 1594298 1517282 1430752 1349080 1285785 1249049
41644A249049q789J5768L5281M9595N7735N7187M5132K0586j3923n2136q5797
$$ 1249049 1240260 1256028 1291309 1340904 1398639 1455826 1500958 1521544 1507621 1455485 1369688
41633A369688j07822j15143j09496r5857p9682o4507n0894l7053k0724j191J9880
$$ 1369688 1261866 1146723 1037227 941370 861688 797181 746287 709234 688510 687319 707199
41622G07199L9184N3372O0396N9908N2840M0626K4646O178j3266l1781m7425n8878
$$ 707199 746383 799755 860151 920059 972899 1013525 1038171 1044349 1031083 999302 951877 892999
41610H92999o5706o8018o6030o0361n2940m7154m6282n1182n9402o6766p0010
$$ 892999 827293 759275 693245 632884 579944 532790 486508 435326 375924 309158 239148
41599B39148o8260o2668n5280m8070m2198l7302l1347k1538n890J5740M1966P1208
$$ 239148 170888 108220 52940 4870 -37328 -74630 -105977 -127515 -133405 -117665 -75699 -4491
41587d491J02878J37312J74410K12154K46419K72295K85922K85732K72779K50474
$$ -4491 98387 235699 410109 622263 868682 1140977 1426899 1712631 1985410 2235884
41577B235884K23908J98773J80172J71742J75029J89061K10088K32116K48566
$$ 2235884 2459792 2658565 2838737 3010479 3185508 3374569 3584657 3816773 4065339
41568D065339K54632K48961K33252K09850J79194J39539Q9480L1049k9612q4864
$$ 4065339 4319971 4568932 4802184 5012034 5191228 5330767 5420247 5451296 5421684 5336820
41558E336820j29398j62274j85872k02954k14266k18223k12412j95498j68338
$$ 5336820 5207422 5045148 4859276 4656322 4442056 4223833 4011421 3815923 3647585
41549C647585j34051r7206o2281l1828n572J8477M1365O0963P2178O9683N1345
$$ 3647585 3513534 3416328 3354047 3322219 3316647 3335124 3376489 3437452 3509630 3579313 3630658
41538C630658J9978j7767n4620q5866j10449j29732j45306j57772j67128j73922
$$ 3630658 3650636 3632869 3578249 3492383 3381934 3252202 3106896 2949124 2781996 2608074
41528B608074j79637j85598j91026j92002j82645j58086j17328o4056n200N1352
$$ 2608074 2428437 2242839 2051813 1859811 1677166 1519080 1401752 1337696 1332496 1383848
41518A383848R8658J31941J49639J54008J50477J45460J43730J46946J53941J62246
$$ 1383848 1482506 1614447 1764086 1918094 2068571 2214031 2357761 2504707 2658648 2820894
41508B820894J69841J76485J83881J94277K08085K22338K31340K29039K11440
$$ 2820894 2990735 3167220 3351101 3545378 3753463 3975801 4207141 4436180 4647620
41499D647620J77953J31677P8831K7141j6479m7980o6904p5589p7338p4394o6892
$$ 4647620 4825573 4957250 5036081 5063222 5046743 4998763 4931859 4856270 4778932 4704538 4637646
41488D637646n3674l4486j1667J0264K6570L3910L0454J5174j2553n2595j03398
$$ 4637646 4583972 4549486 4537819 4548083 4574653 4608563 4639017 4654191 4641638 4589043 4485645
41477D485645j61540k21929k78754l26843l62585l83935l89723l79133l51980
$$ 4485645 4324105 4102176 3823422 3496579 3133994 2750059 2360336 1981203 1629223
41468A629223l09538k55310j95060j36002q5314m8448k7655k1353k4787l1980
$$ 1629223 1319685 1064375 869315 733313 647999 599551 571896 550543 525756 493776
41458D93776l8072m0693l9733l5927k9436j9514n335J2834L3151N2741O8763P9184
$$ 493776 455704 415011 375278 339351 309915 290401 285066 297900 331051 383792 452555 531739
41446E31739Q3134Q1064P4698O6484N8562N1987M6938M3697M3523M8709O1671
$$ 531739 614873 695937 770635 837119 895681 947668 994606 1038303 1081826 1130535 1192206
41435A192206Q3633J13524J47780J81345K09428K28998K39070K39734K30725K10726
$$ 1192206 1275839 1389363 1537143 1718488 1927916 2156914 2395984 2635718 2866443 3077169
41425C077169J78069J32495P6813J7058l9276q6026j20369j42785j55341j59767
$$ 3077169 3255238 3387733 3464546 3481604 3442328 3356302 3235933 3093148 2937807 2778040
41415B778040j56594j45614j26985j02321p5320n1592l7446l7832n4200q3453
$$ 2778040 2621446 2475832 2348847 2246526 2171206 2119614 2082168 2044336 1990136 1906683
41405A906683j18780j52130j76909j89434j88768j75893j53184j24116r2589o1920
$$ 1906683 1787903 1635773 1458864 1269430 1080662 904769 751585 627469 534880 472960
41395D72960l4229j0452R489K6681M3070O0918Q2239J08657J41339J80424K24161
$$ 472960 438731 428279 437768 464449 507519 568437 650676 759333 900672 1081096 1305257
41384A305257K68503L07582L34890L44995L35481L08321K69484K26608J85871
$$ 1305257 1573760 1881342 2216232 2561227 2896708 3205029 3474513 3701121 3886992
41375C886992J49655J15947P9705L5946j6590p3341j25296j63319j82548j83908
$$ 3886992 4036647 4152594 4232299 4268245 4251655 4178314 4053018 3889699 3707151 3523243
41365C523243j72204j52921j30249j07082q5896o9010n8050n3353n3882n7434
$$ 3523243 3351039 3198118 3067869 2960787 2874891 2805881 2747831 2694478 2640596 2583162
41355B583162o0710n9677n0936l3815j1428J0962K9791M6335O6437R6860J41131
$$ 2583162 2522452 2462775 2411839 2378024 2366596 2377558 2407349 2453684 2520121 2616981 2758112
41344B758112J97918K62411L28844L91945M46724M87656N08754N05353M76748
$$ 2758112 2956030 3218441 3547285 3939230 4385954 4873610 5382364 5887717 6364465
41335F364465M27725L67152L04197K44721J90367J40526R5095N5839K5748P330
$$ 6364465 6792190 7159342 7463539 7708260 7898627 8039153 8134248 8190087 8215835 8223165
41325H223165J165N520J7139L2606M9504O6819Q4499J02400J19276J32591J39753
$$ 8223165 8224330 8229850 8246989 8279595 8329099 8395918 8480417 8582817 8702093 8834684 8974437
41314H974437J40163J36570J34509J40079J57429J87332K27153K71733L14297
$$ 8974437 9114600 9251170 9385679 9525758 9683187 9870519 10097672 10369405 10683702
41305A0683702L46786L59691L42485K85811J85408M5777j19050k88864m43287
$$ 10683702 11030488 11390179 11732664 12018475 12203883 12249660 12130610 11841746 11398459
41296A1398459n67295o53649p01882p15667p00612o63291o10757n49540m84296
$$ 11398459 10831164 10177515 9475633 8759966 8059354 7396063 6785306 6235766 5751470
41287E751470m17299l49603k83290k22865j74333j42267j27045j24422j27870
$$ 5751470 5334171 4984568 4701278 4478413 4304080 4161813 4034768 3910346 3782476
41278C782476j32117j35564j40260j49810j66489j89134k12817k30462k35665
$$ 3782476 3650359 3514795 3374535 3224725 3058236 2869102 2656285 2425823 2190158
41269B190158k25428k01508j69778j37760j11316r2073p7036o0792l9108j1709
$$ 2190158 1964730 1763222 1593444 1455684 1344368 1252295 1175259 1114467 1075359 1063650
41259A063650J7489M2748N9917O8712P2602P6592Q4477R7229J13063J28641J40525
$$ 1063650 1081139 1123887 1183804 1252516 1325118 1401710 1486187 1583416 1696479 1825120 1965645
41248A965645J46303J45245J38276J27242J13819R8746Q1693O1563L6963O911
$$ 1965645 2111948 2257193 2395469 2522711 2636530 2735276 2816969 2878532 2915495 2922406
41238B922406k8255o6139j02364j31614j49072j51670j38948j13515q0876m8124
$$ 2922406 2894151 2828012 2725648 2594034 2444962 2293292 2154344 2040829 1959953 1911829
41228A911829k1768n509P44J27l216o324q658j1939j8919l1856n1423p6374j03815
$$ 1911829 1890061 1884552 1885296 1885423 1882207 1875883 1867225 1855286 1836367 1804511 1753088 1676714 1572899
41215A572899j29837j50273j61447j60774j47144j21161q5453m5090p596J8343
$$ 1572899 1443062 1292789 1131342 970568 823424 702263 616810 571720 564124 582467
41205E82467K5752J2646j6464n2160q3834j03129j05437q9611n7188j1821M1139
$$ 582467 608219 620865 604401 552241 468407 365278 259841 170230 113042 101221 142360
41194A42360R5155J43216J78804J97159J96495J78495J47730J10316P2515L9662
$$ 142360 237515 380731 559535 756694 953189 1131684 1279414 1389730 1462245 1501907
41184A501907J5423J483k504J167Q429J4044J3046K662j6406m0294o3826q2774
$$ 1501907 1517330 1518813 1516309 1517476 1525905 1539949 1552995 1555657 1539251 1498957 1435131 1352357
41172A352357r5219j01212j01206r4784q1091o0792l7552j7063l889J267J500
$$ 1352357 1257138 1155926 1054720 959936 878845 818053 780501 763438 759549 760816 762316
41161G62316J136L133Q437J6942K8383M2219N6992P0039P7714P6006O1580L3278
$$ 762316 763452 766585 775022 791964 820347 862566 919558 989597 1067311 1143317 1204897 1238175
41149A238175o646n2675r7928j36660j65802j84643j93282j91227j77221j50532
$$ 1238175 1231529 1178854 1080926 944266 778464 593821 400539 209312 32091 -118441
41139a18441j12775o8768k5489J0553L6023N1823O1972P1058Q1624R2876J01228
$$ -118441 -231216 -299984 -325473 -314920 -278897 -227074 -165102 -94044 -12420 80456 181684
41128A81684J02499R4529P8571N8683L9748K5600J8132J7289K1589K9020L8100
$$ 181684 284183 378712 457283 515966 555714 581314 599446 616735 638324 667344 705444
41117G05444M8510O0877P6071R4538J15816J38030J57691J70353J72061J60719
$$ 705444 753954 814831 890902 985440 1101256 1239286 1396977 1567330 1739391 1900110
41107A900110J36583J01846N9629J2886l6163q5789j34172j79218k18843k50947
$$ 1900110 2036693 2138539 2198168 2211054 2174891 2089102 1954930 1775712 1556869 1305922
41097A305922k72960k82006k76397k57497k30185k01397j77693j62942j56795
$$ 1305922 1032962 750956 474559 217062 -13123 -214520 -392213 -555155 -711950
41088g11950j54726j50344j39127j21043r9896p9784o1429m1117j2907K7497P9796
$$ -711950 -866676 -1017020 -1156147 -1277190 -1377086 -1456870 -1518299 -1559416 -1572323 -1544826 -1465030
41077a465030J38925J97469K48818K89106L17244L33811L39788L35890L22510
$$ -1465030 -1326105 -1128636 -879818 -590712 -273468 60343 400131 736021 1058531
41068A058531L00066K69308K31352J87539J39431Q9081L9394n828m2465o7064
$$ 1058531 1358597 1627905 1859257 2046796 2186227 2275308 2314702 2308874 2266409 2199345
41058B199345p7690p4022n6925k8152R349N0904R0154J20177J35305J32774J13397
$$ 2199345 2121655 2047633 1990708 1962556 1971905 2022809 2112963 2233140 2368445 2501219 2614616
41047B614616Q1053M1482J001l4591o1097p6748q2347q0318p3007o1035m2491
$$ 2614616 2695669 2737151 2738152 2703561 2642464 2565716 2483369 2403051 2330044 2269009 2226518
41036B226518j3736K8135Q2279J42579J99012K41315K62834K62461K43954K13150
$$ 2226518 2212782 2240917 2323196 2465775 2664787 2906102 3168936 3431397 3675351 3888501
41026C888501J74804J31000Q2157K9669k2244o7184r9183j15176j15605j03124
$$ 3888501 4063305 4194305 4276462 4306131 4283887 4216703 4117520 4002344 3886739 3783615
41016C783615q0751n1005j6507J8830M9281O8273P0411N3656K0690k1183o1824
$$ 3783615 3702864 3651859 3635352 3654182 3703463 3771736 3842147 3895803 3916493 3895310 3833486
41005C833486r1178j02340r3574o8763l6246o483J0924J0037r540m2346p8544
$$ 3833486 3742308 3639968 3546394 3477631 3441385 3434902 3445826 3455863 3446323 3403977 3325433
40994C325433j07020j19023j10760q3770m3419L148M8408Q5464J09363J18656
$$ 3325433 3218413 3099390 2988630 2904860 2861441 2864589 2912997 2998461 3107824 3226480
40984C226480J15869J06015R3922Q2330P1820O1937N2108M1835L0483J7143O95
$$ 3226480 3342349 3448364 3542286 3624616 3696436 3758373 3810481 3852316 3882799 3899942 3900637
40973C900637j9812m4424p1582r8199j20660j36020j42451j38941j24803r9791
$$ 3900637 3880825 3836401 3764819 3666620 3545960 3409940 3267489 3128548 3003745 2903954
40963B903954o4779k2645K1237N9482Q4397R0584P7429N0083J7920r164k4758
$$ 2903954 2839175 2816530 2837767 2897249 2981646 3072230 3149659 3199742 3217662 3208498 3183740
40952C183740k8011k2737j4453p380k998n01J623M070O075N788J224q774k3791
$$ 3183740 3155729 3132992 3118539 3111159 3108161 3107660 3109283 3113353 3119428 3125216 3126440 3117666 3093875
40939C093875m1464n7569o6837o4408m7493j6288K6449P6915J31490J86603K37528
$$ 3093875 3052411 2994842 2928005 2863597 2816104 2799816 2826265 2903180 3034670 3221273 3458801
40928C458801K77912L01288L03828K86249K53300K11303J65587J19616P5970L7851
$$ 3458801 3736713 4038001 4341829 4628078 4881378 5092681 5258268 5377884 5453854 5491705
40918E491705R264o376p952K862K2455M6359O9936Q8947J00453J03615R9868R2458
$$ 5491705 5500969 5494593 5486641 5489503 5511958 5558317 5628253 5717200 5817653 5921268 6021136 6113594
40906F113594Q5721Q4204R1227J07271J29262J51624J68509J75638J70808J53649
$$ 6113594 6199315 6283519 6374746 6482017 6611279 6762903 6931412 7107050 7277858 7431507
40896G431507J25698R0735N4298K1875l078j9611k8148k9263k3468j1640N155
$$ 7431507 7557205 7647940 7702238 7724113 7721035 7701424 7673276 7644013 7620545 7608905 7614060
40885G614060K6581N3533Q7294J27802J72488K16661K55078K83582L00077L04991
$$ 7614060 7640641 7694174 7781468 7909270 8081758 8298419 8553497 8837079 9137156 9442147
40875I442147L01349K94055K87641K83162K76190K57823K18399J51774N7824n7555
$$ 9442147 9743496 10037551 10325192 10608354 10884544 11142367 11360766 11512540 11570364 11512809
40865A1512809j84165l09754m22248n11699n71785o00343n98728n70722n22025
$$ 11512809 11328644 11018890 10596642 10084943 9513158 8912815 8314087 7743365 7221340
40856G221340m60279l94158l30644k71944k14990j54503q7414j5268N6408J20452
$$ 7221340 6761061 6366903 6036259 5764315 5549325 5394822 5307408 5292140 5348548 5469000
40846E469000J70443K02493K16189K14178K00316J77718J47999J11967P0670K6138
$$ 5469000 5639443 5841936 6058125 6272303 6472619 6650337 6798336 6910303 6980973 7007111
40836G007111j8288n8007q8015j04506j06405r5904p7893n8912m5955m4965n9029
$$ 7007111 6988823 6930816 6842801 6738295 6631890 6535986 6458093 6399181 6353226 6308261 6249232
40825F249232q6869j22789j58481j86144k01230k03283j94571j77794j54563j25459
$$ 6249232 6162363 6039574 5881093 5694949 5493719 5290436 5095865 4918071 4763508 4638049
40815D638049r1055n2898j3804K2627N3068P5699R0856J00582J07269J12331J15810
$$ 4638049 4546994 4494096 4480292 4502919 4555987 4631686 4722542 4823124 4930393 5042724 5158534
40804E158534J16979J15267J10678J03661R4883Q5453P7232P2497P2630P6603
$$ 5158534 5275513 5390780 5501458 5605119 5700002 5785455 5862687 5935184 6007814 6084417
40794F084417Q0682P9925P0666N2334K7545P14k3706m2495n4239n9483o0550o0809
$$ 6084417 6165099 6245024 6315690 6368024 6395569 6396283 6372577 6330082 6275843 6216360 6155810 6095001
40782F095001o3221o8613p4706p6719o9476m9881j8363K1198O2726R9642J26715
$$ 6095001 6031780 5963167 5888461 5811742 5742266 5692385 5674022 5695220 5757946 5857588 5984303
40771E984303J41685J45994J43793J39526J35599J31714J26044J17019J04430
$$ 5984303 6125988 6271982 6415775 6555301 6690900 6822614 6948658 7065677 7170107
40762G170107Q9567P4861O3407N8433O2609P7493J03237J38489J80213K23540
$$ 7170107 7259674 7334535 7397942 7456375 7518984 7596477 7699714 7838203 8018416 8241956
40752H241956K62210K90009L02806L00209K85881K66254K47979K35133K27663
$$ 8241956 8504166 8794175 9096981 9397190 9683071 9949325 10197304 10432437 10660100
40743A0660100K22331K15755K07253J99041J93788J91927J91190J88414J81833
$$ 10660100 10882431 11098186 11305439 11504480 11698268 11890195 12081385 12269799 12451632
40734A2451632J72199J62605J57703J62734J82434K19822K75082L45109M24103
$$ 12451632 12623831 12786436 12944139 13106873 13289307 13509129 13784211 14129320 14553423
40725A4553423N05264N82751O52983P14893P69424Q18439Q63083R02175R31826
$$ 14553423 15058687 15641438 16294421 17009314 17778738 18597177 19460260 20362435 21294261
40716B1294261R46762R41998R13109Q55066P61613O26872M48648K31378j2994
$$ 21294261 22241023 23183021 24096130 24951196 25712809 26339681 26788329 27019707 27006713
40707B7006713k66685n09756p24499q98923j028001j112680j157757j169778j155476
$$ 27006713 26740028 26230272 25505773 24606850 23578849 22466169 21308412 20138634 18983158
40698A8983158j120794j070331j007219r33387q50206p59462o64171n68774m78514
$$ 18983158 17862364 16792033 15784814 14851427 14001221 13241759 12577588 12008814 11530300
40689A1530300l98317l31485k78603k37101k02037j67890j30494q8081m1160Q201
$$ 11530300 11131983 10800498 10521895 10284794 10082757 9914867 9784373 9696292 9655132 9663333
40679I663333N7141J02598J41812J72749J94505K07682K14667K19451K26523K38783
$$ 9663333 9720474 9823072 9964884 10137633 10332138 10539820 10754487 10973938 11200461 11439244
40669A1439244K55513K71931K80975K76186K53809K13341J57438R1827K4575l6228
$$ 11439244 11694757 11966688 12247663 12523849 12777658 12990999 13148437 13240264 13264839 13228611
40659A3228611q5684j23912j55100j84527k15777k49639k84667l18418l48394
$$ 13228611 13142927 13019015 12863915 12679388 12463611 12213972 11929305 11610887 11262493
40650A1262493l72288l87857l92930l85741l65476l32827k90366k42215j92680
$$ 11262493 10890205 10502348 10109418 9723677 9358201 9025374 8735008 8492793 8300113
40641H300113j44489r8279n4102j3692J8891L9175M5243L9204K6037J0698m375
$$ 8300113 8155624 8057345 8003243 7989551 8008442 8047617 8092860 8132064 8158101 8168799 8164424
40630H164424j9735l7321n8219q1352j03522j20216j26613j19038r6700o2848
$$ 8164424 8144689 8107368 8049149 7967797 7864275 7744059 7617446 7498408 7401708 7338860
40620G338860k4312J0512L4082M1553L1744P213k6454o1923r1486j08498j09006
$$ 7338860 7314548 7325060 7359142 7400695 7432439 7439652 7413198 7351275 7259789 7151291 7042285
40609G042285r3211o5705l3865n037J5859K7351L1021L0132K7647K4387J8279
$$ 7042285 6949074 6883369 6849504 6844467 6860326 6887677 6918698 6948830 6976477 7000864 7019143
40598G019143N337j8075n3008r6875j43953j86896k18461k32933k27170k01374
$$ 7019143 7024480 7006405 6953397 6856522 6712569 6525673 6307212 6074279 5847109 5645735
40588E645735j59354j07788n4303m995L7295P2991J04274J33193J60497J85438
$$ 5645735 5486381 5378593 5324290 5319295 5356590 5429581 5533855 5667048 5827545 6012983
40578F012983K05910K18720K20361K08737J85213J55621J29125J15134J19474
$$ 6012983 6218893 6437613 6657974 6866711 7051924 7207545 7336670 7451804 7571278
40569G571278J41434J73218K02446K16874K09022J78448J30962P5866K2785k0948
$$ 7571278 7712712 7885930 8088376 8305250 8514272 8692720 8823682 8899548 8922333 8901385
40559H901385n1664o9097p4418o7972m8636j5660K8477P6820J19733J48681J59681
$$ 8901385 8849721 8780624 8706206 8638234 8589598 8573938 8602415 8679235 8798968 8947649 9107330
40548I107330J54497J39240J21502J07749J02262J07644J25469J55835J95983
$$ 9107330 9261827 9401067 9522569 9630318 9732580 9840224 9965693 10121528 10317511
40539A0317511K39489K77314L00563L03535K85509K50441K04974J56026J09246
$$ 10317511 10557000 10834314 11134877 11438412 11723921 11974362 12179336 12335362 12444608
40530A2444608O8695L7137J6218O407P128J7329L6356O4478J02413J50072K05550
$$ 12444608 12513303 12550440 12566658 12573065 12580193 12597522 12633878 12698356 12800769 12950841 13156391
40519A3156391K65371L25605L82784M34186M78125N14468N44463N69381N89271
$$ 13156391 13421762 13747367 14130151 14564337 15042462 15556930 16101393 16670774 17260045
40510A7260045O03526O12836O20172O29507O43714O64006O91364P28022P76795
$$ 17260045 17863571 18476407 19096579 19726086 20369800 21033806 21725170 22453192 23229987
40501B3229987Q37904R05129R63953R93043R68523Q69421O83499M12956P8197
$$ 23229987 24067891 24973020 25936973 26930016 27898539 28767960 29451459 29864415 29942612
40492B9942612k83623o27261r12480j115201j231245j272115j256924j205287
$$ 29942612 29658989 29031728 28119248 27004047 25772802 24500687 23243763 22038476
40484B2038476j133409j052714r69512q85217p97614p03391o00962m92047l81288
$$ 22038476 20905067 19852353 18882841 17997624 17200010 16496619 15895657 15403610 15022322
40475A5022322k74420j76426r0918k0844L0648O0486O7234N2815K2967j4001m9748
$$ 15022322 14747902 14571476 14480558 14459714 14490362 14550848 14618082 14670897 14693864 14679863 14630115
40464A4630115p8671r9604j15532j31418j51575j77937k09341k41366k66967k78641
$$ 14630115 14551444 14451840 14336308 14204890 14053315 13875378 13666037 13424671 13157704 12879063
40454A2879063k71746k47037k10373j69576j30543r5143o2040k9394K843L2482
$$ 12879063 12607317 12360280 12149907 11980331 11849788 11754645 11692605 11663211 11666054 11698536
40444A1698536N6124P0157P1303N7515K9655p327m5296p5730r2574r3624q0547
$$ 11698536 11754660 11824817 11896120 11953635 11983290 11975963 11930667 11854937 11762363 11668739 11588192
40433A1588192n8083l2575r756P474J9936L1063M4350O0881P8464R2885J00463
$$ 11588192 11530109 11497534 11487778 11495252 11515188 11546251 11590601 11651482 11729946 11822831 11923294
40422A1923294J00208R4525Q8501Q8287R8612J19825J46187J67580J74412J62472
$$ 11923294 12023502 12118027 12206528 12294815 12393427 12513252 12659439 12827019 13001431 13163903
40412A3163903J34206R6139N5183J6353j7673m6022o8741q5714r5864r7245q8019
$$ 13163903 13298109 13394248 13449431 13465784 13448111 13402089 13333348 13247634 13151770 13054525 12966506
40401A2966506o7854l8975o226K4328M7712O1762O7146O6175O1884N7911N8266
$$ 12966506 12898652 12859677 12853451 12877779 12925491 12987253 13054399 13120574 13182458 13240369 13298635
40390A3298635O6300Q3422J08570J38550J68808J94421K11329K17381K12481J97781
$$ 13298635 13364935 13448357 13556927 13695477 13864285 14058706 14270035 14487416 14699897 14897678
40380A4897678J74923J46006J13972Q2513N5386L5563K4830K3714L1582M6720
$$ 14897678 15072601 15218607 15332579 15415092 15470478 15506041 15530871 15554585 15586167 15632887
40370A5632887O6432Q7269J05450J17688J22201J19262J10851R9666Q8384P9699
$$ 15632887 15699319 15786588 15892038 16009726 16131927 16251189 16362040 16461706 16550090 16629789
40360A6629789P6775Q3393J03325J39077J90383K53138L19800L81644M31867M67504
$$ 16629789 16706564 16789957 16893282 17032359 17222742 17475880 17795680 18177324 18609191 19076695
40350A9076695M88943M97901M95705M83074M60827M30503L94301L54596L13361
$$ 19076695 19565638 20063539 20559244 21042318 21503145 21933648 22327949 22682545 22995906
40341B2995906K71794K30087J87320J41699R1633L7693j5562n9637q4854q4502
$$ 22995906 23267700 23497787 23685107 23826806 23918439 23956132 23940570 23880933 23796079 23711577
40331B3711577n7686r034N4149J24923J97825K68007L30130L78856M10930M27086
$$ 23711577 23653891 23644857 23699006 23823929 24021754 24289761 24619891 24998747 25409677 25836763
40321B5836763M32071M32603M34557M40522M48245M50315M35630L92866L14829
$$ 25836763 26268834 26701437 27135994 27576516 28024761 28475076 28910706 29303572 29618401
40312B9618401K01872O2904q6166k25867l37351m06369m26083l98103l31445k39588
$$ 29618401 29820273 29883177 29797011 29571144 29233793 28827424 28401341 28003238 27671793 27432205
40302B7432205j36579l3648O2452J49346K28080L02163L76563M56208N44168O40347
$$ 27432205 27295626 27261978 27324430 27473776 27701856 28004019 28380582 28836790 29380958 30021305
40292C0021305P41546Q42946R39992J029323J108114J172405J215764J229165
$$ 30021305 30762851 31605797 32545789 33575112 34683226 35855631 37071395 38300560
40284C8300560J202124J124843R91275Q02698N70276L14716O2293j61193l35851
$$ 38300560 39502684 40627527 41618802 42421500 42991776 43306492 43368785 43207592 42871741
40275D2871741m50578n02992m97381m41865l45796k18124o6904J00286K75876
$$ 42871741 42421163 41918171 41420790 40978925 40633129 40415005 40348101 40448387 40724263
40266D0724263M52298O22228P78617R14329J021768J092659J117875J087411R91306
$$ 40724263 41176561 41798789 42577406 43491735 44513503 45606162 46724037 47811448 48802754
40257D8802754Q22291N79788K73556p5018m35186p72465j055859j264054j388281
$$ 48802754 49625045 50204833 50478389 50403371 49968185 49195720 48139861 46875807 45487526
40248D5487526j431350j404033j320815j196751j046083q82104p16958n60737
$$ 45487526 44056176 42652143 41331328 40134577 39088494 38206390 37489432 36928695
40240C6928695m20411k99714j99925j20361n7976o846M1011R3223J53910K21494
$$ 36928695 36508284 36208570 36008645 35888284 35830308 35823462 35864473 35957696 36111606 36333100
40230C6333100K88653L44767L79731L87265L66380L21023K58648J88552J20493
$$ 36333100 36621753 36966520 37346251 37733516 38099896 38420919 38679567 38868119 38988612
40221C8988612O4019K8113K0136M3738R7010J72557K59747L47645M27286M93050
$$ 38988612 39052631 39080744 39100880 39144618 39241628 39414185 39673932 40021577 40448863 40941913
40211D0941913N43447N81198O12460O45219O87180P43522Q15159Q98039R83560
$$ 40941913 41485360 42066558 42679018 43324237 44011417 44754939 45570098 46468137 47451697
40202D7451697J059485J111050J122442J078762R68155P83932N27117K09270j46354
$$ 47451697 48511182 49622232 50744674 51823436 52791591 53575523 54102640 54311910 54165556
40193E4165556n07492q39680j114249j313665j432418j474544j450278j373425
$$ 54165556 53658064 52818384 51704135 50390470 48958052 47483508 46033230 44659805
40185D4659805j259569j124404r81933q42885p13835n97322m93056l99873l17518
$$ 44659805 43400236 42275832 41293899 40451014 39737179 39139857 38646801 38246928 37929410
40176C7929410k46907j88699j41535j01705o4557k6284J5250O0659J09471J60571
$$ 37929410 37682503 37493804 37352269 37250564 37186007 37159723 37174973 37235632 37345103 37505674
40166C7505674K12828K65782L19871L75855M33891M93072N51932O09598O66848
$$ 37505674 37718502 37984284 38304155 38680010 39113901 39606973 40158905 40768503 41435351
40157D1435351P26436P92548Q69833R62258J071965J198249J337218J482450J626366
$$ 41435351 42161787 42954335 43824168 44786426 45858391 47056640 48393858 49876308 51502674
40148E1502674J761414J880665J978276K050324K095727K116360K116079K099373
$$ 51502674 53264088 55144753 57123029 59173353 61269080 63385440 65501519 67600892
40140F7600892K070270K031104J980322J909689J802985J638581J396456J067603
$$ 67600892 69671162 71702266 73682588 75592277 77395262 79033843 80430299 81497902
40132H1497902O62112K12113k32879o17960q98171j050674j078203j002939q55307
$$ 81497902 82160014 82372127 82139248 81521288 80623117 79572443 78494240 77491301 76635994
40123G6635994o63899m50219k27898l931K19816M45146O75878R16070J168608
$$ 76635994 75972095 75521876 75293978 75290047 75509863 75955009 76630887 77546957 78715565
40114G8715565J434588J713446K003488K302456K608064K918744L234729L559021
$$ 78715565 80150153 81863599 83867087 86169543 88777607 91696351 94931080 98490101
40106I8490101L897718M259351M653670N090348N577734O121473O723008P378377
$$ 98490101 102387819 106647170 111300840 116391188 121968922 128090395 134813403 142191780
40098A42191780Q077870Q806401R543995J0265425J0938315J1519119J1947669
$$ 142191780 150269650 159076051 168620046 178885471 189823786 201342905 213290574
40091B13290574J2142505J2000623J1404668J0239470Q418727N920111K820484
$$ 213290574 225433079 237433702 248838370 259077840 267496567 273416678 276237162
40084B76237162o85859m304178p696006j0557374j2685789j4009607j4575082
$$ 276237162 275551303 271247125 263551119 252993745 240307956 226298349 211723267
40077B11723267j4506467j3960757j3092334j2032750j0883672r717960q584205
$$ 211723267 197216800 183256043 170163709 158130959 147247287 137529327 128945122
40070A28945122p512040o517323n606730m781010m036777l367598k765539k223017
$$ 128945122 121433082 114915759 109309029 104528019 100491242 97123644 94358105 92135088
40062I2135088j733956j293463q96739n38716k15255P4994L30211N47733P27866
$$ 92135088 90401132 89107669 88210930 87672214 87456959 87531953 87862164 88409897 89137763
40053H9137763Q76097J001670J113668J217763J315838J407980J494941J579804
$$ 89137763 90013860 91015530 92129198 93346961 94662799 96070779 97565720 99145524
40045I9145524J668938J772592J904784K081509K316876K618336K983496L400532
$$ 99145524 100814462 102587054 104491838 106573347 108890223 111508559 114492055 117892587
40037A17892587L852060M320220M791001N257281N720649O191219O684204P213520
$$ 117892587 121744647 126064867 130855868 136113149 141833798 148025017 154709221 161922741
40029A61922741P784760Q389960R004922R588119J0079995J0402331J0458767
$$ 161922741 169707501 178097461 187102383 196690502 206770497 217172828 227631595
40022B27631595J0138527R326443P922141N869592L192549K2816l397572o753184
$$ 227631595 237770122 247096565 255018706 260888298 264080847 264103663 260706091 253952907
40014B53952907r724802j2064643j3644905j4463067j4611527j4233389j3483913
$$ 253952907 244228105 232163462 218518557 204055490 189443963 175210574 161726661
40007A61726661j2505900j1417843j0310448r247736q270448p400317o644519
$$ 161726661 149220761 137802918 127492470 118244734 109974286 102573969 95929450
40000I5929450n999978n457385n004503m628082m314149m047586l812643l594973
$$ 95929450 89929472 84472087 79467584 74839502 70525353 66477767 62665124 59070151
39992E9070151l384159l174862k965792k757342k549644k342297k135872j933670
$$ 59070151 55685992 52511130 49545338 46787996 44238352 41896055 39760183 37826513
39984C7826513j741740j566332j410390j271780j144534j021833q98371p71172
$$ 37826513 36084773 34518441 33108051 31836271 30691737 29669904 28771533 28000361
39976B8000361o39581n05381l72771k47438j34948l9715L4770Q5228J08744J03802
$$ 28000361 27360780 26855399 26482628 26235190 26100242 26060527 26095297 26180525 26289269 26393071
39966B6393071P0956J2548o7720j64409k69713l73899m67133n41474n91897o16471
$$ 26393071 26464027 26476575 26408855 26244446 25974733 25600834 25133701 24592227 24000330 23383859
39956B3383859o16299n95209n58695n12189m59678m03417l44539k83747k21768
$$ 23383859 22767560 22172351 21613656 21101467 20641789 20238372 19893833 19610086 19388318
39947A9388318j59798j00015m5824j379K9607M5430M7736M1809L5056L4029M1941
$$ 19388318 19228520 19128505 19082681 19081302 19110909 19156339 19204075 19245884 19280940 19314969 19356910
39936A9356910N8446Q1636J10190J44041J83805K30164K83592L43985M09899M77850
$$ 19356910 19415356 19496992 19607182 19751223 19935028 20165192 20448784 20792769 21202668 21680518
39926B1680518N42353N97172O37847O64709O84684P10292P55779Q32205R43696
$$ 21680518 22222871 22820043 23457890 24122599 24807283 25517575 26273354 27105559 28049255
39917B8049255J086267J249280J418823J581479J727068J849591J946704K018486
$$ 28049255 29135522 30384802 31803625 33385104 35112172 36961763 38908467 40926953
39909D0926953K066044K090259K091054K067281K016687J935265J816033J648699
$$ 40926953 42992997 45083256 47174310 49241591 51258278 53193543 55009576 56658275
39901E6658275J422110J129986P77870L87175p129l65266o54237q57082r76137
$$ 56658275 58080385 59210371 59988241 60375416 60368287 60003021 59348784 58491702 57515565
39892E7515565j029818j045404j051376j072007j124519j217598j350374j512328
$$ 57515565 56485747 55440343 54388967 53316960 52192441 50974843 49624469 48112141
39884D8112141j685137j846543j975095k054403k076095k041018j958284j842133
$$ 48112141 46427004 44580461 42605366 40550963 38474868 36433850 34475566 32633433
39876C2633433j707652j567253j429309j298883j179144j072216r79400r01445
$$ 32633433 30925781 29358528 27929219 26630336 25451192 24378976 23399576 22498131
39868B2498131q39036p92848p62554p45314p35037p23256p01340o63031o06371
$$ 22498131 21659095 20866247 20103693 19358379 18623342 17900086 17198746 16535715 15929344
39859A5929344n34420m54609l76657l09740k59833k28302k12098k05173k00480
$$ 15929344 15394924 14940315 14563658 14253918 13994085 13765783 13553685 13348512 13148032
39850A3148032j91846j75125j48357j11215o4626j1144M4360R4843J32715J52262
$$ 13148032 12956186 12781061 12632704 12521489 12456863 12445719 12490079 12584922 12717637 12869899
39840A2869899J51343J31344R5742M8687n255o0416j09703j45795j63453j61459
$$ 12869899 13021242 13152586 13248328 13297015 13291760 13231344 13121641 12975846 12812393 12650934
39830A2650934j42879j13615q0218m7931j9556M775K6853M8877P1858R4965J16489
$$ 12650934 12508055 12394440 12314222 12266291 12246735 12251510 12278363 12327240 12399098 12494063 12610552
39819A2610552J35832J54722J76534K04251K38865K79156L22421L65381M05016
$$ 12610552 12746384 12901106 13077640 13281891 13520756 13799912 14122333 14487714 14892730
39810A4892730M39384M67860M90133N04473N06573M90168M49208L80428K85104
$$ 14892730 15332114 15799974 16290107 16794580 17301153 17791321 18240529 18620957 18906061
39801A8906061J69462M3870p8792j85357k64989l11707l25841l13714k85503k52023
$$ 18906061 19075523 19119393 19040601 18855244 18590255 18278548 17952707 17638993 17353490 17101467
39791A7101467k21621j98402j82549j72364j66709j66361j73777j91749k21883
$$ 17101467 16879846 16681444 16498895 16326531 16159822 15993461 15819684 15627935 15406052
39782A5406052k63679l14298l68826m20688m62417m87212m91109m74761m43753
$$ 15406052 15142373 14828075 14459249 14038561 13576144 13088932 12597823 12123062 11679309
39773A1679309m07026l73819l50068l35956l26347l14288k95381k69883k41498
$$ 11679309 11272283 10898464 10548396 10212440 9886093 9571805 9276424 9006541 8765043
39764H765043k14434j91051j71154j52576j32400j08265p9126m5023o323L6654
$$ 8765043 8550609 8359558 8188404 8035828 7903428 7795163 7716037 7671014 7664691 7701345
39754G701345Q3017J30441J75144K13083K41420K59073K66203K63484K51829K32333
$$ 7701345 7784362 7914803 8089947 8303030 8544450 8803523 9069726 9333210 9585039 9817372
39744I817372K06152J74550J39482J04210P2855M8688L2155K0058O553j4172m4733
$$ 9817372 10023524 10198074 10337556 10441766 10514621 10563309 10595464 10615522 10622075 10607903 10563170
39733A0563170q2711j21613j54285j76408j87862j91573j91274j89717j88010
$$ 10563170 10480459 10358846 10204561 10028153 9840291 9648718 9457444 9267727 9079717
39724I079717j85783j81672j73672j59583j37895j08891p5043m0170q097J8066
$$ 9079717 8893934 8712262 8538590 8379007 8241112 8132221 8057178 8017008 8008911 8026977
39714H026977L5944M3993M2242L3037K0909J1133P551J0971J9545L1221M6402
$$ 8026977 8062921 8106914 8149156 8182193 8203102 8214235 8221786 8232757 8252302 8283523 8329925
39703H329925O8164R9360J38763J79606K11797K26298K18983J92159J53621J13984
$$ 8329925 8398089 8497449 8636212 8815818 9027615 9253913 9472896 9665055 9818676 9932660
39693I932660Q3289O7939O9222Q4118J07789J35847J65084J92970K17370K37007
$$ 9932660 10015949 10083888 10153110 10237228 10345017 10480864 10645948 10838918 11056288 11293295
39683A1293295K51840K62587K69960K74684K78402K84284K96321L17542L48317
$$ 11293295 11545135 11807722 12077682 12352366 12630768 12915052 13211373 13528915 13877232
39674A3877232L85684M23663M53984M66888M52245M01345L09240J76773J1550
$$ 13877232 14262916 14686579 15140563 15607451 16059696 16461041 16770281 16947054 16958604
39665A6958604j72515l57072n22540o52306p36631p74713p73598p44272o96795
$$ 16958604 16786089 16429017 15906477 15254171 14517540 13742827 12969229 12224957 11528162
39656A1528162o37093n66927m86358l96413l00061k01640j06147j9150N3311J06040
$$ 11528162 10891069 10324142 9837784 9441371 9141310 8939670 8833523 8814373 8867684 8973724
39646H973724J37044J49602J52207J55797J69614J97928K39404K88772L39157
$$ 8973724 9110768 9260370 9412577 9568374 9737988 9935916 10175320 10464092 10803249
39637A0803249L83665M16207M32082M28674M06107L67735L20159K72231K32584
$$ 10803249 11186914 11603121 12035203 12463877 12869984 13237719 13557878 13830109 14062693
39628A4062693K06575J94318J91198J90634J87536J80735J73414J71788J82838
$$ 14062693 14269268 14463586 14654784 14845418 15032954 15213689 15387103 15558891 15741729
39619A5741729K11973K60999L26744M01027M72506N29743N63810N69250N43792
$$ 15741729 15953702 16214701 16541445 16942472 17414978 17944721 18508531 19077781 19621573
39610A9621573M88109M06110L05130J95312Q8146n335p6322j19813j35530j27575
$$ 19621573 20109682 20515792 20820922 21016234 21104380 21099045 21022723 20902910 20767380 20639805
39600B0639805j02682o7806k8315J2379N2121Q9266J22473J50624J72232J84751
$$ 20639805 20537123 20469317 20441002 20453381 20505502 20594768 20717241 20867865 21040097 21224848
39590B1224848J84766J69525J38698R4908M2581j3927p1601j28829j84633k37804
$$ 21224848 21409614 21579139 21717837 21812745 21855326 21841399 21769798 21640969 21456336 21218532
39580B1218532k86612l28977l62552l84417l90766l77312l40706k80286j99263
$$ 21218532 20931920 20602943 20240391 19855974 19465208 19087896 18747190 18466904 18267641
39571A8267641j04716o532Q4274J57461K05338K24235K15270J83974J38620Q7800
$$ 18267641 18162925 18156393 18240667 18398128 18603466 18827701 19042971 19226945 19365565 19453365
39561A9453365L8384n224m0589o6279q1296q5004p7202n8000k7722J2882O2119
$$ 19453365 19491749 19486525 19445936 19379657 19298361 19213357 19136155 19078155 19050433 19063315 19125434
39550A9125434J17131J74318K30292K82546L29500L70064M03229M27925M43048
$$ 19125434 19242565 19416883 19647175 19929721 20259221 20629285 21032514 21460439 21903487
39541B1903487M47467M40038M19949L87638L46122L01662K62778K37430K29751
$$ 21903487 22350954 22790992 23210941 23598579 23944701 24246363 24509141 24746571 24976322
39532B4976322K38215K56238K74911K86488K87185K78213K64688K53016K48053
$$ 24976322 25214537 25470775 25745686 26032174 26319359 26597572 26862260 27115276 27363329
39523B7363329K51330K60965K73040K83563K90089K92462K92653K94070L00428
$$ 27363329 27614659 27875624 28148664 28432227 28722316 29014778 29307431 29601501 29901929
39514B9901929L14246L35426L60904L85992M06938M23178M37977M57076M86001
$$ 29901929 30216175 30551601 30912505 31298497 31705435 32128613 32566590 33023666 33509667
39505C3509667N27250N78608O33422O82749P18456P36008P35878P23011P04373
$$ 33509667 34036917 34615525 35248947 35931696 36650152 37386160 38122038 38845049 39549422
39496C9549422O85637O68833O52452O33924O12805N92604N80250N83403O06831
$$ 39549422 40235059 40903892 41556344 42190268 42803073 43395677 43975927 44559330 45166161
39487D5166161O49724P05680P65594Q21714Q70129R10450R43825R71231R92845
$$ 45166161 45815885 46521565 47287159 48108873 48979002 49889452 50833277 51804508 52797353
39478E2797353J008026J015450J013756J002943R85896R68726R59158R63519R83856
$$ 52797353 53805379 54820829 55834585 56837528 57823424 58792150 59751308 60714827 61698683
39469F1698683J016822J054970J089640J113878J124355J122033J111543J099106
$$ 61698683 62715505 63770475 64860115 65973993 67098348 68220381 69331924 70431030
39461G0431030J089478J083593J078611J070323J056073J036115J012697R87827
$$ 70431030 71520508 72604101 73682712 74753035 75809108 76845223 77857920 78845747
39453G8845747R61392R30820Q92221Q41608P75407O90836N87286M67985L39860
$$ 78845747 79807139 80737959 81630180 82471788 83247195 83938031 84525317 84993302 85333162
39444H5333162K10671Q5408l5321j54222k74896l99562n27445o54335p73801q79676
$$ 85333162 85543833 85629241 85593920 85439698 85164802 84765240 84237795 83583460 82809659 81929983
39434H1929983r68444j040180j097920j146086j188743j228115j263833j293082
$$ 81929983 80961539 79921359 78823439 77677353 76488610 75260495 73996662 72703580
39426G2703580j311604j315388j302579j274561j235417j190261j144046j101571
$$ 72703580 71391976 70076588 68774009 67499448 66264031 65073770 63929724 62828153
39418F2828153j067804j047391j043694j058523j092803j146932j219968j308279
$$ 62828153 61760349 60712958 59669264 58610741 57517938 56371006 55151038 53842759
39410E3842759j405046j501347j588105j657650j704085j722797j710232j664659
$$ 53842759 52437713 50936366 49348261 47690611 45986526 44263729 42553497 40888838
39402D0888838j587361j483195j360066j227904j097688r80263q84238q13299
$$ 40888838 39301477 37818282 36458216 35230312 34132624 33152361 32268123 31454824
39394C1454824p64460p29105o96904o60623o18835n75055n34425n00542m74144
$$ 31454824 30690364 29961259 29264355 28603732 27984897 27409842 26875417 26374875 25900731
39385B5900731m53497m35426m16329l93287l65106l32809k99042k66543k36581
$$ 25900731 25447234 25011808 24595479 24202192 23837086 23504277 23205235 22938692 22702111
39376B2702111k08431j80178j50207j18360q6338n7782l8327l5184n5363j02555
$$ 22702111 22493680 22313502 22163295 22044935 21958597 21900815 21862488 21827304 21771941 21669386
39366B1669386j74272k61255l49943m26757m81923n11240n15527m98480m64209
$$ 21669386 21495114 21233859 20883916 20457159 19975236 19463996 18948469 18449989 17985780
39357A7985780m15856l56187k89554k23229j66481j27756j11885j18866j44389
$$ 17985780 17569924 17213737 16924183 16700954 16534473 16406717 16294832 16175966 16031577
39348A6031577j81302k21348k56651k80690k88992k79838k54542k16442j68865
$$ 16031577 15850275 15628927 15372276 15091586 14802594 14522756 14268214 14051772 13882907
39339A3882907j13909n3461Q883O7671J17922J57690J88537K14112K38492K65118
$$ 13882907 13768998 13715537 13724420 13792091 13910013 14067703 14256240 14470352 14708844 14973962
39329A4973962K95961L30937L68345M06341M44190M81980N19079N52757N78226
$$ 14973962 15269923 15600860 15969205 16375546 16819736 17301716 17820795 18373552 18951778
39320A8951778N90200N85085N62561N25627M79321M29020L79072L31826K87096
$$ 18951778 19541978 20127063 20689624 21215251 21694572 22123592 22502664 22834490 23121586
39311B3121586K42525J95104J43096Q7023K9103k7935q1447j28461j65325j88660
$$ 23121586 23364111 23559215 23702311 23789334 23818437 23790502 23709055 23580594 23415269 23226609
39301B3226609j97592j95608j89978j88666j96977k16383k45749k83029l25755
$$ 23226609 23029017 22833409 22643431 22454765 22257788 22041405 21795656 21512627 21186872
39292B1186872l70503m12524m46209m66099m68002m50105m13923l64617l10073
$$ 21186872 20816369 20403845 19957636 19491537 19023535 18573430 18159507 17794890 17484817
39283A7484817k58499k15297j80815j50630j18556q0725l8213L263L6283N5514
$$ 17484817 17226318 17011021 16830206 16679576 16561020 16480295 16442082 16445345 16481628 16537142
39273A6537142O0141N3581M0945K6191J0941m633k0205l4637m6656n5930o3360
$$ 16537142 16597283 16650864 16691809 16718000 16728941 16724308 16704103 16669466 16622810 16566880 16503520
39262A6503520p0367p7976q6442r5429j04200j11638j16396j17356j14051j06647
$$ 16503520 16433153 16355177 16268735 16173306 16069106 15957468 15841072 15723716 15609665 15503018
39252A5503018r5637q1383o3656m1375j3280K0104N4206P9809Q5249O0589J565
$$ 15503018 15407381 15325998 15262342 15220967 15207687 15227791 15281997 15361806 15447055 15507644 15509209
39241A5509209q8481j99207l15615m21032n00175n42163n43185n07715m47292
$$ 15509209 15420728 15221521 14905906 14484874 13984699 13442536 12899351 12391636 11944344
39232A1944344l76946l10791k58588k24205k06051j99073j97479j96933j94999
$$ 11944344 11567398 11256607 10998019 10773814 10567763 10368690 10171211 9974278 9779279
39223I779279j89796j78205j55467j16947o1147P833P9825J40549J75579J75192
$$ 9779279 9589483 9411278 9255811 9138864 9077717 9085550 9165375 9305924 9481503 9656695
39213I656695J38085P2073q688q8170j52477j92427k04988j93543j66188j32145
$$ 9656695 9794780 9866853 9858165 9769995 9617518 9425091 9220103 9026560 8860372 8728227
39203H728227r8049o6248l5810n197K5032N0841O5532O2741M0077J071m5933r1190
$$ 8728227 8630178 8563930 8528120 8522923 8547955 8598796 8664328 8727069 8767146 8768217 8722284 8631094
39191H631094j27101j50243j61586j65555j68228j74945j87857k04688k19598
$$ 8631094 8503993 8353750 8192164 8026609 7858381 7683436 7495579 7290891 7071293
39182G071293k25780k18404j96450j62660j21615p6989k9726K1581P8626J41485
$$ 7071293 6845513 6627109 6430659 6267999 6146384 6069395 6039669 6061250 6139876 6281361
39172F281361K08318K76357L43069M06771M66534N21447N69666O08302O34788
$$ 6281361 6489679 6766036 7109105 7515876 7982410 8503857 9073523 9681825 10316613
39163A0316613O49031O54511O57550O65470O84958P21058P76418Q50574R39502
$$ 10316613 10965644 11620155 12277705 12943175 13628133 14349191 15125609 15976183 16915685
39154A6915685J035742J128991J206993J256611J264903J220063J112049R33465
$$ 16915685 17951427 19080418 20287411 21544022 22808925 24028988 25141037 26074502
39146B6074502O81437L60833j2508m10925p98214j136647j395356j557131j621287
$$ 26074502 26755939 27116772 27104264 26693339 25895125 24758478 23363122 21805991 20184704
39137B0184704j601562j520039j400021j261067j117607r79941q55570p49824
$$ 20184704 18583142 17063103 15663082 14402015 13284408 12304467 11448897 10699073
39129A0699073o65933o04961n65607n44072n34188n28310n19052n01535m75034
$$ 10699073 10033140 9428179 8862572 8318500 7784312 7256002 6736950 6235415 5760381
39120E760381m42827m09864l79564l51934l24199k93202k57714k19244j81186
$$ 5760381 5317554 4907690 4528126 4176192 3851993 3558791 3301077 3081833 2900647
39111B900647j47012j18558r5355p5397n6846l9486k5022j6281j6031k5884m5385
$$ 2900647 2753635 2635077 2539722 2464325 2407479 2367993 2342971 2326690 2310659 2284775 2239390
39100B239390p1413r8342j19299j28202j21713j00289o7884l0302P173M1799P3954
$$ 2239390 2167977 2069635 1950336 1822134 1700421 1600132 1532248 1501946 1509119 1550918 1624872
39089A624872J06144J41174J80566K23721K67832L08347L39890L57485L57857
$$ 1624872 1731016 1872190 2052756 2276477 2544309 2852656 3192546 3550031 3907888
39080C907888L40484L08043K66031K21505J81237J49857J28740J16249J09391
$$ 3907888 4248372 4556415 4822446 5043951 5225188 5375045 5503785 5620034 5729425
39071E729425J05921J05456J08851J16601J27838J40548J52345J60694J62450
$$ 5729425 5835346 5940802 6049653 6166254 6294092 6434640 6586985 6747679 6910129
39062F910129J53474J28935Q4405J7486p0386j72640k77693l70993m38532m70558
$$ 6910129 7063603 7192538 7276943 7294429 7224043 7051403 6773710 6402717 5964185 5493627
39052E493627m64080m23183l56964k76329j91494j11243m3093P152L6880M7763
$$ 5493627 5029547 4606364 4249400 3973071 3781577 3670334 3627241 3634393 3671273 3719036
39042C719036M5086L5396K3812J2404K87j4830l4422n7594q1026j00355j12103
$$ 3719036 3764122 3799518 3823330 3835734 3836021 3821191 3786769 3729175 3648149 3547794 3435691
39031C435691j15087j10727j02160r2528q3276p3394o0162m1123j6046J2391L9775
$$ 3435691 3320604 3209877 3107717 3015189 2931913 2858519 2798357 2757234 2741188 2753579 2793354
39020B793354O1952P6292Q1398P6148N9471L1218o659m9999r3625j33168j66197
$$ 2793354 2855306 2931598 3012996 3089144 3148615 3179833 3173174 3123175 3029550 2896382 2730185
39009B730185j92052k10721k21795k24205k16758j99050j72329j39761j05623
$$ 2730185 2538133 2327412 2105617 1881412 1664654 1465604 1293275 1153514 1047891
39000A047891p3751m6199k2991k772J6248L5416N4913P3680R0269J03852J14105
$$ 1047891 974140 927941 904950 902178 918426 953842 1008755 1082435 1172704 1276556 1390661
38989A390661J20019J19235J09222Q9352O1672K9417n209m1711p9817j17428j50178
$$ 1390661 1510680 1629915 1739137 1828489 1890161 1919578 1914369 1872658 1792841 1675413 1525235
38978A525235j72995j82226j76843j58590j31702j02178p6273n8677n1711n5943
$$ 1525235 1352240 1170014 993171 834581 702879 600701 524428 465751 414040 358097
38968C58097p1138r6245j28567j63273j94057k14790k21581k14424j97439j77240
$$ 358097 286959 190714 62147 -101126 -295183 -509973 -731554 -945978 -1143417 -1320657
38958a320657j60191j49998j46665j46685j44137j32690j08270p1289k6809J7766
$$ -1320657 -1480848 -1630846 -1777511 -1924196 -2068333 -2201023 -2309293 -2380582 -2407391 -2389625
38948b389625N6188Q5769J07452J24130J38629J52375J64911J74300J78291J75571
$$ -2389625 -2333437 -2247668 -2140216 -2016086 -1877457 -1725082 -1560171 -1385871 -1207580 -1032009
38938a032009J66123J50461J28797J01269O9109L5685O310j3275j9254j1530O289
$$ -1032009 -865886 -715425 -586628 -485359 -416250 -380565 -374255 -387530 -406784 -418314 -412025
38927d12025K8998N2391P4250R3160J06800J11760J05418Q8238O4437M0140K0338
$$ -412025 -383027 -330636 -256386 -163226 -56426 55334 160752 248990 313427 353567 373905
38916C73905O914j061n635q651j1478j5215k0709k8466l8796n2180o9538r2106
$$ 373905 380819 379758 374123 365472 353994 338779 318070 289604 250808 198628 129090 36984
38904C6984j20485j52904j83541k02684j99706j67848j08145k9980N2119J23495
$$ 36984 -83501 -236405 -419946 -622630 -822336 -990184 -1098329 -1128309 -1076190 -952695
38894i52695J73390J96485J92608J65968J24158P6295L0416q430l8380n9640p3384
$$ -952695 -779305 -582820 -390212 -224244 -100086 -23791 6625 -1805 -40185 -99825 -173209
38883a73209q1051q3937q3102p9811p6075p4459p7047q4312r4678j04826j10480
$$ -173209 -254260 -338197 -421299 -501110 -577185 -651644 -728691 -813003 -907681 -1012507 -1122987
38872a122987j07574r3433o7598l2064Q967M9712Q4058J07269J17451J16026J07058
$$ -1122987 -1230561 -1323994 -1391592 -1423656 -1414689 -1364977 -1280919 -1173650 -1056199 -940173 -833115
38861h33115R5938Q7766Q5751R0065R7694J03522J02058Q9009O2229K2257k7192
$$ -833115 -737177 -649411 -563660 -473595 -375901 -272379 -170321 -81312 -19083 3174 -24018
38850b4018p9163j24582j54982j65665j57276j34813j05018p4137m7163k8016
$$ -24018 -103181 -227763 -382745 -548410 -705686 -840499 -945517 -1019654 -1066817 -1094833
38840a094833j9534k2843l6662n7410q0365j01369j18108j30071j37176j38040
$$ -1094833 -1114367 -1137210 -1173872 -1231282 -1311647 -1413016 -1531124 -1661195 -1798371 -1936411
38830a936411j29564j08727p5568l4806N880M0098O6296Q7853J09919J35648J64437
$$ -1936411 -2065975 -2174702 -2250270 -2285076 -2279196 -2239098 -2172802 -2084949 -1975030 -1839382 -1674945
38819a674945J92717K16040K31067K36668K34102K26545K18114K12604K12167
$$ -1674945 -1482228 -1266188 -1035121 -798453 -564351 -337806 -119692 92912 305079
38810C05079K16525K23322K29470K32672K32292K29376K26027K24124K23671K21780
$$ 305079 521604 744926 974396 1207068 1439360 1668736 1894763 2118887 2342558 2564338
38800B564338K13584J94904J64874J26686Q6239M9888K2418N844p75m24L190O306
$$ 2564338 2777922 2972826 3137700 3264386 3350625 3400513 3422931 3428775 3428000 3427576 3430766 3437072
38788C437072M923n330k8156o4602j11467j61459k05489k36335k51896k56113
$$ 3437072 3441995 3436665 3408509 3343907 3232440 3070981 2865492 2629157 2377261 2121148
38778B121148k56781k61374k73227k90033l05126l10611l00710k73709k31654
$$ 2121148 1864367 1602993 1329766 1039733 734607 423996 123286 -150423 -382077
38769c82077j78646j19444n9495n548L4846N5600N4852L6310Q098k0242m1169
$$ -382077 -560723 -680167 -739662 -745210 -710364 -654764 -599912 -563602 -555504 -575746 -616915
38758f16915n1395n2243m8343m5696m9932o5057r2451j30249j73393k14752k47080
$$ -616915 -668310 -720553 -768896 -814592 -864524 -929581 -1022032 -1152281 -1325674 -1540426 -1787506
38747a787506k65182k67414k55688k33896k05647j73006j36912r8456n9351k1176
$$ -1787506 -2052688 -2320102 -2575790 -2809686 -3015333 -3188339 -3325251 -3423707 -3483058 -3504234
38737c504234J5453N0441Q2671J08918J24434J24930J08748P8109L8948n31l2311
$$ -3504234 -3488781 -3438340 -3355669 -3246751 -3122317 -2997387 -2888639 -2810530 -2771582 -2772113 -2804424
38726b804424n1097n5716m8671l4277j6641J513J9243L7447N8609Q5913J21705
$$ -2804424 -2855521 -2911237 -2959908 -2994185 -3010826 -3009313 -2990070 -2952623 -2894014 -2808101 -2686396
38715b686396J66137K16890K70244L22696L71916M16221M52963M77311M82876
$$ -2686396 -2520259 -2303369 -2033125 -1710429 -1338513 -922292 -469329 7982 490858
38706D90858M64179M19503L52232K70031J82613R9452K8302k5485n9405p4332
$$ 490858 955037 1374540 1726772 1996803 2179416 2278868 2307170 2281685 2222280 2147948
38696B147948p4768o7980o1990o3463p6734j03899j44888j96959k54430l09761
$$ 2147948 2073180 2005200 1943210 1879747 1803013 1699114 1554226 1357267 1102837 793076
38686G93076l55686l86963m00675l95512l71124l28128k68517j96133j16937l8760
$$ 793076 437390 50427 -350248 -745760 -1116884 -1445012 -1713529 -1909662 -2026599 -2065359
38676b065359L0030Q2781J16598J32744J35011J27326J12368R1909O8026M3755
$$ -2065359 -2035329 -1952548 -1835950 -1703206 -1568195 -1440869 -1328501 -1236592 -1168566 -1124811
38666a124811K2595P612J003M226J8022M1971P4082J10997J48599J82326K07106
$$ -1124811 -1102216 -1094604 -1093601 -1089375 -1071353 -1029382 -955300 -844303 -695704 -513378 -306272
38655c06272K17509K08754J78284J27017N9564j6685r3279j62508k18569k57752
$$ -306272 -88763 119991 298275 425292 484856 468171 374892 212384 -6185 -263937
38645b63937k78079k79249k63129k34116j98324j61540j27229r6168o8196m4524
$$ -263937 -542016 -821265 -1084394 -1318510 -1516834 -1678374 -1805603 -1901771 -1969967 -2014491
38635b014491k8437k3457l0295m5214o1198p1226p1329o1583m4932k5131n326
$$ -2014491 -2042928 -2066385 -2096680 -2141894 -2203092 -2274318 -2345647 -2407230 -2452162 -2477293 -2482619
38624b482619J2306K6396L6412M2838M6898M9482M9770M4721L0288L985l2772
$$ -2482619 -2470313 -2443917 -2407505 -2364667 -2317769 -2268287 -2218517 -2173796 -2143508 -2139523 -2172295
38613b172295p4261j12280j39029j49396j41820j17987q2005l9560K861L8915
$$ -2172295 -2246556 -2358836 -2497865 -2647261 -2789081 -2907068 -2989073 -3028633 -3025772 -2986857
38603b986857O3737P5481P6152P0874O5588O4199O6696O9134O5617N1188K4167
$$ -2986857 -2923120 -2847639 -2771487 -2700613 -2635025 -2570826 -2504130 -2434996 -2369379 -2318191 -2294024
38592b294024j3172n5503r5879j26964j42011j35978j06805n6406R136Q0540J47440
$$ -2294024 -2307196 -2362699 -2458578 -2585542 -2727553 -2863531 -2970336 -3026742 -3017606 -2937066 -2789626
38581b789626K00985K35863K51015K48976K34390K12247J86424J59243J32295
$$ -2789626 -2588641 -2352778 -2101763 -1852787 -1618397 -1406150 -1219726 -1060483 -928188
38572i28188J07790Q9039P9296P9889Q9118J02757J15657J23427J23472J15102
$$ -928188 -820398 -731359 -652063 -572174 -483056 -380299 -264642 -141215 -17743 97359
38562I7359R8846P5476M5795J1628k2771n0804o6042o5933n3890l7975k6828k5491
$$ 97359 196205 271681 317476 329104 306333 255529 189487 123554 69664 31689 4861 -20630
38550b0630l3616m6662n8958o6559o8376o5431n9470n2206m5440m1101m0465m2970
$$ -20630 -54246 -100908 -159866 -226425 -294801 -360232 -419702 -471908 -517348 -558449 -598914 -641884
38538f41884m5791m4639l5273j5006J6020N3970R1693J20872J35143J32416J15344
$$ -641884 -687675 -732314 -767587 -782593 -766573 -712603 -620910 -500038 -364895 -232479 -117135
38527a17135R0432O6380N1602N1005O3661Q3374J02321J15395J22357J26717J32614
$$ -117135 -26703 39677 91279 142284 205945 289319 391640 507035 629392 756109 888723
38516H88723J41884J53057J62456J66090J60846J44626J16471P7242L0266j9232
$$ 888723 1030607 1183664 1346120 1512210 1673056 1817682 1934153 2011395 2041661 2022429
38506B022429o5827j05511j36187j57215j68904j72592j70897j67318j64886j64694
$$ 2022429 1956602 1851091 1714904 1557689 1388785 1216193 1045296 877978 713092 548398
38496E48398j65397j64009j57137j42008j17450q5089m9965j9320L93O418N29
$$ 548398 383001 218992 61855 -80153 -197603 -282692 -332657 -351977 -351584 -345166 -344637
38485c44637j2630k8383m4152n9813p6354r3984j11071j24524j31239j29499j19587
$$ -344637 -357267 -385650 -429802 -489615 -565969 -659953 -771024 -895548 -1026787 -1156286 -1275873
38474a275873j03570q4778o7212n4740m9806n2242n9183o6542p1173p2269p1322
$$ -1275873 -1379443 -1464221 -1531433 -1586173 -1635979 -1688221 -1747404 -1813946 -1885119 -1957388 -2028710
38463b028710p1047p3935q1044r1390j02335j10685j13802j10306j00310q5129
$$ -2028710 -2099757 -2173692 -2254736 -2346126 -2448461 -2559146 -2672948 -2783254 -2883564 -2968693
38453b968693o6263m4000j6840J7417N9531J07347J56137K00407K35822K60043
$$ -2968693 -3034956 -3078956 -3095796 -3078379 -3018848 -2911501 -2755364 -2554957 -2319135 -2059092
38443b059092K72314K72607K61243K39226K08717J72870J35171R8721O5923L8591
$$ -2059092 -1786778 -1514171 -1252928 -1013702 -804985 -632115 -496944 -398223 -332300 -293709
38433b93709J8450P793R557K6230N7965J01423J50357J97332K35137K57224K57968
$$ -293709 -275259 -267466 -257909 -231679 -173714 -72291 78066 275398 510535 767759 1025727
38422A025727K33735J84508J14819L3171m9709j22898j77259k07378k13110j99585
$$ 1025727 1259462 1443970 1558789 1591960 1542251 1419353 1242094 1034716 821606 622021
38412F22021j75064j47457j21478r7770p4018m6923j4081K4623O6349J05793J36849
$$ 622021 446957 299500 178022 80252 6234 -40689 -54770 -30147 36202 141995 278844
38401B78844J54835J57919J47136J25398R6534O4769L4207P961j2655k8227m0480
$$ 278844 433679 591598 738734 864132 960666 1025435 1059642 1067603 1054948 1026721 986241
38390I86241n1254o1847p2793q3792r3649j00393j01819r6391q4230o7657n0960
$$ 986241 934987 873140 800347 716555 622906 522513 420694 324303 240073 172416 121456
38379A21456l9280l6960m6073o5789r2520j20569j43148j54222j50791j34083
$$ 121456 82176 45216 -857 -66646 -159166 -279735 -422883 -577105 -727896 -861979
38369h61979j08387p8316m7018j6591J0581L1616M4234M7640M2323K9527J1342
$$ -861979 -970366 -1048682 -1095700 -1112291 -1101710 -1070094 -1025860 -978220 -935897 -906370 -895028
38358h95028q863k6714l8169m0937l4958k1591k365K1624M9061P7125J00830J13982
$$ -895028 -903891 -930605 -968774 -1009711 -1044669 -1066260 -1068625 -1047001 -997940 -920815 -819985 -706003
38346g06003J11560R2180N9143J9438j8613m7754o3344o4018n1572k9886k998
$$ -706003 -594443 -502263 -443120 -423682 -442295 -490049 -553393 -617411 -668983 -698869 -701867
38335g01867K6624N8395R2383J27920J63224J95880K23140K41729K47831K38117
$$ -701867 -675243 -616848 -524465 -396545 -233321 -37441 185699 427428 675259 913376
38325I13376K11382J69712J18121O2883R599l7772p6611j04673j19616j19649
$$ 913376 1124758 1294470 1412591 1475474 1485073 1447301 1370690 1266017 1146401 1026752
38315A026752j05122p9882n1132k7474j6023k0190l9093o8557j03094j38072j71115
$$ 1026752 921630 841748 790616 763142 747119 726929 687836 619279 516185 378113 206998
38304B06998k01788k29737k52723k66352k65858k48488k14576j66981j09980m8869
$$ 206998 5210 -224527 -477250 -743602 -1009460 -1257948 -1472524 -1639505 -1749485 -1798354
38294a798354J0056O0228R6586J17136J22778J15587R7255O9285L4600j078k9634
$$ -1798354 -1788298 -1728070 -1631484 -1514348 -1391570 -1275983 -1178728 -1109443 -1074843 -1075921 -1105555
38283a105555m2859l5657q510L2250P6790J15813J44251J62612J75501J88462
$$ -1105555 -1148414 -1184071 -1192581 -1160331 -1083541 -967728 -823477 -660865 -485364 -296902
38273b96902K05353K27444K53976K83024L12122L38796L61178L78378L90313L97394
$$ -296902 -91549 135895 389871 672895 985017 1323813 1684991 2063369 2453682 2851076
38263B851076M00440M00689L99441L97350L94096L88852L81182L71510L60945
$$ 2851076 3251516 3652205 4051646 4448996 4843092 5231944 5613126 5984636 6345581
38254F345581L51039L43968L42666L49958L66551L89286M11123M22890M15277
$$ 6345581 6696620 7040588 7383254 7733212 8099763 8489049 8900172 9323062 9738339
38245I738339L80010L10666K04161O2935j03500k79287m45767n86669o92376p60772
$$ 9738339 10118349 10429015 10633176 10696111 10592611 10313324 9867557 9280888 8588512 7827740
38235G827740p94551p97603p73495p26688o64252n95758n30992m77014m36156
$$ 7827740 7033189 6235586 5462091 4735403 4071151 3475393 2944401 2467387 2031231
38226B031231m05795l79880l51845l17867k78988k40744k10132j91539j84171
$$ 2031231 1625436 1245556 893711 575844 296856 56112 -154020 -345559 -529730
38217e29730j82710j80430j72524j57643j37386j14822r3236p5601o4546o2073
$$ -529730 -712440 -892870 -1065394 -1223037 -1360423 -1475245 -1568481 -1644082 -1708628 -1770701
38207a770701o8575q1642r5808j03802r8747p6302l6294J6461P2853J22128J55504
$$ -1770701 -1839276 -1920918 -2016726 -2120528 -2219275 -2295577 -2331871 -2315410 -2242557 -2120429 -1964925
38196a964925J68739J62469J41026J11016P9937N4379L8142L1378L1286L3625
$$ -1964925 -1796186 -1633717 -1492691 -1381675 -1301738 -1247359 -1209217 -1177839 -1146553 -1112928
38186a112928L3899K8158J3919q702l6447o3708q4523r5107r5840r1584q9556
$$ -1112928 -1079029 -1050871 -1036952 -1045654 -1082101 -1145809 -1230332 -1325439 -1421279 -1512863 -1602419
38175a602419r5389j09639j27256j40570j43722j35648j19938j02129q6374p3578
$$ -1602419 -1697808 -1807447 -1934703 -2075273 -2218995 -2354643 -2474581 -2576710 -2663084 -2736662
38165b736662o1853m8646l2748j4980K478J7339K8491L7116M6990O3148Q9130
$$ -2736662 -2798515 -2847161 -2879909 -2894889 -2892411 -2875072 -2846581 -2809465 -2762475 -2699327 -2610197
38154b610197J24697J65917K07470K45003K75601K96551L04185K94174K63352
$$ -2610197 -2485500 -2319583 -2112113 -1867110 -1591509 -1294958 -990773 -696599 -433247
38145d33247K11992J45047P1285M26o0081j06721j39414j59883j70290j72527
$$ -433247 -221255 -76208 -4923 -4497 -64578 -171299 -310713 -470596 -640886 -813413
38135h13413j67886j56895j39467j15356q4590m7696n974L8048Q0162J14773J36248
$$ -813413 -981299 -1138194 -1277661 -1393017 -1477607 -1525303 -1531277 -1493229 -1413067 -1298294 -1162046
38124a162046J40945J28694J02736O8365L1294l500l2487n4020o8106p5307p5417
$$ -1162046 -1021101 -892407 -789671 -721306 -690012 -693512 -725999 -780019 -848125 -923432 -998849
38113i98849o7252m9996k5121K762K7076M1872M4180L4719J6957m334k3978l6934
$$ -998849 -1066101 -1116097 -1141218 -1138456 -1111380 -1069508 -1025328 -990609 -973652 -977986 -1001964 -1038898
38101a038898l9060k8176m720K8294O5816J01589J29292J43945J43034J26753
$$ -1038898 -1077958 -1106134 -1110854 -1082560 -1016744 -915155 -785863 -641918 -498884 -372131
38091c72131R7323N7831J1292l9532r1591j41077j83670k15439k33676k37380
$$ -372131 -274808 -216977 -205685 -245217 -336808 -477885 -661555 -876994 -1110670 -1348050
38081a348050k27637k07818j83144j59445j41645j32630j32483j38082j43709
$$ -1348050 -1575687 -1783505 -1966649 -2126094 -2267739 -2400369 -2532852 -2670934 -2814643
38072b814643j43285j33584j16539r8727q8028q9353j02269j21952j42414j59154
$$ -2814643 -2957928 -3091512 -3208051 -3306778 -3394806 -3484159 -3586428 -3708380 -3850794 -4009948
38062d009948j69340j70288j58686j31948r0688l9911J2345N8177R2779J15781
$$ -4009948 -4179288 -4349576 -4508262 -4640210 -4730898 -4770809 -4758464 -4700287 -4607508 -4491727
38052d491727J30856J44061J61381J86084K17272K50771K81667L06376L22713
$$ -4491727 -4360871 -4216810 -4055429 -3869345 -3652073 -3401302 -3119635 -2813259 -2490546
38043b490546L28707L21863K99730K61267K08149J45155P9015J5783m1632r3857
$$ -2490546 -2161839 -1839976 -1540246 -1278979 -1070830 -925675 -846660 -830877 -872509 -966366
38033i66366j42900j89027k28905k56086k63556k46982k07040j49541q3501j8403
$$ -966366 -1109266 -1298293 -1527198 -1783284 -2046840 -2293822 -2500862 -2650403 -2733904 -2752307
38023b752307L7977Q0671J07627J19154J16971J03333Q0611N1193J7350j9234
$$ -2752307 -2714330 -2633659 -2526032 -2406878 -2289907 -2186574 -2105963 -2054770 -2037420 -2056654
38013b056654n7861r8557j40815j82221k18155k42924k51352k39818k06959j54761
$$ -2056654 -2114515 -2213072 -2353887 -2536108 -2754263 -2997187 -3248539 -3488357 -3695316 -3850077
38003c850077q9645k2009L6441P6515R4291R1395P2986M4856J1551k3484n6575
$$ -3850077 -3939722 -3961731 -3925290 -3848775 -3754484 -3663089 -3590103 -3545247 -3533696 -3557180 -3613755
37992c613755q3195r8954j01447r1523p3299n3012l6865k8462k7078k7848k4009
$$ -3613755 -3696950 -3795904 -3897351 -3988874 -4062173 -4115185 -4152050 -4180512 -4207590 -4235438 -4259447
37981d259447j0114J5067M7400P8949J01953J12912J14038J11177J09918J12634
$$ -4259447 -4269561 -4254494 -4207094 -4128145 -4026192 -3913280 -3799242 -3688065 -3578147 -3465513
37971c465513J17979J22445J22431J15286R9150P2834L6963m180m2171o6995p1674
$$ -3465513 -3347534 -3225089 -3102658 -2987372 -2888222 -2815388 -2778425 -2782605 -2824776 -2891771 -2963445
37960b963445n6150k7797J641K0918K3367Q584j8318m8991p4451q7152q2146n7769
$$ -2963445 -3019595 -3047392 -3045751 -3024833 -3001466 -2992882 -3011200 -3060191 -3134642 -3221794 -3303940 -3361709
37948c361709j6377L5022Q5524J23352J40139J34089J10318P8623M9963L2835
$$ -3361709 -3378086 -3343064 -3257540 -3134188 -2994049 -2859960 -2749642 -2671019 -2621056 -2588221
37938b588221L0695M1616O0534Q2608J05212J27276J47073J60839J63649J51876
$$ -2588221 -2557526 -2515910 -2455376 -2372768 -2267556 -2140280 -1993207 -1832368 -1668719 -1516843
37928a516843J25199Q6698M1277o047n0908q9492j18438j35175j38633j30003
$$ -1516843 -1391644 -1304946 -1263669 -1269716 -1320624 -1410116 -1528554 -1663729 -1802362 -1932365
37918a932365j13163r4209p9739p4385p8778q9053r8347r9579q8205o3600k8593
$$ -1932365 -2045528 -2139737 -2219476 -2293861 -2372639 -2461692 -2560039 -2659618 -2747823 -2811423 -2840016
37907b840016J2017N2950Q9451J18046J37141J47122J49983J48840J47460J49428
$$ -2840016 -2827999 -2775049 -2685598 -2567552 -2430411 -2283289 -2133306 -1984466 -1837006 -1687578
37897a687578J56798J68944J82545J92707J94557J84731J62699J31547R7468O7510
$$ -1687578 -1530780 -1361836 -1179291 -986584 -792027 -607296 -444597 -313050 -215582 -148072
37887a48072M6656L5996L3058L3698L4030L1401K4611J3870O76j2453k2355k5596
$$ -148072 -101416 -65420 -32362 1336 35366 66767 91378 105248 105924 93471 71116 45520
37875D5520j9178j959K3883N2781P7841R3792R8817R4271Q3182O8775N3638L9205
$$ 45520 26342 24383 48266 101047 178888 272680 371497 465768 548950 617725 671363 710568
37863G10568K5305J0100q907l2639n8398q0159r1921r1806q3305p2537o4111n9119
$$ 710568 735873 745973 737066 704427 646029 565870 473949 382143 298838 226301 162190 103071
37851A03071n6134n3386n0200m7268m6282m8973n5811o5326p5084q3897r3406
$$ 103071 46937 -6449 -56649 -103917 -150199 -199172 -254983 -320309 -395393 -479290 -572696
37840e72696j07405j29215j59016j92875k23754k43601k45522k25572j83929j25069
$$ -572696 -680101 -809316 -968332 -1161207 -1384961 -1628562 -1874084 -2099656 -2283585 -2408654
37830b408654n6652J2506P4366J22830J54009J66311J60619J40306J10574P7073
$$ -2408654 -2465306 -2452800 -2378434 -2255604 -2101595 -1935284 -1774665 -1634359 -1523785 -1446712
37820a446712M4554J6258n938k1107k8879k9068k1410n743J7299M5752P6499J05987
$$ -1446712 -1402158 -1385900 -1391838 -1412945 -1441824 -1470892 -1492302 -1498045 -1480746 -1434994 -1358495 -1252508
37808a252508J30825J47920J54520J48667J30054J00870O5966L1883M860j1185
$$ -1252508 -1121683 -973763 -819243 -670576 -540522 -439652 -373686 -341803 -336943 -348128
37798c48128j5680j1082j850O522Q346j097k3931n8232r7881j34463j60593j72818
$$ -348128 -363808 -374890 -376740 -370218 -361872 -362969 -386900 -445132 -543013 -677476 -838069 -1010887
37786a010887j72345j63295j49985j35140j19879j04911r1643q2133p7994p9191
$$ -1010887 -1183232 -1346527 -1496512 -1631652 -1751531 -1856442 -1948085 -2030218 -2108212 -2187403
37776b187403q3928q9710r4700r8306j00841j02882j04803j06674j08472j10640
$$ -2187403 -2271331 -2361041 -2455741 -2554047 -2654888 -2757770 -2862573 -2969247 -3077719 -3188359
37766c188359j14673j23004j37486j57120j76692j88004j83347j59076j16917
$$ -3188359 -3303032 -3426036 -3563522 -3720642 -3897334 -4085338 -4268685 -4427761 -4544678
37757d544678o2634l435N4177J05510J48026J81153K05769K23314K34918K40832
$$ -4544678 -4607312 -4610747 -4556570 -4451060 -4303034 -4121881 -3916112 -3692798 -3457880 -3217048
37747c217048K40426K32630K16380J90568J53829J04983M4654k2954q9868j46710
$$ -3217048 -2976622 -2743992 -2527612 -2337044 -2183215 -2078232 -2033578 -2056532 -2146400 -2293110
37737b293110j86338k06369k08961j98456j78793j52315j20080q2958m2598j786
$$ -2293110 -2479448 -2685817 -2894778 -3093234 -3272027 -3424342 -3544422 -3627380 -3669978 -3671764
37727c671764L6079O8062R2437J08486J15698J13313J00702P8063M6917J0283
$$ -3671764 -3635685 -3567623 -3475186 -3366700 -3251002 -3137689 -3036987 -2958924 -2912007 -2901724
37717b901724k7270o0005q2023q8730p8159n1674j3805K8957P0079J04805J30946
$$ -2901724 -2928994 -2988999 -3071022 -3159752 -3237911 -3289585 -3303390 -3274433 -3204354 -3099549 -2968603
37706b968603J48474J58508J62466J61746J57872J52739J48433J46575J47540
$$ -2968603 -2820129 -2661621 -2499155 -2337409 -2179537 -2026798 -1878365 -1731790 -1584250
37697a584250J49971J50818J45809J30508J01953O0397J0186m0891q3691j10424
$$ -1584250 -1434279 -1283461 -1137652 -1007144 -905191 -844794 -834608 -875499 -959190 -1069614
37687a069614j16957j03715p4941l6881M148M3266P7913J07967J34993J60827
$$ -1069614 -1186571 -1290286 -1365227 -1402108 -1397960 -1354694 -1276781 -1168814 -1033821 -872994
37677h72994J86158K09627K27780K36001K30220K08515J71733J23142O7788J1783
$$ -872994 -686836 -477209 -249429 -13428 216792 425307 597040 720182 787970 799753
37667G99753l9038q1020j13858j39845j61819j81423j98576k11828k19184k19315
$$ 799753 760715 679695 565837 425992 264173 82750 -115826 -327654 -546838 -766153
37657g66153k12532k00512j84818j65803j43123j17025q8724n9611l0658k990
$$ -766153 -978685 -1179197 -1364015 -1529818 -1672941 -1789966 -1878690 -1938301 -1968959 -1971949
37647a971949K1318L9495M9507N1652M9281M8322N5407P5041J07113J46324J84045
$$ -1971949 -1950631 -1911136 -1861629 -1809977 -1760696 -1712374 -1656967 -1581926 -1474813 -1328489 -1144444
37636a144444K11472K22384K14563J89813J52879J09652O5200K2470j7803n5877
$$ -1144444 -932972 -710588 -496025 -306212 -153333 -43681 21519 43989 26186 -29691
37626b9691r1180j20999j40761j45945j34583j08805p4712m0749j5260l676o184
$$ -29691 -120871 -241870 -382631 -528576 -663159 -771964 -846676 -887425 -902685 -906361 -912545
37615i12545j7087k7048k7517j4826Q610L6251O0467P4654P4273N7737K7064j2641
$$ -912545 -929632 -956680 -984197 -999023 -990413 -954162 -893695 -819041 -744768 -687031 -659967 -672608
37603f72608n5159r5110j28422j51547j60962j53959j29954r0991m0732J7194
$$ -672608 -727767 -822877 -951299 -1102846 -1263808 -1417767 -1547721 -1638712 -1679444 -1662250
37593a662250Q0200J46231K12353K73797L24544L59149L74537L70618L49472L13958
$$ -1662250 -1582050 -1435819 -1223466 -949669 -625125 -265976 108561 479179 828651 1142609
37583A142609K66852K11007J49865Q7190K6043l1782q4833j30370j63924j80823
$$ 1142609 1409461 1620468 1770333 1857523 1883566 1851784 1766951 1636581 1472657 1291834
37573A291834j78627j58728j26249q8554n3171k5883r610m276p508j5803k5801
$$ 1291834 1113207 954479 828230 739676 686505 660622 651012 646736 639228 623425 597624
37562E97624l5267m3512n1152n9437o9259q0288r0865r9031j04104j07409j11326
$$ 597624 562357 518845 467693 408256 338997 258709 167844 68813 -35291 -142700 -254026
37551b54026j17430j25226j32349j35793j33154j23345j06807q5581o3207m4125
$$ -254026 -371456 -496682 -629031 -764824 -897978 -1021323 -1128130 -1213711 -1276918 -1321043
37541a321043l2397l0160l6635m8355o0648o9649p3619p2603o6783n5098l5617
$$ -1321043 -1353440 -1383600 -1420235 -1468590 -1529238 -1598887 -1672506 -1745109 -1811892 -1866990 -1902607
37530a902607p211K9238P1180J15604J59780K01062K36347K61799K73256K67490
$$ -1902607 -1909818 -1880580 -1809400 -1693796 -1534016 -1332954 -1096607 -834808 -561552 -294062
37520b94062K43908K05677J59220J12243P1389M0614K0655R319K228o209k1366
$$ -294062 -50154 155523 314743 426986 498375 538989 559644 568963 571191 564982 543616
37509E43616m6421q0521j18610j53468j78531j89430j84028j62483j27917q6464
$$ 543616 497195 416674 298064 144596 -33935 -223365 -407393 -569876 -697793 -784257
37499g84257m5323r784J8610M1669O2820Q5211J10169J36153J58694J71646J69326
$$ -784257 -829580 -839364 -820754 -779085 -716265 -631054 -520885 -384732 -226038 -54392 114934
37488A14934J48721J11056O2177J1169l2649o3037p8565q1980p8148p2218o8832
$$ 114934 263655 374711 436888 448057 415408 352371 273806 191826 113678 41460 -27372
37477b7372p1876q3812j04507j30325j54621j69758j69752j52248j19170p6061
$$ -27372 -99248 -183060 -287567 -417892 -572513 -742271 -912023 -1064271 -1183441 -1259502
37467a259502l0531R902M0012N8124O5633O4988N7631M3411K1782o334l7557o6744
$$ -1259502 -1290033 -1280131 -1240119 -1181995 -1116362 -1051374 -993743 -950332 -928550 -934884 -972441 -1039185
37455a039185q9025j01906j06088j04362r9396r2136q2139o9445n6160m6238m3358
$$ -1039185 -1128210 -1230116 -1336204 -1440566 -1539962 -1632098 -1714237 -1783682 -1839842 -1886080 -1929438
37444a929438m8339n7713o4518o1037m2161p621L7957Q6903J31280J65491J88077
$$ -1929438 -1977777 -2035490 -2100008 -2161045 -2203206 -2210827 -2172870 -2085967 -1954687 -1789196 -1601119
37433a601119K01900K12605K25763K44021K65382K83402K89662K77808K46976
$$ -1601119 -1399219 -1186614 -960851 -716830 -451448 -168046 121616 399424 646400
37424F46400K02244J51718J02696N9492K3539n631k9548n0096o8649q5235r8157
$$ 646400 848644 1000362 1103058 1162550 1186089 1180458 1150910 1100814 1032165 946930 848773
37413H48773j04230r9891q2948n3825j4997L1056Q3288J41181K02324K60920L08870
$$ 848773 744543 644652 561704 507879 492882 523938 607226 748407 950731 1211651 1520521
37402A520521L38674L46036L30811K96424K48838J95704J45298J04902P9234O9964
$$ 1520521 1859195 2205231 2536042 2832466 3081304 3277008 3422306 3527208 3606442 3676406
37392C676406P6247R5194J21821J49528J71976J85484J90039J88436J84755J83395
$$ 3676406 3752653 3847847 3969668 4119196 4291172 4476656 4666695 4855131 5039886 5223281
37382E223281J88497K03007K27331K58509K90711L16922L30791L27487L03411
$$ 5223281 5411778 5614785 5842116 6100625 6391336 6708258 7039049 7366536 7669947
37373G669947K55520J81311P9842m6389j89474l35320m65628n62827o15814o23292
$$ 7669947 7925467 8106778 8186620 8140231 7950757 7615437 7149809 6586982 5971168 5347876
37363E347876n93072n38345m73237m09558l55570l16529k95720k94563l11540
$$ 5347876 4754804 4216459 3743222 3333664 2978094 2661565 2365845 2071282 1759742
37354A759742l41334l75691m05880m25272m30621m21843m00876l70281l31961
$$ 1759742 1418408 1042717 636837 211565 -219056 -640899 -1041775 -1412056 -1744017
37345a744017k86151k31167j64433q4953L996R3923J73143K30808K60527K61787
$$ -1744017 -2030168 -2261335 -2425768 -2510721 -2506725 -2412802 -2239659 -2008851 -1748324 -1486537
37335a486537K39051J99626J51385J00908N2439P874l2177o6837r3943j10306
$$ -1486537 -1247486 -1047860 -896475 -795567 -743128 -735254 -767431 -834268 -928211 -1038517
37325a038517j13187j02096p9902n2591k7583j1193o404j2218k4681l8709m9493
$$ -1038517 -1151704 -1253800 -1333702 -1386293 -1413876 -1425069 -1431473 -1443691 -1468372 -1507081 -1556574
37314a556574n3391m8521l5217j6005M959K2776L2896L2468K1598L723j5421k9782
$$ -1556574 -1609965 -1658486 -1693703 -1709708 -1704749 -1681973 -1649077 -1616609 -1595011 -1591288 -1606709 -1636491
37302a636491l5010k9723j5820K265J9275L1438L8420M3779N3324P1898J00359
$$ -1636491 -1671501 -1701224 -1717044 -1714779 -1695504 -1664066 -1625646 -1581867 -1528543 -1456645 -1356286
37291a356286J34571J67016J89827J97376J87369J60587J20044P0105J5785l7682
$$ -1356286 -1221715 -1054699 -864872 -667496 -480127 -319540 -199496 -129391 -113606 -151288
$$ [...]
##END NTUPLES=NMR SPECTRUM
##END=
