##TITLE=31Pdec_DE-26
 CDCl3
  64 sc
 10.1.2024
##JCAMPDX= 6.0         $$ Bruker NMR JCAMP-DX V2.0
##DATA TYPE= NMR SPECTRUM
##DATA CLASS= NTUPLES
##ORIGIN= UXNMR, Bruker Analytische Messtechnik GmbH
##OWNER= root
$$ XWIN-NMR		Version 3.5
$$ Wed Jan 10 14:45:42 2024 Russian Standard Time (UT+4h)  she@DPX200
##.OBSERVE FREQUENCY= 81.013821
##.OBSERVE NUCLEUS= ^31P
##.ACQUISITION MODE= SIMULTANEOUS
##.ACQUISITION SCHEME= undefined
##.AVERAGES= 64
##.DIGITISER RES= 16
##SPECTROMETER/DATA SYSTEM= spect
##.PULSE SEQUENCE= zgpg30
##.SOLVENT NAME= DMSO
##.SHIFT REFERENCE= (INTERNAL, DMSO, 0, 248.564)
##AUDIT TRAIL= $$ (NUMBER, WHEN, WHO, WHERE, WHAT)
$$ ##TITLE= Audit trail, XWIN-NMR		Version 3.5
$$ ##JCAMPDX= 5.01
$$ ##ORIGIN= Bruker BioSpin GmbH
$$ ##OWNER= she
$$ F:/spectra/data/she/nmr/P31/1/pdata/1/auditp.txt
$$ ##AUDIT TRAIL=  $$ (NUMBER, WHEN, WHO, WHERE, WHAT)
(   1,<2024-01-10 14:44:49.12 +0400>,<she>,<DPX200>,
      <continue with go, POWCHK disabled, PULCHK disabled
       configuration hash MD5:
       00 E9 B6 7A A2 85 ED C7 34 08 36 98 17 FE 4E 26
       data hash MD5: 32K
       77 1A ED 1A 39 E4 67 F8 9C 7F 77 DB FB 07 39 9C>)
(   2,<2024-01-10 14:44:50.92 +0400>,<she>,<DPX200>,
      <Start of raw data processing
       efp BC_mod = 2 LB = 10 FT_mod = 6 PKNL = 1 PHC0 = -12257.94 PHC1 = 292.2938 SI = 64K 
       data hash MD5: 64K
       C6 9D D9 F3 BC 11 88 26 8E 83 7E 71 F8 C1 71 9D>)
(   3,<2024-01-10 14:45:11.81 +0400>,<she>,<DPX200>,
      <pk PHC0 = 10.97579 PHC1 = 0 
       data hash MD5: 64K
       C8 AB FA 90 92 DD 79 84 5C 40 6A 6E F8 EE 18 E3>)
$$ ##END=
$$ 
$$ hash MD5
$$ CF 53 A6 2A 32 01 77 14 E3 2C 16 43 7D 0A 3A 62
##$RELAX= 
##$RELAX= 
##$RELAX= 
##$RELAX= 
##$RELAX= 
##$RELAX= 
##$RELAX= 
##$RELAX= 
##$RELAX= 
$$ Bruker specific parameters
$$ --------------------------
##$DU= <F:/spectra>
##$EXPNO= 1
##$NAME= <P31>
##$PROCNO= 1
##$TYPE= <nmr>
##$USER= <she>
##$AMP= (0..31)
100 100 100 100 100 100 100 100 100 100 100 100 100 100 100 100 100 100 
100 100 100 100 100 100 100 100 100 100 100 100 100 100 
##$AQSEQ= 0
##$AQ_mod= 1
##$AUNM= <au_zg>
##$AUTOPOS= <>
##$BF1= 81.014009
##$BF2= 200.13
##$BF3= 200.13
##$BF4= 200.13
##$BF5= 200.13
##$BF6= 200.13
##$BF7= 200.13
##$BF8= 200.13
##$BYTORDA= 1
##$CFDGTYP= 0
##$CFRGTYP= 5
##$CHEMSTR= <none>
##$CNST= (0..31)
1 1 145 1 1 1 1 1 1 1 1 1 1 1 1 1 1 1 1 1 1 1 1 1 1 1 1 1 1 1 1 1 
##$CPDPRG= <waltz16>
##$CPDPRG1= <>
##$CPDPRG2= <waltz16>
##$CPDPRG3= <>
##$CPDPRG4= <mlev>
##$CPDPRG5= <mlev>
##$CPDPRG6= <mlev>
##$CPDPRG7= <mlev>
##$CPDPRG8= <mlev>
##$CPDPRGB= <>
##$CPDPRGT= <>
##$D= (0..31)
0 1 0 0 0 0 0 0 0 0 0 0.03 2e-05 3e-06 0 0 0 0 0 0 0 0 0 0 0 0 0 0 0 0 
0 0 
##$DATE= 1704883409
##$DBL= (0..7)
120 120 120 11 120 120 24 19 
##$DBP= (0..7)
150 150 150 150 150 150 150 150 
##$DBP07= 0
##$DBPNAM0= <>
##$DBPNAM1= <>
##$DBPNAM2= <>
##$DBPNAM3= <>
##$DBPNAM4= <>
##$DBPNAM5= <>
##$DBPNAM6= <>
##$DBPNAM7= <>
##$DBPOAL= (0..7)
0.5 0.5 0.5 0.5 0.5 0.5 0.5 0.5 
##$DBPOFFS= (0..7)
$$ [...]
##$SUBNAM2= <"">
##$SUBNAM3= <"">
##$SUBNAM4= <"">
##$SUBNAM5= <"">
##$SUBNAM6= <"">
##$SUBNAM7= <"">
##$SUBNAM8= <"">
##$SUBNAM9= <"">
##$SW= 501.771253377433
##$SWIBOX= (0..15)
0 1 3 0 0 0 0 0 0 0 0 0 0 0 0 0 
##$SW_h= 40650.406504065
##$TD= 32768
##$TD0= 1
##$TE= 0
##$TE2= 300
##$TE3= 300
##$TEG= 300
##$TL= (0..7)
0 120 53 12 22 120 120 120 
##$TP= (0..7)
150 150 150 150 150 150 150 150 
##$TP07= 0
##$TPNAME0= <>
##$TPNAME1= <>
##$TPNAME2= <>
##$TPNAME3= <>
##$TPNAME4= <>
##$TPNAME5= <>
##$TPNAME6= <>
##$TPNAME7= <>
##$TPOAL= (0..7)
0.5 0.5 0.5 0.5 0.5 0.5 0.5 0.5 
##$TPOFFS= (0..7)
0 0 0 0 0 0 0 0 
##$TUNHIN= 0
##$TUNHOUT= 0
##$TUNXOUT= 0
##$USERA1= <user>
##$USERA2= <user>
##$USERA3= <user>
##$USERA4= <user>
##$USERA5= <user>
##$V9= 5
##$VALIST= <valist>
##$VCLIST= <CCCCCCCCCCCCCCC>
##$VD= 0
##$VDLIST= <DDDDDDDDDDDDDDD>
##$VPLIST= <PPPPPPPPPPPPPPP>
##$VTLIST= <TTTTTTTTTTTTTTT>
##$WBST= 1024
##$WBSW= 4
##$XGAIN= (0..3)
0 0 0 0 
##$XL= 0
##$YL= 0
##$YMAX_a= 1891
##$YMIN_a= -1740
##$ZGOPTNS= <>
##$ZL1= 120
##$ZL2= 120
##$ZL3= 120
##$ZL4= 120
##$ABSF1= 0
##$ABSF2= 0
##$ABSG= 0
##$ABSL= 0
##$ALPHA= 0
##$AQORDER= 0
##$ASSFAC= 0
##$ASSFACI= 0
##$ASSFACX= 0
##$ASSWID= 0
##$AUNMP= <proc_1d>
##$AZFE= 0.1
##$AZFW= 0.5
##$BCFW= 0
##$BC_mod= 2
##$BYTORDP= 0
##$COROFFS= 0
##$CY= -3
##$DATMOD= 1
##$DC= 0
##$DFILT= <>
##$DTYPP= 0
##$F1P= 0
##$F2P= 0
##$FCOR= 1
##$FTSIZE= 65536
##$FT_mod= 6
##$GAMMA= 0
##$GB= 0
##$INTBC= 1
##$INTSCL= 6.047779e-11
##$ISEN= 30
##$LB= 10
##$LEV0= 0
##$LPBIN= 0
##$MAXI= 10000
##$MC2= 0
##$MEAN= 0
##$ME_mod= 0
##$MI= 50
##$NCOEF= 0
##$NC_proc= -10
##$NLEV= 6
##$NOISF1= 182.463
##$NOISF2= 159.3651
##$NSP= 0
##$NTH_PI= 0
##$NZP= 0
##$OFFSET= 248.5645
##$PC= 4
##$PHC0= -12246.96
##$PHC1= 292.2938
##$PH_mod= 1
##$PKNL= yes
##$PPARMOD= 0
##$PSCAL= 0
##$PSIGN= 0
##$REVERSE= no
##$SF= 81.0140089999694
##$SI= 65536
##$SIGF1= 159.3651
##$SIGF2= -187.1042
##$SINO= 113.3802
##$SIOLD= 16384
##$SREGLST= <1H.CDCl3>
##$SSB= 0
##$STSI= 65536
##$STSR= 0
##$SW_p= 40650.406504065
##$SYMM= 0
##$S_DEV= 0
##$TDeff= 32768
##$TDoff= 0
##$TI= <>
##$TILT= no
##$TM1= 0
##$TM2= 0
##$TOPLEV= 0
##$USERP1= <user>
##$USERP2= <user>
##$USERP3= <user>
##$USERP4= <user>
##$USERP5= <user>
##$WDW= 1
##$XDIM= 65536
##$YMAX_p= 366935163
##$YMIN_p= -41494975
$$ End of Bruker specific parameters
$$ ---------------------------------
##NTUPLES= NMR SPECTRUM
##VAR_NAME=  FREQUENCY,     SPECTRUM/REAL,   SPECTRUM/IMAG
##SYMBOL=    X,             R,               I
##VAR_TYPE=  INDEPENDENT,   DEPENDENT,       DEPENDENT
##VAR_FORM=  AFFN,          ASDF,            ASDF
##VAR_DIM=   65536,         65536,           65536
##UNITS=     HZ,            ARBITRARY UNITS, ARBITRARY UNITS
##FACTOR=    0.620285442955139, 1,           1
##FIRST=     20137.2065510682, 0,            0
##LAST=      -20513.1999529968, 0,           0
##MIN=       -20513.1999529968, -41494975,   0
##MAX=       20137.2065510682, 366935163,    0
$$ Real data points
##PAGE= N=1
##DATA TABLE= (X++(R..R)), XYDATA
$$ [...]
14421 6874728 5781437 4701330 3692780 2805998 2078272 1529535 1162661 967755 926441
14412 926441 1015827 1214085 1504978 1874645 2299311 2732243 3100239 3312525 3277673 2923271
14402 2923271 2214968 1170551 -137513 -1595904 -3077660 -4471556 -5701335 -6730793
14394 -6730793 -7560604 -8224231 -8783023 -9315714 -9902255 -10609390 -11483716 -12548923 -13800432
14385 -13800432 -15198417 -16668214 -18112925 -19430756 -20524732 -21301646 -21670037 -21548839
14377 -21548839 -20886871 -19680489 -17975463 -15850935 -13396887 -10699450 -7839054 -4894852
14369 -4894852 -1946132 932108 3675275 6232963 8571152 10675193 12551582 14222814
14361 14222814 15713471 17034674 18177754 19120970 19842606 20330760 20585894 20618322 20443239
14352 20443239 20074063 19516295 18766934 17822686 16693016 15407964 14012132 12545030 11018230
14343 11018230 9404279 7646688 5687467 3497730 1096685 -1446165 -4021426 -6496728
14335 -6496728 -8737794 -10632542 -12113445 -13169193 -13838209 -14184872 -14269462 -14127900 -13772286
14326 -13772286 -13210087 -12467545 -11600644 -10686269 -9798649 -8983323 -8240945 -7529336 -6786083
14317 -6786083 -5964577 -5067078 -4156821 -3341529 -2736338 -2423887 -2428261 -2711719 -3193834 -3783607
14307 -3783607 -4408304 -5023144 -5596480 -6081213 -6394109 -6422184 -6058838 -5251633 -4033383
14298 -4033383 -2517813 -864429 764755 2234905 3447988 4339870 4875647 5049390 4887892
14289 4887892 4452768 3834120 3133710 2442810 1822555 1291219 819768 337553 -250879
14280 -250879 -1042821 -2117373 -3522705 -5266827 -7308508 -9553953 -11868781 -14105969
14272 -14105969 -16137810 -17876967 -19280061 -20337535 -21059249 -21465107 -21585188 -21465586 -21170309
14263 -21170309 -20772474 -20337916 -19911052 -19509902 -19129188 -18746744 -18330862 -17848619 -17273944
14254 -17273944 -16592436 -15801896 -14911392 -13942236 -12930715 -11929571 -11006282 -10239099 -9711787
14245 -9711787 -9505137 -9681695 -10263502 -11210066 -12410099 -13699023 -14902180 -15886560 -16594680
14236 -16594680 -17042874 -17288536 -17389694 -17381221 -17276051 -17081955 -16818180 -16522309 -16246697 -16047839
14226 -16047839 -15971734 -16039303 -16238658 -16530182 -16862657 -17190531 -17482717 -17721656 -17897971 -18004670
14216 -18004670 -18030898 -17955999 -17748109 -17369768 -16786532 -15972099 -14909597 -13595588 -12050745
14207 -12050745 -10331006 -8526857 -6744650 -5077462 -3581910 -2273598 -1141012 -165811
14199 -165811 664337 1356430 1921762 2384044 2776844 3128815 3445002 3697998 3837539 3813737
14189 3813737 3599023 3196794 2636428 1962204 1221799 455721 -310467 -1066498 -1808040
14180 -1808040 -2522586 -3179994 -3733850 -4132319 -4332229 -4310356 -4069334 -3638560 -3070917 -2435191
14170 -2435191 -1804746 -1246155 -812928 -545703 -474090 -614373 -963016 -1491918 -2150922 -2877765
14160 -2877765 -3612010 -4309075 -4950915 -5549092 -6136602 -6748969 -7401452 -8073232 -8707302
14151 -8707302 -9226485 -9556394 -9642891 -9457191 -8990774 -8246599 -7231326 -5950318 -4406408
14142 -4406408 -2602975 -550118 1728618 4190979 6773441 9392996 11953817 14355716
14134 14355716 16499611 18289709 19638547 20480124 20787407 20583117 19935789 18943078 17710955
14125 17710955 16335870 14892042 13424060 11945718 10445506 8896028 7263123 5513563
14117 5513563 3624381 1595614 -538026 -2704190 -4801041 -6711411 -8316887 -9510953
14109 -9510953 -10212363 -10375768 -9993568 -9087515 -7696468 -5869350 -3668203 -1179146 1477145
14100 1477145 4146689 6661555 8871148 10669123 12003615 12873490 13322545 13437209 13341521
14091 13341521 13181652 13102463 13226601 13643094 14402919 15515648 16946936 18622677 20443328
14082 20443328 22303139 24104022 25759018 27190408 28331896 29138984 29603151 29761327
14074 29761327 29694002 29509906 29320473 29211950 29224945 29348582 29530484 29697654 29779491 29724172
14064 29724172 29504215 29113640 28562224 27868917 27051971 26115034 25035811 23767930 22260574
14055 22260574 20488034 18472554 16286092 14028916 11797498 9660361 7653140 5789242
14047 5789242 4073238 2507867 1095109 -164138 -1271552 -2237036 -3086982 -3866567 -4628924
14038 -4628924 -5414983 -6237073 -7077246 -7900668 -8675794 -9391457 -10063556 -10728174 -11424180
14029 -11424180 -12174968 -12979667 -13817165 -14657618 -15472986 -16240352 -16936024 -17524192 -17950494
14020 -17950494 -18151483 -18080647 -17736830 -17175996 -16497043 -15808389 -15192728 -14687578 -14289069
14011 -14289069 -13971109 -13702975 -13454891 -13196665 -12900448 -12548708 -12137454 -11668494 -11137562
14002 -11137562 -10530063 -9828635 -9027599 -8147015 -7239934 -6387647 -5682164 -5203522 -5003676
13993 -5003676 -5103114 -5496406 -6158441 -7046468 -8098716 -9234478 -10361389 -11391852 -12261987
13984 -12261987 -12940348 -13418543 -13690841 -13740845 -13547882 -13108186 -12453400 -11652905 -10800600
13975 -10800600 -9995837 -9326247 -8854515 -8609986 -8587969 -8758153 -9078182 -9504939 -9998704
13966 -9998704 -10521369 -11033660 -11495311 -11868221 -12119783 -12224260 -12163182 -11927290 -11520886 -10966586
13956 -10966586 -10307324 -9603137 -8921881 -8325801 -7858472 -7536184 -7344075 -7235664 -7137812
13947 -7137812 -6965618 -6646476 -6143206 -5464033 -4654826 -3778104 -2887231 -2005655 -1121694
13938 -1121694 -204497 765873 1772398 2755608 3632069 4326922 4804717 5083976 5227727
13929 5227727 5313814 5400097 5502550 5595561 5630526 5560328 5357131 5016708 4550090 3969285
13919 3969285 3275916 2459311 1505372 411848 -797637 -2067788 -3316572 -4448493 -5370790
13910 -5370790 -6006592 -6300570 -6216454 -5731167 -4833056 -3528357 -1852810 119065 2272628
13901 2272628 4459832 6511083 8250910 9519259 10199250 10245115 9696430 8666562 7306931
13892 7306931 5764322 4151901 2543077 982047 -501170 -1879133 -3120199 -4186482
13884 -4186482 -5038310 -5646409 -6007977 -6157860 -6166992 -6127205 -6128853 -6240698 -6499723 -6913725
13874 -6913725 -7473190 -8163550 -8968831 -9863996 -10801341 -11700601 -12451669 -12934275 -13050618
13865 -13050618 -12756969 -12076518 -11084684 -9874176 -8516930 -7038072 -5409927 -3568784
13857 -3568784 -1451305 962610 3621925 6408940 9175858 11793709 14186440 16332648
13849 16332648 18237637 19896401 21272206 22303047 22928826 23120191 22892929 22304332 21438147
13840 21438147 20385927 19228534 18020282 16781422 15506216 14187030 12842630 11531892
13832 11531892 10340872 9348451 8591361 8050358 7664023 7356965 7061984 6725747 6302851
13823 6302851 5748837 5018107 4067825 2868311 1418484 -240658 -2023802 -3813032 -5477488
13814 -5477488 -6893439 -7962020 -8624530 -8872921 -8751018 -8344146 -7759205 -7100662 -6448857
13805 -6448857 -5845781 -5290967 -4748479 -4164772 -3493575 -2718141 -1860170 -972543 -122909
13796 -122909 623353 1218576 1647708 1939702 2167965 2434791 2841773 3454445 4273134 5222672
13786 5222672 6168157 6952584 7441745 7559517 7302408 6730897 5943045 5041530 4106010
13777 4106010 3178054 2259940 1325544 339899 -719256 -1847599 -3014806 -4177612 -5295551
13768 -5295551 -6339258 -7288295 -8124162 -8828179 -9390008 -9822813 -10172832 -10511606 -10909304
13759 -10909304 -11400642 -11961716 -12511069 -12934325 -13118750 -12981928 -12487367 -11649022 -10527826
13750 -10527826 -9219173 -7830359 -6454108 -5150538 -3946699 -2851054 -1869896 -1012762
13742 -1012762 -284141 329913 868521 1390138 1956194 2611301 3369360 4214473 5119303
13733 5119303 6071595 7090899 8221954 9506560 10949599 12497417 14038475 15424291
13725 15424291 16500402 17136836 17253101 16836399 15948666 14715135 13293537 11836351 10464345
13716 10464345 9261025 8283356 7576616 7182716 7137468 7460357 8147098 9173362 10506206
13707 10506206 12109813 13936992 15913721 17932946 19866982 21593195 23018693 24090952
13699 24090952 24790162 25111370 25052588 24620173 23845687 22794822 21554166 20201778 18782337
13690 18782337 17303367 15752199 14120537 12422773 10700743 9014915 7427523 5986461
13682 5986461 4717269 3624135 2694855 1905352 1224849 625141 92944 -361358 -704874
13673 -704874 -893688 -890170 -681045 -291966 206231 704475 1076290 1206213 1015432 476826
13663 476826 -382219 -1487195 -2732299 -4002556 -5196098 -6237925 -7081689 -7705747 -8111834
13654 -8111834 -8325248 -8386706 -8331820 -8169996 -7880398 -7429081 -6792562 -5970008 -4981041 -3860582
13644 -3860582 -2660689 -1456828 -348435 551691 1135766 1320698 1065165 382040 -657301
13635 -657301 -1930690 -3285765 -4569828 -5661693 -6496070 -7071578 -7439550 -7680449 -7879780
13626 -7879780 -8111088 -8425792 -8847148 -9368710 -9959246 -10573402 -11165070 -11701087 -12173248
13617 -12173248 -12604452 -13043625 -13547931 -14157545 -14873091 -15646295 -16390236 -17006414 -17415379
13608 -17415379 -17574565 -17476959 -17139479 -16595225 -15894079 -15103402 -14299961 -13555482 -12926840
13599 -12926840 -12457276 -12182755 -12132389 -12319041 -12726885 -13305573 -13974756 -14635962 -15187202
13590 -15187202 -15537266 -15617791 -15390603 -14848062 -14006638 -12897947 -11563841 -10059584 -8462067
13581 -8462067 -6873837 -5414456 -4198494 -3308608 -2775851 -2575715 -2639981 -2877074 -3192567
13572 -3192567 -3506122 -3764842 -3950980 -4078654 -4177751 -4272143 -4363921 -4430120 -4430532 -4322428 -4079004
13561 -4079004 -3706832 -3254088 -2802146 -2440501 -2233904 -2195055 -2273992 -2367724 -2344572 -2072466
13551 -2072466 -1442176 -382247 1133136 3081061 5390105 7944543 10595689 13183260
13543 13183260 15563368 17631588 19328508 20625142 21499393 21920673 21853131 21274153 20194729
13534 20194729 18669147 16790867 14679949 12467873 10281289 8224894 6367305 4736151
13526 4736151 3324556 2104363 1039031 92225 -768146 -1570125 -2342104 -3118885 -3942800
13517 -3942800 -4853697 -5869509 -6968442 -8085240 -9125098 -9988501 -10596558 -10908628 -10926589
13508 -10926589 -10683123 -10219386 -9566770 -8746989 -7789620 -6749459 -5705158 -4737567 -3903869
13499 -3903869 -3225456 -2694072 -2286871 -1977965 -1740401 -1540260 -1329180 -1043009 -612392
13490 -612392 15730 855900 1875089 3004558 4168589 5317676 6452191 7625748 8923498
13481 8923498 10420435 12136209 14008968 15904405 17658700 19134707 20261924 21040079
13473 21040079 21509136 21709085 21655612 21342152 20759502 19915804 18844214 17595740 16223836
13464 16223836 14772163 13275100 11771386 10320135 9004035 7911437 7102636 6576884
13456 6576884 6258667 6013302 5687640 5159128 4372719 3351736 2181217 973856 -165669
13447 -165669 -1163693 -1981226 -2601637 -3013149 -3197415 -3129271 -2785114 -2153610 -1243667 -87685
13437 -87685 1259640 2725396 4223754 5662403 6952080 8019995 8823362 9356435 9647871
13428 9647871 9751485 9735464 9672144 9627878 9653402 9776215 9995443 10279114 10566198 10777750
13418 10777750 10838018 10698603 10353823 9838432 9208846 8519042 7804838 7082453 6355411
13409 6355411 5618632 4854598 4026690 3078695 1944764 567564 -1080337 -2977183 -5041691
13400 -5041691 -7140095 -9114963 -10829152 -12206361 -13247599 -14014718 -14591036 -15042110 -15397841
13391 -15397841 -15662151 -15837985 -15945675 -16019107 -16082838 -16129516 -16116037 -15980426 -15666182 -15140416
13381 -15140416 -14402267 -13484908 -12452773 -11392613 -10399247 -9561050 -8949920 -8616142 -8586065
13372 -8586065 -8862166 -9426842 -10248957 -11288454 -12495192 -13805202 -15143104 -16435525 -17628852
13363 -17628852 -18697854 -19638211 -20449718 -21123930 -21643817 -21991481 -22154692 -22127382 -21906526
13354 -21906526 -21490563 -20881150 -20085520 -19116830 -17994474 -16749379 -15435361 -14139255 -12978642
13345 -12978642 -12082001 -11557662 -11464914 -11798231 -12487677 -13412872 -14427117 -15388706 -16193682
13336 -16193682 -16799109 -17224823 -17529513 -17771100 -17971709 -18105170 -18110380 -17917961 -17472288 -16738864
13326 -16738864 -15700126 -14349998 -12694833 -10759995 -8595188 -6272356 -3876156 -1492576
13318 -1492576 798931 2928984 4839578 6484183 7826680 8841823 9520999 9880932
13310 9880932 9964272 9822701 9488198 8952763 8174956 7113341 5767647 4203118 2544294
13301 2544294 942715 -463746 -1581657 -2374625 -2860237 -3097395 -3168248 -3157793 -3135665
13292 -3135665 -3144327 -3193892 -3260323 -3285744 -3184879 -2863268 -2246194 -1307599 -85033 1326056
13282 1326056 2794246 4179980 5360293 6244704 6779772 6944635 6744876 6211280 5402473
13273 5402473 4404219 3320422 2257673 1308288 534983 -40647 -442045 -729373 -978039
13264 -978039 -1249860 -1568569 -1911572 -2221572 -2429767 -2477412 -2328827 -1977415 -1446828 -784962
13254 -784962 -49567 708616 1456190 2177817 2872007 3548392 4228934 4950027 5758560 6696235
13244 6696235 7775076 8957263 10153356 11242185 12103582 12650932 12853006 12738368 12380889
13235 12380889 11872191 11291946 10685998 10058076 9377067 8597144 7681636 6619320 5428728
13226 5428728 4155404 2868277 1654393 606604 -197653 -720855 -982835 -1061215 -1070656
13217 -1070656 -1127365 -1314762 -1666104 -2168655 -2781044 -3451126 -4126940 -4761020 -5312140 -5748012
13207 -5748012 -6050181 -6219900 -6281572 -6279262 -6264118 -6276451 -6331514 -6417305 -6505817 -6571723 -6609423
13196 -6609423 -6640513 -6707208 -6853338 -7101846 -7440956 -7826152 -8195395 -8488284 -8659986 -8685694
13186 -8685694 -8557596 -8280594 -7871767 -7361909 -6792530 -6205272 -5629580 -5077611 -4548016
13177 -4548016 -4030986 -3507135 -2941986 -2285563 -1483558 -495975 688138 2047893 3538084
13168 3538084 5100196 6673193 8204860 9662635 11037944 12338952 13574973 14742111
13160 14742111 15817020 16758157 17511027 18017687 18233781 18151698 17818678 17334304 16820910
13151 16820910 16378648 16049605 15810411 15594032 15324396 14944635 14429493 13783856 13034177
13142 13034177 12218345 11377643 10554467 9798371 9177142 8781852 8713353 9047715 9794064
13133 9794064 10868028 12098820 13270236 14177058 14671722 14685772 14227518 13366552 12213213
13124 12213213 10895668 9538032 8245391 7097547 6145435 5403838 4843125 4390061 3944116
13115 3944116 3405850 2707172 1832608 823502 -236830 -1249926 -2127541 -2804813 -3240919
13106 -3240919 -3415316 -3327065 -2997930 -2474738 -1827522 -1144014 -522300 -60675 157956 86003
13096 86003 -271815 -852868 -1546159 -2215153 -2729261 -2996512 -2986190 -2730937 -2307190 -1804870
13086 -1804870 -1301163 -846471 -461571 -141502 137050 407368 706546 1073322 1546542
13077 1546542 2157536 2914274 3785298 4696369 5545486 6228859 6664076 6801924 6627651
13068 6627651 6157199 5432327 4514481 3475079 2382355 1290887 242157 -723249 -1553499
13059 -1553499 -2187668 -2574070 -2692061 -2562919 -2245359 -1820599 -1373985 -978399 -682496
13050 -682496 -504111 -427776 -407732 -380631 -287803 -97352 187126 534838 903463 1249159
13040 1249159 1526510 1684586 1667972 1426247 928183 174122 -797673 -1911544 -3062207
13031 -3062207 -4131142 -5010274 -5625322 -5947944 -5991131 -5792458 -5395686 -4839299 -4154327
13022 -4154327 -3368479 -2511041 -1613375 -703746 199592 1090747 1971096 2839538 3683264
13013 3683264 4472413 5160150 5689933 6010502 6093445 5943426 5594217 5093768 4488619 3816053
13003 3816053 3105073 2381899 1673977 1008126 403750 -131553 -596623 -983724 -1269598
12994 -1269598 -1419843 -1403788 -1209205 -849172 -360126 206825 797899 1365841 1871037 2276696
12984 2276696 2547089 2654643 2591152 2373092 2036254 1623499 1172857 710805 251752 -197736
12974 -197736 -632236 -1040008 -1396173 -1659326 -1776093 -1695874 -1391194 -873079 -192072 576295
12964 576295 1354288 2082740 2732433 3303497 3814499 4286783 4732669 5155243 5560187 5970597
12954 5970597 6432690 7006957 7749450 8692447 9831422 11120928 12479188 13799093 14961507
12945 14961507 15847811 16352346 16397244 15948451 15026292 13704000 12093941 10327028 8530359
12936 8530359 6804939 5206610 3738227 2360920 1022170 -313451 -1646310 -2941516
12928 -2941516 -4141046 -5181226 -6012642 -6620107 -7035819 -7336606 -7621763 -7979132 -8455344
12919 -8455344 -9044289 -9696483 -10339754 -10899053 -11310574 -11532674 -11555205 -11403574 -11133091 -10813926
12909 -10813926 -10511088 -10264650 -10076048 -9906905 -9693163 -9369020 -8889820 -8245634 -7463869
12900 -7463869 -6603098 -5741259 -4961847 -4341710 -3941482 -3797304 -3913874 -4262217 -4785335
12891 -4785335 -5409731 -6056006 -6642631 -7083673 -7288057 -7168458 -6660155 -5740815 -4440566
12882 -4440566 -2839600 -1057351 764414 2486821 4005065 5271750 6295931 7116074
12874 7116074 7764982 8249626 8555018 8663308 8573013 8309331 7924206 7486892 7065740 6706319
12864 6706319 6417762 6178527 5960006 5751517 5568022 5435810 5369068 5356160 5364563 5357730
12854 5357730 5309700 5210147 5064784 4898941 4761821 4719432 4830336 5115338 5540421 6022651
12844 6022651 6453364 6726908 6766171 6539212 6063121 5396132 4624516 3849815 3175228 2688067
12834 2688067 2441878 2447943 2681752 3099149 3650644 4286345 4953014 5590928 6137947 6542587
12824 6542587 6781120 6869323 6860084 6824241 6821882 6879278 6984684 7102965 7194886 7226553 7169017
12813 7169017 7001038 6723781 6379263 6055021 5866782 5928322 6324246 7093131 8218693
12804 8218693 9627549 11198919 12790505 14272904 15555431 16591633 17368191 17890605
12796 17890605 18174815 18244041 18126105 17850301 17446626 16948387 16394377 15825993 15280009
12787 15280009 14783691 14357770 14024557 13812122 13748323 13847086 14094412 14440626 14803235 15083127
12777 15083127 15191565 15076655 14734614 14199871 13521503 12740071 11875375 10928686 9896735
12768 9896735 8789390 7640101 6501963 5431500 4469568 3629475 2898083 2249143 1661005
12759 1661005 1127336 655310 257744 -48978 -238201 -267561 -86345 344714 1032766 1942554
12749 1942554 3000011 4107318 5165123 6095124 6853300 7426475 7814919 8014127 8009541
12740 8009541 7787738 7355627 6755004 6064565 5388676 4836897 4500059 4429505 4625758 5040499
12730 5040499 5591939 6190003 6764521 7287049 7777297 8291361 8898697 9660111 10614320
12721 10614320 11770754 13102430 14539803 15975047 17283941 18359132 19137591 19607778
12713 19607778 19795560 19739668 19470173 18998932 18324234 17445309 16377536 15159100 13845563
12704 13845563 12496949 11166549 9898225 8731369 7705797 6858942 6215335 5776212
12696 5776212 5517362 5396317 5364175 5377398 5407013 5441400 5477702 5502855 5475870 5326608 4975958
12685 4975958 4366522 3486101 2372885 1102331 -237799 -1575678 -2876745 -4148450
12677 -4148450 -5426440 -6752141 -8156238 -9653872 -11244880 -12910152 -14604761 -16257322
12669 -16257322 -17782770 -19104945 -20176413 -20983102 -21530864 -21824165 -21853881 -21605023 -21079611
12660 -21079611 -20318128 -19403747 -18444299 -17539079 -16746044 -16066710 -15457928 -14863323 -14244372
12651 -14244372 -13593620 -12927579 -12269925 -11637098 -11032206 -10447279 -9871030 -9298038 -8735443
12642 -8735443 -8204502 -7735420 -7355305 -7072850 -6868171 -6695958 -6501826 -6242031 -5894688
12633 -5894688 -5458187 -4942228 -4360693 -3731463 -3081028 -2447994 -1881861 -1437715 -1168473
12624 -1168473 -1115051 -1296225 -1703648 -2306708 -3064268 -3934393 -4877184 -5854180 -6829087 -7768106
12614 -7768106 -8635228 -9384723 -9960487 -10308904 -10400335 -10246422 -9902761 -9454880 -8992675 -8582494
12604 -8582494 -8247286 -7962769 -7670418 -7299834 -6789462 -6098255 -5207706 -4118345 -2845832
12595 -2845832 -1420832 105348 1651845 3104040 4323806 5177939 5577097 5508451 5045471
12586 5045471 4328599 3524880 2783802 2205296 1826925 1628481 1548400 1505727 1420833 1229140
12576 1229140 887350 377822 -283948 -1042597 -1808067 -2479258 -2978301 -3276964 -3400751
12567 -3400751 -3411690 -3383825 -3385934 -3475711 -3698828 -4084046 -4632502 -5308179 -6038860 -6730406
12557 -6730406 -7288268 -7637387 -7735770 -7581041 -7208527 -6678428 -6055006 -5388898 -4713310 -4052725
12547 -4052725 -3430561 -2863891 -2347747 -1843821 -1286008 -601410 266295 1343348 2623839
12538 2623839 4072451 5627239 7205079 8714357 10073670 11229428 12165826 12904899
12530 12904899 13497332 14006847 14494748 15012163 15601603 16301022 17142276 18142838 19296118
12521 19296118 20565965 21887555 23174376 24329299 25256260 25869622 26101135 25905998 25268536
12512 25268536 24207342 22779629 21082040 19241166 17389704 15636233 14045846 12642426
12504 12642426 11426142 10390607 9531277 8848407 8349239 8046741 7949133 8041949 8273839
12495 8273839 8557594 8788240 8869734 8738472 8374898 7799133 7051785 6167542 5154664
12486 5154664 3992236 2647447 1103365 -618214 -2450785 -4295616 -6043334 -7591665
12478 -7591665 -8853596 -9761434 -10274795 -10391273 -10149868 -9620803 -8887240 -8029871 -7119471
12469 -7119471 -6214205 -5356845 -4570934 -3858623 -3203679 -2580852 -1968091 -1354438 -738958
12460 -738958 -123847 490897 1108298 1735150 2387169 3095564 3906596 4869373 6016338
12451 6016338 7346713 8820784 10365922 11890027 13297327 14502481 15439320 16062109
12443 16062109 16342079 16266564 15845656 15122521 14177872 13122760 12082027 11174754 10496333
12434 10496333 10104835 10014201 10196248 10591076 11123001 11717403 12312837 12864236 13338957
12425 13338957 13713015 13972699 14117891 14159475 14110748 13982449 13788683 13557920 13335530 13172208
12415 13172208 13106746 13155020 13307440 13527657 13747773 13865314 13751934 13277590 12342990 10906655
12405 10906655 8994676 6689636 4106025 1366569 -1409428 -4106761 -6614433 -8832591
12397 -8832591 -10682718 -12113253 -13099932 -13647574 -13796192 -13624113 -13238544 -12753933 -12268781
12388 -12268781 -11851132 -11534375 -11319170 -11178479 -11065961 -10927885 -10716334 -10400579 -9974500
12379 -9974500 -9458762 -8896078 -8338603 -7829900 -7388470 -7001277 -6631329 -6235299 -5781274
12370 -5781274 -5257794 -4672437 -4044718 -3399094 -2759959 -2147692 -1575780 -1050777 -575035
12361 -575035 -148284 235487 592903 949923 1330662 1742963 2172237 2588367 2959241 3260366
12351 3260366 3475901 3594472 3605840 3501148 3274942 2925898 2456139 1873139 1198389 480900
12341 480900 -193993 -711611 -954114 -837469 -342532 475294 1502704 2601779 3642631
12332 3642631 4523585 5179958 5588549 5769585 5780817 5701033 5609345 5570015 5626353 5799201
12322 5799201 6084609 6450731 6838914 7173641 7380080 7401012 7203412 6772120 6098096 5172130
12312 5172130 3988993 2559249 922944 -839890 -2606471 -4220083 -5510743 -6323140
12304 -6323140 -6545370 -6133261 -5125620 -3644264 -1873487 -20692 1729222 3247243
12296 3247243 4468641 5378204 5986144 6309149 6362946 6165697 5749428 5173939 4532122
12287 4532122 3935168 3478410 3205060 3088870 3043132 2947017 2676235 2131199 1260136 72409
12277 72409 -1363541 -2937326 -4521194 -5994151 -7262775 -8278134 -9044328 -9611193 -10049291
12268 -10049291 -10416975 -10736437 -10991197 -11144837 -11169247 -11066736 -10874570 -10649965 -10444090
12259 -10444090 -10279885 -10146014 -10008315 -9828088 -9573368 -9217885 -8735070 -8099400 -7300217
12250 -7300217 -6361254 -5352813 -4386650 -3592155 -3081218 -2915080 -3086976 -3528085 -4133467
12241 -4133467 -4796022 -5434177 -6002995 -6486329 -6877279 -7160938 -7311109 -7301496 -7121639 -6787763
12231 -6787763 -6346340 -5872461 -5461946 -5212806 -5196672 -5431050 -5867991 -6407584 -6930478 -7333093
12221 -7333093 -7549326 -7552035 -7339098 -6915590 -6282941 -5439644 -4390496 -3157018 -1782528
12212 -1782528 -329542 1129260 2523392 3795773 4907867 5836948 6569986 7101392 7436924
12203 7436924 7598487 7623353 7557158 7444713 7321844 7208905 7107216 7000756 6863611 6670450
12193 6670450 6406974 6078395 5712700 5353125 5037396 4770964 4509243 4160779 3611334
12184 3611334 2757991 1540250 -40781 -1919378 -3979311 -6081421 -8094919 -9920269
12176 -9920269 -11497066 -12799882 -13830515 -14612324 -15186172 -15604208 -15919251 -16171013 -16373136
12167 -16373136 -16506296 -16521942 -16358082 -15963446 -15321521 -14464580 -13471370 -12448904 -11504766
12158 -11504766 -10718630 -10121242 -9687774 -9349589 -9022047 -8638161 -8174192 -7656390 -7145255
12149 -7145255 -6702079 -6351105 -6056074 -5724902 -5239888 -4495364 -3424605 -2011509 -293580
12140 -293580 1639858 3658546 5615436 7378183 8854121 9998519 10807082 11301451 11516202
12131 11516202 11491381 11271937 10914024 10494159 10111304 9871956 9859598 10104698 10574659 11189849
12121 11189849 11854417 12484742 13025761 13455393 13781470 14034658 14259030 14500809 14796394
12112 14796394 15163599 15601792 16102553 16663950 17297030 18018428 18833258 19719027 20620404
12103 20620404 21458706 22152084 22636604 22879218 22880805 22673278 22313180 21869776 21407484 20970007
12093 20970007 20576097 20229160 19932633 19700337 19556473 19526715 19625321 19843791 20145890 20472160
12083 20472160 20753945 20932268 20972576 20867169 20625319 20260881 19788359 19229006 18618605
12074 18618605 18008034 17454497 17006671 16687556 16478568 16310391 16068052 15615424 14836161
12065 14836161 13676885 12172070 10436369 8627506 6898508 5360327 4066088 3016735
12057 3016735 2181082 1520239 1006358 629503 392795 300939 349572 523031 803900 1187759
12047 1187759 1689178 2330938 3124017 4054103 5082188 6153736 7208303 8187543 9042369
12038 9042369 9736822 10245732 10549116 10631066 10487900 10142320 9654367 9118985 8644819 8319006
12028 8319006 8173735 8172523 8223454 8211018 8030626 7613413 6936069 6015019 4888298 3594422
12018 3594422 2160817 608217 -1034744 -2719376 -4375078 -5916664 -7256593 -8320580
12010 -8320580 -9065393 -9492637 -9648714 -9606242 -9433101 -9163527 -8785221 -8248373 -7491403 -6470122
12000 -6470122 -5177173 -3647270 -1953130 -198196 1494487 3001723 4225824 5114236
11992 5114236 5661334 5894564 5859650 5615710 5235459 4797240 4364580 3964530 3580921 3168540
11982 3168540 2679374 2084241 1377028 561897 -362455 -1404974 -2566890 -3821863 -5109735
11973 -5109735 -6351347 -7476090 -8445638 -9260819 -9950631 -10554473 -11110455 -11651500 -12199908
11964 -12199908 -12755403 -13286795 -13741262 -14069578 -14248627 -14284971 -14200065 -14009259 -13705842 -13256954
11954 -13256954 -12615057 -11742305 -10635579 -9337130 -7924302 -6484328 -5086661 -3764741
11946 -3764741 -2514188 -1306518 -109580 1095704 2306348 3493144 4598768 5540982
11938 5540982 6225970 6571531 6531754 6110974 5359891 4357807 3193482 1955231 730159
11929 730159 -396072 -1345818 -2060732 -2510447 -2692741 -2624794 -2330231 -1829485 -1140198 -288788
11919 -288788 674168 1666975 2586370 3330550 3823800 4031533 3962247 3659160 3185327 2606273
11909 2606273 1976082 1332040 695581 70732 -563711 -1258350 -2078101 -3065468 -4201444
11900 -4201444 -5392321 -6496933 -7382548 -7978853 -8301665 -8438282 -8508586 -8624927 -8866939
11891 -8866939 -9274797 -9855398 -10592624 -11453583 -12387361 -13319941 -14153738 -14778372 -15092662
11882 -15092662 -15031394 -14587438 -13820539 -12848632 -11824398 -10904839 -10221806 -9858092 -9831233
11873 -9831233 -10087386 -10508499 -10934641 -11198717 -11164338 -10754025 -9958341 -8826150 -7444624
11864 -7444624 -5918907 -4356804 -2858928 -1512443 -386020 475890 1059349 1385214 1507964
11855 1507964 1507174 1472758 1488158 1617148 1898624 2349181 2968827 3744344 4648171 5635029
11845 5635029 6640695 7586221 8387997 8971282 9283510 9303413 9042417 8536862 7834055
11836 7834055 6978941 6007228 4945486 3815129 2637879 1441940 267087 -834093
11828 -834093 -1799354 -2562192 -3058720 -3238271 -3078282 -2597130 -1854860 -937284 69578
11819 69578 1100584 2117506 3101278 4041376 4931909 5773680 6574270 7342341 8081287
11810 8081287 8788816 9461307 10095560 10683638 11204489 11619676 11877777 11926827 11730698 11284081
11800 11284081 10621445 9817119 8975297 8210776 7624699 7283140 7206115 7369457 7716104
11791 7716104 8171365 8657911 9107066 9463229 9680977 9719658 9543275 9129559 8483360 7644279
11781 7644279 6682808 5688787 4760251 3994823 3478753 3270913 3388475 3804723 4461587
11772 4461587 5289071 6221756 7208105 8212608 9211435 10183117 11098772 11917257 12587482
11763 12587482 13056415 13280605 13239902 12951162 12477123 11924485 11427625 11119982 11101549 11414261
11753 11414261 12034450 12883966 13853572 14828439 15706681 16406703 16865652 17036469 16891059
11744 16891059 16430895 15698499 14780937 13801299 12900884 12217156 11860714 11893674 12314223
11735 12314223 13053898 13990729 14974619 15857112 16518301 16886204 16945144 16731095 16315437
11726 16315437 15782583 15207851 14640142 14092209 13540500 12934785 12214481 11327002 10245092
11717 10245092 8981861 7600633 6213674 4964963 3998895 3423914 3282290 3534792 4065924
11708 4065924 4711726 5304682 5720043 5903601 5869826 5676435 5393045 5079105 4775208 4503189
11698 4503189 4269380 4069070 3893311 3738764 3617006 3555388 3583380 3708302 3894989 4064076
11688 4064076 4112028 3943241 3500941 2788351 1876237 893757 649 -654771 -977727 -950736
11678 -950736 -627859 -104440 518889 1158887 1752907 2251281 2612500 2808298 2835709 2726973
11668 2726973 2548267 2383326 2306621 2358962 2539866 2821595 3174631 3585432 4053491 4571098
11658 4571098 5101928 5573578 5888018 5944256 5665239 5022381 4050722 2847137 1548552
11649 1548552 296522 -798032 -1676842 -2337547 -2821335 -3192459 -3516633 -3842740 -4191121
11640 -4191121 -4552312 -4898404 -5202779 -5456816 -5672215 -5867362 -6048085 -6197068 -6279241 -6258926
11630 -6258926 -6117279 -5860146 -5515402 -5126975 -4752339 -4461157 -4325800 -4399572 -4692408 -5161236
11620 -5161236 -5724040 -6290280 -6790952 -7194841 -7506984 -7753214 -7959003 -8132296 -8257579
11611 -8257579 -8301986 -8228476 -8010043 -7640785 -7140153 -6546655 -5901551 -5231055 -4539093 -3815855
11601 -3815855 -3055585 -2271113 -1496124 -773795 -136470 414987 921541 1457727 2105424
11592 2105424 2920726 3909458 5021523 6163811 7222997 8087860 8664871 8886621 8715716
11583 8715716 8145591 7197203 5910574 4333415 2512130 489882 -1687933 -3965535
11575 -3965535 -6273236 -8533617 -10675816 -12649166 -14426080 -15991346 -17325789 -18396723
11567 -18396723 -19162132 -19585969 -19656595 -19400050 -18880592 -18183461 -17383438 -16514656 -15560049
11558 -15560049 -14466259 -13172675 -11637737 -9854063 -7853361 -5704203 -3504746 -1373405
11550 -1373405 560493 2169790 3352362 4060771 4322571 4234842 3932610 3548160 3181204
11541 3181204 2889134 2694182 2598212 2596228 2683208 2853445 3095520 3388090 3701170 4004356
11531 4004356 4278036 4519888 4740930 4952404 5150886 5310203 5385721 5331265 5121514 4766444
11521 4766444 4306849 3793203 3263490 2735522 2216495 1720859 1286275 981649 903016 1153789
11511 1153789 1811798 2895354 4344872 6030004 7779420 9420017 10809678 11852624
11503 11852624 12496426 12719425 12520593 11918424 10956252 9706114 8264969 6742589 5245064
11494 5245064 3859171 2641111 1610404 749026 7679 -678286 -1365380 -2079972 -2808260
11485 -2808260 -3501492 -4091240 -4507869 -4698948 -4645556 -4371203 -3937104 -3423515 -2905616 -2435979
11475 -2435979 -2041038 -1730075 -1508633 -1387284 -1381196 -1502044 -1747703 -2095605 -2503028 -2913003
11465 -2913003 -3260817 -3477724 -3495198 -3256704 -2736594 -1953457 -963806 163404 1374289
11456 1374289 2641084 3952586 5294964 6637794 7933360 9127176 10171489 11034416
11448 11034416 11703535 12187533 12517886 12747680 12943227 13168389 13466680 13848482 14289308
11439 14289308 14740771 15149572 15475334 15699853 15826953 15877118 15880787 15871462 15878766 15922199 16006948
11428 16006948 16123222 16249689 16359244 16423470 16414032 16303784 16071642 15710905 15235841 14682022
11418 14682022 14100716 13551154 13094297 12789272 12690081 12837919 13246874 13888626 14687349
11409 14687349 15531302 16295719 16865260 17149173 17090504 16671712 15914863 14874658 13628362
11400 13628362 12268725 10898741 9619345 8505579 7581440 6811731 6119379 5417803 4639029
11391 4639029 3746146 2731946 1610552 405003 -868249 -2211837 -3645627 -5184825
11383 -5184825 -6808648 -8442715 -9971972 -11278502 -12280343 -12950073 -13309595 -13410647 -13310604
11374 -13310604 -13049897 -12639522 -12068311 -11329703 -10452156 -9512468 -8622879 -7899793 -7430649
11365 -7430649 -7253341 -7354876 -7687493 -8193917 -8831313 -9585637 -10472089 -11521608 -12758366
11356 -12758366 -14177571 -15732650 -17336076 -18873480 -20228656 -21313835 -22093923 -22592417
11348 -22592417 -22876527 -23032345 -23144332 -23284232 -23504463 -23830131 -24250257 -24714114 -25138479
11339 -25138479 -25426451 -25490700 -25268960 -24724022 -23833390 -22583933 -20982916 -19081217 -16990986
11330 -16990986 -14879535 -12933772 -11307231 -10074350 -9215706 -8642129 -8244209 -7941118 -7706284
11321 -7706284 -7562839 -7558362 -7737244 -8125572 -8731006 -9548616 -10562663 -11742210 -13035384
11312 -13035384 -14367375 -15645225 -16771894 -17668990 -18299469 -18676245 -18849101 -18876301 -18795338
11303 -18795338 -18604179 -18258262 -17685734 -16819637 -15635903 -14176963 -12544545 -10863429 -9237266
11294 -9237266 -7722134 -6330252 -5056036 -3904578 -2905441 -2106983 -1557611 -1284418 -1277360
11285 -1277360 -1482363 -1803385 -2113367 -2275861 -2177037 -1759259 -1039674 -101474 938443
11276 938443 1967535 2903209 3698302 4329230 4775442 5002127 4958482 4596783 3903724 2924610
11266 2924610 1762843 552162 -582594 -1552597 -2305689 -2806140 -3012780 -2872099 -2329101
11257 -2329101 -1348130 65703 1851802 3892363 6027266 8082341 9901105 11369428
11249 11369428 12427510 13069182 13332095 13284016 13010079 12603464 12159248 11769145 11513788
11240 11513788 11449791 11593630 11911345 12324420 12733311 13047842 13209702 13199137 13027432 12722166
11230 12722166 12313186 11825855 11283779 10717005 10168451 9693795 9354838 9209419 9301926
11221 9301926 9658188 10286056 11178732 12316417 13665229 15175544 16780422 18393342 19909662
11212 19909662 21222159 22254325 22995859 23513254 23921337 24329672 24794244 25297083 25756673
11203 25756673 26059325 26099955 25820823 25234491 24419270 23487813 22545366 21659202 20849671
11194 20849671 20097532 19357003 18571226 17693274 16710852 15662217 14629793 13711390 12984605
11185 12984605 12482890 12191164 12057034 12009877 11982128 11928196 11835693 11725554 11642922 11644419
11175 11644419 11785650 12108949 12630844 13332408 14158438 15029371 15863108 16596786 17195899
11166 17195899 17643889 17917640 17964728 17698676 17018514 15846284 14166973 12051830 9650352
11157 9650352 7151001 4729920 2515137 581211 -1033428 -2306387 -3221979 -3772449
11149 -3772449 -3962645 -3812409 -3354145 -2625161 -1657729 -473766 909091 2459900 4114048
11140 4114048 5762528 7258871 8442352 9168790 9339025 8918397 7943933 6517570 4785923
11131 4785923 2911300 1042652 -704960 -2258451 -3584411 -4682184 -5577467 -6317246
11123 -6317246 -6962058 -7571156 -8182621 -8799184 -9392107 -9924863 -10382758 -10788614 -11195477
11114 -11195477 -11664930 -12246756 -12967432 -13824306 -14782305 -15777171 -16729473 -17564059 -18223006
11105 -18223006 -18666571 -18869146 -18820514 -18533767 -18051281 -17440226 -16777682 -16132961 -15555090
11096 -15555090 -15068651 -14676556 -14366707 -14118924 -13908125 -13701288 -13450975 -13093672 -12560125
11087 -12560125 -11796342 -10785214 -9558206 -8193861 -6807654 -5539277 -4538658 -3946742
11079 -3946742 -3868113 -4341313 -5321372 -6686829 -8269406 -9891156 -11393960 -12657366 -13609926
11070 -13609926 -14238309 -14591994 -14777107 -14934064 -15199898 -15665937 -16349183 -17192034 -18088832
11061 -18088832 -18921910 -19589233 -20018874 -20176040 -20065695 -19726289 -19211827 -18570429 -17833402
11052 -17833402 -17021225 -16159601 -15293312 -14490086 -13833085 -13403823 -13260113 -13418222 -13849718
11043 -13849718 -14496518 -15295541 -16196939 -17163725 -18153250 -19093746 -19873116 -20349703 -20381582
11034 -20381582 -19861873 -18747037 -17069848 -14934096 -12493978 -9927474 -7414754 -5125944
11026 -5125944 -3212601 -1794814 -943305 -664477 -897677 -1528488 -2415087 -3419021 -4428563
11017 -4428563 -5365497 -6175769 -6814300 -7235516 -7393957 -7252348 -6793850 -6036396 -5044185
11008 -5044185 -3927208 -2822662 -1863801 -1151713 -743318 -656301 -881564 -1394438 -2163110
10999 -2163110 -3156318 -4349099 -5721392 -7246766 -8876452 -10529934 -12100893 -13477747
10991 -13477747 -14568967 -15321733 -15728206 -15820753 -15660548 -15323409 -14885879 -14414214 -13957745
10982 -13957745 -13545644 -13184308 -12854007 -12507692 -12078326 -11498852 -10729318 -9775627 -8684905
10973 -8684905 -7517098 -6309962 -5059429 -3725853 -2260695 -639884 1109448 2898489
10965 2898489 4587126 6012105 7021988 7506068 7410439 6742224 5566388 3998092 2191384
10956 2191384 323827 -1423697 -2891786 -3967629 -4601515 -4806493 -4641639 -4189500 -3540088
10947 -3540088 -2785021 -2014962 -1311431 -731739 -295362 17691 253007 459395 670084
10938 670084 895133 1123641 1329523 1477353 1529896 1459921 1265006 979355 674778 445967
10928 445967 383805 550274 969785 1639451 2545662 3672253 4998498 6495971 8129387
10919 8129387 9856193 11619567 13340191 14918284 16249795 17248527 17862659 18080435 17926688
10910 17926688 17454149 16732635 15837871 14840316 13794469 12731688 11661337 10581320 9491759
10901 9491759 8402756 7332533 6299707 5316159 4385448 3509889 2705657 2017477 1518732
10892 1518732 1289396 1381702 1795299 2476929 3340999 4295120 5257229 6160955 6952618 7584834
10882 7584834 8011635 8189722 8087670 7699961 7058435 6233565 5321521 4419202 3595989
10873 3595989 2874704 2231371 1614035 971018 275624 -461651 -1196111 -1865647 -2416668
10864 -2416668 -2830155 -3136241 -3409068 -3742563 -4216448 -4866177 -5669369 -6554171 -7423718
10855 -7423718 -8182637 -8754688 -9091881 -9181654 -9052473 -8768977 -8410099 -8037041 -7668434 -7275948
10845 -7275948 -6799705 -6172396 -5341759 -4288045 -3036065 -1657295 -255213 1064345 2222023
10836 2222023 3175288 3908524 4418595 4710575 4801589 4719574 4490375 4121190 3594265 2877791
10826 2877791 1948933 815797 -474152 -1842585 -3197775 -4449250 -5513831 -6315822
10818 -6315822 -6787168 -6871101 -6530187 -5757706 -4587537 -3094200 -1377147 466420 2365635
10809 2365635 4282106 6195422 8080281 9892050 11568061 13038234 14234326 15093944
10801 15093944 15563770 15607081 15215082 14416204 13276528 11887850 10346576 8733048 7101476
10792 7101476 5483412 3898473 2363042 892209 -503028 -1817394 -3046605 -4176139
10784 -4176139 -5170788 -5975885 -6534990 -6815946 -6829585 -6631163 -6307841 -5961921 -5694456 -5586784
10774 -5586784 -5679451 -5956512 -6345954 -6738804 -7018229 -7085899 -6877261 -6364029 -5547211 -4446838
10764 -4446838 -3095041 -1536639 162588 1904118 3550589 4938371 5916515 6402418
10756 6402418 6426582 6137951 5761606 5526496 5594750 6020368 6749460 7655136 8586799 9413273
10746 9413273 10049802 10469203 10699271 10806473 10868590 10945574 11060198 11194793 11302596 11328090
10736 11328090 11230111 11001219 10675964 10322553 10019724 9830169 9784699 9882740 10101970 10405554
10726 10405554 10742746 11047705 11243300 11252162 11012153 10489794 9684356 8619916 7331137
10717 7331137 5853108 4221200 2478907 687665 -1067802 -2685282 -4065440 -5140156
10709 -5140156 -5892718 -6356816 -6595342 -6671533 -6625227 -6461537 -6155319 -5671208 -4991864 -4140238
10699 -4140238 -3182924 -2213029 -1325021 -599504 -106854 79319 -120834 -773146 -1894303
10690 -1894303 -3426399 -5242247 -7182760 -9106983 -10927753 -12615524 -14172905 -15599583
10682 -15599583 -16870233 -17936344 -18746645 -19271093 -19513667 -19506851 -19290900 -18889699 -18297991
10673 -18297991 -17489975 -16447498 -15192830 -13804933 -12406096 -11124904 -10057580 -9249764
10665 -9249764 -8705223 -8410322 -8355505 -8539828 -8956707 -9571078 -10303389 -11031075 -11607620 -11890888
10655 -11890888 -11769869 -11180869 -10109450 -8582511 -6660856 -4438748 -2044551 371197
10647 371197 2666587 4747152 6591007 8243552 9781739 11264687 12694745 14007555
10639 14007555 15094558 15845104 16186486 16103425 15631903 14837764 13797215 12589273 11296373
10630 11296373 10002768 8786328 7709002 6812673 6120377 5637679 5351693 5231686 5237308
10621 5237308 5335087 5514919 5793892 6200392 6745170 7397419 8082474 8703684 9175601 9450678
10611 9450678 9528095 9443204 9242814 8955457 8569297 8030912 7270503 6243431 4964968
10602 4964968 3516540 2018896 588637 -696667 -1808425 -2753865 -3553965 -4225942 -4775325
10593 -4775325 -5196333 -5477948 -5612535 -5602014 -5457388 -5193163 -4823641 -4366575 -3852392 -3331451
10583 -3331451 -2872353 -2549875 -2427878 -2546325 -2919055 -3541156 -4397681 -5465592 -6707374
10574 -6707374 -8061816 -9440091 -10732728 -11826667 -12625336 -13064062 -13119162 -12813631 -12219009
10565 -12219009 -11446841 -10625724 -9871237 -9263009 -8837028 -8589535 -8484207 -8458952 -8434922 -8331311
10555 -8331311 -8085713 -7674174 -7121897 -6497445 -5891012 -5386268 -5039299 -4873557 -4889038 -5074717
10545 -5074717 -5413376 -5877355 -6423030 -6991565 -7515470 -7925164 -8152274 -8131449 -7803292 -7118758
10535 -7118758 -6044738 -4571821 -2724459 -569560 1784165 4201659 6548325 8715336
10527 8715336 10630221 12250613 13551587 14518360 15146660 15445238 15436962 15160421 14673233
10518 14673233 14052470 13386247 12757233 12226009 11821115 11534898 11320358 11090557 10730466
10509 10730466 10127684 9212261 7984202 6514362 4922919 3349861 1927266 755229
10501 755229 -117790 -706435 -1087943 -1389314 -1766277 -2381876 -3391592 -4934169 -7118539
10492 -7118539 -9998496 -13537775 -17577940 -21824773 -25870056 -29261436 -31611484 -32703736
10484 -32703736 -32540852 -31310536 -29295479 -26779856 -23991223 -21086637 -18170886 -15326403
10476 -15326403 -12633957 -10171595 -7995328 -6117980 -4502640 -3076709 -1760153 -493521
10468 -493521 748554 1962562 3130841 4231970 5241309 6127662 6855238 7394077 7734578
10459 7734578 7898353 7939161 7931908 7952242 8052637 8243750 8490524 8727031 8882671 8904920
10449 8904920 8768943 8476234 8049543 7527225 6956437 6386213 5862370 5423131 5093401
10440 5093401 4879620 4769353 4735625 4741865 4745785 4704863 4585172 4371521 4075779 3740687
10430 3740687 3434645 3233393 3192768 3326279 3600074 3945259 4277221 4512801 4583959 4450677
10420 4450677 4113490 3621385 3068596 2575754 2257123 2183330 2353548 2689378 3055026 3297825
10410 3297825 3294199 2983359 2376846 1543946 583805 -401686 -1325424 -2121967 -2746785 -3170339
10400 -3170339 -3369654 -3322668 -3010471 -2425190 -1573690 -470335 875140 2461078 4282683
10391 4282683 6314509 8500938 10761830 13008779 15160776 17150352 18919985 20416569
10383 20416569 21591407 22405563 22835035 22873467 22535308 21860445 20915207 19784735 18559479
10374 18559479 17323985 16152544 15109021 14245298 13595507 13167599 12936817 12846006 12814920
10365 12814920 12756475 12595373 12284491 11814484 11212272 10527052 9808346 9084729 8351174
10356 8351174 7569712 6684942 5651664 4464973 3177984 1895787 746718 -154978 -737413
10347 -737413 -980432 -908932 -580061 -72413 521250 1100230 1563446 1819136 1796751 1459306
10337 1459306 812221 -95395 -1177319 -2321534 -3403692 -4302866 -4919785 -5194255 -5115748
10328 -5115748 -4722691 -4090901 -3315973 -2495729 -1717287 -1050562 -547156 -241458 -150480 -271560
10318 -271560 -581268 -1039872 -1601572 -2225247 -2880544 -3549918 -4230713 -4937471 -5697910 -6535856
10308 -6535856 -7443536 -8357055 -9152860 -9674701 -9783363 -9406022 -8560562 -7344921 -5901360
10299 -5901360 -4375592 -2886757 -1514491 -301558 734520 1590608 2276143 2820427 3279613
10290 3279613 3732406 4261161 4925463 5740485 6670585 7641338 8563732 9357832 9965103
10281 9965103 10348213 10486697 10377503 10040997 9524318 8893931 8218358 7551302 6925677
10272 6925677 6360141 5870213 5474427 5191678 5032519 4990247 5037573 5132123 5228574 5289848
10262 5289848 5290623 5214345 5051580 4804910 4496530 4170048 3882104 3686852 3619769 3686384
10252 3686384 3859143 4083257 4289596 4410438 4392991 4206232 3839078 3293261 2579129 1720754
10242 1720754 766746 -205602 -1102256 -1837044 -2355990 -2650836 -2760076 -2760582 -2751422 -2830328
10232 -2830328 -3066902 -3481539 -4039390 -4662976 -5258448 -5743934 -6067940 -6211795 -6178734 -5977552
10222 -5977552 -5608900 -5060189 -4312717 -3359611 -2225116 -971245 315485 1550061 2671788
10213 2671788 3652922 4494251 5215745 5848414 6428488 6992469 7571868 8187765 8846743
10204 8846743 9540322 10248398 10944514 11599862 12184904 12670410 13031194 13254927 13354370 13375471
10194 13375471 13391268 13477993 13682604 13999534 14370343 14706739 14924677 14972506 14840183 14547853
10184 14547853 14124595 13593018 12967765 12263003 11498772 10701780 9903638 9139692 8447326
10175 8447326 7861510 7408092 7097446 6920979 6852871 6858367 6905521 6972516 7044625 7103964 7121854
10164 7121854 7061018 6886885 6582144 6157716 5653895 5128869 4639839 4228305 3917502 3718962
10154 3718962 3639887 3688543 3881261 4250949 4848599 5729827 6930574 8446775 10230004
10145 10230004 12197844 14247722 16265133 18127577 19712749 20916004 21671590 21965257
10137 21965257 21829888 21327639 20531197 19515089 18356901 17138110 15935598 14806598
10129 14806598 13778861 12852782 12009356 11213667 10414250 9549619 8569178 7460457 6266010
10120 6266010 5079542 4022857 3211700 2719511 2549476 2626251 2813777 2953668 2907914
10111 2907914 2588816 1968286 1069969 -46548 -1301508 -2607258 -3877501 -5035505 -6021894
10102 -6021894 -6799557 -7351957 -7675068 -7769406 -7639627 -7301933 -6790778 -6155284 -5443979 -4686833
10092 -4686833 -3888242 -3039486 -2146788 -1258725 -474171 77876 279097 64377 -553786
10083 -553786 -1490047 -2617294 -3809048 -4974960 -6077921 -7131342 -8181858 -9285679
10075 -9285679 -10487430 -11806787 -13231141 -14709839 -16151786 -17435306 -18434863 -19056343
10067 -19056343 -19265208 -19096291 -18642752 -18027887 -17368747 -16745512 -16189015 -15688315 -15209392
10058 -15209392 -14713727 -14169816 -13555315 -12851621 -12037632 -11090506 -9994842 -8753093 -7389105
10049 -7389105 -5943367 -4464034 -2997430 -1580130 -235585 1021505 2174504 3194989
10041 3194989 4040673 4661467 5008600 5043391 4746809 4130479 3243958 2170756 1011898
10032 1011898 -135453 -1194969 -2119373 -2890033 -3509543 -3990875 -4349448 -4602954 -4777368
10023 -4777368 -4911910 -5056051 -5255730 -5531457 -5858025 -6160856 -6339297 -6310772 -6053403 -5623599
10013 -5623599 -5139829 -4741707 -4542960 -4596397 -4883193 -5330197 -5847592 -6368044 -6865392 -7343172
10003 -7343172 -7805365 -8235004 -8597149 -8859886 -9013484 -9074985 -9080672 -9075193 -9101142 -9187472 -9336560
9992 -9336560 -9515528 -9659739 -9690550 -9539112 -9163530 -8554411 -7735042 -6762424 -5724569 -4724866
9982 -4724866 -3855651 -3176486 -2709931 -2451711 -2382287 -2472072 -2682910 -2971861 -3298987 -3635527
9972 -3635527 -3967211 -4290466 -4604676 -4907096 -5194242 -5466737 -5730681 -5991965 -6247044 -6477034
9962 -6477034 -6648784 -6720561 -6647927 -6388321 -5906187 -5179668 -4206807 -3007958 -1622235 -98084
9952 -98084 1518063 3186912 4869369 6512690 8043689 9377306 10434651 11159086 11525953
9943 11525953 11547601 11272910 10778839 10156696 9499768 8894237 8410047 8091149 7949364 7964526
9933 7964526 8089512 8259601 8407434 8481196 8458674 8351822 8202592 8073108 8032304 8141545
9923 8141545 8442652 8950297 9649276 10497791 11437051 12405400 13357042 14288824 15272058 16472260
9913 16472260 18138765 20566474 24051888 28864172 35237617 43382898 53510591 65855399
9905 65855399 80690396 98329231 119113437 143365152 171275646 202713442 236961301
9898 236961301 272435508 306532222 335832981 356820926 366935163 365446849 353642921
9891 353642921 334228778 310349477 284763088 259446894 235589096 213775354 194211440
9884 194211440 176898144 161730642 148538381 137104924 127193606 118575519 111046926
9877 111046926 104434816 98598091 93428956 88853346 84825542 81311921 78266393 75612090
9869 75612090 73244580 71055920 68963160 66926126 64950585 63079505 61375346 59897162
9861 59897162 58678103 57708171 56926652 56229689 55495437 54619528 53545734 52278936 50876386
9852 50876386 49421814 47993579 46641120 45378797 44194064 43059661 41943603 40817405
9844 40817405 39662430 38470387 37236146 35948386 34587384 33134941 31591689 29988235
9836 29988235 28377573 26809998 25307919 23858327 22424019 20960715 19430580 17812981
9828 17812981 16113707 14367011 12625471 10942634 9359159 7898141 6567627 5366690
9820 5366690 4293639 3355205 2573323 1985096 1634093 1556456 1769199 2265837 3017553 3974437
9810 3974437 5065851 6205134 7302439 8281467 9091603 9711201 10144602 10417376 10571068
9801 10571068 10655619 10718246 10790566 10877574 10951066 10948504 10779520 10344214 9564820 8423804
9791 8423804 6993532 5442503 4011099 2961213 2514712 2801592 3835228 5519571 7679266
9782 7679266 10097904 12552922 14842214 16802677 18323198 19353377 19905198 20042686 19858873
9773 19858873 19447181 18877541 18183591 17361881 16382392 15209080 13824969 12250451 10543999
9764 10543999 8784407 7045936 5381304 3819670 2374929 1053986 -141693 -1219963
9756 -1219963 -2200819 -3113151 -3986791 -4846298 -5710500 -6593761 -7500565 -8411601 -9271222 -9989740
9746 -9989740 -10464824 -10612966 -10396294 -9834054 -8996087 -7982440 -6897128 -5824850 -4817515
9737 -4817515 -3893390 -3046838 -2262467 -1526866 -834789 -191221 388426 880366 1257879 1498804
9727 1498804 1592138 1542767 1375200 1135424 887495 703049 646290 759233 1050995 1494073
9717 1494073 2030531 2588433 3102244 3525985 3831626 3997052 3996915 3806114 3412725 2828957
9707 2828957 2093061 1264336 415272 -379366 -1056600 -1576009 -1918969 -2077208 -2042060 -1805077
9697 -1805077 -1369785 -765002 -49398 697594 1396464 1992347 2474049 2879567 3284655 3775924
9687 3775924 4416226 5216440 6127992 7060125 7911647 8600801 9083114 9356797 9458923 9453101
9677 9453101 9408373 9373733 9358867 9331248 9230857 8993427 8570430 7940010 7110134 6117026
9667 6117026 5019634 3889010 2792647 1777545 860504 34866 -705761 -1340489 -1811213
9658 -1811213 -2039649 -1961257 -1553848 -843053 117912 1281435 2630890 4181165 5952336
9649 5952336 7932313 10051632 12184748 14175514 15872711 17159979 17970024 18280891 18100591
9640 18100591 17452573 16373394 14923533 13199988 11336465 9486805 7799323 6392586
9632 6392586 5337798 4648856 4282038 4147151 4127961 4105927 3981754 3690441 3205662 2532599
9622 2532599 1695986 733446 -303363 -1347414 -2322563 -3156416 -3793255 -4202669 -4382565
9613 -4382565 -4354925 -4153579 -3808082 -3331420 -2717536 -1950352 -1022417 42733 1175196
9604 1175196 2260933 3164242 3762397 3978868 3802921 3288715 2534231 1648780 723609
9595 723609 -180832 -1026103 -1773494 -2365957 -2729845 -2796256 -2523869 -1903828 -945329 340224
9585 340224 1938970 3818546 5911604 8113005 10292892 12318491 14076085 15488043
9577 15488043 16523321 17201128 17586216 17773404 17861531 17923320 17982156 18005463 17918296 17633887
9567 17633887 17092304 16293966 15313391 14284304 13359934 12665408 12263871 12150847 12276694
9558 12276694 12582868 13031273 13611246 14323542 15155950 16069427 17003314 17892576 18683085
9549 18683085 19337169 19831982 20156814 20311401 20303778 20148374 19868327 19503686 19119654 18804603
9539 18804603 18651791 18728928 19047959 19549056 20107571 20562625 20755672 20563560 19917131 18807363
9529 18807363 17285196 15455043 13455719 11427526 9477907 7665511 6012809 4536528
9521 4536528 3271055 2266084 1561932 1165027 1044911 1154383 1455011 1927517 2560296
9512 2560296 3326070 4164614 4984859 5685898 6182567 6418877 6364810 6007490 5350312 4421577
9502 4421577 3281622 2017964 728867 -495217 -1583304 -2486771 -3178353 -3653218 -3933176
9493 -3933176 -4068708 -4131603 -4196071 -4314903 -4502479 -4733849 -4959752 -5128035 -5199933 -5156714
9483 -5156714 -5001047 -4759228 -4484131 -4252109 -4147472 -4235284 -4531360 -4982499 -5467975 -5825576
9473 -5825576 -5894778 -5561239 -4785949 -3610476 -2142020 -529597 1059860 2465048 3556438
9464 3556438 4261609 4579218 4573741 4354555 4050642 3789741 3683538 3817106 4242171 4975462
9454 4975462 6002736 7286399 8772090 10390005 12051893 13650948 15072122 16213016
9446 16213016 17007048 17437891 17537784 17369111 16996821 16465520 15793799 14987571 14061401 13052453
9436 13052453 12018099 11019518 10102079 9284866 8565119 7932607 7382492 6918774 6549400
9427 6549400 6279120 6104337 6011108 5977241 5978952 5998465 6025255 6047353 6039639 5962673 5778928
9416 5778928 5477002 5084337 4656558 4250721 3901919 3617379 3386217 3192444 3020721 2853891
9406 2853891 2669146 2440503 2149698 1800611 1429525 1105742 920410 963745 1294721 1914227
9396 1914227 2756368 3705599 4632444 5429446 6030594 6409150 6561205 6487788 6185071 5643848
9386 5643848 4853822 3809602 2519745 1019745 -616304 -2274837 -3817571 -5107500
9378 -5107500 -6036080 -6543172 -6626369 -6340068 -5786258 -5099362 -4427188 -3909420 -3655261 -3724046
9368 -3724046 -4115333 -4774294 -5611772 -6530157 -7443811 -8288321 -9020517 -9613846 -10052148 -10324111
9358 -10324111 -10421425 -10341768 -10093097 -9694140 -9171005 -8555711 -7891509 -7242029 -6694784 -6351035
9348 -6351035 -6302538 -6604291 -7255101 -8193803 -9312070 -10478661 -11566213 -12471070 -13120828
9339 -13120828 -13472380 -13509150 -13243514 -12721241 -12019040 -11230189 -10442604 -9719104 -9087149 -8538403
9329 -8538403 -8033323 -7506724 -6875781 -6055632 -4983577 -3643377 -2076638 -374826 1343188
9320 1343188 2957739 4371212 5523285 6396318 7010454 7412002 7661323 7824231 7965752
9311 7965752 8143079 8397543 8749594 9200796 9741338 10355696 11019608 11689828 12296906 12751343
9301 12751343 12964032 12871611 12454752 11742767 10804954 9732643 8616205 7521837 6475404
9292 6475404 5462105 4445813 3400602 2337304 1309773 398406 -318972 -795660 -1035146
9283 -1035146 -1096092 -1081230 -1112550 -1301040 -1721663 -2400765 -3317601 -4417811 -5633536 -6901797
9273 -6901797 -8173135 -9409107 -10575106 -11636071 -12556370 -13299626 -13825920 -14089588 -14042451
9264 -14042451 -13642756 -12865193 -11707291 -10191142 -8361563 -6281280 -4023699 -1665590
9256 -1665590 717541 3053489 5275619 7326402 9159544 10738642 12035480 13033130
9248 13033130 13733956 14165962 14380869 14442935 14412403 14328944 14201222 14008531 13715509 13292252
9238 13292252 12728449 12036809 11251070 10425551 9635128 8967750 8505725 8302951 8370811 8679435
9228 8679435 9170208 9770280 10402987 10993942 11475553 11793460 11917550 11856033 11663540 11431116
9218 11431116 11254750 11194977 11248519 11345968 11374987 11218388 10793919 10083127 9139036 8069300
9208 8069300 7002012 6048485 5276497 4700856 4291402 3993596 3753576 3538449 3345066
9199 3345066 3195562 3123072 3154191 3295919 3533202 3837637 4180644 4541582 4906652 5262943
9189 5262943 5594317 5880410 6095353 6205653 6171706 5956103 5535589 4911658 4118413 3227064
9179 3227064 2341364 1577470 1032306 757157 752516 985040 1412521 2000416 2722492 3550013
9169 3550013 4440948 5338811 6181510 6911550 7479342 7840465 7955565 7799565 7377399 6735787
9159 6735787 5961199 5162566 4446862 3899183 3573727 3493503 3652335 4015403 4520424 5084697
9149 5084697 5620317 6051978 6326252 6406363 6259954 5854130 5162476 4174336 2896671 1352119
9139 1352119 -417521 -2344088 -4333932 -6281180 -8082777 -9644481 -10881532 -11726187
9131 -11726187 -12144727 -12152123 -11810638 -11210276 -10441275 -9572400 -8643178 -7668585 -6647960 -5570569
9121 -5570569 -4417011 -3161482 -1779342 -259441 1384261 3108672 4849330 6537823
9113 6537823 8120005 9564777 10859982 12002125 12991048 13834744 14558562 15207405 15835368
9104 15835368 16488327 17190079 17937345 18701091 19430409 20059172 20517002 20742561 20694744 20359690
9094 20359690 19754231 18925333 17942577 16882361 15808253 14756574 13735158 12735902 11752823
9085 11752823 10793380 9875965 9016674 8214977 7446374 6664890 5814194 4843701 3723486
9076 3723486 2451784 1053636 -424939 -1922370 -3366267 -4680190 -5792537 -6643348
9068 -6643348 -7184958 -7377733 -7187592 -6591968 -5593973 -4235534 -2597499 -782444 1111547
9059 1111547 3011328 4873334 6673086 8387887 9982254 11402910 12585673 13471091
9051 13471091 14020657 14225445 14105308 13703873 13084802 12328194 11521164 10741039 10038480
9042 10038480 9430534 8906275 8438694 7995111 7543872 7059923 6531739 5969370 5410802
9033 5410802 4921830 4584274 4472060 4623661 5025372 5615541 6307303 7016771 7683042 8273880
9023 8273880 8779208 9198572 9528884 9756945 9858400 9801812 9555133 9092736 8402606 7493161
9013 7493161 6398104 5177501 3913716 2701119 1629339 763536 129659 -287156 -529653
9004 -529653 -648225 -684219 -664069 -604427 -522483 -443770 -402638 -435723 -571716 -819815 -1157921
8993 -1157921 -1523940 -1817158 -1915771 -1709223 -1134883 -204089 994699 2318720 3610911
8984 3610911 4740199 5626353 6243488 6607140 6755043 6730702 6574872 6325259 6020218 5699602
8974 5699602 5398168 5133512 4896936 4655895 4369244 4007008 3563326 3057454 2526566 2017066
8964 2017066 1577448 1251723 1072091 1051412 1177288 1410415 1689345 1940444 2087666 2057972
8954 2057972 1785073 1218017 335525 -842040 -2252336 -3803532 -5393295 -6927234 -8332770
8945 -8332770 -9565797 -10608155 -11456883 -12110921 -12562926 -12800796 -12817098 -12619183 -12232852
8936 -12232852 -11698253 -11063021 -10378086 -9696294 -9069708 -8543279 -8147795 -7897436 -7793835
8927 -7793835 -7831984 -7999906 -8268263 -8576714 -8831222 -8921337 -8751509 -8269522 -7478542 -6431897
8917 -6431897 -5218630 -3947564 -2732902 -1681038 -877482 -373989 -179428 -261673 -566252
8908 -566252 -1047959 -1699464 -2556802 -3672340 -5066926 -6689650 -8411707 -10059175 -11464168
8899 -11464168 -12504915 -13118238 -13288973 -13032502 -12383292 -11392489 -10130994 -8693570 -7200543
8890 -7200543 -5793308 -4619193 -3804268 -3420217 -3458266 -3822281 -4343940 -4813341 -5015785
8881 -5015785 -4768224 -3950688 -2526831 -548369 1856948 4509082 7205065 9749079 11978488
8872 11978488 13780783 15099284 15930137 16314559 16327242 16059532 15599138 15013387 14342912
8863 14342912 13606195 12808564 11948802 11021508 10017958 8928337 7745444 6468501 5106739
8854 5106739 3683400 2239506 835148 -452827 -1535175 -2315215 -2696254 -2594122 -1952867
8845 -1952867 -757096 963101 3131975 5628840 8292125 10933873 13366964 15438002
8837 15438002 17054398 18197046 18914974 19303373 19472366 19517944 19503193 19449733 19336160 19105863
8827 19105863 18690199 18044462 17179520 16168665 15123659 14153893 13331209 12675885 12165319
8818 12165319 11756604 11411737 11117450 10895614 10801700 10909702 11286139 11962891 12921770 14096998
8808 14096998 15389479 16680651 17839973 18731753 19231001 19249456 18760329 17806248 16482970
8799 16482970 14905000 13168639 11328977 9400648 7380581 5279241 3142153 1049753
8791 1049753 -903842 -2642873 -4139836 -5431098 -6608532 -7785198 -9047115 -10413980
8783 -10413980 -11828482 -13177259 -14329557 -15173823 -15638851 -15698115 -15365325 -14689805 -13752759
8774 -13752759 -12658840 -11520168 -10438590 -9494575 -8743876 -8215903 -7909933 -7792408 -7801036
8765 -7801036 -7857879 -7889627 -7850505 -7739603 -7603141 -7518570 -7568538 -7817837 -8300977 -9019649
8755 -9019649 -9946261 -11030949 -12210197 -13414825 -14575986 -15629261 -16516721 -17186412 -17590429
8746 -17590429 -17685486 -17439477 -16843206 -15921331 -14734799 -13370470 -11921372 -10468046 -9071315
8737 -9071315 -7778377 -6634695 -5692620 -5013738 -4667324 -4726423 -5259179 -6313081 -7894903
8728 -7894903 -9953996 -12376539 -14994125 -17605871 -20010236 -22039583 -23587430 -24619591
8720 -24619591 -25168154 -25315540 -25176980 -24883630 -24563616 -24319961 -24209413 -24229063 -24317221 -24372118
8710 -24372118 -24285346 -23978259 -23425606 -22657105 -21739850 -20752676 -19764068 -18821216 -17951936 -17174003
8700 -17174003 -16501806 -15943840 -15494626 -15131052 -14819060 -14526694 -14233841 -13931466 -13611142
8691 -13611142 -13253385 -12825404 -12292364 -11635152 -10861581 -10002781 -9097231 -8171644 -7227500
8682 -7227500 -6238041 -5156722 -3934141 -2536967 -961903 758539 2557335 4339118
8674 4339118 5991092 7400054 8474851 9168632 9491888 9509810 9325610 9058523 8824754
8665 8824754 8723183 8823255 9155324 9709134 10445647 11319444 12300717 13385470 14590485
8656 14590485 15938810 17444601 19102289 20879431 22711246 24498394 26112934 27416305
8648 27416305 28287540 28653725 28511137 27926825 27017577 25914092 24726005 23521951 22329654
8639 22329654 21152154 19992085 18873620 17849807 16987074 16332308 15882323 15576542 15319082
8630 15319082 15018873 14627752 14158338 13672504 13245608 12925969 12711959 12555419 12381574
8621 12381574 12109255 11663819 10986167 10044151 8848262 7466819 6029775 4709173 3674609
8612 3674609 3040882 2836362 3010742 3475727 4152555 5000049 6012208 7192654 8524875
8603 8524875 9958267 11419263 12839254 14178805 15431955 16612050 17734601 18809781
8595 18809781 19842547 20829990 21752198 22564971 23204569 23604179 23711372 23496230 22949160
8586 22949160 22075378 20893339 19438479 17767562 15957407 14095434 12265025 10532023
8578 10532023 8938436 7506528 6252121 5200841 4397988 3905176 3784138 4074920 4777416
8569 4777416 5842523 7175318 8649521 10129487 11493420 12650400 13545470 14152029 14457582
8560 14457582 14453326 14135265 13515582 12634899 11565251 10399233 9227633 8113386 7073796
8551 7073796 6083110 5099252 4103395 3129357 2262927 1609136 1245750 1189186 1389898 1756014
8541 1756014 2189516 2616729 3002761 3349760 3684643 4041984 4446493 4900052 5378787 5842304
8531 5842304 6250492 6579035 6826495 7011007 7158684 7288160 7397874 7462860 7443223 7299685
8521 7299685 7008547 6570400 6010123 5367929 4684707 3989288 3295142 2607438 1934423 1295991
8511 1295991 725586 264492 -50147 -198002 -180735 -15732 276270 679264 1179592 1756154
8501 1756154 2372164 2976646 3517264 3957765 4288384 4520840 4669765 4731832 4675061 4443467
8491 4443467 3972940 3209711 2124833 723128 -952134 -2818740 -4761309 -6645110 -8336766
8482 -8336766 -9727755 -10754851 -11410919 -11740622 -11820521 -11730232 -11526055 -11227687 -10823216 -10290480
8472 -10290480 -9625663 -8864725 -8084252 -7378151 -6821254 -6439754 -6203983 -6044156 -5876282
8463 -5876282 -5622979 -5222214 -4627744 -3810427 -2766943 -1533854 -196350 1120097 2277607
8454 2277607 3162531 3714923 3940887 3907390 3724042 3517529 3406170 3482938 3810598 4424767
8444 4424767 5337298 6536524 7986795 9631191 11398204 13209867 14988463 16661772
8436 16661772 18169726 19474207 20568449 21478937 22255976 22956425 23625952 24286425 24931217
8427 24931217 25529928 26041822 26432567 26685165 26797760 26768159 26573820 26161386 25456339 24390773
8417 24390773 22934455 21113073 19008113 16743405 14464832 12316136 10413830 8827794
8409 8827794 7574379 6623575 5915714 5381046 4957036 4601310 4300219 4072290 3963092
8400 3963092 4028306 4308239 4805338 5477120 6247528 7028135 7737067 8310035 8706030 8911425
8390 8911425 8941088 8831886 8628528 8369063 8078346 7770684 7455744 7141549 6833253 6530235
8380 6530235 6224307 5900185 5537571 5113610 4605620 3995235 3273582 2443941 1518805 514246
8370 514246 -550850 -1646895 -2723079 -3706020 -4514349 -5083905 -5388470 -5442214 -5282996
8361 -5282996 -4950192 -4473452 -3877148 -3191593 -2459605 -1734215 -1070214 -513728 -93531 182731
8351 182731 326744 364605 331439 265686 202681 168867 177820 227446 298955 361752 386204 357200
8339 357200 276469 150195 -26710 -273123 -605246 -1012571 -1445773 -1827429 -2077895 -2137545
8329 -2137545 -1974161 -1581828 -984217 -243710 535096 1216903 1659717 1743129 1395110 611605
8319 611605 -540489 -1943062 -3461735 -4978218 -6405981 -7687693 -8782082 -9650518 -10251492
8310 -10251492 -10544912 -10499685 -10096266 -9324297 -8184095 -6697321 -4920344 -2947835 -899876
8301 -899876 1104155 2974502 4668822 6187775 7549983 8764054 9817922 10689655 11365385
8292 11365385 11848456 12157077 12318117 12362964 12324657 12233013 12106683 11944874 11724443 11407766
8282 11407766 10960215 10367255 9639709 8805359 7896623 6945725 5989517 5075607 4259402
8273 4259402 3588925 3084288 2723091 2439272 2136119 1710575 1084464 233921 -796417
8264 -796417 -1903548 -2955777 -3826935 -4423933 -4706100 -4696080 -4476479 -4167587 -3892607 -3745175
8254 -3745175 -3770054 -3958585 -4255714 -4575086 -4817856 -4890624 -4721395 -4275184 -3567444 -2667652
8244 -2667652 -1686939 -752882 18263 542613 779125 729561 430202 -60672 -675378 -1347473
8234 -1347473 -2019851 -2648793 -3202402 -3655218 -3984467 -4172241 -4212778 -4120126 -3931069 -3699905
8224 -3699905 -3484533 -3327923 -3243151 -3209239 -3178905 -3093556 -2900126 -2566077 -2088840 -1495393
8214 -1495393 -831167 -144275 525446 1147333 1693466 2132606 2431018 2561315 2514117 2303773
8204 2303773 1962507 1526019 1020228 456396 -166727 -859149 -1635139 -2504022 -3456134 -4452926
8194 -4452926 -5431743 -6325478 -7084584 -7687025 -8131672 -8422617 -8556121 -8517928 -8291293 -7870010
8184 -7870010 -7268117 -6520376 -5674498 -4782642 -3899743 -3088839 -2425207 -1989793 -1849152 -2028888
8174 -2028888 -2493894 -3147396 -3851567 -4460547 -4851339 -4944453 -4716627 -4209697 -3530971 -2834884
8164 -2834884 -2284716 -2009377 -2075393 -2482454 -3175796 -4065462 -5049350 -6040124 -6989254 -7894453
8154 -7894453 -8782347 -9674893 -10560342 -11385430 -12069522 -12529229 -12702052 -12563988 -12139452 -11501134
8144 -11501134 -10758619 -10039451 -9469676 -9158262 -9184376 -9584971 -10344402 -11392591 -12616769
8135 -12616769 -13883879 -15063531 -16043122 -16736258 -17091848 -17106226 -16829747 -16356347 -15795344
8126 -15795344 -15239397 -14747040 -14347767 -14060644 -13907262 -13905139 -14045622 -14276108 -14505305 -14632269
8116 -14632269 -14581745 -14325832 -13883609 -13303469 -12639351 -11932868 -11209881 -10491030 -9804902 -9190384
8106 -9190384 -8685663 -8314386 -8080702 -7974287 -7977404 -8067906 -8219588 -8404312 -8597081 -8782102
8096 -8782102 -8958719 -9146598 -9386069 -9726364 -10200098 -10796072 -11451043 -12071681 -12575045 -12920098
8086 -12920098 -13109794 -13167150 -13107969 -12931922 -12636025 -12236430 -11779595 -11334056 -10969623 -10738722
8076 -10738722 -10668897 -10763071 -10998521 -11322448 -11652511 -11891899 -11957827 -11809811 -11460937 -10963611
8066 -10963611 -10375652 -9724205 -8987014 -8100644 -6990052 -5604400 -3945540 -2081745 -142548
8057 -142548 1707233 3308159 4543651 5354830 5728273 5672219 5202361 4345384 3151290
8048 3151290 1699997 94719 -1555107 -3152547 -4624142 -5918382 -6995593 -7820227
8040 -7820227 -8364411 -8621166 -8617078 -8415688 -8110119 -7807522 -7608235 -7585506 -7776300 -8190192
8030 -8190192 -8829735 -9705278 -10832751 -12218127 -13840038 -15637897 -17507541 -19306945 -20874727
8021 -20874727 -22057866 -22738341 -22849628 -22381134 -21373405 -19907802 -18094651 -16063878 -13958843
8012 -13958843 -11929762 -10122974 -8666084 -7651907 -7124848 -7074116 -7437668 -8115879 -8988460
8003 -8988460 -9929640 -10822839 -11576557 -12135546 -12477684 -12596014 -12478438 -12100164 -11434778 -10478255
7993 -10478255 -9273135 -7918575 -6557317 -5342965 -4402480 -3809337 -3573042 -3641662 -3913251
7984 -3913251 -4255304 -4531914 -4634313 -4506188 -4154374 -3640485 -3057572 -2502387 -2053435 -1759638
7974 -1759638 -1638843 -1681782 -1855794 -2105686 -2356474 -2526039 -2547332 -2386591 -2042605 -1526987
7964 -1526987 -841882 26992 1096890 2363525 3781276 5260359 6682915 7929031 8900288
7955 8900288 9533798 9807032 9736205 9370417 8784066 8069663 7329925 6666370 6165874 5891753
7945 5891753 5883311 6159692 6721253 7548253 8603155 9840414 11218968 12707574 14276835
7936 14276835 15881713 17446806 18866993 20026995 20831943 21235647 21256126 20974045 20514663
7927 20514663 20017480 19600930 19331453 19206249 19156091 19068230 18821362 18320108 17518899 16430814
7917 16430814 15120202 13680430 12204559 10763217 9400171 8142179 7009872 6021139
7909 6021139 5189741 4525479 4036445 3729248 3605334 3655714 3857224 4171553 4546800 4920826
7899 4920826 5225627 5393321 5366289 5113150 4646625 4032876 3381891 2817896 2442059 2306169
7889 2306169 2408891 2711145 3157015 3688835 4254435 4810118 5321642 5763283 6116563 6372782
7879 6372782 6541298 6658750 6789807 7013298 7397470 7976688 8741733 9647007 10627781 11616892
7869 11616892 12554249 13389349 14081136 14599308 14928575 15074759 15070148 14974853 14871270 14850576
7859 14850576 14993415 15349637 15922363 16660340 17461297 18187314 18690111 18840242 18552506
7850 18552506 17801283 16622676 15103934 13364867 11538527 9755887 8133203 6758233
7842 6758233 5676412 4883981 4333743 3950842 3649186 3340404 2934913 2342834 1484349
7833 1484349 311567 -1168377 -2884895 -4717677 -6524803 -8170135 -9540660 -10554494
7825 -10554494 -11164652 -11362346 -11180780 -10697522 -10029908 -9317479 -8691394 -8239887 -7983025
7816 -7983025 -7866482 -7776987 -7576046 -7143131 -6414261 -5400319 -4176657 -2849823 -1519220
7807 -1519220 -251706 923797 2006527 3007902 3935598 4781188 5515152 6092233 6465858
7798 6465858 6605669 6511337 6218056 5791946 5317184 4881452 4567931 4456174 4624637 5144696
7788 5144696 6063635 7384784 9056719 10979021 13024444 15069945 17022963 18829218
7780 18829218 20458846 21883781 23066322 23968158 24570266 24885082 24950366 24809537 24492759
7771 24492759 24011678 23371809 22594869 21734991 20874331 20096577 19452766 18940026 18505400
7762 18505400 18070922 17564385 16939959 16182772 15302954 14328103 13297466 12255176 11241545
7753 11241545 10286793 9411059 8627465 7942160 7351723 6844554 6408738 6038956 5733273
7744 5733273 5480533 5249233 4988646 4644463 4182531 3609623 2980056 2382424 1910796 1633253
7734 1633253 1570957 1693527 1928630 2180610 2353431 2373559 2207672 1869686 1413361 911482
7724 911482 428607 -1846 -387390 -770192 -1207283 -1743193 -2384494 -3088552 -3775195 -4357218
7714 -4357218 -4772427 -4999070 -5049436 -4951110 -4729645 -4400683 -3971980 -3451842 -2859225 -2230826
7704 -2230826 -1622078 -1101681 -741427 -603946 -731600 -1139547 -1814010 -2713593 -3770930
7695 -3770930 -4895092 -5978400 -6910193 -7595229 -7970456 -8014381 -7746802 -7220435 -6507953
7686 -6507953 -5688505 -4836937 -4016877 -3276643 -2646466 -2137067 -1740540 -1433130 -1178006 -927920
7676 -927920 -631367 -245340 248648 834351 1463022 2065676 2566836 2893980 2984450 2795258
7666 2795258 2316856 1583641 670526 -327914 -1325901 -2265620 -3118042 -3871581 -4522602 -5075486
7656 -5075486 -5548485 -5976030 -6400910 -6856066 -7342801 -7816698 -8190226 -8351420 -8189710 -7620589
7646 -7620589 -6606258 -5170096 -3399500 -1433992 555539 2387029 3885327 4904737
7638 4904737 5357461 5236927 4621890 3657985 2525387 1404095 445390 -244063 -602513
7629 -602513 -602450 -240229 465898 1471341 2702598 4061828 5437899 6721320 7821645
7620 7821645 8685062 9306334 9727778 10022217 10265105 10507282 10759017 10989105 11136606 11131581
7610 11131581 10921883 10499668 9915863 9272010 8690033 8273161 8075197 8089372 8258690 8501477
7600 8501477 8740491 8923069 9025333 9042101 8970291 8794755 8483982 7999482 7316279 6444567
7590 6444567 5440383 4399037 3434550 2654629 2140548 1936741 2049628 2452266 3092017
7581 3092017 3899817 4799243 5712658 6564133 7283466 7815831 8134492 8246742 8185256 7987874
7571 7987874 7678557 7261973 6734872 6106297 5413048 4720107 4105918 3642570 3382573 3356141
7561 3356141 3573695 4027129 4689594 5517559 6455063 7435271 8378292 9193402 9794983 10129487
7551 10129487 10198535 10064670 9838694 9656049 9648634 9915623 10498871 11371620 12447100 13606371
7541 13606371 14736402 15763112 16664131 17456332 18168600 18817739 19398263 19884713 20240438
7532 20240438 20429435 20429122 20240609 19893780 19447384 18983782 18595010 18358757 18310999 18427569
7522 18427569 18623421 18770069 18725574 18368439 17624973 16481139 14976452 13185765 11198461
7513 11198461 9102266 6974026 4876101 2856269 950901 -807019 -2375280 -3691102
7505 -3691102 -4670377 -5222787 -5278407 -4813673 -3864661 -2522880 -917128 811176 2532897
7496 2532897 4151883 5616578 6917790 8072725 9102774 10015222 10795389 11410803 11826635
7487 11826635 12028273 12040854 11933392 11803179 11749271 11849350 12147446 12649292 13318960 14076353
7477 14076353 14802522 15359948 15626431 15530688 15074051 14328537 13412310 12452631 11550678 10761234
7467 10761234 10092318 9518904 8999151 8487001 7944522 7358555 6756360 6206394 5795348
7458 5795348 5588759 5595451 5755172 5956382 6076854 6030448 5800267 5441698 5050960 4713970
7448 4713970 4464646 4276830 4090217 3847961 3521726 3116728 2664965 2215746 1825096 1542811
7438 1542811 1400510 1407674 1558993 1847986 2276301 2850306 3565175 4385261 5232039 5986809
7428 5986809 6509070 6666598 6369568 5598183 4413765 2948751 1378503 -116802 -1389232
7419 -1389232 -2347187 -2958035 -3230465 -3189111 -2856996 -2252735 -1397462 -321890 931531
7410 931531 2309990 3752392 5192279 6563390 7807206 8878172 9743230 10378000 10765896
7401 10765896 10902781 10802380 10496055 10027319 9447959 8820376 8222672 7748471 7496287
7392 7496287 7549404 7952588 8695388 9711183 10893877 12124091 13292849 14316800 15146570
7383 15146570 15770478 16211585 16515282 16729408 16884302 16982041 17001809 16921314 16743681 16512840
7373 16512840 16306665 16212041 16296208 16586846 17066269 17680981 18364671 19066236 19769670 20497002
7363 20497002 21295483 22215599 23285751 24490372 25762639 27000927 28103987 29004409 29679516
7354 29679516 30135951 30383815 30421841 30243564 29856437 29296091 28623024 27903164 27185023 26487193
7344 26487193 25802721 25117485 24432170 23774783 23195671 22748369 22469560 22371036 22446447 22684678
7334 22684678 23078657 23623590 24306687 25095700 25933455 26741298 27429818 27913927 28130642
7325 28130642 28057341 27723995 27209542 26617278 26036748 25510502 25022744 24513700 23909298 23150744
7315 23150744 22212660 21104966 19859524 18508963 17070334 15544276 13929442 12240816
7307 12240816 10519332 8828537 7242026 5827203 4629630 3661968 2901292 2295421 1774988
7298 1774988 1267272 709701 61617 -688521 -1523207 -2402659 -3274526 -4082697 -4773519 -5299480
7288 -5299480 -5621592 -5712961 -5565007 -5192834 -4632161 -3924192 -3096168 -2152675 -1086568 96830
7278 96830 1359326 2628085 3815389 4849229 5696207 6361459 6865081 7211701 7374760
7269 7374760 7304833 6953705 6298285 5353527 4171938 2832195 1422119 23299 -1296576
7260 -1296576 -2483453 -3493985 -4295519 -4870646 -5223503 -5382209 -5391989 -5299333 -5136343 -4916887
7250 -4916887 -4646235 -4332299 -3985382 -3606885 -3180529 -2677625 -2073931 -1364942 -568435 285855
7240 285855 1169427 2059497 2931767 3750816 4471949 5058838 5506036 5849558 6157549 6506442
7230 6506442 6954773 7525296 8201209 8936054 9669892 10341864 10895222 11279932 11459014 11417149
7220 11417149 11164376 10731664 10162695 9507634 8819607 8150728 7545688 7034258 6626668
7211 6626668 6316522 6092903 5956032 5925458 6033862 6311225 6770740 7402541 8172048 9018206
7201 9018206 9853456 10571594 11066370 11256718 11109605 10650939 9958338 9137109 8288859 7484835
7191 7484835 6751838 6072075 5394274 4651041 3775974 2715736 1437999 -59720 -1738575
7182 -1738575 -3509785 -5237406 -6756718 -7905780 -8562661 -8677270 -8285933 -7502608 -6491387
7173 -6491387 -5432168 -4489473 -3788249 -3398191 -3329253 -3539680 -3953347 -4480515 -5037624 -5563048
7163 -5563048 -6024823 -6417363 -6750216 -7037622 -7295383 -7542419 -7798522 -8074408 -8359909 -8620136
7153 -8620136 -8802468 -8847471 -8695222 -8287071 -7571050 -6516716 -5134233 -3485546 -1679811
7144 -1679811 144702 1844922 3297917 4422997 5195653 5646546 5843469 5863791 5771144
7135 5771144 5607493 5402153 5189719 5024337 4979990 5134010 5540860 6210094 7101225 8138275
7125 8138275 9234540 10312994 11313806 12192003 12914978 13466284 13853558 14112977 14304647
7116 14304647 14499144 14759598 15124323 15594359 16130183 16660724 17103396 17387464 17469979 17338074
7106 17338074 17001029 16481466 15811178 15027711 14164642 13236668 12231039 11115785 9861730
7097 9861730 8463522 6947182 5363733 3776628 2248747 829463 -458042 -1624970
7089 -1624970 -2714320 -3784720 -4884532 -6025793 -7169621 -8231813 -9109461 -9719167 -10030249
7080 -10030249 -10077763 -9950220 -9759226 -9604572 -9546909 -9595674 -9716004 -9852451 -9958311 -10013927
7070 -10013927 -10023992 -9999419 -9939670 -9827995 -9640612 -9362862 -9003541 -8600197 -8211869 -7902413
7060 -7902413 -7723332 -7703852 -7849185 -8143146 -8552263 -9030527 -9523137 -9966908 -10288318 -10404257
7050 -10404257 -10229614 -9690627 -8739752 -7368850 -5618667 -3580682 -1386515 815217 2886596
7041 2886596 4721444 6254035 7458667 8346676 8962971 9378018 9671546 9911771 10141250
7032 10141250 10378360 10632398 10919595 11267223 11702578 12233617 12831735 13426139 13917059
7023 13917059 14208594 14248970 14054808 13700996 13280387 12859142 12454352 12041643 11581092 11044788
7013 11044788 10435567 9792726 9183123 8679736 8336252 8169756 8158240 8249100 8369328 8432833
7003 8432833 8348317 8032394 7426127 6508145 5299936 3864606 2301523 735846 -698831
6994 -698831 -1881683 -2721485 -3162125 -3177633 -2765398 -1946769 -776139 650895 2202854
6985 2202854 3735533 5124314 6289659 7203184 7872390 8313659 8530029 8507773 8233713
6976 8233713 7720883 7025074 6242108 5487545 4867685 4452121 4257357 4248236 4357116 4512019
6966 4512019 4660926 4782804 4883708 4982886 5096702 5227337 5359298 5462483 5498978 5432494
6956 5432494 5240375 4924829 4515073 4053257 3568192 3054180 2473624 1786181 985345 115349
6946 115349 -744918 -1519332 -2166478 -2685725 -3098536 -3424387 -3670767 -3840799 -3946779 -4017178
6936 -4017178 -4095065 -4233046 -4487006 -4906407 -5521365 -6332974 -7313734 -8418127 -9597345
6927 -9597345 -10811931 -12038739 -13269943 -14503222 -15726945 -16909459 -18001086 -18949064
6919 -18949064 -19716003 -20290473 -20685831 -20932281 -21068756 -21135852 -21167049 -21177757 -21156950 -21067307
6909 -21067307 -20855852 -20471770 -19885021 -19099380 -18155618 -17123124 -16080423 -15088214 -14164514
6900 -14164514 -13276025 -12354426 -11330703 -10167796 -8874435 -7497747 -6103984 -4757845
6892 -4757845 -3506977 -2375585 -1368530 -482267 285003 930459 1452275 1859527 2178941
6883 2178941 2451918 2721827 3020472 3364784 3766264 4243734 4826026 5538372 6378106 7294274
6873 7294274 8186189 8926460 9398753 9530624 9305510 8751661 7918387 6854247 5598046
6864 5598046 4184377 2654881 1061727 -542936 -2123612 -3668889 -5181454 -6656738
6856 -6656738 -8065434 -9352689 -10455170 -11323436 -11931666 -12267242 -12312673 -12041540 -11436071
6847 -11436071 -10510043 -9313823 -7916560 -6382447 -4759945 -3086232 -1395297 280047
6839 280047 1911371 3476194 4953213 6312041 7503621 8460962 9117452 9439600 9458364
6830 9458364 9279857 9066846 8998327 9223450 9824399 10796532 12049067 13426459 14746464
6821 14746464 15845555 16618465 17039032 17155086 17059508 16849825 16594483 16320217 16021948
6812 16021948 15683283 15292683 14848733 14357654 13828414 13268566 12684287 12089332 11521885
6803 11521885 11057433 10802812 10868668 11333769 12219517 13484776 15039751 16770546 18563161
6794 18563161 20317054 21945257 23367140 24503764 25281963 25646614 25575820 25091196 24256358
6785 24256358 23162912 21911777 20599776 19314119 18128817 17097034 16240397 15541767
6777 15541767 14947832 14384699 13785377 13121587 12425515 11786795 11321135 11124104 11233440
6768 11233440 11617218 12187793 12827757 13414146 13836685 14012708 13899862 13502564 12866822
6759 12866822 12062196 11157011 10199326 9215192 8224161 7257689 6363865 5595622 4994652
6750 4994652 4583758 4369099 4345808 4502193 4822217 5286376 5869756 6537291 7239716 7916422
6740 7916422 8510187 8991279 9377083 9729680 10126441 10619766 11210830 11850381 12460676 12963916
6730 12963916 13304980 13461724 13441712 13271379 12987827 12638487 12283876 11995279 11845037 11893351
6720 11893351 12175525 12691689 13402248 14233481 15093859 15895249 16571020 17086496 17441016
6711 17441016 17661880 17790879 17867286 17914759 17938529 17931574 17880804 17764909 17545314 17160836
6701 17160836 16535144 15595839 14295954 12630090 10643163 8431672 6135136 3915723
6693 3915723 1929995 302730 -887816 -1611041 -1876486 -1724364 -1217808 -436721 528767
6684 528767 1587289 2658097 3683270 4635311 5516079 6347691 7160917 7987574 8859433
6675 8859433 9809984 10871821 12065645 13385911 14794885 16232882 17639781 18974383
6667 18974383 20221697 21388004 22488626 23532867 24511038 25390275 26122590 26660017 26967184
6658 26967184 27026788 26840926 26431788 25840356 25119970 24325824 23505861 22698306 21936676 21257718
6648 21257718 20704810 20321335 20135377 20143685 20304275 20543298 20776080 20936256 21000890 20997874
6638 20997874 20989415 21039169 21180310 21399960 21644970 21843065 21927274 21852117 21596431 21156680
6628 21156680 20539405 19758163 18833210 17789424 16652207 15445804 14197161 12942124 11727015
6619 11727015 10602086 9610144 8776689 8104682 7572766 7135594 6728377 6279127 5728300
6610 5728300 5049366 4260984 3424264 2624883 1946489 1445991 1141715 1020389 1059244 1249807
6600 1249807 1607338 2157829 2908871 3821726 4802679 5722054 6454357 6920433 7109609 7070600
6590 7070600 6879441 6606491 6300794 5992700 5701797 5439507 5208188 5004780 4830361 4697409
6580 4697409 4627278 4640483 4749214 4957406 5265369 5673499 6183453 6797715 7516650 8331048
6570 8331048 9212004 10105172 10936543 11631075 12137662 12448942 12605205 12678678 12744361 12850046
6560 12850046 12997957 13145731 13227333 13184999 12995078 12672418 12252808 11768705 11235157 10650641
6550 10650641 10006313 9296056 8523319 7702676 6856048 6008425 5189489 4440382 3815775
6541 3815775 3372981 3152370 3163177 3385698 3788802 4352501 5083991 6019815 7212271 8704224
6531 8704224 10502239 12560455 14783213 17044442 19213137 21173881 22838303 24150191
6523 24150191 25088018 25666082 25933592 25970750 25880530 25775158 25759195 25914447 26291663 26909934
6513 26909934 27761348 28818064 30039374 31376010 32770112 34152931 35444650 36558214
6505 36558214 37404866 37899159 37965626 37550956 36640555 35271547 33533229 31551807 29463600
6496 29463600 27385434 25392238 23509642 21723005 19996006 18288366 16566552 14808678
6488 14808678 13007706 11174945 9343281 7568428 5925100 4494611 3345762 2519036
6480 2519036 2024516 1851623 1976355 2354997 2910928 3533176 4097814 4503642 4701253 4698837
6470 4698837 4542452 4281784 3938883 3495879 2908260 2135552 1170340 48596 -1161243
6461 -1161243 -2378447 -3524874 -4529543 -5328732 -5870422 -6126255 -6105033 -5856414 -5457320
6452 -5457320 -4986255 -4501847 -4039343 -3623735 -3285398 -3065655 -3010420 -3157949 -3527296 -4111872
6442 -4111872 -4879577 -5777176 -6735137 -7673531 -8514140 -9198824 -9702882 -10030394 -10193542 -10194398
6432 -10194398 -10026618 -9696257 -9243952 -8749714 -8315099 -8033485 -7966186 -8135214 -8528681 -9105950
6422 -9105950 -9795536 -10492755 -11069959 -11403553 -11408503 -11065481 -10430094 -9620915 -8789072 -8077462
6412 -8077462 -7582486 -7331735 -7284646 -7353185 -7432753 -7433424 -7304790 -7049856 -6724061 -6418015 -6228239
6401 -6228239 -6225860 -6434738 -6826798 -7334928 -7876058 -8373264 -8768938 -9028422 -9138386 -9103596
6391 -9103596 -8943273 -8688083 -8378930 -8066245 -7805753 -7648415 -7627465 -7748364 -7986116 -8291121
6381 -8291121 -8601560 -8857211 -9009013 -9022791 -8880462 -8580820 -8136320 -7562527 -6866097 -6043514
6371 -6043514 -5095226 -4044810 -2947343 -1881173 -931034 -174063 327262 529941 418602
6362 418602 15368 -617294 -1387560 -2195105 -2949501 -3577312 -4020806 -4236981 -4199810 -3900834
6352 -3900834 -3344610 -2543686 -1520307 -314090 1013905 2388187 3733055 4983009 6084097
6343 6084097 6992466 7679203 8141379 8409804 8545124 8622301 8709303 8846968 9037603 9248822
6333 9248822 9430652 9532894 9509895 9314523 8895048 8202832 7204485 5889726 4277096
6324 4277096 2424853 443417 -1506727 -3242883 -4605522 -5498790 -5906916 -5882152 -5513548
6315 -5513548 -4891871 -4084592 -3128553 -2039768 -833011 459223 1777610 3040948 4162944
6306 4162944 5074042 5740596 6175275 6434772 6604339 6773948 7015091 7365732 7824788 8353223
6296 8353223 8880573 9318778 9582766 9609979 9368658 8852609 8071313 7045738 5810052
6287 5810052 4410326 2895031 1304163 -331444 -1978008 -3583351 -5069569 -6337307
6279 -6337307 -7277820 -7788498 -7790152 -7244397 -6166625 -4628700 -2748392 -668953 1462532
6270 1462532 3510063 5355813 6904920 8093403 8898266 9343319 9495026 9448667 9310689
6261 9310689 9183949 9157737 9298720 9638710 10162027 10801822 11452725 11997913 12341173 12433341
6251 12433341 12284500 11956272 11536345 11108697 10737275 10469748 10350597 10426821 10739860 11310755
6241 11310755 12128659 13147023 14287121 15448551 16526557 17432803 18112700 18553154 18779347
6232 18779347 18843366 18808564 18732613 18652162 18572643 18466001 18276659 17933728 17366508 16519606
6222 16519606 15363447 13897628 12149029 10169512 8035745 5848470 3726684 1795285
6214 1795285 168858 -1063991 -1851474 -2181542 -2076788 -1585156 -771470 288124 1510457
6205 1510457 2810604 4108434 5335142 6437979 7381753 8147398 8730625 9143716 9418654
6196 9418654 9604813 9756168 9911267 10075617 10215045 10262444 10134673 9753310 9062142 8036708
6186 8036708 6686894 5057450 3228441 1310716 -570641 -2304571 -3822648 -5112441
6178 -5112441 -6207256 -7157943 -8003241 -8754833 -9401959 -9927317 -10321466 -10589091 -10748517
6169 -10748517 -10827474 -10854610 -10845663 -10788025 -10631799 -10293562 -9673019 -8677739 -7249187 -5382218
6159 -5382218 -3130879 -597789 2088119 4795576 7407915 9829841 11986505 13819895
6151 13819895 15286692 16358468 17022054 17277512 17133526 16602168 15694932 14421329 12791997
6142 12791997 10827970 8573446 6103961 3521899 939030 -1545610 -3862470 -5977992
6134 -5977992 -7892403 -9632584 -11242380 -12769834 -14249957 -15685078 -17031326 -18202424
6126 -18202424 -19094605 -19622355 -19746373 -19481060 -18883526 -18036055 -17032391 -15969968 -14944064
6117 -14944064 -14038774 -13312126 -12777461 -12389113 -12043836 -11604614 -10941030 -9968769 -8669714
6108 -8669714 -7084731 -5285664 -3342301 -1299994 824025 3027888 5304968 7624770
6100 7624770 9918390 12071056 13928951 15329092 16149717 16360105 16041038 15361131 14520034
6091 14520034 13686484 12957607 12351748 11831625 11343198 10849980 10345757 9842342 9346578
6082 9346578 8849049 8337042 7822978 7364478 7057077 7000882 7260235 7836758 8663879 9618906
6072 9618906 10546101 11287393 11716881 11768834 11444847 10794277 9880199 8754739 7458602
6063 7458602 6036991 4550586 3069137 1654887 351489 -814986 -1829522 -2686404
6055 -2686404 -3395720 -3992440 -4537417 -5102791 -5745296 -6482498 -7287452 -8104308 -8872547 -9544746
6045 -9544746 -10091646 -10498296 -10758133 -10869213 -10832558 -10649600 -10316321 -9816467 -9121017 -8198664
6035 -8198664 -7032994 -5634550 -4038746 -2291942 -438127 1481707 3416910 5294040
6027 5294040 7018836 8496678 9658502 10474152 10946333 11093411 10933985 10479807 9736580
6018 9736580 8710797 7420808 5907410 4236647 2491979 762050 -866230 -2306481
6010 -2306481 -3470686 -4274768 -4652636 -4570680 -4033167 -3074675 -1743626 -86779 1855169
6001 1855169 4037443 6393303 8820886 11183680 13325056 15091221 16355467 17036779
5993 17036779 17106885 16584193 15519979 13985985 12069371 9873074 7514226 5114505 2783085
5984 2783085 600142 -1389325 -3167641 -4728558 -6064988 -7168499 -8039115 -8696219 -9181441
5975 -9181441 -9551182 -9863582 -10166631 -10491736 -10854077 -11259543 -11715560 -12239200 -12854766 -13578292
5965 -13578292 -14395366 -15244499 -16017057 -16577429 -16797068 -16587937 -15920732 -14822663 -13361541
5956 -13361541 -11627005 -9714219 -7708471 -5669289 -3618963 -1545223 576022 2745011
5948 2745011 4909834 6965520 8782611 10246335 11283258 11866728 12008107 11743860 11124313
5939 11124313 10207751 9062124 7770178 6428181 5133540 3967907 2985829 2211160 1637170
5930 1637170 1229175 932858 688592 446287 175308 -131932 -462096 -788057 -1077488 -1297091
5920 -1297091 -1411626 -1385350 -1192945 -834907 -342734 234794 856593 1508078 2201556 2959278
5910 2959278 3790156 4672583 5550615 6343368 6962313 7330339 7397903 7151718 6611172 5812331
5900 5812331 4789177 3567109 2175178 666137 -875569 -2347691 -3656524 -4737172
5892 -4737172 -5557443 -6109779 -6402537 -6457933 -6316189 -6040217 -5713559 -5426661 -5253688 -5230985
5882 -5230985 -5351111 -5577680 -5871414 -6209614 -6587311 -7002942 -7441495 -7866398 -8222326 -8444930
5872 -8444930 -8473797 -8266854 -7812856 -7136014 -6289743 -5343892 -4372880 -3446840 -2621879 -1928503
5862 -1928503 -1365364 -906303 -518271 -177825 123947 386576 606018 774363 875759 886734
5852 886734 786106 569686 257642 -113004 -504407 -888290 -1244981 -1559942 -1828586 -2066928
5842 -2066928 -2314984 -2625075 -3041179 -3581747 -4233473 -4956440 -5698469 -6415261 -7089372 -7737822
5832 -7737822 -8401247 -9118084 -9898502 -10714591 -11512021 -12233072 -12835729 -13302160 -13639963 -13879781
5822 -13879781 -14067074 -14246562 -14446052 -14670191 -14907191 -15141438 -15363255 -15573073 -15781534
5813 -15781534 -16006365 -16266158 -16573567 -16931729 -17334130 -17763842 -18190021 -18566869 -18843147
5804 -18843147 -18982182 -18980252 -18868996 -18698998 -18515506 -18340703 -18169845 -17979925 -17744561 -17446817
5794 -17446817 -17083307 -16659813 -16185945 -15674966 -15145291 -14615573 -14093354 -13567686 -13014044
5785 -13014044 -12406986 -11728783 -10968631 -10117345 -9164956 -8103887 -6935884 -5679457 -4374047
5776 -4374047 -3077772 -1858610 -781984 102288 771815 1238535 1544919 1747728 1896480
5767 1896480 2018065 2113562 2165531 2151740 2062449 1916462 1767739 1696442 1786427 2097928 2645695
5756 2645695 3391777 4258990 5161845 6038589 6864094 7636867 8353774 8992897 9513303 9864837
5746 9864837 9997189 9864889 9432405 8683413 7632781 6335077 4883500 3398037 2007123
5737 2007123 828533 -47454 -571749 -744080 -608640 -234098 316734 1013683 1868283
5728 1868283 2919718 4203758 5718256 7399902 9122843 10721788 12031764 12928477
5720 12928477 13353012 13314073 12873513 12126973 11187342 10170067 9175683 8270141 7471796
5711 7471796 6755052 6071423 5377238 4654704 3920606 3224964 2642615 2257454 2139921 2323981
5701 2323981 2793675 3486466 4312965 5184770 6038056 6843099 7598326 8316081 9008936 9680770
5691 9680770 10322308 10910250 11410216 11783437 11996362 12031883 11899207 11637312 11308142 10981250
5681 10981250 10716439 10550507 10490576 10513820 10571940 10597565 10511024 10229857 9684583 8837796
5671 8837796 7696578 6310626 4759470 3138275 1546273 73967 -1213209 -2288307
5663 -2288307 -3163410 -3874827 -4461350 -4947864 -5341184 -5636486 -5828053 -5919164 -5929323 -5898316
5653 -5898316 -5884759 -5956040 -6170417 -6558675 -7115334 -7803920 -8571084 -9359230 -10112167 -10778323
5643 -10778323 -11320883 -11737132 -12075872 -12435369 -12933448 -13661029 -14644521 -15838509 -17150545
5634 -17150545 -18479768 -19745494 -20892986 -21880583 -22663022 -23184970 -23390084 -23240727 -22737035
5625 -22737035 -21924315 -20884089 -19712831 -18498716 -17307413 -16182550 -15157153 -14265038
5617 -14265038 -13542557 -13021294 -12721909 -12657164 -12840053 -13284408 -13990704 -14924226 -16001673
5608 -16001673 -17097862 -18071097 -18794993 -19183159 -19200565 -18864366 -18239606 -17430362 -16562187
5599 -16562187 -15755071 -15095367 -14619761 -14318135 -14151034 -14071256 -14040682 -14037809 -14054654 -14084802
5589 -14084802 -14109073 -14088782 -13974005 -13724995 -13335110 -12841508 -12317787 -11853929 -11533622 -11414794
5579 -11414794 -11513520 -11792265 -12158805 -12483288 -12632871 -12511520 -12086793 -11391198 -10500404 -9504072
5569 -9504072 -8486420 -7521004 -6669783 -5975683 -5450406 -5068706 -4775245 -4498468 -4163341
5560 -4163341 -3702248 -3067874 -2246690 -1264999 -181183 933400 2014945 3018047 3911593
5551 3911593 4664503 5234313 5569759 5626525 5384340 4853896 4071188 3084337 1939424 670334
5541 670334 -704204 -2176461 -3742279 -5394741 -7120614 -8898905 -10700732 -12489676
5533 -12489676 -14221468 -15843400 -17296122 -18519530 -19460832 -20081886 -20365292 -20318892 -19974905
5524 -19974905 -19380332 -18583315 -17625884 -16547103 -15388427 -14191684 -12991581 -11813919 -10685190
5515 -10685190 -9645812 -8752991 -8065931 -7619372 -7401425 -7351559 -7382999 -7417393 -7411069 -7359138
5505 -7359138 -7279432 -7189116 -7086728 -6946336 -6725006 -6380900 -5895487 -5290737 -4632813 -4018342
5495 -4018342 -3546229 -3285016 -3249441 -3396396 -3640341 -3878202 -4011730 -3962167 -3680082 -3153730
5485 -3153730 -2413030 -1522692 -563864 386581 1267886 2035741 2657787 3111456 3385675 3484786
5475 3484786 3433929 3284472 3114501 3018585 3086093 3373990 3883116 4546953 5239756 5804485
5465 5804485 6091046 5989276 5445489 4461867 3085048 1390315 -534087 -2598510 -4716075
5456 -4716075 -6799211 -8751837 -10462774 -11806752 -12658104 -12917189 -12541598 -11568060 -10111968
5447 -10111968 -8340850 -6431851 -4532970 -2745405 -1129738 277122 1451376 2385256
5439 2385256 3096978 3635273 4070439 4473894 4896740 5358963 5853165 6356245 6838898 7268676
5429 7268676 7610514 7830702 7905600 7830585 7622244 7309819 6919013 6458157 5916629 5276889
5419 5276889 4531219 3691555 2787178 1854618 928626 39836 -782840 -1511457 -2123003 -2604332
5409 -2604332 -2952060 -3166451 -3243836 -3172697 -2935798 -2518592 -1921516 -1169666 -312556 586131
5399 586131 1460261 2246110 2881864 3310600 3492261 3420555 3134790 2718338 2282048 1938151
5389 1938151 1774072 1833978 2111006 2550067 3061383 3544310 3916547 4138744 4224495 4231418
5379 4231418 4236858 4308291 4481184 4753523 5096607 5472105 5843644 6178488 6444434 6610234
5369 6610234 6652951 6567898 6373735 6109314 5825731 5579331 5427228 5421695 5600149 5973223
5359 5973223 6517992 7181637 7894712 8588466 9210104 9731624 10149934 10478756 10736793 10939023
5349 10939023 11095235 11213539 11303252 11375087 11442197 11525469 11660025 11895121 12283171 12862393
5339 12862393 13642850 14602699 15694190 16853861 18011682 19097446 20046148 20804830 21340548
5330 21340548 21644223 21723455 21583883 21210552 20565595 19607606 18319392 16723811 14879562
5321 14879562 12866497 10774721 8702133 6754665 5041900 3665492 2703095 2193931
5313 2193931 2132210 2469815 3123037 3977197 4889679 5699042 6247341 6414552 6154092 5512931
5303 5512931 4623057 3663521 2807458 2175498 1811516 1685402 1717674 1813999 1894192 1904838
5293 1904838 1817688 1626073 1347402 1026582 729980 528508 479463 616782 950647 1471010
5283 1471010 2151320 2953255 3834442 4757455 5694595 6624264 7521254 8348466 9055327 9581440
5273 9581440 9861825 9834830 9456501 8718691 7659133 6353178 4890660 3353635 1808619
5264 1808619 313677 -1069922 -2271605 -3214507 -3827068 -4061864 -3917955 -3457596 -2805570
5255 -2805570 -2125547 -1579941 -1289202 -1306589 -1615937 -2148260 -2805531 -3481068 -4073818 -4499965
$$ [...]
##END NTUPLES=NMR SPECTRUM
##END=
