##TITLE=31Pdec_DE-26+28dec
 CDCl3
  64 sc
 10.1.2024
##JCAMPDX= 6.0         $$ Bruker NMR JCAMP-DX V2.0
##DATA TYPE= NMR SPECTRUM
##DATA CLASS= NTUPLES
##ORIGIN= UXNMR, Bruker Analytische Messtechnik GmbH
##OWNER= root
$$ XWIN-NMR		Version 3.5
$$ Wed Jan 10 16:01:36 2024 Russian Standard Time (UT+4h)  she@DPX200
##.OBSERVE FREQUENCY= 81.013821
##.OBSERVE NUCLEUS= ^31P
##.ACQUISITION MODE= SIMULTANEOUS
##.ACQUISITION SCHEME= undefined
##.AVERAGES= 64
##.DIGITISER RES= 16
##SPECTROMETER/DATA SYSTEM= spect
##.PULSE SEQUENCE= zgpg30
##.SOLVENT NAME= DMSO
##.SHIFT REFERENCE= (INTERNAL, DMSO, 0, 248.564)
##AUDIT TRAIL= $$ (NUMBER, WHEN, WHO, WHERE, WHAT)
$$ ##TITLE= Audit trail, XWIN-NMR		Version 3.5
$$ ##JCAMPDX= 5.01
$$ ##ORIGIN= Bruker BioSpin GmbH
$$ ##OWNER= she
$$ F:/spectra/data/she/nmr/P31/1/pdata/1/auditp.txt
$$ ##AUDIT TRAIL=  $$ (NUMBER, WHEN, WHO, WHERE, WHAT)
(   1,<2024-01-10 15:59:29.60 +0400>,<she>,<DPX200>,
      <continue with go, POWCHK disabled, PULCHK disabled
       configuration hash MD5:
       00 E9 B6 7A A2 85 ED C7 34 08 36 98 17 FE 4E 26
       data hash MD5: 32K
       8D 7D E3 CB 7E 0C 1C 5E 55 FE F5 7C 4D 98 D0 86>)
(   2,<2024-01-10 15:59:31.29 +0400>,<she>,<DPX200>,
      <Start of raw data processing
       efp BC_mod = 2 LB = 10 FT_mod = 6 PKNL = 1 PHC0 = -12198.7 PHC1 = 214.0936 SI = 64K 
       data hash MD5: 64K
       DB A4 74 A1 C7 6D AB 40 6D EC 9D E9 27 46 46 C2>)
(   3,<2024-01-10 16:01:06.51 +0400>,<she>,<DPX200>,
      <pk PHC0 = 10.0557 PHC1 = -75.80477 
       data hash MD5: 64K
       BB 3D 1A 46 83 6F 3D F2 A9 61 04 2D 01 0B 14 90>)
$$ ##END=
$$ 
$$ hash MD5
$$ 3C 9C 83 18 81 B1 24 86 3E 2B 8C 1C CE AC 67 8F
##$RELAX= 
##$RELAX= 
##$RELAX= 
##$RELAX= 
##$RELAX= 
##$RELAX= 
##$RELAX= 
##$RELAX= 
##$RELAX= 
$$ Bruker specific parameters
$$ --------------------------
##$DU= <F:/spectra>
##$EXPNO= 1
##$NAME= <P31>
##$PROCNO= 1
##$TYPE= <nmr>
##$USER= <she>
##$AMP= (0..31)
100 100 100 100 100 100 100 100 100 100 100 100 100 100 100 100 100 100 
100 100 100 100 100 100 100 100 100 100 100 100 100 100 
##$AQSEQ= 0
##$AQ_mod= 1
##$AUNM= <au_zg>
##$AUTOPOS= <>
##$BF1= 81.014009
##$BF2= 200.13
##$BF3= 200.13
##$BF4= 200.13
##$BF5= 200.13
##$BF6= 200.13
##$BF7= 200.13
##$BF8= 200.13
##$BYTORDA= 1
##$CFDGTYP= 0
##$CFRGTYP= 5
##$CHEMSTR= <none>
##$CNST= (0..31)
1 1 145 1 1 1 1 1 1 1 1 1 1 1 1 1 1 1 1 1 1 1 1 1 1 1 1 1 1 1 1 1 
##$CPDPRG= <waltz16>
##$CPDPRG1= <>
##$CPDPRG2= <waltz16>
##$CPDPRG3= <>
##$CPDPRG4= <mlev>
##$CPDPRG5= <mlev>
##$CPDPRG6= <mlev>
##$CPDPRG7= <mlev>
##$CPDPRG8= <mlev>
##$CPDPRGB= <>
##$CPDPRGT= <>
##$D= (0..31)
0 1 0 0 0 0 0 0 0 0 0 0.03 2e-05 3e-06 0 0 0 0 0 0 0 0 0 0 0 0 0 0 0 0 
0 0 
##$DATE= 1704887893
##$DBL= (0..7)
120 120 120 11 120 120 24 19 
##$DBP= (0..7)
150 150 150 150 150 150 150 150 
##$DBP07= 0
##$DBPNAM0= <>
##$DBPNAM1= <>
##$DBPNAM2= <>
##$DBPNAM3= <>
##$DBPNAM4= <>
##$DBPNAM5= <>
##$DBPNAM6= <>
##$DBPNAM7= <>
##$DBPOAL= (0..7)
0.5 0.5 0.5 0.5 0.5 0.5 0.5 0.5 
$$ [...]
##$SUBNAM2= <"">
##$SUBNAM3= <"">
##$SUBNAM4= <"">
##$SUBNAM5= <"">
##$SUBNAM6= <"">
##$SUBNAM7= <"">
##$SUBNAM8= <"">
##$SUBNAM9= <"">
##$SW= 501.771253377433
##$SWIBOX= (0..15)
0 1 3 0 0 0 0 0 0 0 0 0 0 0 0 0 
##$SW_h= 40650.406504065
##$TD= 32768
##$TD0= 1
##$TE= 0
##$TE2= 300
##$TE3= 300
##$TEG= 300
##$TL= (0..7)
0 120 53 12 22 120 120 120 
##$TP= (0..7)
150 150 150 150 150 150 150 150 
##$TP07= 0
##$TPNAME0= <>
##$TPNAME1= <>
##$TPNAME2= <>
##$TPNAME3= <>
##$TPNAME4= <>
##$TPNAME5= <>
##$TPNAME6= <>
##$TPNAME7= <>
##$TPOAL= (0..7)
0.5 0.5 0.5 0.5 0.5 0.5 0.5 0.5 
##$TPOFFS= (0..7)
0 0 0 0 0 0 0 0 
##$TUNHIN= 0
##$TUNHOUT= 0
##$TUNXOUT= 0
##$USERA1= <user>
##$USERA2= <user>
##$USERA3= <user>
##$USERA4= <user>
##$USERA5= <user>
##$V9= 5
##$VALIST= <valist>
##$VCLIST= <CCCCCCCCCCCCCCC>
##$VD= 0
##$VDLIST= <DDDDDDDDDDDDDDD>
##$VPLIST= <PPPPPPPPPPPPPPP>
##$VTLIST= <TTTTTTTTTTTTTTT>
##$WBST= 1024
##$WBSW= 4
##$XGAIN= (0..3)
0 0 0 0 
##$XL= 0
##$YL= 0
##$YMAX_a= 5591
##$YMIN_a= -1690
##$ZGOPTNS= <>
##$ZL1= 120
##$ZL2= 120
##$ZL3= 120
##$ZL4= 120
##$ABSF1= 0
##$ABSF2= 0
##$ABSG= 0
##$ABSL= 0
##$ALPHA= 0
##$AQORDER= 0
##$ASSFAC= 0
##$ASSFACI= 0
##$ASSFACX= 0
##$ASSWID= 0
##$AUNMP= <proc_1d>
##$AZFE= 0.1
##$AZFW= 0.5
##$BCFW= 0
##$BC_mod= 2
##$BYTORDP= 0
##$COROFFS= 0
##$CY= -3
##$DATMOD= 1
##$DC= 0
##$DFILT= <>
##$DTYPP= 0
##$F1P= 0
##$F2P= 0
##$FCOR= 1
##$FTSIZE= 65536
##$FT_mod= 6
##$GAMMA= 0
##$GB= 0
##$INTBC= 1
##$INTSCL= 6.047779e-11
##$ISEN= 30
##$LB= 10
##$LEV0= 0
##$LPBIN= 0
##$MAXI= 10000
##$MC2= 0
##$MEAN= 0
##$ME_mod= 0
##$MI= 50
##$NCOEF= 0
##$NC_proc= -10
##$NLEV= 6
##$NOISF1= 182.463
##$NOISF2= 159.3651
##$NSP= 0
##$NTH_PI= 0
##$NZP= 0
##$OFFSET= 248.5645
##$PC= 4
##$PHC0= -12188.64
##$PHC1= 138.2888
##$PH_mod= 1
##$PKNL= yes
##$PPARMOD= 0
##$PSCAL= 0
##$PSIGN= 0
##$REVERSE= no
##$SF= 81.0140089999694
##$SI= 65536
##$SIGF1= 159.3651
##$SIGF2= -187.1042
##$SINO= 113.3802
##$SIOLD= 16384
##$SREGLST= <1H.CDCl3>
##$SSB= 0
##$STSI= 65536
##$STSR= 0
##$SW_p= 40650.406504065
##$SYMM= 0
##$S_DEV= 0
##$TDeff= 32768
##$TDoff= 0
##$TI= <>
##$TILT= no
##$TM1= 0
##$TM2= 0
##$TOPLEV= 0
##$USERP1= <user>
##$USERP2= <user>
##$USERP3= <user>
##$USERP4= <user>
##$USERP5= <user>
##$WDW= 1
##$XDIM= 65536
##$YMAX_p= 341574051
##$YMIN_p= -34397977
$$ End of Bruker specific parameters
$$ ---------------------------------
##NTUPLES= NMR SPECTRUM
##VAR_NAME=  FREQUENCY,     SPECTRUM/REAL,   SPECTRUM/IMAG
##SYMBOL=    X,             R,               I
##VAR_TYPE=  INDEPENDENT,   DEPENDENT,       DEPENDENT
##VAR_FORM=  AFFN,          ASDF,            ASDF
##VAR_DIM=   65536,         65536,           65536
##UNITS=     HZ,            ARBITRARY UNITS, ARBITRARY UNITS
##FACTOR=    0.620285442955139, 1,           1
##FIRST=     20137.2065510682, 0,            0
##LAST=      -20513.1999529968, 0,           0
##MIN=       -20513.1999529968, -34397977,   0
##MAX=       20137.2065510682, 341574051,    0
$$ Real data points
##PAGE= N=1
##DATA TABLE= (X++(R..R)), XYDATA
$$ [...]
13101h530117M39452M35745M27417M24488M29553M35306M25742L85390L13098
$$ -8530117 -8090665 -7654920 -7227503 -6803015 -6373462 -5938156 -5512414 -5127024 -4813926
13092d813926K28474J62176J35712J47397J75842J95741J91066J57147R5887J3075
$$ -4813926 -4585452 -4423276 -4287564 -4140167 -3964325 -3768584 -3577518 -3420371 -3324484 -3311409
13082c311409p9555j62222k09700j98053j11146N5699K94153N82152Q85286J162698
$$ -3311409 -3390964 -3553186 -3762886 -3960939 -4072085 -4016386 -3722233 -3140081 -2254795 -1092097
13072a092097J376411J499312J518107J432998J258156J023551P73944N61077
$$ -1092097 284314 1783626 3301733 4734731 5992887 7016438 7790382 8351459
13064H351459M29771M03418M75808O14302P73728R13604J008825J049975J038835
$$ 8351459 8781230 9184648 9660456 10274758 11048486 11962090 12970915 14020890 15059725
13055A5059725R86878R16832Q59355Q39973Q63560R10374R49334R58596R37449
$$ 15059725 16046603 16963435 17822790 18662763 19526323 20436697 21386031 22344627 23282076
13046B3282076R03025Q78401Q81534R18224R78378J037319J064866J038401R50107
$$ 23282076 24185101 25063502 25945036 26863260 27841638 28878957 29943823 30982224 31932331
13037C1932331Q02664N99796L43629M3226k74415n64203p78549q90416r08438
$$ 31932331 32734995 33334791 33678420 33721646 33447231 32883028 32104479 31214063 30305625
13028C0305625q73464q38381q43745r03201j004366j119850j218383j270697j253245
$$ 30305625 29432161 28593780 27750035 26846834 25842468 24722618 23504235 22233538 20980293
13019B0980293j155099r86759p82499n90169m52758l92792m06619m67321n32252
$$ 20980293 19825194 18838435 18055936 17465767 17013009 16620217 16213598 15746277 15214025
13010A5214025n54063m95301l42682j13731J49001L93776N77315O75738O85634
$$ 15214025 14659962 14164661 13821979 13708248 13857249 14251025 14828340 15504078 16189712
13001A6189712O19049M98701L55598K25502J41104J23105J76608K94057M58688
$$ 16189712 16808761 17307462 17663060 17888562 18029666 18152771 18329379 18623436 19082124
12992A9082124O43904Q12396R22591R42519Q60963O86316M34886J19744k50861
$$ 19082124 19726028 20538424 21461015 22403534 23264497 23950813 24385699 24505443 24254582
12983B4254582o66409j105483j531947j898015k153624k259640k200378j989948
$$ 24254582 23588173 22482690 20950743 19052728 16899104 14639464 12439086 10449138
12975A0449138j669223j294431r21681n92616l25535j14382O4212K37827M23532
$$ 10449138 8779915 7485484 6563803 5971187 5645652 5531270 5595482 5833309 6256841
12966F256841O17870P96953R26785R77273R32046P91288N70541K98204J0928k54084
$$ 6256841 6874711 7671664 8598449 9575722 10507768 11299056 11869597 12167801 12178729 11924645
12956A1924645m66611o06090o59609o20906m94334l00580p7467J26357K60993
$$ 11924645 11458034 10851944 10192335 9571429 9077095 8776515 8699048 8825405 9086398
12947I086398K83805J66680r6959m87113r58013j446043j882364k206619k378711
$$ 9086398 9370203 9536883 9439924 8952811 7994798 6548755 4666391 2459772 81061
12938H1061k385429k239251j970312j616887j219329q17685m49759j47210O9734
$$ 81061 -2304368 -4543619 -6513931 -8130818 -9350147 -10167832 -10617591 -10764801 -10695067
12929a0695067J97111K49346K56802K58309K90600L78423N28595P29894R58449
$$ -10695067 -10497956 -10248610 -9991808 -9733499 -9442899 -9064476 -8535881 -7805987 -6847538
12920f847538J185822J385766J537586J627616J650807J611987J524535J405516
$$ -6847538 -5661716 -4275950 -2738364 -1110748 540059 2152046 3676581 5082097
12912E082097J268453J116822R42951P36194M97789K52096M4212p5934p3790N4615
$$ 5082097 6350550 7467372 8410323 9146517 9644306 9896402 9940614 9864680 9790890 9845505
12902I845505K77075N31562P44719Q56216Q37003O93394M58830J79922r8954l49924
$$ 9845505 10122580 10654142 11398861 12255077 13092080 13785474 14244304 14424226 14325272 13975348
12892A3975348n69476p74654r88726j223847j468648j685587j820719j825068
$$ 13975348 13405872 12631218 11642492 10418645 8949997 7264410 5443691 3618623
12884C618623j679200j406824j067661p33740m64666k95695k39319k90117m24283
$$ 3618623 1939423 532599 -535062 -1268802 -1733468 -2029163 -2268482 -2558599 -2982882
12875b982882n96643p45476q09768p51550n70134l00332L760K90453N26073O96669
$$ -2982882 -3579525 -4325001 -5134769 -5886319 -6456453 -6756785 -6753025 -6462572 -5936499 -5239830
12865e239830P97892Q24349P68497O28346M14877J52937j23175l75559n68655
$$ -5239830 -4441938 -3617589 -2849092 -2220746 -1805869 -1652932 -1776107 -2151666 -2720321
12856b720321o75516o83121n94431m26328k04588M2025K86643N07322O88627Q22229
$$ -2720321 -3395837 -4078958 -4673389 -5099717 -5304305 -5262280 -4975637 -4468315 -3779688 -2957459
12846b957459R06048R42435R37553R02599Q53376Q04862P64702P33944P16004
$$ -2957459 -2051411 -1108976 -171423 731176 1584552 2389414 3154116 3888060 4604064
12837D604064P22699P66635Q45050R32671R93980J005498R68543R02970Q29964
$$ 4604064 5326763 6093398 6938448 7871119 8865099 9870597 10839140 11742110 12572074
12828A2572074P59003O86048N99052M84040L29602J31814j00343l42980n63029
$$ 12572074 13331077 14017125 14616177 15100217 15429819 15561633 15461290 15118310 14555281
12819A4555281p30506q29668q61088q34382p59711o45586n01755l40275j72679
$$ 14555281 13824775 12995107 12134019 11299637 10539926 9894340 9392585 9052310 8879631
12810H879631q504J41101K59209L25605L25941K60592J47134J5688j00668j77074
$$ 8879631 8871127 9012228 9271437 9597042 9922983 10183575 10330709 10346397 10245729 10068655
12800A0068655k05017j93745j65837j51007j80517k81603m71708p53396j110026
$$ 10068655 9863638 9669893 9504056 9353049 9172532 8890929 8419221 7665825 6555799
12791F555799j502575j871633k149232k278025k228035k003138j637957j189005
$$ 6555799 5053224 3181591 1032359 -1245666 -3473701 -5476839 -7114796 -8303801
12783h303801p21271k91575O5324L40902N46445P01332Q22228R17691R90430J044976
$$ -8303801 -9025072 -9316647 -9251323 -8910421 -8363976 -7662644 -6840416 -5922725 -4932295 -3887319
12773c887319J093204J151805J233871J341593J463623J576229J648544J653512
$$ -3887319 -2794115 -1642310 -408439 933154 2396777 3973006 5621550 7275062
12765G275062J581035J444209J272823J097975R37467P89672O38428M66073K66661
$$ 7275062 8856097 10300306 11573129 12671104 13608571 14398243 15036671 15502744 15769405
12756A5769405N0313j63164l53978n07321o13684o69909o81846o63119o26661
$$ 15769405 15819718 15656554 15302576 14795255 14181571 13511662 12829816 12166697 11540036
12747A1540036n74542m95786l75651k09702j2127J86943L51964M53546M76667
$$ 11540036 10965494 10469708 10094057 9884355 9872228 10059171 10411135 10864681 11341348
12738A1341348M24594L17652J85210N1866p5424k10243l75918n86867q34196j085458
$$ 11341348 11765942 12083594 12268804 12320670 12245246 12035003 11659085 11072218 10238022 9152564
12728I152564j298924j443264j510282j513827j476791j414747j325787j192180
$$ 9152564 7853640 6410376 4900094 3386267 1909476 494729 -831058 -2023238
12720b023238r92234p14318l63774M0854M77952R30875J387736J832703K234855
$$ -2023238 -3015472 -3729790 -4093564 -4052710 -3574758 -2643883 -1256147 576556 2811411
12711B811411K543707K698008K646420K370453J897192J294012O47009L4469m89911
$$ 2811411 5355118 8053126 10699546 13069999 14967191 16261203 16908212 16942681 16452770
12702A6452770q96069j165107j280528j233033j034044p24519l70291m6249J83100
$$ 16452770 15556701 14391594 13111066 11878033 10843989 10119470 9749179 9702930 9886030
12693I886030K80458K45879J15882n1292k00290l00839l54649l84018m11550m44633
$$ 9886030 10166488 10412367 10528249 10476957 10276667 9975828 9621179 9237161 8825611 8380978
12683H380978m72222m72986m29280l39419k20413r8212O790Q5451J31985J33089
$$ 8380978 7908756 7435770 7006490 6667071 6446658 6348446 6355236 6440687 6572672 6705761
12673F705761O8105p8123l00841n69628q32716j028482j102297j025954q12143
$$ 6705761 6773866 6695743 6394902 5825274 4992558 3964076 2861779 1835825 1023682
12664A023682n14813k11774K4633J54969J83499J46626Q8184L8876J0325M28P72
$$ 1023682 508869 297095 321728 476697 660196 806822 895006 933882 944207 944635 945407
12653I45407K131j296r916k1944l9903p2875j29615k06957k83316l23178k90228
$$ 945407 947538 946242 936326 914382 874479 801604 671989 465032 181716 -141462 -431690
12642d31690j62095N9155L43123O34153Q62141R61168Q91652O56328L00655j03745
$$ -431690 -593785 -534630 -191507 442646 1304787 2265955 3157607 3813935 4114590 4010845
12632D010845m84425p89821r97734j108089j126778j054129q88440o40870l45397
$$ 4010845 3526420 2736599 1738865 630776 -496002 -1550131 -2438571 -3079441 -3424838
12623c424838n1371J96376L73163M75151N09089M82238L99668K69142J08918m9275
$$ -3424838 -3476209 -3279833 -2906670 -2431519 -1922430 -1440192 -1040524 -771382 -662464 -711739
12613g11739j68326k21964k06482j38079m0402O4360J55832K15305K32935K17595
$$ -711739 -880065 -1102029 -1308511 -1446590 -1486992 -1422632 -1266800 -1051495 -818560 -600965
12603f00965J98177K12281K88599M32079O17697P96062R10331R17942Q06748N99165
$$ -600965 -402788 -190507 98092 530171 1147868 1943930 2854261 3772203 4578951 5178116
12593E178116L45259J08806n0574r4810j7512J57654L87393O20868Q09501R15250
$$ 5178116 5523375 5632181 5581607 5486797 5469285 5626939 6014332 6635200 7444701 8359951
12583H359951R17634Q16479O27603L74264Q0931k26516n17377p56494r11285r60066
$$ 8359951 9277585 10094064 10721667 11095931 11176862 10950346 10432969 9676475 8765190 7805124
12573G805124q93870p11232m13865j0625M72794R88485J472800J862616K112288
$$ 7805124 6911254 6200022 5786157 5775532 6248326 7236811 8709611 10572227 12684515
12564A2684515K202315K137167J937221J632244J259000Q58585M69115J17014
$$ 12684515 14886830 17023997 18961218 20593462 21852462 22711047 23180162 23297176
12556B3297176j85105m31837o17486p36714p92943q04514q00112q04918q27624
$$ 23297176 23112071 22680234 22062748 21326034 20533091 19728577 18928465 18123547 17295923
12547A7295923q57572q73010q53384p87824o76818n28504l52004j50855P8405
$$ 17295923 16438351 15565341 14711957 13924133 13247315 12718811 12366807 12215952 12294357
12538A2294357L38691O19867Q92512J115676J253706J288943J222234J064250
$$ 12294357 12633048 13252915 14145427 15261103 16514809 17803752 19025986 20090236
12530B0090236Q26380N17401J47115k65727o86856j067587j355422j509160j511075
$$ 20090236 20916616 21434017 21581132 21315405 20628549 19560962 18205540 16696380 15185305
12521A5185305j372621j133824q55888o05528m34160l61382l71696m24914m72561
$$ 15185305 13812684 12678860 11822972 11217444 10783284 10421902 10050206 9625292 9152731
12512I152731m72254l96731k37760n823K73261N63683Q26569J028399J148746
$$ 9152731 8680477 8283746 8045986 8040163 8313424 8877107 9703676 10732075 11880821
12503A1880821J183236J139966J032992Q78440O94824N04236L30906J97296J20101
$$ 11880821 13064057 14204023 15237015 16115455 16810279 17314515 17645421 17842717 17962818
12494A7962818J07639J58409K60567L92977N28775O41216P10108P26275O92663
$$ 17962818 18070457 18228866 18489433 18882410 19411185 20052401 20762509 21488784 22181447
12485B2181447O22638N36592M56799M00214L71056L57546L35849K79794J71804
$$ 22181447 22804085 23340677 23797476 24197690 24568746 24926292 25262141 25541935 25713739
12476B5713739J0962j83831l77030n26422n97141n73160m60768k84133p7462J23175
$$ 25713739 25724701 25540870 25163840 24637418 24040277 23467117 23006349 22722216 22644754 22767929
12466B2767929K88657M05443M78446N23119N49654N50469N01120L75187J64202
$$ 22767929 23056586 23462029 23940475 24463594 25013248 25563717 26064837 26440024 26604226
12457B6604226j09698l96823o38206p88677q31066p75380o48661m85611l23752
$$ 26604226 26494528 26097705 25459499 24670822 23839756 23064376 22415715 21930104 21606352
12448B1606352j99117j38294j48690k13633k97663l61405l78422l43956k70444
$$ 21606352 21407235 21268941 21120251 20906618 20608955 20247550 19869128 19525172 19254728
12439A9254728j74180o3091O6561K23309M07692O01250P65353Q52690Q25370O68548
$$ 19254728 19080548 19017457 19084018 19307327 19715019 20316269 21081622 21934312 22759682 23428230
12429B3428230L93020K8713l85171q09144j209274j558357j833064k011022k072034
$$ 23428230 23821250 23849963 23464792 22655648 21446374 19888017 18054953 16043931 13971897
12420A3971897k004387j813176j525420j186804q48478n49777l08224j24386K583
$$ 13971897 11967510 10154334 8628914 7442110 6593632 6043855 5735631 5611245 5613828
12411E613828O2273L5178r0079k97038n36036p40935q58896q73328q05812o99082
$$ 5613828 5676101 5711279 5621200 5324162 4788126 4047191 3188295 2314967 1509155 810073
12401H10073n94778n18301m74252m49632m21199l64324k61083j04753J01175L47657
$$ 810073 215295 -303006 -777258 -1226890 -1648089 -2012413 -2273496 -2378249 -2277074 -1929417
12391a929417O23007R10883J187395J424306J597706J693093J701592J614342
$$ -1929417 -1306410 -395527 791868 2216174 3813880 5506973 7208565 8822907
12383H822907J425053J139354P79571L79054k7786m11239p47464j019350j217927
$$ 8822907 10247960 11387314 12166885 12545939 12518153 12106914 11359450 10340100 9122173
12374I122173j341822j394870j385461j329040j249942j177221j133724j123894
$$ 9122173 7780351 6385481 5000020 3670980 2421038 1243817 110093 -1013801
12366a013801j128771j113457j044633r08150p15373m93844k69275n3068J54314
$$ -1013801 -2142572 -3256029 -4300662 -5208812 -5924185 -6418029 -6687304 -6740372 -6586058
12357f586058L47994N06849N98207N96157M97673L23862J08157j16515l23005
$$ -6586058 -6238064 -5731215 -5133008 -4536851 -4039178 -3715316 -3607159 -3723674 -4046679
12348d046679m89118n97472o39147o17580n47824m50555l44657k41498j41559
$$ -4046679 -4535797 -5133269 -5772416 -6389996 -6937820 -7388375 -7733032 -7974530 -8116089
12339h116089l4839R1828K41679L98710N32701O17103O45547O34129O10270N98672
$$ -8116089 -8150928 -8059100 -7817421 -7418711 -6886010 -6268907 -5623360 -4989231 -4378961 -3780289
12329c780289O12469O50085O95718P22751P00062N99585M03657J11768k53777
$$ -3780289 -3167820 -2517735 -1822017 -1099266 -399204 200381 604038 715806 462029
12320D62029o46707j004839j268223j400592j402516j308208j167864j025390
$$ 462029 -184678 -1189517 -2457740 -3858332 -5260848 -6569056 -7736920 -8762310
12312h762310r02247p93444o75635n22126l16404n8040K37970N43117Q17451J016922
$$ -8762310 -9664557 -10458001 -11133636 -11655762 -11972166 -12030206 -11792236 -11249119 -10431668 -9414746
12302i414746J108260J083277R61398P79607N80297M05631K95457K80564L70511
$$ -9414746 -8306486 -7223209 -6261811 -5482204 -4901907 -4496276 -4200819 -3920255 -3549744
12293c549744N44746P55933R45561J063291J079822R88597P99633N33168K17725
$$ -3549744 -3004998 -2249065 -1303504 -240213 839609 1828206 2627839 3161007 3378732
12284C378732j09719m06828o33385p59165p68825o64473m67248k15745M1093K54432
$$ 3378732 3269013 2862185 2228800 1469635 700810 36337 -430911 -646656 -605563 -351131
12274c51131L84173M04376L08224J12768j41316l98186n99643o95957o53401m61271
$$ -351131 33042 437418 745642 858410 717094 318908 -280735 -976692 -1630093 -2091364
12264b091364j38271K66075O78302J015549J205633J209210J035992P44402M21141
$$ -2091364 -2229635 -1963560 -1285258 -269709 935924 2145134 3181126 3925528 4346669
12255D346669J50722q699l3964O7141K64820N16472P75880J002453J168313J260686
$$ 4346669 4497391 4488692 4454728 4521869 4786689 5303161 6079041 7081494 8249807 9510493
12245I510493J279628J234242J139997J016554Q84148P59575O55968N87452N72861
$$ 9510493 10790121 12024363 13164360 14180914 15065062 15824637 16480605 17068057 17640918
12236A7640918O30724P65459R55361J154742J311846J390620J381084J293851
$$ 17640918 18271642 19037101 19992462 21147204 22459050 23849670 25230754 26524605
12228B6524605J147700R61133P49794N24457K88328L9037k21691m77035o92844
$$ 26524605 27672305 28633438 29383232 29907689 30196017 30235054 30013363 29536328 28843484
12219B8843484q27114q45367p34506n10590k18275P8935L14921M37662M21250
$$ 28843484 28016370 27171003 26436497 25925907 25707632 25786567 26101488 26539150 26960400
12210B6960400K71210K2440k71220n54114p85862r50074j051606j106961j134636
$$ 26960400 27231610 27254050 26982830 26428716 25642854 24692780 23641174 22534213 21399577
12201B1399577j148627j153931j142626j091888r67352p34256l74808R5318O22086
$$ 21399577 20250950 19097019 17954393 16862505 15895153 15160897 14786089 14881407 15503493
12192A5503493J126893J534427J798698J912259J896972J787589J619866J425477
$$ 15503493 16630386 18164813 19963511 21875770 23772742 25560331 27180197 28605674
12184B8605674J228798J041907Q59617O59993M14392J05067k59021o39869r85364
$$ 28605674 29834472 30876379 31735996 32395989 32810381 32915448 32656427 32016558 31031194
12175C1031194j252470j423464j506597j524750j502052j455369j390630j301460
$$ 31031194 29778724 28355260 26848663 25323913 23821861 22366492 20975862 19674402
12167A9674402j170477r76821p10318l84809m0289K69023M92295N94488N60226
$$ 19674402 18503925 17527104 16816786 16431977 16391688 16660711 17153006 17747494 18307720
12158A8307720L93403J16234k33416o08705r63349j259881j473880j594683j625099
$$ 18307720 18701123 18817357 18583941 17975236 17011887 15752006 14278126 12683443 11058344
12149A1058344j580800j487115j370784j248867j122044r78389q06453o09539
$$ 11058344 9477544 7990429 6619645 5370778 4248734 3270345 2463892 1854353
12141A854353m12244k54460j74500j89385k84121m17681n42338o23126o45228
$$ 1854353 1442109 1187649 1013149 823764 539643 121962 -420376 -1043502 -1688730
12132a688730o07725n12584l59431j49593J06118L84572O56412Q96829J092981
$$ -1688730 -2296455 -2809039 -3168470 -3318063 -3211945 -2827373 -2170961 -1274132 -181151
12123a81151J243810J354699J431995J479957J499377J487248J438619J350956
$$ -181151 1062659 2417358 3849353 5329310 6828687 8315935 9754554 11105510
12115A1105510J227446J074561Q94656O81643M26845J32203j80028m68919o86441
$$ 11105510 12332956 13407517 14302173 14983816 15410661 15542864 15362836 14893917 14207476
12106A4207476p93302p74504o49745m71471l07353k14856k22477l26638n01420
$$ 14207476 13414174 12639670 11989925 11518454 11211101 10996245 10773768 10447130 9945710
12097I945710p11778r22369j099548j209693j220386j108592q72201n36135j47438
$$ 9945710 9233932 8311563 7212015 6002322 4781936 3673344 2801143 2265008 2117570
12088B117570K38305N72895Q27889R98912J099393J146732J149355J102775R95912
$$ 2117570 2355875 2928770 3756659 4755571 5854964 7001696 8151051 9253826 10249738
12079A0249738Q22462N90268L23164N3770j88159l82919n18717n85397n73643
$$ 10249738 11072200 11662468 11985632 12039402 11851243 11468324 10949607 10364210 9790567
12070I790567m82505l28213j46186J5032J04503Q2327o5180l14388o06518q65918
$$ 9790567 9308062 8979849 8833663 8848695 8953198 9035525 8970345 8655957 8049439 7183521
12060G183521j025071j042132r05032o27224k42125K01906O47301J033055J299505
$$ 7183521 6158450 5116318 4211286 3584062 3341937 3543843 4191144 5224199 6523704
12051F523704J394803J286859R78950N19862r87m75401q07548r41378q73432o47925
$$ 6523704 7918507 9205366 10184316 10704178 10703191 10227790 9420242 8478864 7605432 6957507
12041F957507l38809k6297K25773L85032M51125M41002L69498K40275N2125j88313
$$ 6957507 6618698 6592401 6818174 7203206 7654331 8095333 8464831 8705106 8757231 8568918
12031H568918m59835p29786r62374j126138j197835j163255j017606p67867m35849
$$ 8568918 8109083 7379297 6416923 5290785 4092950 2929695 1912089 1144222 708373
12022G08373n7092L27322O82100R84332J221007J381245J451827J422125J295537
$$ 708373 651281 978603 1660703 2645035 3866042 5247287 6699114 8121239 9416776
12013I416776J096314Q62451O27944M09071K06517J9593j42472k62635l27734
$$ 9416776 10513090 11375541 12003485 12412556 12619073 12638666 12496194 12233559 11905825
12004A1905825l37342l01995k34004j40142k1822J19159K74730M27776N53129
$$ 11905825 11568483 11266488 11032484 10892342 10870520 10989679 11264409 11692185 12245314
11995A2245314O22256O10863N05948L08549L1965l01355o62349j017810j333111
$$ 12245314 12867570 13478433 13984381 14292930 14324895 14023540 13361191 12343381 11010270
11986A1010270j574471j711790j723882j604266j362256j018041n97048j28277
$$ 11010270 9435799 7724009 6000127 4395861 3033605 2015564 1418516 1290239
11978A290239L55346Q18424J225274J540142J728388J764523J646122J403226
$$ 1290239 1645585 2464009 3689283 5229425 6957813 8722336 10368458 11771684
11970A1771684J092831P77981N02252K75497Q1190r9700k67873m05302m92921
$$ 11771684 12864515 13642496 14144748 14420245 14501435 14401735 14133862 13728560 13235639
11961A3235639n27246n21961m99098m82829m98726n69679p03155q78048j044831
$$ 13235639 12708393 12186432 11687334 11204505 10705779 10136100 9432945 8554897 7510066
11952G510066j143102j126254r78818p20319l99116q1269J65039K89644K79151
$$ 7510066 6366964 5240710 4261892 3541573 3142457 3061188 3226227 3515871 3795022
11943C795022J63848O491j22484j70945j20064J6982K08633M20846O26730Q08732
$$ 3795022 3958870 3965361 3842877 3671932 3551868 3568850 3777483 4198329 4825059 5633791
11933E633791R57815J072599J157054J215415J246889J243857J194049J084248
$$ 5633791 6591606 7664205 8821259 10036674 11283563 12527420 13721469 14805717
11925A4805717R04346O52076L37437j6215l76056p06965r79231j175695j297666
$$ 14805717 15710063 16362139 16699576 16683361 16307305 15600340 14621109 13445414 12147748
11916A2147748j366561j417164j482483j576888j686494j772123j784174j684243
$$ 12147748 10781187 9364023 7881540 6304652 4618158 2846035 1061861 -622382
11908f22382j464852j156763q17702n07456k64780r9770k839M0322L9385n05p3475
$$ -622382 -2087234 -3243997 -4061699 -4569155 -4833935 -4933705 -4936544 -4896222 -4856837 -4857342 -4930817
11897d930817j69190k73680l71823m46518m74422m24951k69313K121L64934P59746
$$ -4930817 -5100007 -5373687 -5745510 -6192028 -6666450 -7091401 -7360714 -7358593 -6993659 -6233913
11887f233913J108989J344627J433138J384888J243601J062938Q82965P17252
$$ -6233913 -5124924 -3780297 -2347159 -962271 281330 1344268 2227233 2944485
11879B944485N55198L77750J78192k4935j92413k84000k79733j89402m6613J06664
$$ 2944485 3499683 3877433 4055625 4030690 3838277 3554277 3274544 3085142 3038529 3145193
11869C145193K35942L23304L66339L68735L29234K37527Q1295j39716m03035o65029
$$ 3145193 3381135 3704439 4070778 4439513 4768747 5006274 5087569 4947853 4544818 3879789
11859C879789q74588r90684r94858q94615p17335m96593k57078p524K54193N30581
$$ 3879789 3005201 2014517 1019659 125044 -592291 -1088884 -1345962 -1353486 -1099293 -568712
11849e68712Q18281J106611J374804J588309J703322J683520J518767J231794
$$ -568712 249569 1356180 2730984 4319293 6022615 7706135 9224902 10456696
11841A0456696Q70187M91970J52029j09496k76405l59588l90486m06003m30991
$$ 10456696 11326883 11818853 11970882 11861386 11584981 11225393 10834907 10428904 9997913
11832I997913m66806m92736m80378m12183k92221j43453M211J26047K08486K48375
$$ 9997913 9531107 9038371 8557993 8145810 7853589 7710136 7714347 7840394 8048880 8297255
11822H297255K49249K18548J67079J09096O1213M0243O0472J29547K42863L79530
$$ 8297255 8546504 8765052 8932131 9041227 9102440 9142683 9203155 9332702 9575565 9955095
11812I955095N04519N77930N67520M59821K67344K9629j95018l47359l87415l06062
$$ 9955095 10459614 11037544 11605064 12064885 12332229 12361858 12166840 11819481 11432066 11126004
11802A1126004j23120J22752L84371O15078P79522Q63739Q74778Q25335P14188
$$ 11126004 11002884 11125636 11510007 12125085 12904607 13768346 14643124 15468459 16182647
11793A6182647N20875K21821j83612o56571j122771j494872j701644j710596j535016
$$ 16182647 16703522 16925343 16741731 16085160 14962389 13467517 11765873 10055277 8520261
11784H520261j224963q48847m73492j47804J06317K92562M28807N31831O05991
$$ 8520261 7295298 6446451 5972959 5825155 5931472 6224034 6652841 7184672 7790663
11775G790663O39746O10061M93239K78797k0308l67774p14857j015669j238873
$$ 7790663 8430409 9040470 9533709 9812506 9792198 9424424 8709567 7693898 6455025
11766F455025j371883j418715j394933j321779j218785j094749r41192p34999
$$ 6455025 5083142 3664427 2269494 947715 -271070 -1365819 -2307011 -3042010
11758c042010m51130p7859L74124Q70465J357082J769345K048076K157472K093852
$$ -3042010 -3493140 -3570999 -3196875 -2326410 -969328 800017 2848093 5005565 7099417
11749G099417J878809J543205J115429O21214R0553m38994r28185j346309j675686
$$ 7099417 8978226 10521431 11636860 12258074 12348627 11909633 10981448 9635139 7959453
11740G959453j906897k031969k044466j946189j752052j487452j180640q55723
$$ 7959453 6052556 4020587 1976121 29932 -1722120 -3209572 -4390212 -5245935
11732e245935n29505k13262Q1409L37321N33518O54760P00857O87830O41406N89161
$$ -5245935 -5775440 -5988702 -5907293 -5569972 -5036454 -4381694 -3680837 -2993007 -2351601 -1762440
11722a762440N54900N53749N86604O36435O70695O51733N52716L72100J39051
$$ -1762440 -1207540 -653791 -67187 569248 1239943 1891676 2444392 2816492 2955543
11713B955543r2943k60758l09248k08338L4863L76424P52634J105532J400571
$$ 2955543 2862600 2601842 2292594 2084256 2119119 2495543 3248177 4353709 5754280
11704E754280J626935J786309J882291J916050J885427J784940J608511J356922
$$ 5754280 7381215 9167524 11049815 12965865 14851292 16636232 18244743 19601665
11696A9601665J047096P16671M18473K04625J06014J17301J96763K82647L17997
$$ 19601665 20648761 21365432 21783905 21988530 22094544 22211845 22408608 22691255 23009252
11687B3009252K71364J44399l4791k27102l99049n34115o35911p23074q17507
$$ 23009252 23280616 23425015 23390224 23163122 22764073 22229958 21594047 20870973 20053466
11678B0053466r30105j051729j157447j223005j240418j218947j172678j109856
$$ 20053466 19123361 18071632 16914185 15691180 14450762 13231815 12059137 10949281
11670A0949281j034593r54635q82094q25231p81871p42444o98344o45957n83241
$$ 10949281 9914688 8960053 8077959 7252728 6470857 5728413 5030069 4384112 3800871
11661C800871n03930l96058k46591m8522J95178M72670P65516J048021J285974
$$ 3800871 3296941 2900883 2654292 2605770 2800948 3273618 4039134 5087155 6373129
11652F373129J441833J487978J420077J260726J051343Q38060O58542N34332M70938
$$ 6373129 7814962 9302940 10723017 11983743 13035086 13873146 14531688 15066020 15536958
11643A5536958M64645N10165O02261P30026Q69919R85602J037801R99836Q69976
$$ 15536958 16001603 16511768 17114029 17844055 18713974 19699576 20737377 21737213 22607189
11634B2607189O73030M50522K45616R0456o01l2310k5671j1644k2457q2064j97713
$$ 22607189 23280219 23730741 23976357 24066813 24066212 24033902 24008231 23996587 23974130 23892066 23694353
11623B3694353l56169n28603o84220q05430q94844r70070j051266j150125j266177
$$ 23694353 23338184 22809581 22125361 21319931 20425087 19455017 18403751 17253626 15987449
11614A5987449j390987j515869j636865j753394j862926j957217k022790k043629
$$ 15987449 14596462 13080593 11443728 9690334 7827408 5870191 3847401 1803772
11606A803772k003793j890889j702009j450011j164218q81355o29302m12856k11273
$$ 1803772 -200021 -2090910 -3792919 -5242930 -6407148 -7288503 -7917805 -8330661 -8541934
11597h541934R993K80627O10608R85277J369692J719670J996817K182247K280092
$$ -8541934 -8531941 -8251314 -7640706 -6655429 -5285737 -3566067 -1569250 612997 2893089
11588B893089K306039K268113K155646J946927J629829J218236P51863K81911
$$ 2893089 5199128 7467241 9622887 11569814 13199643 14417879 15169742 15451653
11580A5451653j45289m97944p61958r40534j049806j109251j130689j113126j047052
$$ 15451653 15306364 14808420 14046462 13105928 12056122 10946871 9816182 8703056 7656004
11571G656004r24791p50161n42251l31317j48831j7109N6360P9536P4411P4054
$$ 7656004 6731213 5981052 5438801 5107484 4958653 4941544 4997904 5077440 5151851 5225905
11561E225905J15046K24567M07760O43387Q91391J109356J270078J370608J426602
$$ 5225905 5340951 5565518 5973278 6616665 7508056 8617412 9887490 11258098 12684700
11552A2684700J455770J463286J440195J373912J260376J109127R39830P73277
$$ 12684700 14140470 15603756 17043951 18417863 19678239 20787366 21727196 22500473
11544B2500473O21133M79915L34366J69300j8984k21484m25741o25066q17202
$$ 22500473 23121606 23601521 23935887 24105187 24086203 23864719 23438978 22813912 21996710
11535B1996710r93930j135207j219377j244738j243851j275621j398232j639877
$$ 21996710 21002780 19867573 18648196 17403458 16159607 14883986 13485754 11845877
11527A1845877j983063k367638k708929k923586k954160k783922k437692j970745
$$ 11845877 9862814 7495176 4786247 1862661 -1091499 -3875421 -6313113 -8283858
11519h283858j451638r45247n00951j48049J03396K59537L37920L58437L31077
$$ -8283858 -9735496 -10680743 -11181694 -11329743 -11226347 -10966810 -10628890 -10270453 -9939376
11510i939376K48005Q7871j68368n19565r34355j353211j702122j914899j956628
$$ -9939376 -9691371 -9603500 -9771868 -10291433 -11225788 -12578999 -14281121 -16196020 -18152648
11501a8152648j835792j595704j289642r57143o16608k73731O7352M00536P20914
$$ -18152648 -19988440 -21584144 -22873786 -23830929 -24447537 -24721268 -24653916 -24253380 -23532466
11492b3532466J027741J323329J608527J876974K111135K283538K364070K329471
$$ -23532466 -22504725 -21181396 -19572869 -17695895 -15584760 -13301222 -10937152 -8607681
11484h607681K170685J897922J544268J164195Q21587N69661M34234M09917M68023
$$ -8607681 -6436996 -4539074 -2994806 -1830611 -1009024 -439363 -5129 404788 872811
11475H72811N67917O66070P22255P04337N92900L86614J06787k03855m91940p10221
$$ 872811 1440728 2106798 2829053 3533390 4126290 4512904 4619691 4415836 3923896 3213675
11465C213675q31180q50985p84895o58920n00969l32766j65164K50J64026L21889
$$ 3213675 2382495 1531510 746615 87695 -413274 -746040 -911204 -910954 -746928 -425039
11455d25039M63424N76054O48948O73512O43027N56023M22870K69430J32157M5542
$$ -425039 38385 614439 1263387 1936899 2579926 3135949 3558819 3828249 3960406 4005948
11445D005948K8475P7433J70742K81562L90635M89646N74205O35194O58130O31954
$$ 4005948 4034423 4111856 4282598 4564160 4954795 5444441 6018646 6653840 7311970 7943924
11435G943924N60138M65770L86767L62764M18890N53032P31502Q94930R73678
$$ 7943924 8504062 8969832 9356599 9719363 10138253 10691285 11422787 12317717 13291395
11426A3291395R09646O77466K95446j79317o68780j096380j407151j581451j637920
$$ 13291395 14201041 14878507 15173953 14994636 14325856 13229476 11822325 10240874 8602954
11417H602954j622014j582714j548734j517726j464731j363595j205692j001931
$$ 8602954 6980940 5398226 3849492 2331766 867035 -496560 -1702252 -2704183
11409b704183p68263n10494k25105Q4231L92275O56776Q40365R32009R50720R29367
$$ -2704183 -3472446 -3982940 -4208045 -4123814 -3731539 -3074763 -2234398 -1302389 -351669 577698
11399E77698Q92192Q43690P75830O84483N79474M81231M09618L73906L68509L75565
$$ 577698 1469890 2313580 3089410 3773893 4353367 4834598 5244216 5618122 5986631 6362196
11389F362196L74271L52555L11502K57470J90029J00039j8256j53012k73397l43795
$$ 6362196 6736467 7089022 7400524 7657994 7848023 7948062 7929806 7776794 7503397 7159602
11379G159602l43027k75180j66371n1602L9221Q9261R5433O4270N866p1589j64293
$$ 7159602 6816575 6541395 6375024 6323422 6362643 6451904 6547337 6611607 6617473 6545884 6381591
11368F381591k72215l97937n46809p25586r36223j167620j393083j576794j683554
$$ 6381591 6109376 5711439 5164630 4439044 3502821 2335201 942118 -634676 -2318230
11359b318230j684616j559633j300047r16411m45257N1391M97723Q24877R91952
$$ -2318230 -4002846 -5562479 -6862526 -7778937 -8224194 -8172803 -7675080 -6850203 -5858251
11350e858251R96448Q68512O54005L97939J36829r9645k83522l87401l92030l00308
$$ -5858251 -4861803 -3993291 -3339286 -2941347 -2804518 -2904163 -3187685 -3575086 -3967116 -4267424
11340d267424j46457J1753J17242J37495O9912p2053k74709n25970q05233j076291
$$ -4267424 -4413881 -4402128 -4284886 -4147391 -4077479 -4149532 -4424241 -4950211 -5755444 -6831735
11330f831735j293239j415112j418790j305003j098809q45531o00279m11309l03988
$$ -6831735 -8124974 -9540086 -10958876 -12263879 -13362688 -14208219 -14808498 -15219807 -15523795
11321a5523795k74395k96348l37291l74140m01689m30541m76521n47667o36172
$$ -15523795 -15798190 -16094538 -16431829 -16805969 -17207658 -17638199 -18114720 -18662387 -19298559
11312a9298559p19498p69058p60698o81579n31249l17860n2661K53036N85767
$$ -19298559 -20018057 -20787115 -21547813 -22229392 -22760641 -23078501 -23131162 -22878126 -22292359
11303b2292359R24715J239564J495808J665057J732959J699952J576536J378013
$$ -22292359 -21367644 -20128080 -18632272 -16967215 -15234256 -13534304 -11957768 -10579755
11295a0579755J121881Q28236N22147K35450L898j42440j91234j53695n9270N6682
$$ -10579755 -9457874 -8629638 -8107491 -7872041 -7868143 -8010583 -8201817 -8355512 -8414782 -8358100
11285h358100J63433K39380K73428K67515K39030K17052K29536K87508L77674
$$ -8358100 -8194667 -7955287 -7681859 -7414344 -7175314 -6958262 -6728726 -6441218 -6063544
11276f063544M70112N35970N62488N55583N30662M99994M65249M18728L51264
$$ -6063544 -5593432 -5057462 -4494974 -3939391 -3408729 -2908735 -2443486 -2024758 -1673494
11267a673494K60876J55117M4331o8192j87748l16232m36319n09126m92350l66722
$$ -1673494 -1412618 -1257501 -1213170 -1281362 -1469110 -1785342 -2221661 -2730787 -3223137 -3589859
11257c589859j50553J07350L49165N30131O31508O61542O45693O11833N79277
$$ -3589859 -3740412 -3633062 -3283897 -2753766 -2122258 -1460716 -815023 -203190 376087
11248C76087N57733N53865N77662O42685P59619R26327J120271J301449J429233
$$ 376087 933820 1487685 2065347 2708032 3467651 4393978 5514249 6815698 8244931
11239H244931J484592J480513J450944J426494J415045J398754J345425J225629
$$ 8244931 9729523 11210036 12660980 14087474 15502519 16901273 18246698 19472327
11231A9472327J027861P66341M77781K07827o117j46421k15954k29906k05183
$$ 19472327 20500188 21266529 21744310 21952137 21946020 21799599 21583645 21353739 21148556
11222B1148556j53070p6787K7943J70949L63858O13388R13160J238413J548085
$$ 21148556 20995486 20918699 20946642 21117591 21481449 22094837 23007997 24246410 25794495
11213B5794495J795234J941291J965949J866768J650885J328325R13988M35237
$$ 25794495 27589729 29531020 31496969 33363737 35014622 36342947 37256935 37692172
11205C7692172o4523n32239r18829j192755j346995j396216j365573j277913j146911
$$ 37692172 37627649 37095410 36176581 34983826 33636831 32240615 30875042 29597129 28450218
11196B8450218r77735p71015n26697k48612N0360L46526O09416Q07974R14711
$$ 28450218 27472483 26701468 26174771 25926159 25976519 26323045 26932461 27740435 28655146
11187B8655146R09827P88655N68210K84178k2456l19533n89648q28205j038175
$$ 28655146 29564973 30353628 30921838 31206016 31183560 30864027 30274379 29446174 28407999
11178B8407999j223535j382601j505717j580673j601869j574868j513271j432533
$$ 28407999 27184464 25801863 24296146 22715473 21113604 19538736 18025465 16592932
11170A6592932j346137j264335j192409j127271j055188r54698q05811o00617
$$ 16592932 15246795 13982460 12790051 11662780 10607592 9652894 8847083 8246466
11162H246466l47996o9894K05821M49913O34181P36791P51670O96278O10803N46463
$$ 8246466 7898470 7828576 8034397 8484310 9118491 9855282 10606952 11303230 11914033 12460496
11152A2460496N46356O27102P72130R42560J098490J213712J273208J260357J150059
$$ 12460496 13006852 13633954 14406084 15348644 16447134 17660846 18934054 20194411 21344470
11143B1344470R16331N48691O5967m80542j017454j471257j793169j973673k038416
$$ 21344470 22260801 22809492 22875459 22394917 21377463 19906206 18113037 16139364 14100948
11134A4100948k029694j986518j933196j877538j814945j735863j634759j516251
$$ 14100948 12071254 10084736 8151540 6274002 4459057 2723194 1088435 -427816
11126d27816j392991j275280j159885j027188q49477o05204k91516P0081M36610
$$ -427816 -1820807 -3096087 -4255972 -5283160 -6132637 -6737841 -7029357 -6959276 -6522666
11117f522666P54277R73644J063389J017024Q51154N98468K99877k065k68613
$$ -6522666 -5768389 -4794745 -3731356 -2714332 -1863178 -1264710 -964833 -966898 -1235511
11108a235511m69820n89175o27178o01857n43407m82224m35042l97500l48438
$$ -1235511 -1705331 -2294506 -2921684 -3523541 -4066948 -4549172 -4984214 -5381714 -5730152
11099e730152k63202j27324N6831K72931N01074P30564R67137J227670J523517
$$ -5730152 -5993354 -6120678 -6063847 -5790916 -5289842 -4559278 -3592141 -2364471 -840954
11090h40954J844231K155066K410987K576661K638688K604423K491820K318262
$$ -840954 1003277 3158343 5569330 8145991 10784679 13389102 15880922 18199184
11082A8199184K093787J820030J493816J113401O84539K23421k44966o91236j085073
$$ 18199184 20292971 22113001 23606817 24720218 25404757 25628178 25383212 24691976 23606903
11073B3606903j396315j596537j664813j596932j412006j150334q62029n92342
$$ 23606903 22210588 20614051 18949238 17352306 15940300 14789966 13927937 13335595
11065A3335595l71426k12215j13509o2737l6865n555N9896J74975L34619N13290
$$ 13335595 12964169 12751954 12638445 12575708 12538843 12533288 12593184 12768159 13102778 13616068
11055A3616068O70054P56509P28453N60993K61527j27366n39060r05108j179523
$$ 13616068 14286122 15042631 15771084 16332077 16593604 16466238 15927178 15022070 13842547
11046A3842547j352941j448007j498870j529212j542876j528793j471245j357373
$$ 13842547 12489606 11041599 9542729 8013517 6470641 4941848 3470603 2113230
11038B113230j181228r46369o66684l64258o5964J98576L98269N05163N04341
$$ 2113230 932002 -14367 -681051 -1045309 -1111273 -912697 -514428 -9265 495076
11029D95076M04948K43878P6799m0417p0120k578J44427L32581N14011O45635
$$ 495076 900024 1143902 1220701 1180284 1110164 1107586 1252013 1584594 2098605 2744240
11019B744240P03476O89185O23303N30136M26745L24111K35630J80177J72654
$$ 2744240 3447716 4136901 4760204 5290340 5717085 6041196 6276826 6457003 6629657
11010F629657K07707K50378K44214J36832q8331l92067o86558q70814q77016p01466
$$ 6629657 6837364 7087742 7331956 7468788 7380457 6988390 6301832 5431018 4554002 3852536
11000C852536m02997p1845K11753M06787N15676N66639N90344O06852O25840O50684
$$ 3852536 3449539 3377694 3589447 3996234 4511910 5078549 5668893 6275745 6901585 7552269
10990G552269O78172O95399O80100O05845M49496J99443j36570n28940r33675
$$ 7552269 8230441 8925840 9605940 10211785 10661281 10860724 10724154 10195214 9261539
10981I261539j306461j613448j833195j953198j966547j870510j667470j369684
$$ 9261539 7955078 6341630 4508435 2555237 588690 -1281820 -2949290 -4318974
10973d318974j006222o24113k76769l306J87689L17752M20265N15390N94507O25383
$$ -4318974 -5325196 -5949309 -6226078 -6229384 -6041695 -5723943 -5303678 -4788288 -4193781 -3568398
10963c568398N75236M36046K35093K4803j40633k28271k37593j95107j36838r0681
$$ -3568398 -2993162 -2557116 -2322023 -2297220 -2437853 -2666124 -2903717 -3098824 -3235662 -3326343
10953c326343p0268q1673j32584k31705l76435n39786o70817p12938o29052m15886
$$ -3326343 -3396611 -3478284 -3610868 -3842573 -4219008 -4758794 -5429611 -6142549 -6771601 -7187487
10943g187487r8587K86906P07901J136757J545174J900887K171141K329619K362113
$$ -7187487 -7286074 -6999168 -6291267 -5154510 -3609336 -1708449 462692 2792311 5154424
10934E154424K269699K070126J797150J496205J215629R94312Q48423P62311O90352
$$ 5154424 7424123 9494249 11291399 12787604 14003233 14997545 15845968 16608279 17298631
10925A7298631N73872L68545O8734k85267o21176q61789r51175q69497o34421
$$ 17298631 17872503 18241048 18309782 18024515 17403339 16541550 15590375 14720878 14086457
10916A4086457k94272Q0893M08802O08616O20260M23571M7336m37118r34587j349758
$$ 14086457 13792185 13873078 14281880 14890496 15510756 15934327 15981663 15544545 14609958 13260200
10906A3260200j609814j680404j569363j316225r73827n93340k19437J08506L58691
$$ 13260200 11650386 9969982 8400619 7084394 6110567 5517227 5297790 5406296 5764987
10897E764987N15955N90104O12544O19471O32528O50536O56428O32003N69931
$$ 5764987 6280942 6871046 7483590 8103061 8735589 9386125 10042553 10674556 11244487
10888A1244487M77437L71567K69034J75565Q1159l4265j86727l73789n69054p28697
$$ 11244487 11721924 12093491 12362525 12538090 12619249 12584984 12398257 12024468 11455414 10726717
10878A0726717q05529p63101n85544k82902J08507N33142R30182J247256J446383
$$ 10726717 9921188 9158087 8572543 8289641 8398148 8931290 9861472 11108728 12555111
10869A2555111J503360J409073J176025Q42318M63535R4048k30506m99344p20206
$$ 12555111 14058471 15467544 16643569 17485887 17949422 18043470 17812964 17313620 16593414
10860A6593414r06164j062189j177353j227293j188048j055988q62694o73511
$$ 16593414 15687250 14625061 13447708 12220415 11032367 9976379 9113685 8440174
10852H440174n66416o00356p90501j103696j474084j827259k100498k253298k268918
$$ 8440174 7873758 7273402 6482901 5379205 3905121 2077862 -22636 -2275934 -4544852
10843d544852k150025j911832j576052j167937p16028k51934J92502N90879R28528
$$ -4544852 -6694877 -8606709 -10182761 -11350698 -12066726 -12318660 -12126158 -11535279 -10606751
10834a0606751J206374J439475J648510J845911K023911K154188K201974K145036
$$ -10606751 -9400377 -7960902 -6312392 -4466481 -2442570 -288382 1913592 4058628
10826D058628J983026J732323J415164J054678O77667L18139J5468j92765k79595
$$ 4058628 6041654 7773977 9189141 10243819 10921486 11239625 11255093 11062328 10782733
10817A0782733k35875p3533J75886M66207P43022R51517J047244J009041Q48600
$$ 10782733 10546858 10473325 10649211 11115418 11858440 12809957 13857201 14866242 15714842
10808A5714842O09161L50637J27601k7154j04451j09441n3497M5223J58147K49741
$$ 15714842 16324003 16674640 16802241 16775087 16670636 16561195 16507698 16552921 16711068 16960809
10798A6960809K88481K55590J44554m4325l05864o26575r80823j330833j630807
$$ 16960809 17249290 17504880 17649434 17605109 17299245 16672670 15691847 14361014 12730207
10789A2730207j834621j906908j834342j630242j328280r69416n90854k21246
$$ 12730207 10895586 8988678 7154336 5524094 4195814 3226398 2635544 2414298
10781B414298J21195M31255P17224R94207J271706J544502J793581J994316K123913
$$ 2414298 2535493 2966748 3683972 4678179 5949885 7494387 9287968 11282284 13406197
10772A3406197K164439K104039J939426J678695J341431R55080N49527J52499
$$ 13406197 15570636 17674675 19614101 21292796 22634227 23589307 24138834 24291333
10764B4291333k13339n32787q00979j024676j218277j394526j555889j693564
$$ 24291333 24077994 23545207 22744228 21719552 20501275 19106749 17550860 15857296
10756A5857296j794712j852031j869100j858699j834945j803336j755504j673514
$$ 15857296 14062584 12210553 10341453 8482754 6647809 4844473 3088969 1415455
10748A415455j540470j347812j094211p81606m16909j9020L78573P36901J028067
$$ 1415455 -125015 -1472827 -2567038 -3348644 -3765553 -3784573 -3406000 -2669099 -1641032
10739a641032J247125J410046J538851J644109J716819J734711J677195J537220
$$ -1641032 -393907 1016139 2554990 4199099 5915918 7650629 9327824 10865044
10731A0865044J322914J052210P49026M44446J77621j0874r3159o7197M0314J83391
$$ 10865044 12187958 13240168 13989194 14433640 14611261 14600387 14507228 14440031 14480345 14663736
10721A4663736L12638L88973L89999L09380J53304o1814l09839n57136p70645
$$ 14663736 14976374 15365347 15755346 16064726 16218030 16156216 15846377 15289241 14518596
10712A4518596r31139j044126j138522j249564j393962j553019j676092j703665
$$ 14518596 13587457 12543331 11404809 10155245 8761283 7208264 5532172 3828507
10704C828507j596134j351204j001699n99279j96413J64331M53701O56802P74682
$$ 3828507 2232373 881169 -120530 -719809 -916222 -751891 -298190 358612 1133294
10695A133294Q24792Q37178Q44918Q70503R13550R48093R34912Q44019O72700
$$ 1133294 1958086 2795264 3640182 4510685 5424235 6372328 7307240 8151259 8823959
10686H823959M46775K05998j4322j94104l28440m19888m69551m74219m33441l60938
$$ 8823959 9270734 9476732 9462410 9268306 8939866 8519978 8050427 7576208 7142767 6781829
10676F781829k88207k53236k80705l68077m86906n97340o65730o75388o26698
$$ 6781829 6493622 6240386 5959681 5591604 5104698 4507358 3841628 3166240 2539542
10667B539542n30732m03543k64200j33150k7055M7598R5438J24834J37465J23920
$$ 2539542 2008810 1605267 1341067 1207917 1180862 1228460 1323898 1448732 1586197 1710117
10657A710117O9587l3823j80263l50014n16876o56632p53926q06489q24371q22995
$$ 1710117 1779704 1745881 1565618 1215604 698728 42096 -711830 -1518319 -2342690 -3165685
10647c165685q14217q02082p84768p58076p17445o60017n87226n04376m16042
$$ -3165685 -3979902 -4781984 -5566752 -6324828 -7042273 -7702290 -8289516 -8793892 -9209934
10638i209934l22278k20220j08253J2528J39323K67220L86946M84246N42429N46970
$$ -9209934 -9532212 -9752432 -9860685 -9848157 -9708834 -9441614 -9054668 -8570422 -8027993 -7481023
10628g481023M90762L77944K22690M2625j46177l26204m72123n53216n48618m64823
$$ -7481023 -6990261 -6612317 -6389627 -6347002 -6493179 -6819383 -7291506 -7844722 -8393340 -8858163
10618h858163l40968k36702k08511k85704m56794o72108q60295r50459q92382
$$ -8858163 -9199131 -9435833 -9644344 -9930048 -10386842 -11058950 -11919245 -12869704 -13762086
10609a3762086o71006l12248J23229N58658R25786J184810J330755J385196J380577
$$ -13762086 -14433092 -14745340 -14622111 -14063453 -13137667 -11952857 -10622102 -9236906 -7856329
10600g856329J346983J305091J261645J205499J109685R44258O93311L63415k0206
$$ -7856329 -6509346 -5204255 -3942610 -2737111 -1627426 -683168 10143 373558 353352
10591C53352m21202p95832j095483j273837j298442j161425q84981n19055j29523
$$ 353352 -67850 -863682 -1959165 -3233002 -4531444 -5692869 -6577850 -7096905 -7226428
10582g226428K20477M87265O52181P14601O79891N52453L39653O3228k32939m89398
$$ -7226428 -7005951 -6518686 -5866505 -5151904 -4472013 -3919560 -3579907 -3516679 -3749618 -4239016
10572d239016o51621o91477o14951m51306k32057K5016L15396O33071R56687J251253
$$ -4239016 -4890637 -5582114 -6197065 -6648371 -6880428 -6855412 -6540016 -5906945 -4950258 -3699005
10562c699005J483542J634815J698726J669413J534690J282215R13061M50647
$$ -3699005 -2215463 -580648 1118078 2787491 4322181 5604396 6517457 6968104
10554F968104o2519n77582j051582j451563j752631j937811k002103j954496j811994
$$ 6968104 6905585 6328003 5276421 3824858 2072227 134416 -1867687 -3822183 -5634177
10545e634177j588950j291732r24974n05288p0150L28633O45586Q62567R95487
$$ -5634177 -7223127 -8514859 -9439833 -9945121 -10015271 -9686638 -9041052 -8178485 -7182998
10536g182998J083063J164547J256707J341159J372271J305354J126662Q61447
$$ -7182998 -6099935 -4935388 -3678681 -2337522 -965251 340103 1466765 2328212
10528B328212N55756K51712k2385k45284l93317m40783l71651j94216N3460L13857
$$ 2328212 2883968 3135680 3113295 2868011 2474694 2033911 1662260 1468044 1521504 1835361
10518A835361N30297O64425P04221O65033N85778N18242N11063N96841P89014
$$ 1835361 2365658 3030083 3734304 4399337 4985115 5503357 6014420 6611261 7400275
10509G400275J086665J482366J969773K547805L218702L982894M836882N775459
$$ 7400275 8486940 9969306 11939079 14486884 17705586 21688480 26525362 32300821
10501C2300821O795980P905902R133865J0534365J2175913J4120291J6408531
$$ 32300821 39096801 47002703 56136568 66670933 78846846 92967137 109375668
10494A09375668J9050371K1997495K5093478K8011174L0193894L0847263K9084772
$$ 109375668 128426039 150423534 175517012 203528186 233722080 264569343 293654115
10487B93654115K4295243J6595654P029039k743812j1120694j7152358k0702039
$$ 293654115 317949358 334545012 341574051 338830239 327709545 310557187 289855148
10480B89855148k2198346k2267405k1476217k0229447j8763124j7187224j5546351
$$ 289855148 267656802 245389397 223913180 203683733 184920609 167733385 152187034
10473A52187034j3867593j2180970j0524807q950051p520446o301866n345425
$$ 152187034 138319441 126138471 115613664 106663613 99143167 92841301 87495876
10466H7495876m672866m267757m075460m015110l999723l954677l830138l608407
$$ 87495876 82823010 78555253 74479793 70464683 66464960 62510283 58680145 55071738
10458E5071738l302429k940066k542028k112026j646625j152029o51987j83995
$$ 55071738 51769309 48829243 46287215 44175189 42528564 41376535 40724548 40540553
10450D0540553K10584M98186O62546P06328O44009M93363K72877L494k91424n89846
$$ 40540553 40751137 41249323 41911869 42618197 43262206 43755569 44028446 44031940 43740516 43150670
10440D3150670q75217j137407j370418j569937j734193j867001j977231k071533
$$ 43150670 42275453 41138046 39767628 38197691 36463498 34596497 32619266 30547733
10432C0547733k146010k185143k168501k079358j911715j675309j394512j096598
$$ 30547733 28401723 26216580 24048079 21968721 20057006 18381697 16987185 15890587
10424A5890587p95571m86254j54995K03154N74172R25134J211287J388598J429791
$$ 15890587 15095016 14608762 14453767 14656921 15231093 16156227 17367514 18756112 20185903
10415B0185903J336182J137608Q81062O14895L73898J68714j4623k00834m03541
$$ 20185903 21522085 22659693 23540755 24155650 24529548 24698262 24683639 24482805 24079264
10406B4079264o10951p90679r10238r57852r48294r09497q59787p93093o84373
$$ 24079264 23468313 22677634 21767396 20809544 19861250 18951753 18091966 17298873 16614500
10397A6614500n11928k79566k1156K15659L92738M93151N14912M57442L16138
$$ 16614500 16102572 15823006 15801850 16017509 16410247 16903398 17418310 17875752 18191890
10388A8191890Q9489k09767n49486q81956j154594j324333j371045j303527j154309
$$ 18191890 18281379 18071612 17522126 16640170 15485576 14161243 12790198 11486671 10332362
10379A0332362r66292p77586o09779m63391l23811j76098j8590J36401K75557
$$ 10332362 9366070 8588484 7978705 7515314 7191503 7015405 6996815 7133216 7408773
10370G408773L98331N17628O46683P84877R15709J018339J081766J109021J108633
$$ 7408773 7807104 8324732 8971415 9756292 10672001 11690340 12772106 13881127 14989760
10361A4989760J082753J023997R24317P87176O31463M83150L60681K63226J67909
$$ 14989760 16072513 17096510 18020827 18808003 19439466 19922616 20283297 20546523 20714432
10352B0714432L7950j60337m39151p80355j142178j475304j735701j887961j904401
$$ 20714432 20752382 20592045 20152894 19372539 18230361 16755057 15019356 13131395 11226994
10343A1226994j767594j476956j054748n47799k3359M42964P86584R72943J004669
$$ 11226994 9459400 7982444 6927696 6379897 6356538 6799502 7586086 8559029 9563698
10334I563698R11893P32173M92639K04079j31266n04995q91906j251044j536885
$$ 9563698 10475591 11207764 11700403 11904482 11773216 11268221 10376315 9125271 7588386
10325G588386j713121j762994j694284j537768j337750j136705r61096q14852
$$ 7588386 5875265 4112271 2417987 880219 -457531 -1594236 -2555332 -3370184
10317c370184o81581n32894l40628r0675K06774N17529P96249J005112J126620
$$ -3370184 -4051765 -4584659 -4925287 -5015962 -4809188 -4291659 -3495410 -2490298 -1363678
10308a363678J163396J128481J036445R02142P44652N89098M62720L87585L74283
$$ -1363678 -200282 928199 1964644 2866786 3611438 4200536 4663256 5050841 5425124
10299E425124M19182N05662O08238O97538P45322P30864O49365N18590L77511
$$ 5425124 5844306 6349968 6958206 7655744 8401066 9131930 9781295 10299885 10677396
10290A0677396K74347K47834L09690M37057N80757O87076P20591O73977N61647
$$ 10677396 10951743 11199577 11509267 11946324 12527081 13214157 13934748 14608725 15170372
10281A5170372M06425K29401M5356j38330l19965m99769o77542q53964j031967
$$ 15170372 15576797 15806198 15851554 15713224 15393259 14893490 14215948 13361984 12330017
10272A2330017j213284j391785j550227j663791j707654j664836j532595j324872
$$ 12330017 11116733 9724948 8174721 6510930 4803276 3138440 1605845 280973
10264B80973j067287p85552m95521k03264Q5244L53640N72712P08320P36095O56122
$$ 280973 -786314 -1571866 -2067387 -2270651 -2185407 -1831767 -1259055 -550735 185360 841482
10254H41482M99450L20041J73188R1385P2080Q4621R1289O9123J9967l6053p7530
$$ 841482 1340932 1660973 1834161 1925546 1997626 2082247 2173536 2242659 2262626 2226573 2149043
10243B149043r5824r5209q1044m9410J0780J05766K27201L53161M58802N30496
$$ 2149043 2053219 1958010 1876966 1827556 1838336 1944102 2171303 2524464 2983266 3513762
10233C513762N76723O28807P26887Q95565J123539J361107J537585J588572J479562
$$ 3513762 4090485 4719292 5446179 6341744 7465283 8826390 10363975 11952547 13432109
10224A3432109J216732Q42112M16924K177l53844o17845p68285p94578p02097
$$ 13432109 14648841 15490953 15907877 15910054 15556210 14938365 14170080 13375502 12673405
10215A2673405n18489k93025q4590N7582J11097Q7891K9798o246L1062J68435
$$ 12673405 12154916 11861891 11777301 11834883 11945980 12033871 12063669 12057423 12088485 12256920
10205A2256920L99191O86849R74973J196379J282407J177350Q56999L40950l10652
$$ 12256920 12656111 13342960 14317933 15514312 16796719 17974069 18831068 19172018 18861366
10196A8861366j014391j684527k248667k655997k879913k916737k781716k503998
$$ 18861366 17846975 16162448 13913781 11257784 8377871 5461134 2679418 175420
10188A75420k121838j678053j215752p75402l93368r9358Q9677J76981J88059
$$ 175420 -1946418 -3624471 -4840223 -5615625 -6008993 -6108351 -6018674 -5841693 -5653634
10179e653634J62445J37112J29785J31558J14451N1277o3906k08967l45223m37766
$$ -5653634 -5491189 -5354077 -5224292 -5092734 -4978283 -4927006 -4990912 -5199879 -5545102 -5982868
10169e982868m69569m42151l66837k55129j13759N4295K45428M52339O65205Q74873
$$ -5982868 -6452437 -6894588 -7261425 -7516554 -7630313 -7576018 -7330590 -6878251 -6213046 -5338173
10159e338173J073381J251120J394795J489437J522886J489655J393484J249678
$$ -5338173 -4264792 -3013672 -1618877 -129440 1393446 2883101 4276585 5526263
10151E526263J086399R42269Q58175Q64278R67788J149466J372876J600188J801915
$$ 5526263 6612662 7554931 8413106 9277384 10245172 11394638 12767514 14367702 16169617
10142A6169617J954145K030372K000847J844255J563393J191863P85646M04976
$$ 16169617 18123762 20154134 22154981 23999236 25562629 26754492 27540138 27945114
10134B7945114R8162j05232j94538j79225r2519J1134P2774N4842m0604j75729
$$ 27945114 28043276 27938044 27743506 27564281 27471762 27482896 27555670 27610512 27569908 27394179
10124B7394179l01313l85035m24993m42151m61391m97102n51672o22844p10364
$$ 27394179 27092866 26707831 26282838 25840687 25379296 24882194 24330522 23707678 22997314
10115B2997314q16089r38374j065664j174887j237321j229359j141791r82791
$$ 22997314 22181225 21242851 20177187 19002300 17764979 16535620 15393829 14411038
10107A4411038p74616n46675l27081j35067K2600J49648K54760L45623M24677
$$ 14411038 13636422 13089747 12762666 12627599 12650199 12799847 13054607 13400230 13824907
10098A3824907M88601N33315N62351N91006O41034P29971Q64805J043818J260858
$$ 13824907 14313508 14846823 15409174 16000180 16641214 17371185 18235990 19279808 20540666
10089B0540666J504252J749281J950810K045509J968604J679548J181983N25605
$$ 20540666 22044918 23794199 25745009 27790518 29759122 31438670 32620653 33146258
10081C3146258k09461r34147j568094k051800k354378k475348k438702k282018
$$ 33146258 32936797 32002650 30434556 28382756 26028378 23553030 21114328 18832310
10073A8832310k045940j767326j476288j195844r42060p22869n36891l75620k28986
$$ 18832310 16786370 15019044 13542756 12346912 11404852 10681983 10145092 9769472 9540486
10064I540486q9110N0735J97370L52781N05710O30241O97059O90206O16441N00662
$$ 9540486 9451376 9502111 9699481 10052262 10557972 11188213 11885272 12575478 13191919 13692581
10054A3692581L71695K48306J33770K1121r6155k17105l35750m50345n70466p14493
$$ 13692581 14064276 14312582 14446352 14467473 14371318 14154213 13818463 13368118 12797652 12083159
10044A2083159q97703j118311j350869j551934j674517j681728j551498j273583
$$ 12083159 11185456 10067145 8716276 7164342 5489825 3808097 2256599 983016
10036I83016q47708k89511L59791J031314J640595K109093K383410K444285K305277
$$ 983016 135308 -154203 205588 1236902 2877497 4986590 7370000 9814285 12119562
10027A2119562K005408J598830J142676O85029K57204j25949m58690p36468r53527
$$ 12119562 14124970 15723800 16866476 17551505 17808709 17682760 17224070 16487602 15534075
10018A5534075j105518j190805j207129j149142j013905q11776n70521l25014
$$ 15534075 14428557 13237752 12030623 10881481 9867576 9055800 8485279 8160265
10010H160265j00233R7024K71277M24766N49551O29747O49598O01655M91702L38736
$$ 8160265 8060032 8157056 8428333 8853099 9402650 10032397 10681995 11283650 11775352 12114088
10000A2114088J69343R018j24422k21448k76426k83258k35849j33958J0284J72005
$$ 12114088 12283431 12292449 12168027 11946579 11670153 11386895 11151046 11017088 11027372 11199377
9990A1199377L22055M39500N19305N70297O06235O36882O63836O81310O79389
$$ 11199377 11521432 11960932 12480237 13050534 13656769 14293651 14957487 15638797 16318186
9981A6318186O47140N74542M54072K83708P1420j61911l85455n68184o90761p51746
$$ 16318186 16965326 17539868 17993940 18277648 18349068 18187157 17801702 17233518 16542757 15791011
9971A5791011p63972p44719p07865o62272o13207n62533n09335m55310m12559
$$ 15791011 15027039 14282320 13574455 12912183 12298976 11736443 11227108 10771798 10359239
9962A0359239m04613m56178n78908p64781r90901j230672j464680j686595j900787
$$ 10359239 9954626 9498448 8919540 8154759 7163858 5933186 4468506 2781911 881124
9953H81124k111467k310085k471102k560656k552612k442175k249710k012803
$$ 881124 -1230343 -3540428 -6011530 -8572186 -11124798 -13566973 -15816683 -17829486
9945a7829486j770189j546118j344395j154468r63105p61927n46525l10675m3988
$$ -17829486 -19599675 -21145793 -22490188 -23644656 -24607761 -25369688 -25916213 -26226888 -26270876
9936b6270876K61130N96465R31095J220888J430153J548441J589500J576838J531590
$$ -26270876 -26009746 -25413281 -24482186 -23261298 -21831145 -20282704 -18693204 -17116366 -15584776
9927a5584776J471467J415059J380548J376813J395122J409448J385380J292334
$$ -15584776 -14113309 -12698250 -11317702 -9940889 -8545767 -7136319 -5750939 -4458605
9919d458605J115152Q62574N67246K72841J3333k01409l84118n56429p33320r12070
$$ -4458605 -3343453 -2480879 -1913633 -1640792 -1627459 -1828868 -2212986 -2769415 -3502735 -4414805
9909d414805j068659j164763j163877j045919q09979m67247l3466M76922J059312
$$ -4414805 -5483464 -6648227 -7812104 -8858023 -9668002 -10135249 -10168715 -9691793 -8632481
9900h632481J728473K519031L468908M583803N787852O884990P579286P584285
$$ -8632481 -6904008 -4384977 -916069 3667734 9455586 16340576 23919862 31504147
9892C1504147O775404N275758L402563J516104j14830j358145k190948k653818
$$ 31504147 38279551 43555309 46957872 48473976 48359146 47001001 44810053 42156235
9884D2156235k816191k753819k537389k233306j907773j621612j416176j303624
$$ 42156235 39340044 36586225 34048836 31815530 29907757 28286145 26869969 25566345
9876B5566345j271063j294852j353654j431283j509562j560942j551137j450567
$$ 25566345 24295282 23000430 21646776 20215493 18705931 17144989 15593852 14143285
9868A4143285j243067r25004n00591J8640O10877J242646J869232K435845K883680
$$ 14143285 12900218 11975214 11474623 11493263 12104140 13346786 15216018 17651863 20535543
9859B0535543L164642L257652L173427K943672K604024K182239J696119J160533
$$ 20535543 23700185 26957837 30131264 33074936 35678960 37861199 39557318 40717851
9851D0717851O00578O3120l85094o78494p83373p18074n48620l63652k45601k51303
$$ 40717851 41318429 41381549 40996455 40317961 39534588 38816514 38267894 37904242 37658641 37407338
9841C7407338m01919o76871j015218j334177j562908j671324j673574j607516
$$ 37407338 37005419 36328548 35313330 33979153 32416245 30744921 29071347 27463831
9833B7463831j509797j402022j288316j158592r96038p87936n33935k46437N4084
$$ 27463831 25954034 24552012 23263696 22105104 21109066 20321130 19787195 19540758 19594842
9824A9594842L41823N86239P57275Q37601Q32923P68840O74005N62890M33013
$$ 19594842 19936665 20522904 21280179 22117780 22950703 23719543 24393548 24956438 25389451
9815B5389451K78840J09904m3679j45380j77002j54958j24388j34698k14669l63655
$$ 25389451 25668291 25778195 25734516 25589136 25412134 25257176 25132788 24998090 24783421 24419766
9805B4419766n59644p72105r69294j121048j203467j206202j135555j008351q40667
$$ 24419766 23860122 23088017 22118723 20997675 19794208 18588006 17452451 16444100 15603433
9796A5603433o41736m18799j87893K0721J69461K29128J93279Q2808o1621j95967
$$ 15603433 14961697 14542898 14355005 14375726 14545187 14774315 14967594 15050402 14988781 14792814
9786A4792814k90725l41199l64143l83297m13966m56708n02658n44895n86675
$$ 14792814 14502089 14160890 13796747 13413450 12999484 12542776 12040118 11495223 10908548
9777A0908548o40286p17266q17742r27248j022870j082718j091510j040110r22151
$$ 10908548 10268262 9550996 8733254 7806006 6783136 5700418 4608908 3568798 2646647
9768B646647p32156m67429j32872K53807O59021J034120J322061J470755J448984
$$ 2646647 1914491 1447062 1314190 1567997 2227018 3261138 4583199 6053954 7502938
9759G502938J256086R20078M88604K0915m18435p70486r98263j098908j101319
$$ 7502938 8759024 9679102 10167706 10188621 9770186 8999700 8001437 6902529 5801210
9750E801210j050061r85216r27373q72576p98213o76341m86763k23548J04753
$$ 5801210 4751149 3765933 2838560 1965984 1167771 491430 4667 -218881 -114128
9741a14128M77343Q63930J228679J534785J748570J844105J809147J649428J387238
$$ -114128 363215 1227145 2455824 3990609 5739179 7583284 9392431 11041859 12429097
9732A2429097J055842O96424L60242J09179M683Q3906L35379O92540J054568J325697
$$ 12429097 13484939 14181363 14541605 14650784 14655467 14739373 15074752 15767292 16821860 18147557
9722A8147557J451118J430274J303960J126504R39788P61816N92806M30440K80829
$$ 18147557 19598675 21028949 22332909 23459413 24399201 25161017 25753823 26184263 26465092
9713B6465092J58208P8398N4985R9193K16863L99212O14187Q09004R27091R30569
$$ 26465092 26623300 26701698 26756683 26855876 27072739 27471951 28086138 28895142 29822233 30752802
9703C0752802Q13501N97445L14591p084l47022o86415j002878j271020j468968
$$ 30752802 31566303 32163748 32478339 32471255 32124233 31437818 30434940 29163920 27694952
9694B7694952j588481j643184j666298j694183j745595j813652j876763j916378
$$ 27694952 26106471 24463287 22796989 21102806 19357211 17543559 15666796 13750418
9686A3750418j924979j900097j834434j713955j526760j275992r87007p02604
$$ 13750418 11825439 9925342 8090908 6376953 4850193 3574201 2587194 1884590
9678A884590m67346l08337k22783j80382j40202p1624L4331J67735L08480M31509
$$ 1884590 1417244 1108907 886124 705742 565540 493916 528247 695982 1004462 1435971
9668A435971N09046N16633M43955L02975J26701m1249j61922k15863k10149j71513
$$ 1435971 1945017 2461650 2905605 3208580 3335281 3294032 3132110 2916247 2706098 2534585
9658B534585j28352r4431o5946l2135R979M6856N1083n212j33346l18071n20882
$$ 2534585 2406233 2311802 2245856 2213721 2223700 2270556 2321639 2316427 2183081 1865010 1344128
9647A344128o93901p96268q06516p27597n82963m05065k21986m9136J11459K66881
$$ 1344128 650227 -146041 -952557 -1680154 -2263117 -2668182 -2890168 -2939304 -2827845 -2560964
9637b560964M27764O02865P93051R84687J145893J232026J203106J045690P84476
$$ -2560964 -2133200 -1530335 -737284 247403 1393296 2625322 3828428 4874118 5658594
9628E658594M74543J79115n3457k03117k79545l13516l41204l86378m48291n02446
$$ 5658594 6133137 6312252 6258795 6055678 5776133 5462617 5121413 4735035 4286744 3784298
9618C784298n15787m69026l72466k63634j86482j65237j90557k27675k41468k21425
$$ 3784298 3268511 2799485 2427019 2163385 1976903 1811666 1621109 1393434 1151966 930541
9608I30541j88109j74965j98197k37461k42208j59686L2594L07479N91988P93558
$$ 930541 742432 567467 369270 131809 -110399 -270085 -237491 69988 661976 1455534
9598A455534Q36612O90708L77305m3514m95448r07496j228977j434381j518045
$$ 1455534 2292146 2982854 3360159 3316645 2821197 1913701 684724 -749657 -2267702
9589b267702j485539j350678j138720q87294o38837m28291k74066j75385j14304
$$ -2267702 -3753241 -5103919 -6242639 -7129933 -7768770 -8197061 -8471127 -8646512 -8760816
9580h760816o1647J2282J24535K71035M29626N74533O93623P96295R05509J039367
$$ -8760816 -8822463 -8810181 -8685646 -8414611 -7984985 -7410452 -6716829 -5920534 -5015025 -3975658
9570c975658J196538J356763J494819J595313J656478J682334J672480J618974
$$ -3975658 -2779120 -1422357 72462 1667775 3324253 5006587 6679067 8298041
9562H298041J511226J342746J114444Q35415N24823K14119n5748k45626l33520
$$ 8298041 9809267 11152013 12266457 13101872 13626695 13840814 13785066 13539440 13205920
9553A3205920l24108k45235j33662k0054P7360J49607J91602K01626J84894J54917
$$ 13205920 12881812 12636577 12502915 12482861 12560221 12709828 12901430 13103056 13287950 13442867
9543A3442867J28805J19644J32032J63360K07507K55599K92642K95942K42946
$$ 13442867 13571672 13691316 13823348 13986708 14194215 14449814 14742456 15038398 15281344
9534A5281344J27815k5561j67542k44119k21719j00168R0889L06614N04421O57109
$$ 15281344 15409159 15383598 15216056 14971937 14750218 14650050 14740939 15047553 15551974 16209083
9524A6209083P56258Q04688Q03634P44673O13028M00533J19491j92943m84824
$$ 16209083 16965341 17770029 18573663 19318336 19931364 20331897 20451388 20258445 19773621
9515A9773621p09277q41796q84314q55739p78359o69547n40706l98724k45405
$$ 19773621 19064344 18222548 17338234 16482495 15704136 15034589 14493883 14095159 13849754
9506A3849754p5313J23350L61414O37746R32464J210298J432005J566655J599751
$$ 13849754 13774441 13897791 14259205 14896951 15829415 17039713 18471718 20038373 21638124
9497B1638124J536894J402960J234449J065003R10926P66289O11027M25758K02985
$$ 21638124 23175018 24577978 25812427 26877430 27788356 28554645 29165672 29591430 29794415
9488B9794415n1134l22203n93096q45188j058604j218202j324861j401136j480950
$$ 29794415 29743281 29421078 28827982 27982794 26924190 25705988 24381127 22979991 21499041
9479B1499041j587991j720609j856230j969584k047401k088311k091651k047359
$$ 21499041 19911050 18190441 16334211 14364627 12317226 10228915 8137264 6089905
9471F089905j935593j735898j439205j055283o12112j48829K93470O79498R85077
$$ 6089905 4154312 2418414 979209 -76074 -688186 -837015 -543545 135953 1121030
9462A121030J200741J333896J407475J452204J493673J541610J589170J621531
$$ 1121030 2321771 3655667 5063142 6515346 8009019 9550629 11139799 12761330
9454A2761330J624644J587526J501087J359502J163109R17163O26731K95155p0636
$$ 12761330 14385974 15973500 17474587 18834089 19997198 20914361 21541092 21836247 21765611
9445B1765611m55096q37211j198911j528196j812819k032382k159212k169841
$$ 21765611 21310515 20473304 19274393 17746197 15933378 13900996 11741784 9571943
9437I571943k059316j849215j584761j321955j109429r72165r04320q74709q42134
$$ 9571943 7512627 5663412 4078651 2756696 1647267 675102 -229218 -1103927 -1946061
9428a946061p73027o53336m89511k98624r4084J22196L53815N94654Q19230R89775
$$ -1946061 -2719088 -3372424 -3861935 -4160559 -4254643 -4132447 -3778632 -3183978 -2364748 -1374973
9418a374973J076273J074415J009914R29021Q82012R05555J008431J165980J327872
$$ -1374973 -298700 775715 1785629 2714650 3596662 4502217 5510648 6676628 8004500
9409H004500J437191J450834J349922J137011Q27571M46049K8750l74187p06276
$$ 8004500 9441691 10892525 12242447 13379458 14207029 14653078 14681828 14307641 13601365
9400A3601365r20927r97142r45686q03108o16617m26154k52244r6492M6081J72781
$$ 13601365 12680438 11683296 10737610 9934502 9317885 8891731 8639487 8542995 8589076 8761857
9390H761857K68489L13637K97641K26400J17987q677j41011k69368l78257m43410
$$ 8761857 9030346 9343983 9641624 9868024 9986011 9977334 9836323 9566955 9188698 8745288
9380H745288m39883l55960k03615j9349J46285K47434K61261J95189Q0107m3028
$$ 8745288 8305405 7949445 7745830 7726481 7872766 8120200 8381461 8576650 8656757 8613729
9370H613729j34248j62326j13061K761J48293K70593L17847K55519P4440k11226
$$ 8613729 8479481 8317155 8204094 8206855 8355148 8625741 8943588 9199107 9273547 9062321
9360I062321n72453r73294j373757j730075j998161k142178k143746k005975j749962
$$ 9062321 8489868 7516574 6142817 4412742 2414581 272403 -1871343 -3877318 -5627280
9351e627280j405896j003587n67790j20383L14547P09587J040058J293128J472406
$$ -5627280 -7033176 -8036763 -8604553 -8724936 -8410389 -7700802 -6660744 -5367616 -3895210
9342c895210J593202J670222J705464J685383J590623J412393J164140Q80914
$$ -3895210 -2302008 -631786 1073678 2759061 4349684 5762077 6926217 7807131
9334G807131O06827L77168K03866P2121m8541j84215l40097m98240o29679p10249
$$ 7807131 8413958 8791126 8994992 9067113 9018572 8834357 8494260 7996020 7366341 6656092
9324F656092p28281o80490n62818l66773q6988K63634O42173R79151J201289J263736
$$ 6656092 5927811 5247321 4684503 4317730 4230742 4494376 5136549 6115700 7316989 8580725
9314H580725J171465R73485P33011M95080K73527O1803j45433l37522m89649n79232
$$ 8580725 9752190 10725675 11458686 11953766 12227293 12289096 12143663 11806141 11316492 10737260
9304A0737260o04549n90336n74265n83873o21680o68284o97777o92184o46603
$$ 10737260 10132711 9542375 8968110 8384237 7762557 7094273 6396496 5704312 5057709
9295E057709n66982m67643l71758l09776l09168l78316m97865o29126p32917p83201
$$ 5057709 4490727 4023084 3651326 3341550 3032382 2654066 2156201 1527075 794158 10957
9285A0957p68975o91678n65722m19443k89160k05339j77598j87006j91918j48444
$$ 10957 -758018 -1449696 -2015418 -2434861 -2724021 -2929360 -3106958 -3293964 -3485882 -3634326
9275c634326l7165J20859K72477L62027L62414K87265J78795Q3232L0899K9779
$$ -3634326 -3671491 -3550632 -3278155 -2916128 -2553714 -2266449 -2087654 -2004422 -1973523 -1943744
9265a943744O9506J29236J87506K34334K80456L54467M85693O82933R23064J155895
$$ -1943744 -1874238 -1745002 -1557496 -1323162 -1042706 -688239 -202546 480387 1403451 2559346
9255B559346J322211J376462J303256J118997Q59378N64025K68869N289k01916
$$ 2559346 3881557 5258019 6561275 7680272 8539650 9103675 9372544 9377833 9175917
9246I175917l39787m09733m24066m01266l64963l43683l64704m41823n65314p02854
$$ 9175917 8836130 8426397 8002331 7601065 7236102 6892419 6527715 6085892 5520578 4817724
9236D817724q12780q62945q45382p79591p02701o50753o40064o58348o69820o29891
$$ 4817724 4004944 3141999 2296617 1517026 814325 163572 -476492 -1134840 -1804660 -2434551
9226b434551n00427k60807Q4531N02134R34017J313156J583196J711325J690501
$$ -2434551 -2934978 -3195785 -3111254 -2609120 -1675103 -361947 1221249 2932574 4623075
9217D623075J535955J280129R64789O29811L03922L017k65445m98094o93861q51654
$$ 4623075 6159030 7439159 8403948 9033759 9337681 9340698 9075253 8577159 7883298 7031644
9207G031644r65607j021676j001592q95246p14840n00603l12282k09661k32006
$$ 7031644 6066037 5044361 4042769 3147523 2432683 1932080 1619798 1410137 1178131
9198A178131l85021o37889r29115j180912j322279j315768j175472r63161p60065
$$ 1178131 793110 155221 -773894 -1954806 -3277085 -4592853 -5768325 -6731486 -7491551
9189g491551o27417n77402n70728n41252m32648k26425N3072L56764O38223Q72242
$$ -7491551 -8118968 -8696370 -9267098 -9808350 -10240998 -10467423 -10414351 -10057587 -9419364 -8547122
9179h547122J055376J194196J294215J356839J381245J365113J303430J189184
$$ -8547122 -7491746 -6297550 -5003335 -3646496 -2265251 -900138 403292 1592476
9171A592476J017971P93942N33142K62138J1834j92235l39492m38173n09039n70499
$$ 1592476 2610447 3404389 3937531 4199669 4211503 4019268 3679776 3241603 2732564 2162065
9161B162065o23222o44723n99409m59443k23835P5904L85348O44009Q00012Q19644
$$ 2162065 1538843 894120 294711 -164732 -388567 -312663 72685 716694 1516706 2336350
9151B336350O93691M41177J06961k49654n72234q22432r85932j067603j080550
$$ 2336350 3030041 3471218 3578179 3328525 2756291 1933859 947927 -119676 -1200226
9142a200226j036152r40021p94157o02103l73549j25651J20396L46030N39549
$$ -1200226 -2236378 -3176399 -3970556 -4572659 -4946208 -5071859 -4951463 -4605433 -4065884
9133d065884O92456P90678Q11130P30387N39121K49886j05959m85752q41370j125212
$$ -4065884 -3373428 -2582750 -1771620 -1041233 -502112 -252226 -358185 -843937 -1685307 -2810519
9123b810519j299557j346857j275528j119439r31731p71860o86160o90007p63854
$$ -2810519 -4110076 -5456933 -6732461 -7851900 -8783631 -9555491 -10241651 -10931658 -11695512
9114a1695512q67252r60880j021510j042742j026142r72591q80118p47293n76588
$$ -11695512 -12562764 -13523644 -14545154 -15587896 -16614038 -17586629 -18466747 -19214040 -19790628
9105a9790628l73708j44809J03420L59186O01201Q00786R31915R83538R65128
$$ -19790628 -20164336 -20309145 -20205725 -19846539 -19245338 -18444552 -17512637 -16529099 -15563971
9096a5563971Q99239Q03973O77565M98801K46354p5440m23649p27791r19214r61147
$$ -15563971 -14664732 -13860759 -13183194 -12684393 -12438039 -12513479 -12937128 -13664919 -14584133 -15545280
9086a5545280q62521o69829m44315k37736p7041L9012J33587K39600L85375N82986
$$ -15545280 -16407801 -17077630 -17521945 -17759681 -17836722 -17797710 -17664123 -17424523 -17039148 -16456162
9076a6456162Q24301J086589J342702J567208J734501J815002J780107J618141
$$ -16456162 -15631861 -14545272 -13202570 -11635362 -9900861 -8085859 -6305752 -4687611
9068d687611J350038J029567P24324M89049L47339K89586K83902K91899K82600
$$ -4687611 -3337573 -2308006 -1583682 -1094633 -747294 -457708 -173806 118093 400693
9059D00693K40718J67893P7810j1306q2466j22135j21048p6775K655R9039J91688
$$ 400693 641411 809304 887114 875808 793342 671207 550159 473384 476039 575078 766766
9048G66766K68738L33066L97184M70795N50995O22964O70853O91098O98709P21986
$$ 766766 1035504 1368570 1765754 2236549 2787544 3410508 4081361 4772459 5471168 6193154
9038F193154P89014R14186J091227J293649J479781J600488J609629J476294J194610
$$ 6193154 6982168 7896354 8987581 10281230 11761011 13361499 14971128 16447422 17642032
9029A7642032P86465K96165k19912p04816j110514j402361j557262j559671j403472
$$ 17642032 18428497 18724662 18504750 17799934 16689420 15287059 13729797 12170126 10766654
9020A0766654j102086o97346k54909J54170M72818O66948P25461O59315N02024
$$ 10766654 9664568 8967222 8712313 8866483 9339301 10006249 10731710 11391025 11893049
9011A1893049L06442J33263L3354L1591J20838K70079M41435O03783P35228Q18679
$$ 11893049 12199491 12332754 12366108 12397699 12518537 12788616 13230051 13833834 14569062 15387741
9001A5387741Q40321P93592O83105N24222L39702J55020q531j41025k45175l28934
$$ 15387741 16228062 17021654 17704759 18228981 18568683 18723703 18715172 18574147 18328972 18000038
8991A8000038l95697m40403m52313m19369l31929j87926Q59K07290L97052N43057
$$ 18000038 17604341 17163938 16711625 16292256 15960327 15772401 15773260 15980550 16377602 16920659
8981A6920659O35801O81622O91084O67832O06331M97505L35305J20505j36247
$$ 16920659 17556460 18238082 18929166 19596998 20203329 20700834 21036139 21156644 21020397
8972B1020397m11120o67768q66204r77040r92889r30332q22031p04089o06503
$$ 21020397 20609277 19941509 19075305 18098265 17105376 16175044 15353013 14648924 14042421
8963A4042421n51989n60345o48798q22884j064049j325861j544012j655338j618052
$$ 14042421 13490432 12930087 12281289 11458405 10394356 9068495 7524483 5869145 4251093
8954D251093j426830j116710p51524m00746j17358P1619J61297J60577Q7607k9894
$$ 4251093 2824263 1707553 956029 555283 437925 509544 670841 831418 919025 889131
8944H89131j54490k44551k66188k05963p6296R0849K59027M03280N18970O19014
$$ 889131 734641 490090 223902 17939 -58357 32492 291519 694799 1213769 1832783
8934A832783P21084Q33312R49162J055048J142134J209406J254928J266700J226754
$$ 1832783 2553867 3387179 4336341 5391389 6533523 7742929 8997857 10264557 11491311
8925A1491311J127977R87782Q43648P32401O69829O45037O30347N97487N30805
$$ 11491311 12619288 13607070 14450718 15183119 15852948 16497985 17128332 17725819 18256624
8916A8256624M32310L16584J98147Q0237m5317j86552l38703m81804n89808o42491
$$ 18256624 18688934 19005518 19203665 19283902 19238585 19052033 18713330 18231526 17641718 16999227
8906A6999227o31134n56411m23921k43043k9487J93418L99102N66310O85869P61523
$$ 16999227 16368093 15811682 15387761 15144718 15115231 15308649 15707751 16274061 16959930 17721453
8896A7721453Q05478Q31460Q46918Q46350Q09986P11344N31272K69924n0798l94384
$$ 17721453 18526931 19358391 20205309 21051659 21861645 22572989 23104261 23374185 23323387 22929003
8886B2929003p20135r91265j180320j273894j275355j201558j073220r05489p05804
$$ 22929003 22208868 21217603 20037283 18763389 17488034 16286476 15213256 14307767 13601963
8877A3601963m78722k31436K3955K69906M83623O41173P27301P45296P17636O74670
$$ 13601963 13123241 12891805 12915760 13185666 13669289 14310462 15037763 15783059 16500695 17175365
8867A7175365O38648O13514N86192N37462M55276L41795K09392O8593q2698k60181
$$ 17175365 17814013 18427527 19013719 19551181 20006457 20348252 20557644 20626237 20543539 20283358
8857B0283358m82853p57421j066469j367084j600842j710455j656599j430113
$$ 20283358 19800505 19043084 17976615 16609531 15008689 13298234 11641635 10211522
8849A0211522j056451n89712r6552L62979P47334J034169J216024J298279J297885
$$ 10211522 9155071 8565359 8468807 8831786 9579120 10613289 11829313 13127592 14425477
8840A4425477J236499J128914R76956P75677N26024K42071n1829l28926n66475
$$ 14425477 15661976 16790890 17767846 18543523 19069547 19311618 19259789 18930863 18364388
8831A8364388p48797q67609r19924r04648q20851o69628m57812j99902Q3302L67820
$$ 18364388 17615591 16747982 15828058 14923410 14102559 13432931 12975119 12775217 12858519 13226339
8821A3226339O28858Q41599R81984J029538R71204Q02129N22586J37605l34266
$$ 13226339 13855197 14696796 15678780 16708318 17679522 18481651 19004237 19141842 18807576
8812A8807576q49231j340083j738929k006371k144113k182769k156434k080518
$$ 18807576 17958345 16618262 14879333 12872962 10728849 8546080 6389646 4309128
8804D309128j942433j709030j349387q61059k80446L31062R11681J413265J799021
$$ 4309128 2366695 657665 -691722 -1552781 -1833227 -1502165 -590484 822781 2621802
8795B621802K037381K104424J994120J728039J358268R59932O11316L66506K35552
$$ 2621802 4659183 6763607 8757727 10485766 11844034 12803966 13415282 13781788 14017340
8786A4017340J86698J69854J44240R2520J7534o9309j56814k35529k94808l21148
$$ 14017340 14204038 14373892 14518132 14610652 14628186 14558877 14402063 14166534 13871726 13550578
8776A3550578l01180k27758j04657N3044K21824L74038M84067N36642N33572M92456
$$ 13550578 13249398 13021640 12916983 12970027 13191851 13565889 14049956 14586598 15120170 15612626
8766A5612626M35850L77579L15274K32643J07999p6231l26588o36176r86652j351262
$$ 15612626 16048476 16426055 16741329 16973972 17081971 17005740 16679152 16042976 15056324 13705062
8756A3705062j694565j969270k116985k079855j822090j351653p29475n8415N46240
$$ 13705062 12010497 10041227 7924242 5844387 4022297 2670644 1941169 1882754 2428994
8747B428994R92841J239435J298917J224790J088413R57645Q80700Q75805R28526
$$ 2428994 3421835 4661270 5960187 7184977 8273390 9231035 10111735 10987540 11916066
8738A1916066R98769J035662R94936Q53080O14398L08440k2188l38485o17190
$$ 11916066 12914835 13950497 14945433 15798513 16412911 16721351 16699163 16360678 15743488
8729A5743488q52271j047903j210053j341292j439067j497300j512295j490466
$$ 15743488 14891217 13843314 12633261 11291969 9852902 8355602 6843307 5352841
8721E352841j450468j415161j398878j400531j406179j395373j346197j240772
$$ 5352841 3902373 2487212 1088334 -312197 -1718376 -3113749 -4459946 -5700718
8713e700718j074058q61967o41021m57357l50667l40334m18225n50326o87525
$$ -5700718 -6774776 -7636743 -8277764 -8735121 -9085788 -9426122 -9844347 -10394673 -11082198
8704a1082198p81751q00020p30226n78451l62325j05562J64210M16172O19578
$$ -11082198 -11863949 -12663969 -13394195 -13972646 -14334971 -14440533 -14276323 -13860151 -13240573
8695a3240573P51276Q04236P90912P38229O76266O25702N89565N53979M98729
$$ -13240573 -12489297 -11685061 -10894149 -10155920 -9479654 -8853952 -8264387 -7710408 -7211679
8686g211679M11569K96051J68275M8012m7218j03377j11067o8729J5859J29236
$$ -7211679 -6800110 -6504059 -6335784 -6287772 -6334990 -6438367 -6549434 -6618163 -6602304 -6473068
8676f473068K58307L93342N26292O47801P46453Q10806Q32782Q10638P49853O61105
$$ -6473068 -6214761 -5821419 -5295127 -4647326 -3900873 -3090067 -2257285 -1446647 -696794 -35689
8666c5689N56943M50628L58118K99494K94181L49277M47999N48367N97119N53528
$$ -35689 521254 971882 1330000 1629494 1923675 2272952 2720951 3269318 3866437 4419965
8656D419965M09978J96730l2078k22483l40752l79848l52718k80139j81625p3094
$$ 4419965 4829943 5026673 4994595 4772112 4431360 4051512 3698794 3418655 3237030 3163936
8646C163936L0717J14058J61607J62795J15678K8240q2528j93494k81618l33668
$$ 3163936 3194653 3308711 3470318 3633113 3748791 3777031 3694503 3501009 3219391 2885723
8636B885723l54297l64335l86939m30410m81724n16173n13331m64290l66591k18097
$$ 2885723 2531426 2167091 1780152 1349742 868018 351845 -161486 -625776 -992367 -1210464
8626a210464k0876K08622M36427O20413P23906P24085O15478M12704J50189j26501
$$ -1210464 -1231340 -1022718 -586291 34122 758028 1482113 2097591 2510295 2660484 2533983
8616B533983l75533n69752o97589p57946p56021p02136o11929n06517m10880l47533
$$ 2533983 2158450 1588698 891109 133163 -622858 -1324994 -1936923 -2443440 -2854320 -3201853
8606c201853l25700l32968l38193l06963k20815q7901O1722J92868K82685L27648
$$ -3201853 -3527553 -3860521 -4198714 -4505677 -4726492 -4814393 -4752671 -4559803 -4277118 -3949470
8596c949470L37472L23001K87323K24550J25333j4183j84858l63383n18263o17892
$$ -3949470 -3611998 -3288997 -3001674 -2777124 -2651791 -2665974 -2850832 -3214215 -3732478 -4350370
8586d350370o35837n54581l71741j06608K01465N06572P73565R86367J143165
$$ -4350370 -4986207 -5540788 -5912529 -6019137 -5817672 -5311100 -4537535 -3551168 -2408003
8577b408003J246721J300046J308942J284223J238377J179899J112030J036661
$$ -2408003 -1161282 138764 1447706 2731929 3970306 5150205 6262235 7298896
8569G298896R57288Q77008P95390P10153O23070N43649M86238M62664M75565N16098
$$ 7298896 8256184 9133192 9928582 10638735 11261805 11805454 12291692 12754356 13229921 13746019
8559A3746019N66891O08375O24719O06217N48811M53888L29488J90051N1721p5610
$$ 13746019 14312910 14921285 15546004 16152221 16701032 17154920 17484408 17674459 17726180 17650570
8549A7650570j93977l15069m49375n93465p25335q12511q27684p61588o26645
$$ 17650570 17456593 17141524 16692149 16098684 15373349 14560838 13733154 12971566 12344921
8540A2344921m51238k67522r7523N4946J99876L45923M85597N91665O26646N59109
$$ 12344921 11893683 11626161 11528638 11583584 11783460 12129383 12614980 13206645 13833291 14392400
8530A4392400L78764J04335k18688n28697p62050q67154q18398o27484l43950
$$ 14392400 14771164 14875499 14656811 14128114 13366064 12498910 11680512 11053028 10709078
8521A0709078l8471K24729M09343N09914N39524N16053M57037L81884L13084K70544
$$ 10709078 10670607 10895336 11304679 11814593 12354117 12870170 13327207 13709091 14022175 14292719
8511A4292719K61374K73030K75949K34668J21259p4584l41219o47126r49216j204572
$$ 14292719 14554093 14827123 15103072 15337740 15458999 15384415 15043196 14396070 13446854 12242282
8501A2242282j380052j455592j423171j287278j069078q09076n60708l74204k79129
$$ 12242282 10862230 9406638 7983467 6696189 5627111 4818035 4257327 3883123 3603994
8492C603994k75767l39012m30796n14105n62313n60125m97726l65976j60456J07799
$$ 3603994 3328227 2989215 2558419 2044314 1482001 921876 424150 58174 -102282 5517
8482E517M07108O94526R34402J111482J230651J308221J363546J413664J468390
$$ 5517 412625 1107151 2041553 3153035 4383686 5691907 7055453 8469117 9937507
8473I937507J525484J569192J574708J516948J380360J166701Q97290O06039L24478
$$ 9937507 11462991 13032183 14606891 16123839 17504199 18670900 19568190 20174229 20498707
8464B0498707O8268j63384l74587n58397o94502p59351p38026o29327m44774k05730
$$ 20498707 20566975 20403591 20029004 19470607 18776105 18016754 17278728 16649401 16204627 15998897
8454A5998897O0341L24705N61414P48490Q67607R04685Q50840P02214M60496J37614
$$ 15998897 16059238 16383943 16945357 17693847 18561454 19466139 20316979 21019193 21479689 21617303
8444B1617303k36666o11463r22840j113370j155166j063889q94188p17859n97923
$$ 21617303 21380637 20769174 19846334 18732964 17577798 16513909 15619721 14901862 14303939
8435A4303939n73100o56168q38036j089331j360685j589398j716777j710782j581662
$$ 14303939 13730839 13074671 12236635 11147304 9786619 8197221 6480444 4769662 3188000
8426C188000j379963j176906j038118j003371j077903j234684j426325j604059
$$ 3188000 1808037 631131 -406987 -1410358 -2488261 -3722945 -5149270 -6753329
8418f753329j735871j813881j849232j861742j870663j886124j900975j888736
$$ -6753329 -8489200 -10303081 -12152313 -14014055 -15884718 -17770842 -19671817 -21560553
8410b1560553j811848j634778j332790q95935l35090L09303R66280J550095J987385
$$ -21560553 -23372401 -25007179 -26339969 -27235904 -27570994 -27261691 -26295411 -24745316 -22757931
8401b2757931K239599K307925K221165K017624J733509J402751J062595P54195
$$ -22757931 -20518332 -18210407 -15989242 -13971618 -12238109 -10835358 -9772763 -9018568
8393i018568N12480L51035K54982J89788J20673K8136r0014k26065l67824m97601
$$ -9018568 -8506088 -8155053 -7900071 -7710283 -7589610 -7561474 -7651488 -7877553 -8245377 -8742978
8383h742978n91498o25973n88072m79559l12048j00342J38472L81430N98976P61847
$$ -8742978 -9334476 -9960449 -10548521 -11028080 -11340128 -11440470 -11301998 -10920568 -10321592 -9559745
8373i559745Q53095Q77662Q62499Q45898Q61850R27903J040838J178849J307516
$$ -9559745 -8706650 -7828988 -6966489 -6120591 -5258741 -4330838 -3290000 -2111151 -803635
8364h03635J388809J392296J304732J133595R03097O45790L94152J75482J0205
$$ -803635 585174 1977470 3282202 4415797 5318894 5964684 6358836 6534318 6544523
8355F544523q9020j19698r1548k3451O5623J65283K74233L92290N11542O14154
$$ 6544523 6455503 6335805 6244257 6220806 6286429 6451712 6725945 7118235 7629777 8243931
8345H243931O77980O85795O32696N27667L88514K33922P8545o6788j93650k98012
$$ 8243931 8921911 9607706 10240402 10768069 11156583 11390505 11469050 11402262 11208612 10910600
8335A0910600l84345m66033n58797o70392p92819r01060r58907r30495p94311
$$ 10910600 10526255 10060222 9501425 8831033 8038214 7137154 6178247 5247752 4453441
8326D453441n54608k44733Q0171L58960N42637O07497N58014M19730K27608J6181
$$ 4453441 3898833 3654100 3734271 4093231 4635868 5243365 5801379 6221109 6448717 6464898
8316F464898j85798l57429m86057n66288n98244n86529n40174m71193l89969l00124
$$ 6464898 6279100 5921671 5435614 4869326 4271082 3684553 3144379 2673186 2283217 1983093
8306A983093j98210p9967N1557J82871K94253L67881L94665L76980L27022K61136
$$ 1983093 1784883 1704916 1756473 1939344 2233597 2601478 2996143 3373123 3700145 3961281
8296C961281J91784J21255M2298n3669j67062k87327l98137m84509n35903n45787
$$ 3961281 4153065 4274320 4316618 4262949 4095887 3808560 3410423 2925914 2390011 1844224
8286A844224n11148m32366l11195j47872N7748K99004N54708P89157R62256J044368
$$ 1844224 1333076 900710 589515 441643 499391 798395 1353103 2142260 3104516 4148884
8276D148884J027457R26888P73293N99337M29625K79631J61962R1802Q4920J49229
$$ 4148884 5176341 6103229 6876522 7475859 7905484 8185115 8347077 8438879 8523799 8673028
8266H673028K76767M42471O11733P53662Q52911R12274R44045R56964R48768R07472
$$ 8673028 8949795 9392266 10003999 10757661 11610572 12522846 13466891 14423855 15372623 16280095
8256A6280095Q15968O54451M02370M5040m15342r51616j514235k044731k492070
$$ 16280095 17096063 17750514 18152884 18197924 17782582 16830966 15316731 13272000 10779930
8247A0779930k821222l009270l035903k881653k540233k035751j428305q00656
$$ 10779930 7958708 4949438 1913535 -968118 -3508351 -5544102 -6972407 -7773063
8239g773063k33722K15569N25160P04920P82164P83965P28196O28278N03250L80069
$$ -7773063 -8006785 -7791216 -7266056 -6561136 -5778972 -4995007 -4266811 -3638533 -3135283 -2755214
8229b755214K85002K32292K18030K19881K01548J24284l4385k63811n18524p35670
$$ -2755214 -2470212 -2237920 -2019890 -1800009 -1598461 -1474177 -1508562 -1772373 -2290897 -3026567
8219c026567q61055q67825p59667n62013l10183m0705K13068M22841N66825O32699
$$ -3026567 -3887622 -4755447 -5515114 -6077127 -6387310 -6428015 -6214947 -5792106 -5225281 -4592582
8209d592582O22738N58538M79535M31707M50591N48421P12338R12200J111392
$$ -4592582 -3969844 -3411306 -2931771 -2500064 -2049473 -1501052 -788714 123486 1234878
8200A234878J275658J378463J402739J339021J182089R30338N90673J86557k37668
$$ 1234878 2510536 3888999 5291738 6630759 7812848 8743186 9333859 9520416 9282748
8191I282748o22590r10419j065841j089847j017271q97655p70107o47946n22046
$$ 9282748 8660158 7749739 6683898 5594051 4576780 3679125 2909018 2261072 1739026
8182A739026l77092k05552r077K08934M48043P06753R74475J227906J435092J564080
$$ 1739026 1361934 1156382 1147305 1356239 1804282 2511035 3485510 4713416 6148508 7712588
8172G712588J591180J505943J312941J032624P02392L74543J05107o6562j36562
$$ 7712588 9303768 10809711 12122652 13155276 13857668 14232211 14337318 14270756 14134194
8163A4134194j38720j26141j44007k11538l21625m52658n81521o91187p72814
$$ 14134194 13995474 13869333 13725326 13513788 13192163 12739505 12157984 11466797 10693983
8154A0693983q24033q44199q28265p63836o35758m36711j75789J22318M27086
$$ 10693983 9869950 9025751 8197486 7433650 6797892 6361181 6185392 6307710 6734796
8145F734796P13122R65088J175631J339674J448581J486710J433680J274448J013201
$$ 6734796 7447918 8413006 9588637 10928311 12376892 13863602 15297282 16571730 17584931
8136A7584931O81140L30985K1393j98627k99180k74607j46562L9183K27483L76126
$$ 17584931 18266071 18597056 18618449 18419822 18120642 17846035 17699473 17738656 17966139 18342265
8126A8342265M71813N28788N73038O25341O93849P76350Q65318R50111J016053
$$ 18342265 18814078 19342866 19915904 20541245 21235094 22011444 22876762 23826873 24842926
8117B4842926J043528J009969Q95420O90222M01517N4562l13748o67434r83644
$$ 24842926 25886454 26896423 27791843 28482065 28883582 28938144 28624396 27956962 26973318
8108B6973318j257112j493798j697933j861448j963394j979991j898456j725182
$$ 26973318 25716206 24222408 22524475 20663027 18699633 16719642 14821186 13096004
8100A3096004j483278j201932r04833o04146l02463n85K93951N62713P78566R12313
$$ 13096004 11612726 10410794 9505961 8901815 8599352 8598767 8892718 9455431 10233997 11146310
8090A1146310R40475Q52826O59398L94572J13233j24459k75606l32463l22473
$$ 11146310 12086785 12939611 13599009 13993581 14106814 13982355 13706749 13374286 13051813
8081A3051813k87339k53574k15762j45663k0482J51565L27472M49678M75958L99812
$$ 13051813 12764474 12510900 12295138 12149475 12128993 12280558 12608030 13057708 13533666 13933478
8071A3933478K50052P2429r2878k23094l09194l44823l20603k29874p9977J03019
$$ 13933478 14183530 14255959 14163081 13939987 13630793 13285970 12965367 12735493 12655516 12758535
8061A2758535K83061M31040N36196O01702O27954N98579M83351K58506o9754m56765
$$ 12758535 13041596 13472636 14008832 14610534 15238488 15837067 16320418 16578924 16509170 16052405
8051A6052405q33512j134382j320441j386180j351507j249083j113751r74486
$$ 16052405 15218893 14084511 12764070 11377890 10026383 8777300 7663549 6689063
8043F689063q48368p39506o44808n62581m96163m49112m16773l83097l27093k34579
$$ 6689063 5840695 5101189 4456381 3893800 3397637 2948525 2531752 2148655 1821562 1586983
8033A586983j06015M4984J99586L41467M60978N56682O34791P05436P76209Q46481
$$ 1586983 1480968 1525952 1725538 2067005 2527983 3084665 3719456 4424892 5201101 6047582
8023F047582R05168R31433Q97684P76763N53944K38426j34104n10986q38636j076109
$$ 6047582 6952750 7884183 8781867 9558630 10112574 10351000 10216896 9705910 8867274 7791165
8013G791165j201172j210585j118355r52490p47047n29148l08038p5857J79045
$$ 7791165 6589993 5379408 4261053 3308563 2561516 2032368 1724330 1648473 1827518
8004A827518M56600P38891R95467J194281J312981J348174J318941J259887J204647
$$ 1827518 2284118 3023009 4018476 5212757 6525738 7873912 9192853 10452740 11657387
7995A1657387J169796J150705J131675J100981J058099J008439R52628Q82108
$$ 11657387 12827183 13977888 15109563 16210544 17268643 18277082 19229710 20111818
7987B0111818P85658O60113N14734L65937K28657J12092K0660m5610r5235j49636
$$ 20111818 20897476 21557589 22072323 22438260 22666917 22779009 22799669 22754059 22658824 22509188
7977B2509188k38607l84172n83081q02815r95591j119791j154652j102896r84958
$$ 22509188 22270581 21886409 21303328 20500513 19504922 18385131 17230479 16127583 15142625
7968A5142625q29244o60894m92049l18036j21734J15285L99201P14836J027692
$$ 15142625 14313381 13652487 13160438 12842402 12720668 12835953 13235154 13949990 14977682
7959A4977682J297480J493589J601543J619686J554619J420513J237738J025534
$$ 14977682 16275162 17768751 19370294 20989980 22544599 23965112 25202850 26228384
7951B6228384P92934N38098K59757k7866k90661m87524n92522o08625n61778m82307
$$ 26228384 27021318 27559416 27819173 27791307 27500646 27013122 26420600 25811975 25250197 24767890
7941B4767890l92280l08353k50677k42028k94262l94623n05743n81654n90614
$$ 24767890 24375610 24067257 23816580 23574552 23280290 22885667 22379924 21798270 21207656
7932B1207656n31948m38003l60911l51636m41483o32507q97830j190648j459119
$$ 21207656 20675708 20237705 19876794 19525158 19083675 18451168 17553338 16362690 14903571
7923A4903571j661885j776991j800031j734523j583139j347209j034462o67061
$$ 14903571 13241686 11464695 9664664 7930141 6347002 4999793 3965331 3298270
7915C298270k81295Q2074L88860O15430P44929P62534O56199M23935Q3491l22371
$$ 3298270 3016975 3099049 3487909 4103339 4848268 5610802 6267001 6690936 6774427 6452056
7905F452056p32206j085893j349334j526263j645484j731286j780520j765357
$$ 6452056 5719850 4633957 3284623 1758360 112876 -1618410 -3398930 -5164287
7897e164287j658537j458889j196158r13174o41500l88714j42831J13426L88716
$$ -5164287 -6822824 -8281713 -9477871 -10391045 -11032545 -11421259 -11564090 -11450664 -11061948
7888a1061948O74813R45290J162289J290932J315384J246663J116989R65154Q22092
$$ -11061948 -10387135 -9441845 -8279556 -6988624 -5673240 -4426577 -3309588 -2344434 -1522342
7879a522342P02615O04791N16761M28332L39635K59312J94725J45612J07864Q0603
$$ -1522342 -819727 -214936 301825 730157 1069792 1329104 1523829 1669441 1777305 1857908
7869A857908O6170O3371O3555N4693K8850j3476o3222j05284j23594j08199o0938
$$ 1857908 1924078 1987449 2051004 2105697 2134547 2121071 2057849 1952565 1828971 1720772 1659834
7858A659834M242O7138J11118J33042J47638J81164K55132L68862M91788N71026
$$ 1659834 1664076 1731214 1842332 1975374 2123012 2304176 2559308 2928170 3419958 3990984
7848C990984N51859M03086J36408j90164m88911o74204o97813n73137l75619k15198
$$ 3990984 4542843 4945929 5082337 4892173 4403262 3729058 3031245 2458108 2082489 1867291
7838A867291j90802l48209o60972j041387j374318j558393j537192j308278r10420
$$ 1867291 1676489 1328280 667308 -374079 -1748397 -3306790 -4843982 -6152260 -7062680
7829g062680m01686J57310P10046J205112J597834J855053J961603J924255J769166
$$ -7062680 -7464366 -7307056 -6597010 -5391898 -3794064 -1939011 22592 1946847 3716013
$$ [...]
##END NTUPLES=NMR SPECTRUM
##END=
