##TITLE=31Pdec_DE-23_45m_rm
 
  24 sc
 1.11.2023
##JCAMPDX= 6.0         $$ Bruker NMR JCAMP-DX V2.0
##DATA TYPE= NMR SPECTRUM
##DATA CLASS= NTUPLES
##ORIGIN= UXNMR, Bruker Analytische Messtechnik GmbH
##OWNER= root
$$ XWIN-NMR		Version 3.5
$$ Wed Nov  1 15:42:48 2023 Russian Standard Time (UT+4h)  she@DPX200
##.OBSERVE FREQUENCY= 81.013821
##.OBSERVE NUCLEUS= ^31P
##.ACQUISITION MODE= SIMULTANEOUS
##.ACQUISITION SCHEME= undefined
##.AVERAGES= 24
##.DIGITISER RES= 16
##SPECTROMETER/DATA SYSTEM= spect
##.PULSE SEQUENCE= zgpg30
##.SOLVENT NAME= CDCl3
##.SHIFT REFERENCE= (INTERNAL, CDCl3, 0, 248.564)
##AUDIT TRAIL= $$ (NUMBER, WHEN, WHO, WHERE, WHAT)
$$ ##TITLE= Audit trail, XWIN-NMR		Version 3.5
$$ ##JCAMPDX= 5.01
$$ ##ORIGIN= Bruker BioSpin GmbH
$$ ##OWNER= she
$$ F:/spectra/data/she/nmr/P31/1/pdata/1/auditp.txt
$$ ##AUDIT TRAIL=  $$ (NUMBER, WHEN, WHO, WHERE, WHAT)
(   1,<2023-11-01 15:41:19.65 +0400>,<she>,<DPX200>,
      <created by zg, POWCHK disabled, PULCHK disabled
       configuration hash MD5:
       00 E9 B6 7A A2 85 ED C7 34 08 36 98 17 FE 4E 26
       data hash MD5: 32K
       56 09 B4 BD 04 7A CA 15 84 3E 20 72 E3 92 8B 36>)
(   2,<2023-11-01 15:41:36.59 +0400>,<she>,<DPX200>,
      <Start of raw data processing
       efp BC_mod = 2 LB = 5 FT_mod = 6 PKNL = 1 PHC0 = -10650.13 PHC1 = 36.4902 SI = 64K 
       data hash MD5: 64K
       42 88 13 9F F5 0E F8 C2 D7 63 3D 62 C9 A1 F0 9F>)
(   3,<2023-11-01 15:42:06.96 +0400>,<she>,<DPX200>,
      <pk PHC0 = -56.12718 PHC1 = 130.4 
       data hash MD5: 64K
       1D BE B6 0B 1A 06 BB 81 5B D7 40 25 8D 8E 95 F1>)
(   4,<2023-11-01 15:42:14.95 +0400>,<she>,<DPX200>,
      <abs ABSG = 5 
       data hash MD5: 64K
       C1 5F 56 A2 08 F7 16 32 89 52 0D EC CD 89 FE 0C>)
$$ ##END=
$$ 
$$ hash MD5
$$ CD DC C8 19 68 25 19 C5 CE 01 46 55 DD 7F D8 4A
##$RELAX= 
##$RELAX= 
##$RELAX= 
##$RELAX= 
##$RELAX= 
##$RELAX= 
##$RELAX= 
##$RELAX= 
##$RELAX= 
$$ Bruker specific parameters
$$ --------------------------
##$DU= <F:/spectra>
##$EXPNO= 1
##$NAME= <P31>
##$PROCNO= 1
##$TYPE= <nmr>
##$USER= <she>
##$AMP= (0..31)
100 100 100 100 100 100 100 100 100 100 100 100 100 100 100 100 100 100 
100 100 100 100 100 100 100 100 100 100 100 100 100 100 
##$AQSEQ= 0
##$AQ_mod= 1
##$AUNM= <au_zg>
##$AUTOPOS= <>
##$BF1= 81.014009
##$BF2= 200.13
##$BF3= 200.13
##$BF4= 200.13
##$BF5= 200.13
##$BF6= 200.13
##$BF7= 200.13
##$BF8= 200.13
##$BYTORDA= 1
##$CFDGTYP= 0
##$CFRGTYP= 5
##$CHEMSTR= <none>
##$CNST= (0..31)
1 1 145 1 1 1 1 1 1 1 1 1 1 1 1 1 1 1 1 1 1 1 1 1 1 1 1 1 1 1 1 1 
##$CPDPRG= <waltz16>
##$CPDPRG1= <>
##$CPDPRG2= <waltz16>
##$CPDPRG3= <>
##$CPDPRG4= <mlev>
##$CPDPRG5= <mlev>
##$CPDPRG6= <mlev>
##$CPDPRG7= <mlev>
##$CPDPRG8= <mlev>
##$CPDPRGB= <>
##$CPDPRGT= <>
##$D= (0..31)
0 1 0 0 0 0 0 0 0 0 0 0.03 2e-05 3e-06 0 0 0 0 0 0 0 0 0 0 0 0 0 0 0 0 
0 0 
##$DATE= 1698838879
##$DBL= (0..7)
120 120 120 11 120 120 24 19 
##$DBP= (0..7)
150 150 150 150 150 150 150 150 
##$DBP07= 0
##$DBPNAM0= <>
##$DBPNAM1= <>
$$ [...]
##$SUBNAM3= <"">
##$SUBNAM4= <"">
##$SUBNAM5= <"">
##$SUBNAM6= <"">
##$SUBNAM7= <"">
##$SUBNAM8= <"">
##$SUBNAM9= <"">
##$SW= 501.771253377433
##$SWIBOX= (0..15)
0 1 3 0 0 0 0 0 0 0 0 0 0 0 0 0 
##$SW_h= 40650.406504065
##$TD= 32768
##$TD0= 1
##$TE= 0
##$TE2= 300
##$TE3= 300
##$TEG= 300
##$TL= (0..7)
0 120 53 12 22 120 120 120 
##$TP= (0..7)
150 150 150 150 150 150 150 150 
##$TP07= 0
##$TPNAME0= <>
##$TPNAME1= <>
##$TPNAME2= <>
##$TPNAME3= <>
##$TPNAME4= <>
##$TPNAME5= <>
##$TPNAME6= <>
##$TPNAME7= <>
##$TPOAL= (0..7)
0.5 0.5 0.5 0.5 0.5 0.5 0.5 0.5 
##$TPOFFS= (0..7)
0 0 0 0 0 0 0 0 
##$TUNHIN= 0
##$TUNHOUT= 0
##$TUNXOUT= 0
##$USERA1= <user>
##$USERA2= <user>
##$USERA3= <user>
##$USERA4= <user>
##$USERA5= <user>
##$V9= 5
##$VALIST= <valist>
##$VCLIST= <CCCCCCCCCCCCCCC>
##$VD= 0
##$VDLIST= <DDDDDDDDDDDDDDD>
##$VPLIST= <PPPPPPPPPPPPPPP>
##$VTLIST= <TTTTTTTTTTTTTTT>
##$WBST= 1024
##$WBSW= 4
##$XGAIN= (0..3)
0 0 0 0 
##$XL= 0
##$YL= 0
##$YMAX_a= 13904
##$YMIN_a= -11530
##$ZGOPTNS= <>
##$ZL1= 120
##$ZL2= 120
##$ZL3= 120
##$ZL4= 120
##$ABSF1= 248.5645
##$ABSF2= -253.2056
##$ABSG= 5
##$ABSL= 3
##$ALPHA= 0
##$AQORDER= 0
##$ASSFAC= 0
##$ASSFACI= 0
##$ASSFACX= 0
##$ASSWID= 0
##$AUNMP= <proc_1d>
##$AZFE= 0.1
##$AZFW= 0.5
##$BCFW= 0
##$BC_mod= 2
##$BYTORDP= 0
##$COROFFS= 0
##$CY= -3
##$DATMOD= 1
##$DC= 0
##$DFILT= <>
##$DTYPP= 0
##$F1P= 0
##$F2P= 0
##$FCOR= 1
##$FTSIZE= 65536
##$FT_mod= 6
##$GAMMA= 0
##$GB= 0
##$INTBC= 1
##$INTSCL= 6.047779e-11
##$ISEN= 30
##$LB= 5
##$LEV0= 0
##$LPBIN= 0
##$MAXI= 10000
##$MC2= 0
##$MEAN= 0
##$ME_mod= 0
##$MI= 50
##$NCOEF= 0
##$NC_proc= -7
##$NLEV= 6
##$NOISF1= 182.463
##$NOISF2= 159.3651
##$NSP= 0
##$NTH_PI= 0
##$NZP= 0
##$OFFSET= 248.5645
##$PC= 4
##$PHC0= -10706.26
##$PHC1= 166.8902
##$PH_mod= 1
##$PKNL= yes
##$PPARMOD= 0
##$PSCAL= 0
##$PSIGN= 0
##$REVERSE= no
##$SF= 81.0140089999694
##$SI= 65536
##$SIGF1= 159.3651
##$SIGF2= -187.1042
##$SINO= 113.3802
##$SIOLD= 16384
##$SREGLST= <1H.CDCl3>
##$SSB= 0
##$STSI= 65536
##$STSR= 0
##$SW_p= 40650.406504065
##$SYMM= 0
##$S_DEV= 0
##$TDeff= 32768
##$TDoff= 0
##$TI= <>
##$TILT= no
##$TM1= 0
##$TM2= 0
##$TOPLEV= 0
##$USERP1= <user>
##$USERP2= <user>
##$USERP3= <user>
##$USERP4= <user>
##$USERP5= <user>
##$WDW= 1
##$XDIM= 65536
##$YMAX_p= 339803384
##$YMIN_p= -33050326
$$ End of Bruker specific parameters
$$ ---------------------------------
##NTUPLES= NMR SPECTRUM
##VAR_NAME=  FREQUENCY,     SPECTRUM/REAL,   SPECTRUM/IMAG
##SYMBOL=    X,             R,               I
##VAR_TYPE=  INDEPENDENT,   DEPENDENT,       DEPENDENT
##VAR_FORM=  AFFN,          ASDF,            ASDF
##VAR_DIM=   65536,         65536,           65536
##UNITS=     HZ,            ARBITRARY UNITS, ARBITRARY UNITS
##FACTOR=    0.620285442955139, 1,           1
##FIRST=     20137.2065510682, 0,            0
##LAST=      -20513.1999529968, 0,           0
##MIN=       -20513.1999529968, -33050326,   0
##MAX=       20137.2065510682, 339803384,    0
$$ Real data points
##PAGE= N=1
##DATA TABLE= (X++(R..R)), XYDATA
$$ [...]
39035A007228j63838j74691j09353j7615L7879M5561K8000o058o8308j61527k62156
39024A55122l31338l36664k66593j31731M4455K35447M13934N50358O16920N97955
39014A547865M99992L52506J92953M3822r2601k10310k78507k62039j64862l7996
39004A590823O1226J07244J04449O7106J0302n3345j17832j74831j98920j62308
38994A233914p5217Q186M1468L1436J9782L6658Q8492J70012K58275L05996K76253
38983B395255J89592J12977R3560J16332J27425Q4108j5963j33929k13756k25394
38973B530207j91273j58678j45292j27031p7381M412J07414K22564L27712L84824
38963B877478L77960L41011L22272L26011L09561K35085J05543m5741j76347k44323
$$ plain form
39035 1007228 843390 668699 559346 541731 579610 625171 653171 647113 578805 417278 155122
39024 155122 -176216 -512880 -779473 -911204 -866749 -631302 -217368 332990 949910 1547865
39014 1547865 2047857 2400363 2593316 2637138 2544537 2334227 2055720 1793681 1628819 1590823
39004 1590823 1652049 1759293 1863742 1930848 1941150 1887805 1769973 1595142 1396222 1233914
38994 1233914 1158697 1166883 1208351 1239787 1259569 1296227 1384719 1554731 1813006 2119002 2395255
38983 2395255 2584847 2697824 2791384 2907716 3035141 3119249 3103286 2969357 2755601 2530207
38973 2530207 2338934 2180256 2034964 1907933 1830552 1834964 1942378 2164942 2492654 2877478
38963 2877478 3255438 3596449 3918721 4244732 4554293 4789378 4894921 4849180 4672833 4428510
38953D428510k26086j42035m7593J8134O3900J13837J60385J73601J47311J05231
38943D795195O0147p72p7947j36550j45423j18362q9194o0909j3963M0251N5126
38932D307599J3992k7091J4250J62656L55145M87202M88100L69648K12610R5267
38922F479378K8653k9388r9018j40628r9410L5554K28513M28057N82452O51278
38912H065441O35729N87007N55089N34564M86979M09989L52855L60370M27202
38903A2415225N12934N79949O11640O15449O16227O28532O28825N73116M50562
38894A7632459L04148J91390J39442J43227J86641K52355L25492M00422M72114
38885B0047690N10853M62957K99334O2918j46272k41324k11737j31436j06989
$$ plain form
38953 4428510 4202424 4060389 4012796 4030930 4094830 4208667 4369052 4542653 4689964 4795195
38943 4795195 4855342 4854570 4776623 4640073 4494650 4376288 4287094 4226185 4212222 4252473 4307599
38932 4307599 4321591 4294500 4308750 4471406 4826551 5313753 5801853 6171501 6384111 6479378
38922 6479378 6508031 6478643 6379625 6238997 6139587 6175141 6403654 6831711 7414163 8065441
38912 8065441 8701170 9288177 9843266 10377830 10864809 11274798 11627653 11988023 12415225
38903 12415225 12928159 13508108 14119748 14735197 15351424 15979956 16608781 17181897 17632459
38894 17632459 17936607 18127997 18267439 18410666 18597307 18849662 19175154 19575576 20047690
38885 20047690 20558543 21021500 21320834 21383752 21237480 20996156 20784419 20652983 20545994
38876B0545994j99035l75531n42414o27794o37171o29327o48891o84941o84940
38867A5515950o06573m68025l49127l25083l89688m57706m50585l64384k47125
38858A1857654j35745l7197M9349J24552J96558K66361L05725K79776K01516J41449
38848A3249998J68759K94313M76075O59968Q02648Q77700Q91654Q91130R23194
38839A9235439R75022R72811Q61382O76653N19403M60408M91202N63826O43596
38830B5399742P06501P19443O63232N63225M59150L49917K10030O1924k1359j1110
38820B9100695K3778Q9p0301r8770l1386J04633K58087M03422N18650N59216M89236
38809C1257349L25238J28002m2423j56940k21041k66334l31425m36441n73278
$$ plain form
38876 20545994 20346959 19971428 19429014 18801220 18164049 17534722 16885831 16200890 15515950
38867 15515950 14909377 14441352 14092225 13767142 13377454 12919748 12469163 12104779 11857654
38858 11857654 11721909 11684712 11734061 11858613 12055171 12321532 12627257 12907033 13108549 13249998
38848 13249998 13418757 13713070 14189145 14849113 15651761 16529461 17421115 18312245 19235439
38839 19235439 20210461 21183272 22044654 22721307 23240710 23701118 24192320 24756146 25399742
38830 25399742 26106243 26825686 27488918 28052143 28511293 28861210 29071240 29133164 29111805 29100695
38820 29100695 29124473 29124562 29054261 28955491 28924105 29028738 29286825 29690247 30208897 30768113 31257349
38809 31257349 31582587 31710589 31668166 31511226 31290185 31023851 30692426 30255985 29682707
38800B9682707p17241q37637r00771q86453q13762p33414o77778o26748n35071
38791B2953832l83873j92694O897J87561L18570L65078L06806J51143p5164l37828
38781B3300328n93667p89895q84081q74439q06653p42231p14901p15907p17325
38772A6461229p03307o79845o64035o68545o88256o96322o62601n84801m92603
38763A0620914m11628l36163k53331j79033j39618j20452o5385O2770K46226M45249
38753I869549O37927Q10458R38882J013557J066387J138646J222539J260198J202883
38744A9161026J053406Q53663O53124M90732L83703L22748K87786K68484K57183
38735B3731855K30010J64484Q1690M0359O8679J22427J37082J12152J17172K11248
$$ plain form
38800 29682707 28965466 28127829 27227058 26340605 25526843 24793429 24115651 23488903 22953832
38791 22953832 22569959 22377265 22384162 22571723 22890293 23255371 23562177 23713320 23638156 23300328
38781 23300328 22706661 21916766 21032685 20158246 19351593 18609362 17894461 17178554 16461229
38772 16461229 15757922 15078077 14414042 13745497 13057241 12360919 11698318 11113517 10620914
38763 10620914 10209286 9873123 9619792 9440759 9301141 9180689 9115304 9178074 9424300 9869549
38753 9869549 10507476 11317934 12256816 13270373 14336760 15475406 16697945 17958143 19161026
38744 19161026 20214432 21068095 21721219 22211951 22595654 22918402 23206188 23474672 23731855
38735 23731855 23961865 24126349 24208039 24248398 24317077 24439504 24576586 24688738 24805910 25017158
38725B5017158L75217N30104O09817O07219N57669M91663M07995K85598J10677
38716B8993117j09941l51120n74902p42687q41860r03947r79743j086329j187111
38707B2215477j229702j192568j091023r58481q38869p78625p92688q35652q32048
38698A3665821p47421o18000n06391m44607m28332m46133m89231n33065n28822
38689H923819m28881k28029J5799K05969K69884K14926J24508R2135J54853K83381
38679I628364M20012N16520N52448N44437N41716N89418O81073P58344P72990
38670A5005322P42243P25236P44968P54010O90453N55863M17509L31771K84047
38661B0251422K17451J09417j945o8944q8852r1052q3735m0380N6370J79743K83734
$$ plain form
38725 25017158 25392375 25922479 26532296 27139515 27697184 28188847 28596842 28882440 28993117
38716 28993117 28883176 28532056 27957154 27214467 26372607 25468660 24488917 23402588 22215477
38707 22215477 20985775 19793207 18702184 17743703 16904834 16126209 15333521 14497869 13665821
38698 13665821 12918400 12300400 11794009 11349402 10921070 10474937 9985706 9452641 8923819
38689 8923819 8494938 8266909 8282708 8488677 8758561 8973487 9097995 9190130 9344983 9628364
38679 9628364 10048376 10564896 11117344 11661781 12203497 12792915 13473988 14232332 15005322
38670 15005322 15747565 16472801 17217769 17971779 18662232 19218095 19635604 19967375 20251422
38661 20251422 20468873 20578290 20576345 20507401 20418549 20327497 20243762 20203382 20259752 20439495 20723229
38650B0723229L49690L86534L88069L17952J54207o5302k64738l97807m76841
38641B1114993n35607n90059o51340p50630r11041j094605j214451j218024j135177
38632A3014059j026667r10665p69412o07603m58999l34964k10385p7833J9051
38623H636582L3222k7385j16913k09383l05801l90959m21199l68132k54535j36622
38613F438875o4377o3211j32306k40909l32574l51655k76399j31422K7311J42676
38603E016009J84078J55165P8621j9170j04403j33519q1378K4960J22526J72067
38593E414956J84937J85520J75335J56644J67153K50926L95798N33700O12011
38584H076980O38150O44340O40861O29825O40182P06244Q10815Q87136Q95155
$$ plain form
38650 20723229 21072919 21459453 21847522 22165474 22319681 22254379 21989641 21591834 21114993
38641 21114993 20579386 19989327 19337987 18587357 17676316 16581711 15367260 14149236 13014059
38632 13014059 11987392 11076727 10307315 9699712 9240713 8905749 8695364 8617531 8636582
38623 8636582 8669804 8642419 8525506 8316123 8010322 7619363 7198164 6830032 6575497 6438875
38613 6438875 6374498 6311287 6178981 5938072 5605498 5253843 4977444 4846022 4873333 5016009
38603 5016009 5200087 5355252 5433873 5414703 5310300 5176781 5095403 5120363 5242889 5414956
38593 5414956 5599893 5785413 5960748 6117392 6284545 6535471 6931269 7464969 8076980
38584 8076980 8715130 9359470 10000331 10630156 11270338 11976582 12787397 13674533 14569688
38575A4569688Q71504Q78341R14527R06933P93848N94105L81870K10618Q1511
38566B0202945k2993j02603j45612j52683j35406r6720k9440O4299J65423K54551
38556B0001761L24991L71777L79443L36969K63386K02620J85982K07511K38511
38547B2512951K51707K21573J20200n6098k53213l81920l95742l33482k62854
38538B1423122j88657m2840K28701N92057R54235J254902J513112J790298K129097
38529B9654027K531241K962963L337976L481214L148798K159122N67900j273894
38521D6569347k873724l867480m191711m032997l636142l159163k672172k231529
38513A9904429j905947j726352j642403j558373j413301j213197r91892p70208
$$ plain form
38575 14569688 15441192 16319533 17234060 18140993 18934841 19528946 19910816 20121434 20202945
38566 20202945 20179952 20077349 19931737 19779054 19643648 19546928 19517488 19581787 19747210 20001761
38556 20001761 20326752 20698529 21077972 21414941 21678327 21880947 22066929 22274440 22512951
38547 22512951 22764658 22986231 23106431 23050333 22797120 22415200 22019458 21685976 21423122
38538 21423122 21234465 21191625 21420326 22012383 22966618 24221520 25734632 27524930 29654027
38529 29654027 32185268 35148231 38486207 41967421 45116219 47275341 47843241 46569347
38521 46569347 43695623 39828143 35636432 31603435 27967293 24808130 22135958 19904429
38513 19904429 17998482 16272130 14629727 13071354 11658053 10444856 9452964 8682756
38505H682756n67012m23672l82297m38266n35224o10105o29013n84704m86912
38496D025551l63785k49137j53362o3009J9778N8512K2251p1914j76893k60442
38486B787550l06601k89265j87617l4815Q5271J13045O9378K3379K0661N9325
38476B340311J20519J96092K85329L83473M82249N74025O47607O81002O45443
38467F356050N26817L50255J78474P2381M6683O5882Q0585O0184l563j05451k31678
38456G396619l66658m98987o10026o58775o03464m52069k72523j34344n2853n725
38446C741195J5772M73m9389j10931j64052j92308j62543m2707J45856L25424
38436C506790M32368M69912M76564M72864M68155M92359N72624O79776P38651
$$ plain form
38505 8682756 8115744 7692072 7309775 6871509 6336285 5726180 5097167 4512463 4025551
38496 4025551 3661766 3412629 3259267 3196258 3216036 3274548 3296799 3224885 3047992 2787550
38486 2787550 2480949 2191684 2004067 1969252 2054523 2167568 2236946 2260325 2280986 2340311
38476 2340311 2460830 2656922 2942251 3325724 3807973 4381998 5029605 5710607 6356050
38467 6356050 6882867 7233122 7411596 7483977 7530660 7596542 7677127 7737311 7733748 7628297 7396619
38456 7396619 7029961 6530974 5920948 5262173 4658709 4206640 3934117 3799773 3746920 3741195
38446 3741195 3756967 3757440 3708051 3597120 3433068 3240760 3078217 3035510 3181366 3506790
38436 3506790 3939158 4409070 4885634 5358498 5826653 6319012 6891636 7571412 8310063
38427H310063P02694N88955M28571K14991p1936m06732p11618r09807r72454r18514
38417F254213p88378o24603m66604l48159k88010k76113k74456k47833k02089
38408B737968j80203k08061k52881k53707j92572j17314q6760j07571j37671j43270
38398A057958j35165j46242j86529k30663k45425k19297j62773q7880K998J05684
38388b47334J95774K28782J68761K6967j26836k03155j55685r458J70422L26260
38378C74498M20161M24470L35516J98281Q2579J4788m6031j44894k64436l47766
38368A047166l69832l49667l00454k14544j09723m4641n2995q6176o0371M4117
38358d97120J60544K13126J90734J37580R3225N7066M922o8379j24930j11085
$$ plain form
38427 8310063 9012757 9601712 10030283 10245274 10173338 9766606 9054988 8145181 7172727 6254213
38417 6254213 5465835 4841232 4374628 4026469 3738459 3462346 3187890 2940057 2737968
38408 2737968 2557765 2349704 2096823 1843116 1650544 1533230 1446470 1338899 1201228 1057958
38398 1057958 922793 776551 590022 359359 113934 -105363 -268136 -356016 -353018 -247334
38388 -247334 -51560 177222 345983 372950 246114 42959 -112726 -122184 48238 374498
38378 374498 794659 1219129 1554645 1752926 1835505 1850293 1804262 1659368 1394932 1047166
38368 1047166 677334 327667 27213 -187331 -297054 -341695 -394690 -480866 -541237 -497120
38358 -497120 -336576 -123450 67284 204864 298089 355155 360077 291698 166768 55683
38348E5683k0829P7600J03712N6189J6559N1762J40697K15980K47013K42324J90506
38337A377196O0605j24218k67179k92583k30770j66625j26025o8878J0191M3313
38327B15027j5437j06426j30493p7544l3484n9301j15130j22579o0423L3086J24160
38316c48544K08112K79122L15786L07195K68816K20704J68901J20341R5491J01185
38306A737109R9181L2173j07195k51052l16483k84509k07360j46141j20443j16954
38296C18326j20791j21947j06580o5411j0734L1451N1091O5926R8807J49296J93295
38285D82729K09488K03063J99802K13414K23586J98688J40611Q9171P3105P4768
38275B108425N8779J7187l7149j05173j95011k86956l43101l56208l53112l40634
$$ plain form
38348 55683 34854 112454 216166 272355 288914 340676 481373 697353 944366 1186690 1377196
38337 1377196 1437801 1313583 1046404 753821 523051 356426 230401 161523 171714 215027
38327 215027 199590 93164 -37329 -114873 -148357 -207658 -322788 -445367 -505790 -472704 -348544
38316 -348544 -140432 138690 454476 761671 1030487 1251191 1420092 1540433 1635924 1737109
38306 1737109 1836290 1868463 1761268 1510216 1193733 909224 701864 555723 435280 318326
38296 318326 197535 75588 -30992 -96403 -107137 -75686 -24595 41331 140138 289434 482729
38285 482729 692217 895280 1095082 1308496 1532082 1730770 1871381 1960552 2033657 2108425
38275 2108425 2167204 2184391 2147242 2042069 1847058 1560102 1217001 860793 507681 167047
38265A67047k87265j80090o6358p286j0175l2315l3510J252P0838J54508K09763
38254a3591K07998J70648J43280J36653J18898O3415k0410j01817j50656j51218
38244D03200j22497j18211j69644k26241j93447m5642J28778K12567J67351M7275
38234H3489o1354r2661k6614R7195J96967K09423J39644M2884l4987q8589j37822
38223C27575k00353k76108l45993l85045l79564l27754k30101r7996L0230J12139
38213a772970J51881J99696K81549L54786L58837K88357J87580R1558P686n5903
38203I3057q0953n9473n71P7709J44533J64094J41102J40201K14615L28407M06916
38192A569637M60070N80373P92789R79567J012126R13683Q28734Q54257R55006
$$ plain form
38265 167047 -120218 -300308 -366666 -373952 -384127 -416442 -449952 -448700 -377862 -223354 -13591
38254 -13591 194407 365055 508335 644988 763886 827301 806891 705074 554418 403200
38244 403200 280703 162492 -7152 -233393 -426840 -472482 -343704 -131137 36214 83489
38234 83489 22135 -70526 -97140 55 197022 406445 546089 588973 553986 465397 327575
38223 327575 127222 -148886 -494879 -879924 -1259488 -1587242 -1817343 -1915339 -1885109 -1772970
38213 -1772970 -1621089 -1421393 -1139844 -785058 -426221 -137864 49716 141274 148960 93057
38203 93057 12104 -47369 -47940 29769 174302 338396 479498 619699 834314 1162721 1569637
38192 1569637 2029707 2610080 3402869 4382436 5394562 6308245 7136979 7991236 8946242
38183H946242J022902R55016O83604K10512l55207q43368j145119j271273j282138
38174F921171j205310j050615q59505o82362n20513l40212j44960P605P0768N9542
38164B255609K5144M111L494J1248M378l4761r3959j38083j54514j73703k25182
38153A483782k89134l15929k82538k03925r9316J7380J12745J38576Q2153r688
38143F34106p6197j00246j08163j27494j60227j85891j76435j18536l5827K0919
38133d33991K0480j9174n7070p0068n5398j6376K6747L1079k2498q0934o0083
38122g37286N4207J79490K26281J85635J12479N4438K5423K6111N3785R6311J41488
38111D18362J89675K38362K61400K26940J35366K1290p9985j51419j87398j94041
$$ plain form
38183 8946242 9969144 10924160 11607764 11818276 11463069 10619701 9474582 8203309 6921171
38174 6921171 5715861 4665246 3805741 3123379 2602866 2262654 2117694 2125299 2196067 2255609
38164 2255609 2280753 2284864 2288358 2299606 2303984 2269223 2175264 2037181 1882667 1708964 1483782
38153 1483782 1194648 878719 596181 392256 292940 310320 423065 561641 643794 634106
38143 634106 557909 457663 349500 222006 61779 -124112 -300547 -419083 -454910 -433991
38133 -433991 -413511 -432685 -489755 -559823 -615221 -631597 -604850 -573771 -596269 -677203 -737286
38122 -737286 -683079 -503589 -277308 -91673 20806 75244 100667 126778 180563 276874 418362
38111 418362 608037 846399 1107799 1334739 1470105 1491395 1411410 1259991 1072593 878552
38101H78552j95645k11273k15606j50167O947J99402L40743L94213L86152L50096
38091A783414K86444J85931P0663j3269m6761o5902j25820k37129l48788l98397
38081A090386l71135l02053k30179j66956j08272n6972k1002M06J4234K0300J3543
38070a17700K262J1803N8085J20102J53057J37940J08893J14745J54902J75378
38060I19467J38872P6943M7823N4041L4667n6318j92588l08675l65498l62845
38050a4111l08398k09491r5863j9832j5104o4504j20659j52938j61310j45957
38040a308167q4187M2297K00678L13158L27060K66744J96268J39262O3692n1434
38030A05371j64577k06018j49212l3451P2025J12655P1693k8305j45096k45551
$$ plain form
38101 878552 682907 471634 256028 105861 112808 312210 652953 1047166 1433318 1783414
38091 1783414 2069858 2255789 2326452 2313183 2266422 2200520 2074700 1837571 1488783 1090386
38081 1090386 719251 417198 187019 20063 -88209 -145181 -166183 -165777 -151543 -131243 -117700
38070 -117700 -115438 -103635 -45550 74552 227609 365549 474442 589187 744089 919467
38060 919467 1058339 1135282 1183105 1237146 1271813 1215495 1022907 714232 348734 -14111
38050 -14111 -322509 -532000 -627863 -647695 -662799 -727303 -847962 -1000900 -1162210 -1308167
38040 -1308167 -1392354 -1350057 -1149379 -836221 -509161 -242417 -46149 93113 156805 105371
38030 105371 -59206 -265224 -414436 -447887 -375862 -263207 -191514 -219819 -364915 -610466
38020f10466l12624l27196k67686j44514j5285O1885Q4780R6229J23137J48184
38010a163556J39517Q8489J9505k0352J2030J14626K25153K69628K30688J53437
38000F9165R0002O2444P5048J26291J95212K41682K37046J82673R7039P024m7217
37989A336409l3797K7049O6659L5339n0661j39085j92231j94544j44000o4412
37979F46726k327J7402J3521J023m9072j61146k85878l31621k66033j44550l3794
37968e95749N1381J22308J71190J84749J83299K10726K78630L36097L11679J95967
37958A450277P7344P0880J95661L42006L85460L20176K50540K60988L31490L83537
37948D068359L72787L22000K88096L12889L92991M91691N90802P23499R33623
$$ plain form
38020 -610466 -923090 -1250286 -1517972 -1662486 -1677771 -1615886 -1531106 -1434877 -1311740 -1163556
38010 -1163556 -1024039 -935550 -916045 -936397 -924367 -809741 -584588 -314960 -84272 69165
38000 69165 159167 221611 296659 422950 618162 859844 1096890 1279563 1376602 1383626 1336409
37989 1336409 1302612 1329661 1396320 1431659 1380998 1241913 1049682 855138 711138 646726
37979 646726 644399 661801 675322 676345 627273 466127 180249 -151372 -417405 -561955 -595749
37968 -595749 -544368 -422060 -250870 -66121 117178 327904 606534 942631 1254310 1450277
37958 1450277 1527621 1598501 1794162 2136168 2521628 2841804 3092344 3353332 3684822 4068359
37948 4068359 4441146 4763146 5051242 5364131 5757122 6248813 6839615 7563114 8496737
37939H496737J211957J507899J800031K108436K427354K695700K856759K892483
37931B5997356K752511K297793J403332J36735j213024k315422k999034l283245
37923B2777002l262661l007693k576012k072384j640019j367384j221793j103621
37915F525435r60130q16606p01128n88715m46056k95769j95378j64046j60867
37906B196740j29965m5594P6173J85877K31377K08820J77089J92787K33807K18404
37896C545515J04703n6166j74889k08705j79813j29822p7466k0322L4195N3124
37886B890354P749p9357j40795j39555j22967j70693k91200m00826m14792l36469
37876H01449k44715k08615k25684k33144j70984m0500R3935J63900J54906J02149
$$ plain form
37939 8496737 9708694 11216593 13016624 15125060 17552414 20248114 23104873 25997356
37931 25997356 28749867 31047660 32450992 32587727 31374703 29059281 26060247 22777002
37923 22777002 19514341 16506648 13930636 11858252 10218233 8850849 7629056 6525435
37915 6525435 5565305 4748699 4047571 3458856 3012800 2717031 2521653 2357607 2196740
37906 2196740 2066775 2021181 2097354 2283231 2514608 2723428 2900517 3093304 3327111 3545515
37896 3545515 3650218 3594052 3419163 3210458 3030645 2900823 2823357 2803035 2837230 2890354
37886 2890354 2898103 2818746 2677951 2538396 2415429 2244736 1953536 1552710 1137918 801449
37876 801449 556734 348119 122435 -110709 -281693 -322193 -228258 -64358 90548 192697
37866A92697M2946p943m5469o4843o7958n8383k9027K2959O9253O8325J9489k8873
37854A13173l9609l0479l9583o9455q8180p0772j8267N0829J06529J17187P9389
37843A10762L3519K6661O0167R2135R0136O1842L1827P843k0905o4258j19257
37832C10472j72604k09477k22379k13747j90523j58676j22227p9604j9749O4338
37822a014176J49993J88384J50977O3705k3130r0943j56011k21256k56048k35412
37812a443917j75644j12242n6363P312Q5331J55570J85003J60788J05201O1358
37802a027603N3804N5947J0647r9411k09822k25693j18104M6353J73524K19041
37792a121317J93300J18757J1697j00928j76142j80377j14543j1977Q2414J35138
$$ plain form
37866 192697 235643 227700 182231 117388 49430 -8953 -37980 -15021 54232 122557 142046 113173
37854 113173 73564 43085 3502 -65953 -154133 -224905 -243172 -192343 -85814 31373 110762
37843 110762 144281 170942 231109 323244 413380 475222 507049 514892 493987 429729 310472
37832 310472 137868 -71609 -293988 -507735 -698258 -856934 -979161 -1058765 -1078514 -1014176
37822 -1014176 -864183 -675799 -524822 -461117 -484247 -575190 -731201 -952457 -1208505 -1443917
37812 -1443917 -1619561 -1731803 -1788166 -1780854 -1695523 -1539953 -1354950 -1194162 -1088961 -1027603
37802 -1027603 -973799 -917852 -907205 -1006616 -1216438 -1442131 -1560235 -1513882 -1340358 -1121317
37792 -1121317 -928017 -809260 -797563 -898491 -1074633 -1255010 -1369553 -1381530 -1299116 -1163978
37782a163978J41894J28945J27873J41644J39894R3134J0306n9874o6752l740
37772e10654P7145J03127M4615n9285j44863j82509j75781j17855J0093J86288
37762g69679L32626L84647L60913L33060L36462L39905K97836J98398N4688j16461
37752A752395k83900l90123l79766k45710l9203J63657L00945L43356K99051K12858
37742A733560J47679J40992J67301J55745O3065p2017j61862j57292q6496p802
37732A922873N2042J04241J69328K62494L88181N25561O32977O89770P19546P43901
37722F210914P25249N92320L25021j4250l35918n83251p37541p99345p81803p03689
37712C897707n78218m21771k70972j63907r9293m2278K0722O1806N7538K4056
$$ plain form
37782 -1163978 -1022084 -893139 -765266 -623622 -483728 -390594 -380288 -440162 -506914 -510654
37772 -510654 -433509 -330382 -285767 -345052 -489915 -672424 -848205 -966060 -955967 -769679
37762 -769679 -437053 -52406 308507 641567 978029 1317934 1615770 1814168 1868856 1752395
37752 1752395 1468495 1078372 698606 452896 413693 577350 878295 1221651 1520702 1733560
37742 1733560 1881239 2022231 2189532 2345277 2408342 2336325 2174463 2017171 1930675 1922873
37732 1922873 1974915 2079156 2248484 2510978 2899159 3424720 4057697 4747467 5467013 6210914
37722 6210914 6936163 7528483 7853504 7839254 7503336 6920085 6182544 5383199 4601396 3897707
37712 3897707 3319489 2897718 2626746 2462839 2363546 2321268 2341990 2403796 2461334 2485390
37702B485390j1558m4920p4417p3753j8776O7747J24146J00426p802j56851k70113
37691B119519k81130j94829r6402p1520j22255j80488j88334j35695l4142R9121
37681I13845K22738K76326K31082J22945K1989k4227j6142R696Q079m3283j21248
37670A601800j67372j32489k1158J02327J55040R8081k7651j30001j37319m2823
37660A298435J13236K79951M04585M37343L65175K35549J17419L8084k0127o8599
37650C201051r1809q1612n8681m4415l4335j3732J9822O3708J21357J88366K40357
37639C510077K52174K23424J75630J33192J13881J22230J39742J38511J24250
37630D933111J52385K74163M68145O49054P48827P68830P46683O97227O09398
$$ plain form
37702 2485390 2473832 2428912 2354495 2280742 2261966 2329713 2453859 2554285 2546483 2389632 2119519
37691 2119519 1838389 1643560 1547158 1475638 1353383 1172895 984561 848866 814724 913845
37681 913845 1136583 1412909 1643991 1766936 1788925 1764698 1748556 1758252 1766331 1723048 1601800
37670 1601800 1434428 1301939 1280781 1383108 1538148 1636229 1608578 1478577 1341258 1298435
37660 1298435 1411671 1691622 2096207 2533550 2898725 3134274 3251693 3289777 3269650 3201051
37650 3201051 3109242 3027630 2968949 2924534 2890199 2876467 2896289 2959997 3081354 3269720 3510077
37639 3510077 3762251 3985675 4161305 4294497 4408378 4530608 4670350 4808861 4933111
37630 4933111 5085496 5359659 5827804 6476858 7225685 7994515 8741198 9438425 10047823
37621A0047823M91159L90506L61453M16425N12839N75987N36523L70355J25030
37612A3828100r9712k22552k42892k27113k33923k62797k68121k01082l8856J93779
37602A2224831M14862N26604M98193L99077L30416L33456L76729M04656L69349
37593A5878173K45126O5618o3799n1310P0175J66070J54967J00160J26180K85204
37583A6976564N32084P86391R74651J042799R82519Q42083O79793N19241L77931
37574B3714056L08185L52109M65731N48384N53173N11738M38466K80191Q153k85409
37564B6894777m43933l90491j77129R4961L60021N96923Q04598R92167J169256
37555B9901150J322059J402964J353239J139784P84180L73802L2274j61161k43865
$$ plain form
37621 10047823 10538982 10929488 11290941 11707366 12220205 12796192 13332715 13703070 13828100
37612 13828100 13728388 13505836 13262944 13035831 12801908 12539111 12270990 12069908 12031052 12224831
37602 12224831 12639693 13166297 13664490 14063567 14393983 14727439 15104168 15508824 15878173
37593 15878173 16123299 16188917 16125118 16073808 16143983 16310053 16465020 16565180 16691360 16976564
37583 16976564 17508648 18295039 19269690 20312489 21295008 22137091 22816884 23336125 23714056
37574 23714056 24022241 24374350 24840081 25388465 25941638 26453376 26891842 27172033 27180186 26894777
37564 26894777 26450844 26060353 25883224 25978185 26338206 26935129 27739727 28731894 29901150
37555 29901150 31223209 32626173 33979412 35119196 35903376 36277178 36309452 36148291 35904426
37546C5904426l44289n62803q78236j175834j357401j420918j449125j529291
37538B7186529j665668j753532j653535j313491q14135k89407J74455N40555P61786
37529B1173557P89853O56534M87033L86040L31029K14180k1022l14907n53897
37520B3148400o66289o59699n97841n50928n44140n36754m60295k85043m1782
37511A8805629K23306N00978Q17400J185633J562041J849257J952763J853690
37503B8750697J627156J372873J125903Q52937N36763K36132M5106J1412J13641
37494C4672620L04519N51805Q37798J135037J386065J507370J431805J165981
37486D2993000P95873M16188O2167k69776n52539p26600p80012p91267q61043
$$ plain form
37546 35904426 35560137 34997334 34119098 32943264 31585863 30164945 28715820 27186529
37538 27186529 25520861 23767329 22113794 20800303 19986168 19696761 19871216 20411771 21173557
37529 21173557 21963410 22619944 23106977 23493017 23824046 24038226 24017204 23702297 23148400
37520 23148400 22482111 21822412 21224571 20673643 20129503 19592749 19132454 18847411 18805629
37511 18805629 19028935 19529913 20347313 21532946 23094987 24944244 26897007 28750697
37503 28750697 30377853 31750726 32876629 33729566 34266329 34502461 34547567 34558979 34672620
37494 34672620 34977139 35528944 36366742 37501779 38887844 40395214 41827019 42993000
37486 42993000 43788873 44205061 44267228 43997452 43444913 42718313 41938301 41147034 40285991
37477D0285991j017549j214125j405359j592496j793591j997541k158784k222659
37469B6883887k152699j955279j692956j459591j320736j274196j271080j265088
37461A4492262j231415j152952j019139q50325p05068o39621o53793o83734o55378
37452F900837n49017m14306l22502l01852l17366l10723k55184j70718r3930m3075
37442D122164j0919J8033M7996O7501O4820M7819L9225M4310L4914j5929q9803
37431D370131j38198j42688j30056j16485o9881M2802J90702K97164L18430K76878
37421D898799K20741J81765J72359J87023J89977J28825j4768j97523l49455m25135
37411D992608m16255l39413k32039j41160q7816m7882J3024R5076J74970K45759
$$ plain form
37477 40285991 39268442 38054317 36648958 35056462 33262871 31265330 29106546 26883887
37469 26883887 24731188 22775909 21082953 19623362 18302626 17028430 15757350 14492262
37461 14492262 13260847 12107895 11088756 10238431 9533363 8893742 8239949 7556215 6900837
37452 6900837 6351820 5937514 5615012 5313160 4995794 4685071 4429887 4259169 4165239 4122164
37442 4122164 4111245 4129278 4177274 4244775 4309595 4357414 4396639 4440949 4475863 4459934 4370131
37431 4370131 4231933 4089245 3959189 3842704 3772823 3815625 4006327 4303491 4621921 4898799
37421 4898799 5119540 5301305 5473664 5660687 5850664 5979489 5964721 5767198 5417743 4992608
37411 4992608 4576353 4236940 4004901 3863741 3775925 3728043 3741067 3836143 4011113 4256872
37401D256872L10739L41629K86926J41231k2771j14572r9729R52J55243L28798
37391E585318M72642N49924N77115N99257O18349N88859N01341M25551M32092
37382A0350448M99399N41924N13035M31748L15202J43165r1333l39854n36586
37373A1827148o52258o87993o44533n30215l81994k45453j39139n8500l53M2695
37363H529405R6863J80285K65259L00860K73737K13840J37571K5409j25098k56688
37353I641443k94854k23643r9464L219M5226L1985p643m5023o1720m4215J9597
37342H964908J25002K34397K97859L00051K71481K39994J84608N8250j45515l65662
37332A0165373n18765n61960n09197l99700k67392j40082m4335J3808O8637J66232
$$ plain form
37401 4256872 4567611 4909240 5196166 5337397 5314626 5200054 5100325 5101277 5256520 5585318
37391 5585318 6057960 6607884 7184999 7784256 8402605 8991464 9492805 9918356 10350448
37382 10350448 10849847 11391771 11904806 12336554 12651756 12794921 12703588 12363734 11827148
37373 11827148 11174890 10486897 9842364 9312149 8930155 8684702 8545563 8487063 8486710 8529405
37363 8529405 8626268 8806553 9071812 9372672 9646409 9860249 9997820 10023229 9898131 9641443
37353 9641443 9346589 9122946 9023482 9026701 9071927 9103912 9096269 9051246 8989526 8945311 8964908
37342 8964908 9089910 9324307 9622166 9922217 10193698 10433692 10618300 10676550 10531035 10165373
37332 10165373 9646608 9084648 8575451 8175751 7908359 7768277 7723942 7737750 7806387 7972619
37322G972619L04393M25612M90010N32314O14057P32919Q19380Q21635P51973
37313A3464912O40213M85511K82321O2904j23237k59749l61407m24644m07730
37304A3359094k70007k1618K68124N06696O26885O13943N01512L57715K75513
37295A6217857L41066N65335Q45271J032933J061116R77174Q48507O77727M35623
37286B3002609J36278j66257m35922o65058q35682r13366q87600p93758o90150
37277A7751094o24128o06706n98571n37660m13134l01779k94851l92211n03179
37268A3478875n48599n24139m65615m02916l65854l90805m87253o18159p34867
37259H940668q11854q32590p72843o30848m57388l22812k56370k36534k30912
$$ plain form
37322 7972619 8277012 8702624 9192634 9724948 10339005 11071924 11891304 12712939 13464912
37313 13464912 14105125 14590636 14872957 14935861 14812624 14552875 14191468 13766824 13359094
37304 13359094 13089087 13067469 13335593 13842289 14469174 15083117 15584629 15942344 16217857
37295 16217857 16558923 17124258 17969529 19002462 20063578 21040752 21889259 22566986 23002609
37286 23002609 23138887 22972630 22536708 21871650 21035968 20122602 19235002 18441244 17751094
37277 17751094 17126966 16520260 15921689 15384029 14970895 14669116 14374265 13982054 13478875
37268 13478875 12930276 12406137 11940522 11537606 11171752 10780947 10293694 9675535 8940668
37259 8940668 8128814 7296224 6523381 5892533 5435145 5112333 4855963 4619429 4388517
37250D388517k21346j94042j31595k6097J06631K28189K93809K80602K10559J36297
37240E071524R2091O6152K9809j9613o0200p7186p3176n3927k3011J7302Q1886
37229E051651K11188M31562P02193R29449J042872J031140Q96308O17141J99175
37220A1112679k60993o16992p94467q43964q60618q77667q58077p67809o23962
37211D608130m72203l42624k36840j43946n8151J5561O8850J05152J45994K16180
37201C906103L21363M42731N49820O13967O18624N72739N13754M81375M81661
37192H502137M86018M68511M32728L95340L52718K74454J31958o5547k63504m00730
37182A0314083m64903m97862n31244n35064m63430l42591k67249k96090l89145
$$ plain form
37250 4388517 4167171 3973129 3841534 3815437 3922068 4150257 4444066 4724668 4935227 5071524
37240 5071524 5163615 5229767 5259576 5239963 5179763 5102577 5029401 4975474 4952463 4969765 5051651
37229 5051651 5262839 5694401 6396594 7326043 8368915 9400055 10296363 10913504 11112679
37220 11112679 10851686 10234694 9440227 8596263 7735645 6857978 5999901 5232092 4608130
37211 4608130 4135927 3793303 3556463 3412517 3354366 3369927 3438777 3543929 3689923 3906103
37201 3906103 4227466 4670197 5220017 5833984 6452608 7025347 7539101 8020476 8502137
37192 8502137 8988155 9456666 9889394 10284734 10637452 10911906 11043864 10978317 10714813 10314083
37182 10314083 9849180 9351318 8820074 8285010 7821580 7478989 7211740 6915650 6526505
37173F526505m66666m91911m70567m09771l22793k50079k26858k36282k30032
37164C421546j86323j15014k1940Q7605J79893K19002K26335K68102L74200N11007
37154D964413O44245P84172R49421J125044J280608J401227J481923J516028J495636
37145A5642717J385646J093826N35155k27726r56839j415201j556591j503453
37137A2997534j375513j209335j027176q88586q29808q01380p15976n47035l54504
37128E248221k21185j79835j95410k05260j77738j34335j11095j04615p2168J3588
37118C860168J26922K12317K32512J86365R2432k9030j57196k65649l29972l47672
37108C581197l43290l37809l12599k24378o6867J00070J98729J99188J26262K2701
$$ plain form
37173 6526505 6059839 5567928 5097361 4687590 4364797 4114718 3887860 3651578 3421546
37164 3421546 3235223 3120209 3098269 3185874 3365767 3584769 3811104 4079206 4453406 4964413
37154 4964413 5608658 6392830 7342251 8467295 9747903 11149130 12631053 14147081 15642717
37145 15642717 17028363 18122189 18657344 18429618 17472779 16057578 14500987 12997534
37137 12997534 11622021 10412686 9385510 8496924 7667116 6865736 6149760 5602725 5248221
37128 5248221 5027036 4847201 4651791 4446531 4268793 4134458 4023363 3918748 3846580 3860168
37118 3860168 3987090 4199407 4431919 4618284 4710716 4681686 4524490 4258841 3928869 3581197
37108 3581197 3237907 2900098 2587499 2363121 2296254 2396324 2595053 2794241 2920503 2943204
37098B943204p2343j28745j44418j52846j80988k03233j68299p0272M0849J21769
37088A984678J71423J93608J65217P1730m8693j29281j39183j07068q4389r5563
37078A982479j19474j14642o8216j8066j3467n8905j18581j71189k24515k70598
37068H04826k70986k11084j31599p2453j8693N3093J00028M5289j11094k61647
37058g4320k88401j64517M1950K28169L10359K60471J25017m292o1560m8525o470
37047C17881L3465O3856Q8536J16200J53341J86137J79416J11338M945q6469j20546
37036A048100q5254R798J42695K81120L88974M38027M16537L35421K28357J33313
37026C337088O5810J8528j0892j0279J9016M5965M2693J9096J993o919k1692k6839
$$ plain form
37098 2943204 2870861 2742116 2597698 2444852 2263864 2060631 1892332 1822060 1862909 1984678
37088 1984678 2156101 2349709 2514926 2586656 2537963 2408682 2269499 2162431 2078042 1982479
37078 1982479 1863005 1748363 1680147 1662081 1648614 1589709 1471128 1299939 1075424 804826
37068 804826 533840 322756 191157 118704 100011 153104 253132 298421 187327 -74320
37058 -74320 -362721 -527238 -485288 -257119 53240 313711 438728 434436 372876 324351 317881
37047 317881 351346 415202 503738 619938 773279 959416 1138832 1250170 1255115 1168646 1048100
37036 1048100 962846 972644 1115339 1396459 1785433 2223460 2639997 2975418 3203775 3337088
37026 3337088 3402898 3421426 3410534 3400255 3419271 3465236 3507929 3527025 3529018 3522099 3500407 3473568
37014C473568K0295J28172K37782K70054J95810N0776j00970k04319k32780j99712
37004C638676j52548j37587j60920j89119j89558j60546j17013n9900J9033R8953
36994B589471J22205N3513n7456j05646l8404Q6524J66601J57590R0916J3099
36984C078413n3620j00921j29213j58181k03511k31934j79194l6102J15246J81224
36974B282207J51429Q6747L4620p778n6898j07798j40170j33596p2753M1583J82461
36963B260054L13772M18165M93206N25477M94831M10709L22871K85208L21889
36954E846182M32575O09301Q34000J076043J312494J541463J748109J848506J691251
36945A6939924J156255K84032o91238j465277j856133j898295j762555j596948
$$ plain form
37014 3473568 3493863 3622035 3859817 4129871 4325681 4376457 4275487 4071168 3838388 3638676
37004 3638676 3486128 3348541 3187621 2998502 2808944 2648398 2531385 2471485 2490518 2589471
36994 2589471 2711676 2765189 2707733 2602087 2563683 2650207 2816808 2974398 3065314 3078413
36984 3078413 3024793 2923872 2794659 2636478 2432967 2201033 2021839 1985737 2100983 2282207
36974 2282207 2433636 2520383 2555003 2547225 2490327 2382529 2242359 2108763 2036010 2077593 2260054
36963 2260054 2573826 2991991 3485197 4010674 4505505 4916214 5239085 5524293 5846182
36954 5846182 6278757 6888058 7722058 8798101 10110595 11652058 13400167 15248673 16939924
36945 16939924 18096179 18380211 17688973 16223696 14367563 12469268 10706713 9109765
36937I109765j441827j265469j043806q01500o00017m97899n08419n80668o25147
36928A745013n71706m16144k20157o4664J0473L0491M5691O7385O0017L127o4707
36917F24819q7781o2043l1510k4661k7580k0369q187p497k4217n0571o2672k3000
36905A94731Q4145K16156L06613L47097L95817M82780N44018M87336L00989O0129
36895C419811j57372l19364m12276m17506l37445k18970j25464q7580q7308q3932
36885A172594n3328j0621K296m0504j13854j53511j07971J9530J76384L04013
36875A195028L78008M09544M11654L73885K80288J46424K0437n7216q3685q4081
36865B990286q8693j19249j73071k13717k03624j57816j35241j56899j64534r3584
$$ plain form
36937 9109765 7667938 6402469 5358663 4557163 3957146 3459247 2950828 2370160 1745013
36928 1745013 1173307 757163 537006 472342 482815 513306 558997 626382 686399 689526 624819
36917 624819 537038 474995 443485 418824 391244 370875 362688 355191 330974 280403 217731 194731
36905 194731 278876 495032 801645 1148742 1544559 2027339 2571357 3058693 3359682 3419811
36895 3419811 3262439 2943075 2530799 2113293 1775848 1556878 1431414 1343834 1256526 1172594
36885 1172594 1119266 1108645 1110941 1070437 956583 803072 695101 714631 891015 1195028
36875 1195028 1573036 1982580 2394234 2768119 3048407 3194831 3215268 3158052 3074367 2990286
36865 2990286 2901593 2782344 2609273 2395556 2191932 2034116 1898875 1741976 1577442 1483858
36855A483858L8442J56793K22001K47501K36833J68503N9573j4523l783M6538
36845B641736M9455k1115j16618j83700k04109j71715q0693M3383J35524J47798
36835B239946J03744P0631P9190R2957O2823p803o8026q0056n6198l5028l6583
36824B365597m7202l6721J7427J11652K08466K53626K16448J14986n720j15359
36814C083200k06423k65868k62414j76904l7415R0728J54662J52322J23282J06203
36804B761373J07529J09300R9386Q4755P7015P9923J00425J59924K75330M27206
36794D282166N61482O31531O34494O03769N72934N53375N42655N42444N56964
36785I481814N72584N51629M64464L32476K27137K16335L15061M91221P06525
$$ plain form
36855 1483858 1522300 1679093 1901094 2148595 2385428 2553931 2613504 2598981 2595198 2641736
36845 2641736 2691191 2670076 2553458 2369758 2165649 1993934 1913241 1956624 2092148 2239946
36835 2239946 2343690 2414321 2493511 2586468 2649291 2641488 2573462 2493406 2437208 2402180 2365597
36824 2365597 2318395 2281674 2299101 2410753 2619219 2872845 3089293 3204279 3198559 3083200
36814 3083200 2876777 2610909 2348495 2171591 2134176 2224904 2379566 2531888 2655170 2761373
36804 2761373 2868902 2978202 3077588 3162343 3239358 3319281 3419706 3579630 3854960 4282166
36794 4282166 4843648 5475179 6109673 6713442 7286376 7839751 8382406 8924850 9481814
36785 9481814 10054398 10606027 11070491 11402967 11630104 11846439 12161500 12652721 13359246
36776A3359246R36325J150592J287119J254327R78201M72914j26822o30445r19699
36767A7761758j015062j009251r55015q43156o72945m97242l83453l55905l88804
36758A1640925m33164m38042l70996k44126j13313l5497k9498q1784j71786k75313
36748I447406l58463l92632l73071l07473j95925m7622Q4102J16155P085j95762
36738G783800l94331n17041n46345m86243l40907j42841K5291P9930J9244o7219
36728E413338q8953m1063J4671L6854M0728N0259N1628J6373m7634r3657q3813
36717E268731k7307K6968K8249l8495j38114k05899j91805r1839N7915K09154
36707D897558L21637L70820L53969K93962K32331K13118K64182L79925N20431
$$ plain form
36776 13359246 14295571 15446163 16733282 17987609 18965810 19438724 19311902 18681457 17761758
36767 17761758 16746696 15737445 14782430 13939274 13266329 12769087 12385634 12029729 11640925
36758 11640925 11207761 10769719 10398723 10154597 10041284 10005787 9976289 9894505 9722719 9447406
36748 9447406 9088943 8696311 8323240 8015767 7819842 7772220 7856322 7972477 7979562 7783800
36738 7783800 7389469 6872428 6326083 5839840 5498933 5356092 5381383 5461313 5480557 5413338
36728 5413338 5324385 5283322 5297993 5334847 5375575 5425834 5477462 5493835 5446201 5352544 5268731
36717 5268731 5241424 5268392 5296641 5258146 5120032 4914133 4722328 4630489 4688404 4897558
36707 4897558 5219195 5590015 5943984 6237946 6470277 6683395 6947577 7327502 7847933
36698G847933O45257P60660R20533J164434J463122J738019J914819J927620J690049
36689B0072446J132521L09903n61433j229678j581547j675975j625535j490640
36681A3350062j291001j059861q38782o39147m51555k88829j81838j27234p4994
36672H396821J1550J05406J50367J37298J23062J69161K73258L67994L86171L26867
36662A0447955K57743K50297L12574L85906M00609L26352J77717m726j70021k73191
36652A2111215k97148k60405k00735j55087j48147j77296k02979j80024j16820
36643A0372574q3384j38325k62827l88588m72703n15113n20065m85662m30419
36634G075488l83801l37597k48660j13543m351N718o6683j32560j28917o9779
$$ plain form
36698 7847933 8493190 9253850 10174383 11338817 12801939 14539958 16454777 18382397 20072446
36689 20072446 21204967 21514870 20953437 19723759 18142212 16466237 14840702 13350062
36681 13350062 12059061 10999200 10160418 9521271 9069716 8780887 8599049 8471815 8396821
36672 8396821 8408371 8513777 8664144 8801442 8924504 9093665 9366923 9734917 10121088 10447955
36662 10447955 10705698 10955995 11268569 11654475 12055084 12381436 12559153 12554427 12384406 12111215
36652 12111215 11814067 11553662 11352927 11197840 11049693 10872397 10669418 10489394 10372574
36643 10372574 10289190 10150865 9888038 9499450 9026747 8511634 7991569 7505907 7075488
36634 7075488 6691687 6354090 6105430 5991887 5987536 5993254 5926571 5794011 5665094 5595315
36624E595315p090K4182J6903k1308p2920j13597j22863q9626j0983R8206J92041
36613E488260K12356J39774J9404p6887j07236o9371K8737J75829L33786M43124
36603F587776M77018M71882M77973M91368M66039L89529L09142K70527K62064
36594A0203318K44400K14429K10861K63331L59464M62120N44080O06832O74588
36585A3783423P64147Q53780Q95977Q73724Q27213Q05022Q05827P96465P75870
36576B1181448P86436Q61864R91432J135433J249006J293369J257911J178138
36568B9935037J103195J039949R57377Q46826P36780O35170N00944L01030O1509
36559C6117817j71332l93650o28204q61207j035179j105291j077128r90737q90363
$$ plain form
36624 5595315 5588225 5612407 5629310 5608002 5535082 5421485 5298622 5208996 5198013 5296219 5488260
36613 5488260 5700616 5840390 5859794 5782907 5675671 5606300 5635037 5810866 6144652 6587776
36603 6587776 7064794 7536676 8014649 8506017 8972056 9361585 9670727 9941254 10203318
36594 10203318 10447718 10662147 10873008 11136339 11495803 11957923 12502003 13108835 13783423
36585 13783423 14547570 15401350 16297327 17171051 17998264 18803286 19609113 20405578 21181448
36576 21181448 21967884 22829748 23821180 24956613 26205619 27498988 28756899 29935037
36568 29935037 31038232 32078181 33035558 33882384 34619164 35254334 35755278 36056308 36117817
36559 36117817 35946485 35552835 34924631 34063424 33028245 31922954 30845826 29855089 28964726
36550B8964726q08367p55895p22450o94236o72941o70449o90108p16701p15575
36541B2518004o44017m89720l08009j90670j74655k05030k12477k00500k19762
36532A9873164k77753l22049l09755k49821j70109q0421J6768J05832J65986J88329
36522A8940171J80255J64534J69779K02063K28804K14047J70289J50111J79690
36513B0599743K21254K11786J28420J2909n9180l6917O5045J84729K76623L44891
36503B1949303M08771M65835N13469N77896O86802Q35974J018715J259693J571696
36494B9288154J905142K198422K459723K742899L072244L465171L995945M731764
36486E3859464N615899O526802P457748Q528599R824897J1333547J2927955J4082169
$$ plain form
36550 28964726 28156359 27400464 26678014 25983778 25310837 24640388 23950280 23233579 22518004
36541 22518004 21873987 21384267 21076258 20885588 20710933 20505903 20293426 20092926 19873164
36532 19873164 19595411 19273362 18963607 18713786 18543677 18463256 18480024 18585856 18751842 18940171
36522 18940171 19120426 19284960 19454739 19656802 19885606 20099653 20269942 20420053 20599743
36513 20599743 20820997 21032783 21161203 21174112 21114932 21078015 21143060 21327789 21604412 21949303
36503 21949303 22358074 22823909 23337378 23915274 24602076 25438050 26456765 27716458 29288154
36494 29288154 31193296 33391718 35851441 38594340 41666584 45131755 49127700 53859464
36486 53859464 59475363 66002165 73459913 81988512 91813409 103146956 116074911 130157080
36478A30157080J3567270R978239L138305n071401j1758579j5125171j5462792
36471A09422951j4218026j2522700j0755885r023345p493617o267869n280243
36464D3861266m449206l770249l217225k704452k205273j794491j518442j309975
36456B2891953j077725q07612n38394l03470j36359p8056j36480k70138m31230
36447A9112489n91057p18333p82997p96179p99345p98850p58174o70015n85746
36438A2611793n48932n40168n09094m25286k85263j14738J8052M1328l5966j14985
36428A0096741j10589l4555M2678P2699M4314m1766j71431l07676m11166m61215
36418H718034m50893l90174l22167k95303k97593k55046j21526N9814K05078K65113
$$ plain form
36478 130157080 143724350 153702589 156840894 151769493 140010914 124885743 109422951
36471 109422951 95204925 82682225 71926340 62902995 55409378 49141509 43861266
36464 43861266 39412060 35641811 32424586 29720134 27514861 25720370 24201928 22891953
36456 22891953 21814228 21006616 20468222 20164752 20028393 19950337 19813857 19543719 19112489
36447 19112489 18521432 17803099 17020102 16223923 15424578 14625728 13867554 13197539 12611793
36438 12611793 12062861 11522693 11013599 10588313 10303050 10188312 10206364 10247692 10211726 10096741
36428 10096741 9986152 9951597 9994275 10066974 10111288 10069522 9898091 9590415 9179249 8718034
36418 8718034 8267141 7876967 7554800 7259497 6961904 6706858 6585332 6645146 6850224 7115337
36408G115337K33222J22257l0543j70282k72433l56932m26574m30283l30418j75689
36398E277662n7612j0538L335K4429N3657P3559P5673O5661O1989Q5181J36418
36387E789414J97418K54408K97096K94260K17899J08693O4233J27571K32906K98938
36377G882836L26643L55106L67737L10980J84473N3250k0099j6575M2144R6195
36367I582690P5921k5352j32223j80736j92484k08192j99191j19217o385N2219
36357H647050L8260L634k9874q7296j62067k05900k05762j98210j97052j71755
36347G431028j05297j3562R3572K08654K89534K96738K66826K74073L18197L30934
36337I390697L00426K97680L52952L91519L38163K23544J43059J54299K46304
$$ plain form
36408 7115337 7348559 7470816 7440273 7269991 6997558 6640626 6214052 5783769 5453351 5277662
36398 5277662 5220050 5209512 5212847 5237276 5290933 5364492 5440165 5505826 5567815 5652996 5789414
36387 5789414 5986832 6241240 6538336 6832596 7050495 7159188 7223421 7350992 7583898 7882836
36377 7882836 8209479 8564585 8932322 9243302 9427775 9481025 9460926 9444351 9486495 9582690
36367 9582690 9658611 9633259 9501036 9320300 9127816 8919624 8720433 8601216 8594831 8647050
36357 8647050 8685310 8688944 8659070 8571774 8409707 8203807 7998045 7799835 7602783 7431028
36347 7431028 7325731 7312169 7405741 7614395 7903929 8200667 8467493 8741566 9059763 9390697
36337 9390697 9691123 9988803 10341755 10733274 11071437 11294981 11438040 11592339 11838643
36328A1838643L69717M70564N24724N53457N82669N97967N76142N38835N25533
36319A6578251N41522N93099P35739J000760J301290J508196J604739J674404
36311B5538000J761891J855607J982007K183784K408130K550667K620644K743743
36303D3644473L008433L440706M106124N063198O214408P386198Q574442R938740
36295I1376722J1567104J3462133J5737903J8541703K1748112K4996736K7926680
36288B25357093K9792020K8760575K2536606J0654947l952121j6436728k3402300
36281B73310092k4735258k2490238j8710712j4432891j0008501n609112j339356
36274A75984024K828490P038291J1416091J5933928K0418151K4537176K7356526
$$ plain form
36328 11838643 12208360 12678924 13203648 13757105 14339774 14937741 15513883 16052718 16578251
36319 16578251 17119773 17712872 18448611 19449371 20750661 22258857 23863596 25538000
36311 25538000 27299891 29155498 31137505 33321289 35729419 38280086 40900730 43644473
36303 43644473 46652906 50093612 54199736 59262934 65477342 72863540 81437982 91376722
36295 91376722 102943826 116405959 132143862 150685565 172433677 197430413 225357093
36288 225357093 255149113 283909688 306446294 317101241 313149120 296712392 273310092
36281 273310092 248574834 226084596 207373884 192940993 182932492 177323380 175984024
36274 175984024 178812514 185850805 197266896 213200824 233618975 258156151 285512677
36267B85512677K6789837K0290447P210423r343674k3834903l2123241l3960621
36260B40540945l1864987k8324843k4498645k0799226j7550672j4885088j2642693
36253H9974791j0688219r072189p794246o692656n670223m796462m100992l474624
36245C7685180k856781k333130j961050j654336j317751r62552o26224l00093
36237B5673263R924K64966M84182P53354J105195J473103J758178J827999J474306
36228C4824470N64174p01704j835564k467065k616279k522826k337086k068307
36220B0839813j720908j347850j004124p30522n57523m73412m22134l68016l17726
36211A3897598k52980j10724J21319L48844M67652M75387M42713M16199L94094
$$ plain form
36267 285512677 312302514 332592961 339803384 330459710 306624807 274501566 240540945
36260 240540945 208675958 180351115 155852470 135053244 117502572 102617484 89974791
36253 89974791 79286572 70214383 62420137 55727481 50057258 45260796 41159804 37685180
36245 37685180 34828399 32495269 30534219 28879883 27562132 26599580 25973356 25673263
36237 25673263 25683187 25948153 26432335 27185689 28290884 29763987 31522165 33350164 34824470
36228 34824470 35388644 34686940 32851376 30384311 27768032 25245206 22908120 20839813
36220 20839813 19118905 17771055 16766931 16036409 15478886 15005474 14583340 14215324 13897598
36211 13897598 13644618 13533894 13655213 14004057 14471709 14947096 15389809 15806008 16200102
36202A6200102L57585K78572J28314p6831k59770l47608l38066k85983k49955
36193A5406360k63745l24298l89381m16322m11887m10722m07673l64797k90452
36184A2127083k45959k52336k53794k06416j46102j29435j54685j79469j74815
36175A0384072j28535l9881N3561Q9012N8645L5809Q1168J62956K13662K26904
36165A1137373K47884K97078L53701L95964M16213M13212M02979M15368M47874
36156A4527646M49930L88538L00874K42974K17624K01617K16045L05961M56511
36147A7307720N87038O38353O27202O09435O25486O89204P97295R35350J091894
36138B3908977J271873J482665J710735J932593K150019K397349K709306L087192
$$ plain form
36202 16200102 16557687 16836259 16964573 16887742 16627972 16280364 15942298 15656315 15406360
36193 15406360 15142615 14818317 14428936 14012614 13600727 13190005 12782332 12417535 12127083
36184 12127083 11881124 11628788 11374994 11168578 11022476 10893041 10738356 10558887 10384072
36175 10384072 10255537 10215656 10269217 10358229 10416874 10452683 10533851 10696807 10910469 11137373
36165 11137373 11385257 11682335 12036036 12432000 12848213 13261425 13664404 14079772 14527646
36156 14527646 14977576 15366114 15666988 15909962 16127586 16329203 16545248 16851209 17307720
36147 17307720 17894758 18533111 19160313 19769748 20395234 21084438 21881733 22817083 23908977
36138 23908977 25180850 26663515 28374250 30306843 32456862 34854211 37563517 40650709
36130D0650709L491948L867402M186763M487629M844744N296268N819063O393377
36122G9037903P059643P870158Q799165R748281J0647816J1513161J2376610J3177203
36114A60229940J3730971J3799002J3177648J1746009R472988O424295K785742
36107B31366595j130350m935234q259066j0839629j2568768j3489944j3745964
36100A66397640j3498105j2879964j2022040j1081794j0195782r397355q623720
36093H8698880p820576p012634o265688n617787n064430m577666m121565l680377
36085D4538157l288031k994546k785051k574592k312533k050784j868811j765202
36077B4898607j667890j523192j326807j091947q44607o40449n29405m97075m81393
$$ plain form
36130 40650709 44142657 48010059 52196822 56684451 61529195 66825463 72644526 79037903
36122 79037903 86097546 93967704 102766869 112515150 123162966 134676127 147052737 160229940
36114 160229940 173960911 187759913 200937561 212683570 222156558 228580853 231366595
36107 231366595 230236245 225301011 217041945 206202316 193633548 180143604 166397640
36100 166397640 152899535 140019571 127997531 116915737 106719955 97322600 88698880
36093 88698880 80878304 73865670 67599982 61982195 56917765 52340099 48218534 44538157
36085 44538157 41250126 38255580 35470529 32895937 30583404 28532620 26663809 24898607
36077 24898607 23230717 21707525 20380718 19288771 18444164 17803715 17274310 16777235 16295842
36068A6295842m49848m24168m31260m72016n42058o40112p42694q05928q09075
36059A0978683p70744p11255o25202n03423l59117k20315j14610o5867q0566j27355
36049G400229j54930j45209j30265j44207j77112j91655j70036j29449j02412
36040F054954j13918j66421k34192k81674k99818l18463l74124m72174n86694
36031C207476o84002p31029o89882n32143k76780q656J61557J77556Q5777l516
36021G06358j1678N3287J33619J92433K30905K54027K55372K39463K25358K08848
36011B487992J45562J682j85790l26075l55632k85819j71749n9727K3659N7704
36001A331807L5446j8286o4932r5083j31546j80517k04105j62643o8933K4165
$$ plain form
36068 16295842 15845994 15421826 14990566 14518550 13976492 13336380 12593686 11787758 10978683
36059 10978683 10207939 9496684 8871482 8368059 8008942 7788627 7674017 7608150 7527584 7400229
36049 7400229 7245299 7100090 6969825 6825618 6648506 6456851 6286815 6157366 6054954
36040 6054954 5941036 5774615 5540423 5258749 4958931 4640468 4266344 3794170 3207476
36031 3207476 2523474 1792445 1102563 570420 293640 284984 446541 624097 709874 706358
36021 706358 694680 747967 881586 1074019 1304924 1558951 1814323 2053786 2279144 2487992
36011 2487992 2633554 2635236 2449446 2123371 1767739 1481920 1310171 1250444 1274103 1331807
36001 1331807 1367253 1348967 1284035 1188952 1057406 876889 672784 510141 441208 465373
35991D65373Q1676J08341J19753J21754J21625J32548J57099J85484K15903K55093
35981A964649K91020K88846K28849J33074M5337J717K3883J10902K20028K82785
35971C591090K66764K06885J58604J42355J54506K01047K77420L31413K97545
35962E627629J76454M4854k3215j5922M3476J47818L02048M83385O35539P11110
35952H133176P11921O83076O69875O85628P23539P90083R09192J091819J320323
35943A5718632J573152J851156K170549K544667K979620L466105L964187M424614
35935C8692682M844416N262437N650941N827648N531712M607321L103528J222770
35927G4743455p73628k617101m075859n021116n459634n494194n262559m902710
$$ plain form
35991 465373 547049 655390 775143 896897 1018522 1151070 1308169 1493653 1709556 1964649
35981 1964649 2255669 2544515 2773364 2906438 2951775 2953492 2977375 3088277 3308305 3591090
35971 3591090 3857854 4064739 4223343 4365698 4520204 4721251 4998671 5330084 5627629
35962 5627629 5804083 5848937 5825722 5809800 5853276 6001094 6303142 6786527 7422066 8133176
35952 8133176 8845097 9528173 10198048 10883676 11607215 12397298 13306490 14398309 15718632
35943 15718632 17291784 19142940 21313489 23858156 26837776 30303881 34268068 38692682
35935 38692682 43537098 48799535 54450476 60278124 65809836 70417157 73520685 74743455
35927 74743455 73969827 71352726 67276867 62255751 56796117 51301923 46039364 41136654
35919D1136654m522346m160568l791235l385808k961654k555993k176453j806902
35911A5775695j453696j158981r62832q61152p99687p09652n66608m24687l73191
35902H465209m38357n40109n69426n02565m15794l90068m27702m69864m70469
35893D240855m31202l74625l09219k30689j44212o8252j5056J9824M0964L4874
35883B763262j8975j19375k32995l10558l08691k08200l2843J48147K58036K68650
35873B206458K14677J50320J02909P1304M8478K4765k4186j27762k83056m29540
35863A954367m74812l64687j41320P3285J69682J37395N8300J8014L3388O2517
35853A526129O4888M0715K1329K9388M3468M654j22831k90868l89154l48215k13103
$$ plain form
35919 41136654 36614308 32453740 28662505 25276697 22315043 19759050 17582597 15775695
35911 15775695 14321999 13163018 12200186 11339034 10539347 9829695 9263087 8838400 8465209
35902 8465209 8026852 7486743 6917317 6414752 5998958 5608890 5181188 4711324 4240855
35893 4240855 3809653 3435028 3125809 2895120 2750908 2682656 2667600 2687424 2728388 2763262
35883 2763262 2744287 2624912 2391917 2081359 1772668 1564468 1531625 1679772 1937808 2206458
35873 2206458 2421135 2571455 2674364 2745668 2794146 2818911 2794725 2666963 2383907 1954367
35863 1954367 1479555 1114868 973548 1046833 1216515 1353910 1412210 1430224 1463612 1526129
35853 1526129 1591017 1631732 1653061 1682449 1725917 1730571 1607740 1316872 927718 579503 366400
35842C66400j00522q9967j66481k51912k65688j63600M3551K86693M67273N13859
35832F39606M24800K63239J11821J7981l6443j12019k40979l74185m14239l10898
35822c1316j12303Q5764K25094L04014L27836K75238J27263q6470k88206m00313
35812D26601l92540k91183j51739k1295P9934J46917J69405J35014N3308l8453
35802A15969j04736j38433j47317j24545n2841O3284J89517K91246L55529L78640
35792H26313L51275K70755J56157L5985p2247j57280j97644j70617q2579K0053
35782I80171P6802N1611m6549j72743k79536l50901m03900m54899m89813m71204
35772a560961l66779j69989Q7664L31158M70384M66110L68126K67303K11107J84083
$$ plain form
35842 366400 265878 175911 9430 -242482 -508170 -671770 -628219 -341526 125747 639606
35832 639606 1064406 1327645 1439466 1457447 1421004 1308985 1068006 693821 279582 -31316
35822 -31316 -143619 -57855 167239 471253 799089 1074327 1201590 1115120 826914 426601
35812 426601 34061 -257122 -408861 -430156 -350222 -203305 -33900 101114 154422 115969
35802 115969 11233 -127200 -274517 -399062 -451903 -388619 -199102 92144 447673 826313
35792 826313 1177588 1448343 1604500 1640485 1568238 1410958 1213314 1042697 960118 980171
35782 980171 1056973 1108584 1062035 889292 609756 258855 -145045 -599944 -1089757 -1560961
35772 -1560961 -1927740 -2097729 -2010065 -1678907 -1208523 -742413 -374287 -106984 104123 288206
35762B88206J61678J48323J54839J69288J67833J35702O7273k8679j05396q7273
35752A071794O1235K79779M50449M93830M16251K76496J33655K3494m8006j04161
35742C054816j75522k67100l55313m16537m39304m04329k81683p3276J54677L10477
35732A106906L52871L15134K56495K08766J73505J48885J40326J48093J53716
35723C004697J18350j168k14484m61881o31904o43044n14123l40435k00547j04297
35713A1164l1716J1451O141k7749l1108K8029J08895J39461R8548M0856L7154
35702C91126R8689J64920J60436O0537r2152k25320k90291k87672k49722k01479
35692d70928j41506n9455L9036J37406K30436L18500L77116L62804K71039J66416
$$ plain form
35762 288206 449884 598207 753046 922334 1090167 1225869 1293142 1264463 1159067 1071794
35752 1071794 1133029 1412808 1863257 2357087 2773338 3049834 3183489 3206983 3158977 3054816
35742 3054816 2879294 2612194 2256881 1840344 1401040 996711 715028 641752 796429 1106906
35732 1106906 1459777 1774911 2031406 2240172 2413677 2562562 2702888 2850981 3004697
35723 3004697 3123047 3121879 2907395 2445514 1813610 1170566 656443 316008 115461 11164
35713 11164 -20552 -9101 -2960 -30709 -61817 -33788 75107 214568 313116 353972 391126
35702 391126 489815 654735 815171 875708 783556 558236 267945 -19727 -269449 -470928
35692 -470928 -612434 -671889 -632853 -495447 -265011 53489 430605 793409 1064448 1230864
35682A230864J22666J41422J62221J48058J23106J19584J25714J05304L9895o8280
35672B250554k06490l38528m07410l87078l20031k72287k58962k44372k08018
35663c92622j73056j63201j63551j41548r0288l6798j3753k7378m7483l1449L2824
35652a248303J12235J66889J92897K07399J99904J30651j2556j77313k80750k72883
35642i81830j64782j1462J23671K01517K21624K07722J78788J34335O1200n0350
35632g9567j85800k90393k91575j66601J3658J35550J45499Q6684L3938J6244
35622e82363J0324j3474n7640j01112j24386j30105j34187j31239q5197K2197
35612a327182J43957K02004J70107R3158K3453k3827m2328o603R5313K25460L20938
$$ plain form
35682 1230864 1353530 1494952 1657173 1805231 1928337 2047921 2173635 2278939 2318834 2250554
35672 2250554 2044064 1705536 1298126 911048 591017 318730 59768 -184604 -392622
35663 -392622 -565678 -728879 -892430 -1033978 -1124266 -1161064 -1174817 -1202195 -1249678 -1281127 -1248303
35652 -1248303 -1136068 -969179 -776282 -568883 -368979 -238328 -250884 -428197 -708947 -981830
35642 -981830 -1146612 -1158074 -1034403 -832886 -611262 -403540 -224752 -90417 -29217 -79567
35632 -79567 -265367 -555760 -847335 -1013936 -1000278 -864728 -719229 -632545 -598607 -582363
35622 -582363 -572039 -585513 -643153 -744265 -868651 -998756 -1132943 -1264182 -1349379 -1327182
35612 -1327182 -1183225 -981221 -811114 -717956 -694503 -718330 -760658 -767261 -671948 -446488 -125550
35601a25550L43077K88464J77039N3345k4290k8720J0195M3941N2421L2393l3470
35590G88845j54651k90639l71985l66254k93931j83141m7073Q6409J61369J35617
35580e35434K2016j24492k47392l09121k91721j97950n0904J12382K44395K92406
35570a085815K25458P1724q0468j35487n4567J20037K92516L74113L44079K62779
35560C34369K10180K01894J78248Q2678o9570k17547l29792m21649m99573n22265
35550a053027m38020k48631j9519J69558K74274K97047K70590K33989K06647J72379
35540a34713R7246k4149j43441j92368j45409m3489M4071P4744N2421O209l8272
35529d47150o6847o6827k4219N7780J42001J77880J50018R6577O8545P8340R7783
$$ plain form
35601 -125550 217527 505991 683030 736375 712085 683365 693560 737501 789922 822315 788845
35590 788845 634194 343555 -28430 -394684 -688615 -871756 -918829 -832420 -671051 -535434
35580 -535434 -513418 -637910 -885302 -1194423 -1486144 -1684094 -1734998 -1622616 -1378221 -1085815
35570 -1085815 -860357 -788633 -869101 -1004588 -1059155 -939118 -646602 -272489 71590 334369
35560 334369 544549 746443 924691 1007369 937799 720252 390460 -31189 -530762 -1053027
35550 -1053027 -1491047 -1739678 -1759197 -1589639 -1315365 -1018318 -747728 -513739 -307092 -134713
35540 -134713 -37467 -61616 -205057 -397425 -542834 -586323 -542252 -467508 -415087 -408878 -447150
35529 -447150 -513997 -580824 -605043 -547263 -405262 -227382 -77364 19213 87758 166098 263881
35518B63881R3511M8253l9273j49381k41281k85679k99923l25720l67593l78437
35508a681642l13356j74613J613J72488K90057L11214K38292J34613P3308P5974
35498h72052J11919J37324J17162L4547q6503j77881j80028r8006J4769J19039
35488h79710K10228K87725L40937L68079L74219L41179K32208M7559j44233k51752
35478I26439k30840j03955O9454K22071K93947K54539J27401j7253j12783j45918
35468A283102j51223j52719j24298k7600J15495K20229K27220J71627J37348J54126
35458A853307J70827J29627L7585m3325n6052Q108J03187J53175J03334l0977
35448B428796j70562k39824k26742j72980j18464p3240m0032l9951r5135j87067
$$ plain form
35518 263881 357392 405645 366372 216991 -24290 -309969 -609892 -935612 -1303205 -1681642
35508 -1681642 -1994998 -2169611 -2167998 -1995510 -1705453 -1394239 -1155947 -1021334 -948026 -872052
35498 -872052 -760133 -622809 -505647 -471100 -557603 -735484 -915512 -1013518 -998749 -879710
35488 -879710 -669482 -381757 -40820 327259 701478 1042657 1274865 1322424 1178191 926439
35478 926439 695599 591644 661098 883169 1177116 1431655 1559056 1541803 1429020 1283102
35468 1283102 1131879 979160 854862 827262 942757 1162986 1390206 1561833 1699181 1853307
35458 1853307 2024134 2153761 2191346 2148021 2091969 2100077 2203264 2356439 2459773 2428796
35448 2428796 2258234 2018410 1791668 1618688 1500224 1426984 1386952 1347001 1251866 1064799
35438A064799k50816k27651j23879q186M9442K7165n3918j57107k36750k39079
35428a55980j32265N1880K18564K68378J69406j4249j64187j96099j23193l1004
35418a08749J1166L165j6550k4593k3155k6272n9732j49910k80872l80047l81042
35407a436591k90086j60921k4036J14312K17429K25867J35033J7594n2457o1642
35397a315498k8965L6929J20970J78991J73157J13901L9636k4908o4191n4401
35387h24379O214O3183M8966l5201j15480j30972r3896n5719m3323m7830n3829
35376a282266m9819j4540P7198K18187L48455L89735L06440J29746p0791k22700
35366a70355k65766j76152p136J22223J28975N5100J2235L6177M6434l3148j65472
$$ plain form
35438 1064799 813983 586332 462453 454267 503709 530874 476956 319849 83099 -155980
35428 -155980 -288245 -236365 -17801 250577 419983 405734 241547 45448 -77745 -108749
35418 -108749 -97583 -94418 -110968 -135561 -158716 -184988 -244720 -394630 -675502 -1055549 -1436591
35407 -1436591 -1726677 -1887598 -1911634 -1797322 -1579893 -1354026 -1218993 -1201399 -1253856 -1315498
35397 -1315498 -1344463 -1307534 -1186564 -1007573 -834416 -720515 -680879 -705787 -769978 -824379
35387 -824379 -818165 -754982 -706016 -741217 -856697 -987669 -1081565 -1137284 -1180607 -1228437 -1282266
35376 -1282266 -1332085 -1346625 -1269427 -1051240 -702785 -313050 -6610 123136 52345 -170355
35366 -170355 -436121 -612273 -619409 -497186 -368211 -313111 -300876 -264699 -218265 -251413 -416885
35355d16885k49176k39914j77899j15840o3921J608J10300K71041M43080N44333
35345A06727N24137M21492L16753K33485J29713j7050j66948k72343l28288l44795
35335F02883l10354k20657j17990n9999n4996n8430l1561K1892P8439J28929J77425
35324A55581K18220K29917J97888J38749R0132O4902K4581p6393k14375k92350
35314E36852k36277q2660N5364J04905R2325Q5395J04791J09626N6110m9632j56105
35303F20694k10352j94418j27948m5449K5028O5775O6279L0088j6754m0752l4531
35292A37660k4856l3638l9198K306R6070J93456K48344K64466K64092K31547J30699
35281A470948k0664j39698j67820j42283j43887j87416k01949j22121L2864J82833
$$ plain form
35355 -416885 -666061 -905975 -1083874 -1199714 -1263635 -1262027 -1151727 -880686 -437606 106727
35345 106727 630864 1052356 1369109 1602594 1732307 1715257 1548309 1275966 947678 602883
35335 602883 292529 71872 -46118 -106117 -161113 -219543 -251104 -229212 -150773 -21844 155581
35324 155581 373801 603718 801606 940355 1030487 1095389 1119970 1043577 829202 536852
35314 536852 300575 217915 273279 378184 470509 555904 660695 770321 826431 776799 620694
35303 620694 410342 215924 87976 42527 67555 133330 199609 229697 212943 172191 137660
35292 137660 112804 79166 39968 42274 138344 331800 580144 844610 1108702 1340249 1470948
35281 1470948 1450284 1310586 1142766 1000483 856596 669180 467231 345110 377974 560807
35271E60807K65609K76475K46049K01051J45447O6681m2972j67679k72103l27600
35261I51765l32536l05119k61172k03742j31469n1183J9364O1041O7629N2217
35251a33205L7541L7366M6779N0578M1121K8374L1712N9999J02043J41352J76572
35240F20232K15291K47422K44750K00701J55418J58534K10973K63594K71796K30277
35230B818988J51973L8151j14770k90012m44280n25048m99860l87506k61860k00245
35220B85531k15516k57114k87113l25908m00047m72805m67683l54365j76078P484
35210b663614J68670K96846L72657L82779L42919K84755K27169J70749J08876
35201c08194L3286n8051j45136j91270j82322j51382j43138j56375j41521n7828
$$ plain form
35271 560807 826416 1102891 1348940 1549991 1695438 1762119 1719147 1551468 1279365 951765
35261 951765 619229 314110 52938 -150804 -282273 -333456 -314092 -253051 -185422 -133205
35251 -133205 -95664 -58298 -11519 39059 80180 108554 140266 200265 302308 443660 620232
35240 620232 835523 1082945 1327695 1528396 1683814 1842348 2053321 2316915 2588711 2818988
35230 2818988 2970961 3009112 2894342 2604330 2160050 1635002 1135142 747636 485776 285531
35220 285531 70015 -187099 -474212 -800120 -1200167 -1672972 -2140655 -2495020 -2671098 -2663614
35210 -2663614 -2494944 -2198098 -1825441 -1442662 -1099743 -814988 -587819 -417070 -308194
35201 -308194 -274908 -332959 -478095 -669365 -851687 -1003069 -1146207 -1302582 -1444103 -1501931
35191a501931Q3219K34804L57586M35286M60376M23024L19473J66177M47j36853
35181H41608k23129k60057k57227k13241j19991J2778J45429K31716K56965K47117
35171F61968K34149K16477J64690O9111l0909p7142m7301K9104J00640J22965
35161A443752O6750p0991k49669l99904m73834m70658m05590k78289r5377R6287
35151h37523K34348K96060L01755K69665K02614J22747P9784J02561J64504K15282
35141A151797K27913J99166J26869J5087j06735j92996k11809j61380p2108j866
35131I73938k909o4693j05002n1669P1378J69219J82241J32671O5114j4018j14978
35120A241292k16265k72106k55642j70468l3608J23608K46240K84205K41001J70609
$$ plain form
35191 -1501931 -1418712 -1183908 -826322 -391036 69340 492364 811837 978014 978461 841608
35181 841608 618479 358422 101195 -112046 -232037 -219259 -73830 157886 414851 661968
35171 661968 896117 1112594 1277284 1346395 1315486 1238344 1191043 1220147 1320787 1443752
35161 1443752 1510502 1439511 1189842 789938 316104 -154554 -560144 -838433 -933810 -837523
35151 -837523 -603175 -307115 -5360 264305 466919 589666 669450 772011 936515 1151797
35141 1151797 1379710 1578876 1705745 1720832 1614097 1421101 1209292 1047912 975804 973938
35131 973938 971029 906336 801334 749665 821043 990262 1172503 1305174 1370288 1356270 1241292
35120 1241292 1025027 752921 497279 326811 293203 416811 663051 947256 1188257 1358866
35110A358866J13005N0875n3937j94563l10499l43525k89368j94870j15007p0743
35100d9766l5385L9247J68322K98733L41631K53163P7857r4728k05416k46630
35090E47028k25474j38142R396J74704K90350L03311K06178M2089j17635k14142
35080H77663k31720j90578j16072k6458N5749J04642J12154R3222O3893L1486
35070G73981J2130L2516R4349J52383J49210O8378n3411j53002j74945j07272
35060G94317l642N3689L7797L034K736J2275k2921q8952j15186p8373k7700P871
35048E74945O8759J79771K65968K13582J964k66494m62058n24002m74258l75781
35038g97604k85648k23908j72925j08997l0893M6285J11098J55956J70876J56965
$$ plain form
35110 1358866 1471871 1522746 1468809 1274246 963747 620222 330854 135984 20977 -49766
35100 -49766 -85151 -45904 122418 421151 762782 1015945 1093802 999074 793658 547028
35090 547028 321554 183412 192808 367512 657862 961173 1167351 1209440 1091805 877663
35080 877663 645943 455365 339293 312835 368584 473226 585380 678602 742495 773981
35070 773981 786111 818627 912976 1065359 1214569 1282947 1229536 1076534 901589 794317
35060 794317 790675 844364 882161 885195 887931 900206 877285 788333 673147 594774 567074 574945
35048 574945 643704 823475 1089443 1303025 1304989 1038495 576437 52435 -421823 -797604
35038 -797604 -1083252 -1307160 -1480085 -1589082 -1619975 -1573690 -1462592 -1306636 -1135760 -978795
35028i78795J38268J39078J52187J48101J14464O8216K8018o403m0779o6321o4558
35017c68524k8209K9049Q3824J22812J50920J79337K10069K38562K64941K85894
35007A168675K75548J97761N0737j15625k39534k91606k72496j94186r0132k2951
34997D66191m0260j20470j92473k13464j99894j76589j30192l6126Q9106J91370
34987c62801K32298K22411K00644J91342J83312J47557P5991k68m0381m0642l5273
34976G74190m3777l8226J5198R3785J27754P8010j8708r3499j12643q2678r737
34965F89669J05433K26094K71435J84067j349j81275k77082k91116k73802k60677
34955A91397k52750k38507k11966j70840j13306m2647K9997R0075J25663J32581
$$ plain form
35028 -978795 -840527 -701449 -549262 -401161 -286697 -218481 -190463 -196866 -237645 -303966 -368524
35017 -368524 -396733 -367684 -283860 -161048 -10128 169209 379278 617840 882781 1168675
35007 1168675 1444223 1641984 1692721 1577096 1337562 1045956 773460 579274 489142 466191
34997 466191 425931 305461 112988 -100476 -300370 -476959 -607151 -643277 -554171 -362801
34987 -362801 -130503 91908 292552 483894 667206 814763 890754 890486 850105 809463 774190
34976 774190 730413 692187 707385 801170 928924 1006934 988226 894727 782084 699406 689669
34965 689669 795102 1021196 1292631 1476698 1475349 1294074 1016992 725876 452074 191397
34955 191397 -61353 -299860 -511826 -682666 -795972 -838619 -808622 -718547 -592884 -460303
34945d60303J20411J14294J42649K12229K90417L18687K57700J27312k485o7654
34935A053257n8413j5050J2210n682o8874j51580k14356k28591j94337j33434
34925d850p3482m1046m9318p4986o7329q085N3311N8963K4872J8880N7526P6332
34913b9212J7878r7360k10793k90811l24935k89191j76296l6000N7343P2945L3898
34902a272534k1618n6468l3444N3812J52413J95001J76474J51911J56614J64861
34892c32978J36893P5056J9957J2761O8477J63397K40512K48662J87451J01642
34882I21830L1881j1334l0542k9927k9569o4103j49628k62497l56016l86937l31563
34871f98405k02631n5374M9552J01391J39357J89932K25768J99797J02929k6504
$$ plain form
34945 -460303 -339892 -225598 -82949 129280 419697 738384 996084 1123396 1120911 1053257
34935 1053257 994844 979794 992004 986322 917448 765868 551512 322921 128584 -4850
34925 -4850 -78332 -119378 -168696 -243682 -311011 -319096 -265785 -206822 -181950 -163070 -105544 -29212
34913 -29212 -11334 -108694 -319487 -610298 -935233 -1224424 -1400720 -1436720 -1379377 -1306432 -1272534
34902 -1272534 -1294152 -1350620 -1384064 -1330252 -1177839 -982838 -806364 -654453 -497839 -332978
34892 -332978 -196085 -121029 -101072 -88311 -19834 143563 384075 632737 820188 921830
34882 921830 953711 942377 911835 881908 852339 788236 638608 376111 20095 -366842 -698405
34871 -698405 -901036 -956410 -906858 -805467 -666110 -476178 -250410 -50613 52316 25812
34861B5812j40545k19432k78854l42020l98214l99381l18080j99361j21962j05722
34851b497759r0850j7376J08068K37131L34984L86748L79122L11101K13680J34693
34841e00458J03942J14385J19257M7706j36735l69303n08819m65720k87637q9951
34831a973333P0701K09491L23034L55189K73200J31358K3653p963P514K9388N3444
34820e04324R5267J45176J60142J05546n698j26442k19401k69510k58697j64935
34810a042876o157J42093K05345J78037J10112M0518k3723p2008p9683m8348k3541
34799f20231m6538j04110j47251j50123j30543j15395j03966p1016K149J04155
34789a382869J96832K38632K08531J16327o49r1133j15941p8448k8978k2185n9617
$$ plain form
34861 25812 -114733 -334165 -613019 -955039 -1353253 -1752634 -2070714 -2270075 -2392037 -2497759
34851 -2497759 -2588609 -2605985 -2497917 -2260786 -1925802 -1539054 -1159932 -848831 -635151 -500458
34841 -500458 -396516 -282131 -162874 -115168 -251903 -621206 -1130025 -1595745 -1883382 -1973333
34831 -1973333 -1902632 -1693141 -1370107 -1014918 -741718 -610360 -586707 -594670 -587156 -557768 -504324
34820 -504324 -409057 -263881 -103739 1807 -3891 -130333 -349734 -619244 -877941 -1042876
34810 -1042876 -1049033 -906940 -701595 -523558 -413446 -372928 -396651 -468659 -548342 -596690 -620231
34799 -620231 -666769 -770879 -918130 -1068253 -1198796 -1314191 -1418157 -1489173 -1487024 -1382869
34789 -1382869 -1186037 -947405 -738874 -622547 -623196 -714329 -830270 -908718 -937696 -959881 -1019498
34778a019498q2785l5023P1626J61950J71566J05946K2294l3427n6753o2594o0933
34767h17631o2141q0482j10080j11119m4325Q4690K31633L52060M11341L75165
34757B29111K37993O7185k8882n967O8699R7395N5003j3850p1071j15383j48578
34746C71655j60012j57098j77467k45835l29592l57038k85778j49740l1117K1670
34736a500352M2586R9629K02669K87820K99726K52627J86827J03839p429j03159
34726a35217j08917k3370N4485L2232p1769j59593j67700j18020o5899l1630O331
34715g89067O9723J49846K17464K53289K62819K63845K65815K62063K35844J73868
34705A365509Q3120n029o1702r6906j51326k38721l12085l07280k13736q6911
$$ plain form
34778 -1019498 -1102283 -1137306 -1065680 -903730 -732164 -626218 -603924 -637351 -694104 -756698 -817631
34767 -817631 -879772 -960254 -1070334 -1181453 -1225778 -1141088 -909455 -557395 -146054 229111
34757 229111 467104 534289 505407 499440 568139 665534 720537 706687 635616 520233 371655
34746 371655 211643 54545 -122922 -368757 -698349 -1055387 -1341165 -1490905 -1522022 -1500352
34736 -1500352 -1457766 -1358137 -1155468 -867648 -567922 -315295 -128468 -24629 -32058 -135217
34726 -135217 -244134 -267504 -213019 -180787 -252556 -412149 -579849 -697869 -763768 -795398 -789067
34715 -789067 -719344 -569498 -352034 -98745 164074 427919 693734 955797 1191641 1365509
34705 1365509 1448629 1443600 1381898 1284992 1133666 894945 582860 275580 61844 -25067
34695b5067K251J7907k6384q2326j02796q1804n3159l8236j4844L8378Q9410Q4761
34683a91909K3575m3012q1809r7893q1771K150J41002K32717J71952l2525k56329
34672b13852l68520l26107j81864l1287N3241O4635M8073M3941N3889O7920R8624
34661f91307J60821K29550K50327J95761R3442m749o6404r1372r6665r4476p7424
34650a92496k4195P3510J89063K70888K75241J91444M5941j10574k27308k77221
34640B14293k63006k05337j31996p0758l4344j2137M967n341p1460j67731k19843
34629i62693j92659j35502j05916q3785j3081R3611J58366J48009J18403J28209
34619h47038J61737J70746J49820J25840R9989M8640k7989j00976j56302k06535
$$ plain form
34695 -25067 -22816 -4909 -31293 -113619 -216415 -298219 -351378 -389614 -404458 -366080 -276670 -191909
34683 -191909 -168334 -211346 -293155 -391048 -472819 -470669 -329667 -96950 75002 42477 -213852
34672 -213852 -582372 -908479 -1090343 -1121630 -1068389 -1003754 -955681 -911740 -857851 -789931 -691307
34661 -691307 -530486 -300936 -50609 145152 238594 233845 167441 76069 -20596 -115072 -192496
34650 -192496 -216691 -143181 45882 316770 592011 783455 829396 718822 491514 214293
34640 214293 -48713 -254050 -386046 -456804 -491148 -503285 -498318 -503659 -575119 -742850 -962693
34629 -962693 -1155352 -1290854 -1396770 -1480555 -1493636 -1400025 -1241659 -1093650 -975247 -847038
34619 -847038 -685301 -514555 -364735 -238895 -138906 -90266 -118255 -219231 -375533 -582068
34609e82068k53319k72365k51355k18667k14896k47914k89947l08355k85861k20050
34599c144797j21067j0682Q7532J60388K05345K24502K26169K26099K33061K33581
34589a679869K05784J52687J06856R2059R2808P6377L5397j0839n2416j00998
34579a082154j60436k09521k29470k29882k26479k07435j50248o6621L635N3780
34569b504831J34781K92424M91779O29376O22143M72987K55542N3998q2399j49752
34559B16048j72652j74182j57116j16521o5314l0860k2962k3779j9913k5894n7037
34548f50182r5227j11207j15278j50165k22605k73851k44452j51389p0387m3323
34538b128066l0068L5705J56986K56421K52403J46367K6258j9374J8819Q5041
$$ plain form
34609 -582068 -835387 -1107752 -1359107 -1577774 -1792670 -2040584 -2330531 -2638886 -2924747 -3144797
34599 -3144797 -3265864 -3276546 -3189014 -3028626 -2823281 -2598779 -2372610 -2146511 -1913450 -1679869
34589 -1679869 -1474085 -1321398 -1214542 -1122483 -1029675 -953298 -917901 -928740 -981156 -1082154
34579 -1082154 -1242590 -1452111 -1681581 -1911463 -2137942 -2345377 -2495625 -2562246 -2558611 -2504831
34569 -2504831 -2370050 -2077626 -1585847 -956471 -334328 138659 394201 448199 365800 216048
34559 216048 43396 -130786 -287902 -404423 -469737 -500597 -523559 -547338 -567251 -593145 -650182
34548 -650182 -745409 -856616 -971894 -1122059 -1344664 -1618515 -1862967 -2014356 -2084743 -2128066
34538 -2128066 -2158134 -2122429 -1965443 -1709022 -1456619 -1310252 -1283994 -1303368 -1284549 -1199508
34528a199508J34789J66447J79998J50420O8861k4147q7216j37822k14459k89137
34518a251774k76960j48192J9063J26441J58141J64618J76814J79813J54793J04139
34508e93104L8561k4488m8431K503J20252K50437L37735L56610L02192J84212
34498I26479M0656p2370j26513j42029j49200j48390j27194r6014p3942m7974
34488a6491J4698J02546J39449N5756j29979l20401m25559m22980l39765k05929
34478a548655m0247J36654K98774M23347M92019M89965M19798L13398K12193J33436
34468A330682P1186K9936L2297Q0597J32396J38337R7003N0496K6364L706n5626
34457A937374j53851k44864k73538k24783j34124n0500P101M8833P4553N5641
$$ plain form
34528 -1199508 -1064719 -898272 -718274 -567854 -498993 -523140 -610356 -748178 -962637 -1251774
34518 -1251774 -1528734 -1676926 -1657863 -1531422 -1373281 -1208663 -1031849 -852036 -697243 -593104
34508 -593104 -554543 -579031 -627462 -624959 -504707 -254270 83465 440075 742267 926479
34498 926479 967135 894765 768252 626223 477023 328633 201439 105425 31483 -16491
34488 -16491 -1793 100753 240202 295958 165979 -154422 -579981 -1002961 -1342726 -1548655
34478 -1548655 -1588902 -1452248 -1153474 -730127 -238108 251857 671655 985053 1197246 1330682
34468 1330682 1401868 1431804 1464101 1544698 1677094 1815431 1912434 1962930 1989294 1993000 1937374
34457 1937374 1783523 1538659 1265121 1040338 906214 855714 862815 911648 986201 1041842
34447A041842l1144j63890k85563l47932l34036k49299j14735L0253J40581J92647
34437a21276J92663J59280J11401P2855O7873R8102J34028J43308J26031J12961
34427A097226J27161J52702J47509R0588J0970m2487n9995p9961j29764j81660
34417A132289j92715j68565j46853j23348m5129J04544K55433L14963K57734J23783
34407A512136m2082k06848l25578l58444l20595k71309k35891j74639n5011P5820
34397d02441J29417P8106j5188p1462p3736o3197p9995j23451j59157j50119q6128
34386a017351M640P4972J01114J07042J37343K04480K70905K83609K16253P8487
34376D61494r5126k51862l35104l21963k50890j92199j81729j93412j78749j16324
$$ plain form
34447 1041842 1010698 846808 561245 213313 -120723 -370022 -484757 -454504 -313923 -121276
34437 -121276 71387 230667 342068 414923 482796 580898 714926 858234 984265 1097226
34427 1097226 1224387 1377089 1524598 1615186 1626156 1583669 1523674 1443713 1313949 1132289
34417 1132289 939574 771009 624156 500808 455679 560223 815656 1130619 1388353 1512136
34407 1512136 1470054 1263206 937628 579184 258589 -12720 -248611 -423250 -478261 -402441
34397 -402441 -273024 -194918 -210106 -281568 -355304 -418501 -498496 -621947 -781104 -931223 -1017351
34386 -1017351 -1012711 -937739 -836625 -729583 -592240 -387760 -116855 166754 383007 461494
34376 461494 366368 114506 -220598 -542561 -793451 -985650 -1167379 -1360791 -1539540 -1655864
34366a655864j5952J03005K14189K75664K49031J39036K832q8631r4778j5292
34356h86760J23451K77049L89628M16860L53126K27736P0452j05886k78945l92944
34346A93767l95038l01202j95122j40569j15892o2715J8145O1977L3379j9566
34336i22836k7072J6903O2263P7767Q2414J03779J36486J53992J45097J26028
34326d5179J19051J21034R2472j2106j89759l69990m65470m43130l36393j94736
34316a724206m2001J14066K54369L46272L62152K94083J58794n689j56810k68911
34306f67881l35385l50776l04070j98179o6431M3962J06504J28629J30657J16474
34296a396496P1017q289q2723r5118l6370K6470J7750n1543q6478j7848J16002
$$ plain form
34366 -1655864 -1671816 -1568811 -1354622 -1078958 -829927 -690891 -688059 -776690 -871468 -886760
34356 -886760 -763309 -486260 -96632 320228 673354 901090 971542 865656 586711 193767
34346 193767 -201271 -502473 -697595 -838164 -954056 -1016771 -998626 -936649 -903270 -922836
34336 -922836 -949908 -933005 -870742 -792975 -710561 -606782 -470296 -316304 -171207 -45179
34326 -45179 73872 194906 287378 275272 85513 -284477 -749947 -1193077 -1529470 -1724206
34316 -1724206 -1766207 -1652141 -1397772 -1051500 -689348 -395265 -236471 -242160 -398970 -667881
34306 -667881 -1003266 -1354042 -1658112 -1856291 -1922722 -1878760 -1772256 -1643627 -1512970 -1396496
34296 -1396496 -1325479 -1333768 -1416491 -1511609 -1547979 -1521509 -1503759 -1555302 -1641780 -1659628 -1543626
34285a543626K14196K17647J45373M7948l7685r0968j04576r4785r2168j03991
34275a442635r9687n0324K7478Q5529R8889Q9180R0154J06292J18005J20413J40099
34264g16607K06061L08962L95020M01751L05031J42266p615q1710q7126r3865
34254G72168j58672k56192l00181k34316q8339N3924J20515Q5316k6420j39672
34244a71869j62168n7942J08573K28320K52005K20233J92854J79607J53238J05727
34234A048578O6307O9836J22837J98970K59352K79698K63661K29415J85829J30263
34224B854746O7271J2716k6972o5543j18600j87623k70697l70895m74929n35827
34214H83647n04340l81804k26168j02565m0033l3690o4557j02761j07771n1281
$$ plain form
34285 -1543626 -1329430 -1111783 -966410 -918462 -956147 -1047115 -1151691 -1246476 -1338644 -1442635
34275 -1442635 -1542322 -1592646 -1565168 -1479639 -1380750 -1291570 -1201416 -1095124 -977119 -856706 -716607
34264 -716607 -510546 -201584 193436 595187 900218 1042484 1034869 953159 866033 772168
34254 772168 613496 357304 57123 -177193 -265532 -211608 -91093 -5777 -32197 -171869
34244 -171869 -334037 -391979 -283406 -55086 196919 417152 610006 789613 942851 1048578
34234 1048578 1114885 1184721 1307558 1506528 1765880 2045578 2309239 2538654 2724483 2854746
34224 2854746 2922017 2934733 2907761 2842218 2723618 2535995 2265298 1894403 1419474 883647
34214 883647 379307 -2497 -228665 -331230 -371263 -404953 -469510 -572271 -680042 -731323
34204g31323N3181J53451J99205J79165J18016M2846l7461j15092j56403j15277
34194d09692J0689J46338J86545R2226o7475j78159j81772j10849l4727O011J0310
34183e30555j0235m4057p4092q6697r2112j14757j52000j62902j19341n4980l3007
34172a474735o3511q1738k3884R3908J91678K11280J66376J09966P4214N3782
34162g42664L6894L2518N6859R9963J22524R6275M0380L011O226K3230J6647j3207
34150b21344l0848j0887L3721P3361J02783J47037K19199K80884K68062J68732
34140A030700N5946J6014M9220P2430K3870o8565j38548j67305j87056k18605
34130D68101k43440k36208j95814j39540q5661m4254r630L6172R5205J32799J07782
$$ plain form
34204 -731323 -678142 -524691 -325486 -146321 -28305 14541 -22920 -138012 -294415 -409692
34194 -409692 -399003 -252665 -66120 26106 -41369 -219528 -401300 -512149 -546876 -540865 -530555
34183 -530555 -540790 -584847 -658939 -745636 -837748 -952505 -1104505 -1267407 -1386748 -1441728 -1474735
34172 -1474735 -1538246 -1619984 -1643868 -1549960 -1358282 -1147002 -980626 -870660 -796446 -742664
34162 -742664 -705770 -673252 -616393 -516430 -393906 -297631 -257251 -254240 -248014 -224784 -208137 -221344
34150 -221344 -252192 -263079 -229358 -155997 -53214 93823 313022 593906 861968 1030700
34140 1030700 1086646 1102660 1151880 1224310 1248180 1179615 1041067 873762 686706 468101
34130 468101 224661 -11547 -207361 -346901 -432562 -476816 -486446 -450274 -355069 -222270 -114488
34119a14488K6190n5291q3531n0099K0325R7402J54633J76739J72239J61894J43030
34108F49043Q3076l6320j82212k92351l25515k82622j95817j12012p0099p0247
34098h35076p1179l6632K0699N9541O8377P9386J20240J73193J94868J65987J08183
34087D7587N3473Q026m5698j11491j55852j37527o1018J7992N2523N5780P5238
34076b00967J23513J58567J37803P4917L0199M7907J10968J60965J63070J46066
34066I53008J68670K46485L27424L46836K91228J93901Q4890k7799j32947k03635
34056B248061k21670j97664j57102j18779r4079r3449j20142j61280j92814j94522
34046F96560j64821j28805j25818j72110k34578k58214k23263j58984r8894m7119
$$ plain form
34119 -114488 -88298 -143589 -227120 -277219 -256894 -159492 -4859 171880 344119 506013 649043
34108 649043 732119 695799 513587 221236 -104279 -386901 -582718 -694730 -764829 -835076
34098 -835076 -906255 -942887 -922188 -862647 -794270 -714884 -594644 -421451 -226583 -60596 47587
34087 47587 101060 109086 63388 -48103 -203955 -341482 -402500 -384508 -331985 -276205 -200967
34076 -200967 -77454 81113 218916 293833 324032 371939 482907 643872 806942 953008
34066 953008 1121678 1368163 1695587 2042423 2333651 2527552 2612442 2584643 2451696 2248061
34056 2248061 2026391 1828727 1671625 1552846 1458767 1365318 1245176 1083896 891082 696560
34046 696560 531739 402934 277116 105006 -129572 -387786 -611049 -770033 -868927 -916046
34036i16046k64K4956J3737j0957o124L5505O9792M9652k1373q8354r3367k9570
34024i72413M3366M3205o0806k15047l26902l38070k51269j07304L9742J39351
34014b006147J76540J95183K58234L67136M41536L98532K42118O3373l5477j0556
34004I0472J04566K23558K61786J93750O5039n5673j30491j59692j61389j62531
33994B69395j89040k35333k53971k05309j12327l6210P41L6254J09341K12347
33984d04112L08967L67489L63618K85458J61393N7340J5795J1136j0667o2553
33974A093864j11555j28492j11342o8106j1868K5538Q707o0115j37762j88741
33964C10128k16036k30759k13389j31669O711J41350K09519K03819J71053J51753
$$ plain form
34036 -916046 -916310 -891354 -877617 -888574 -894698 -859193 -789401 -739749 -761122 -849476 -942843 -972413
34024 -972413 -929047 -885842 -946648 -1161695 -1488597 -1826667 -2077936 -2185240 -2145498 -2006147
34014 -2006147 -1829607 -1634424 -1376190 -1009054 -567518 -168986 73132 136505 101028 90472
34004 90472 195038 418596 680382 874132 939171 883498 753007 593315 431926 269395
33994 269395 80355 -154978 -408949 -614258 -726585 -762795 -762054 -725800 -616459 -404112
33984 -404112 -95145 272344 635962 921420 1082813 1140153 1155948 1167084 1156417 1093864
33974 1093864 982309 853817 742475 674369 662501 688039 696746 636631 498869 310128
33964 310128 94092 -136667 -350056 -481725 -475014 -333664 -124145 79674 250727 402480
33954D02480J30480O2032n2310j39924j31136m6023K3237J7912k8484m8024k7653
33943A62587j4692m4024q8386r0359l1005M5576P5564L5158m8857j41848k37312
33932c77598l41606m38440m89900m71270l89045k65957j25716O497J07594J68008
33922b617433J88580J67582J10400N2991M7023J05400J81721K20369K10014J70365
33912a162988J07763J7111p7600j19481p0495M6282J64506K27422K22670J79163
33902d65647J38448J21561J14444Q6633K9034k7429l5560K2304J12980J80245
33892B77013J93005J60316J01282J8611q4454j76500k15193j94723j55444j40747
33882b16834j59362j89252j94956j37879k189J68589K81557K64674J20476r4468
$$ plain form
33954 402480 532960 594992 542682 402758 271622 225599 248836 266748 238264 190240 162587
33943 162587 147895 103871 15485 -74874 -105879 -60303 15261 50419 1562 -140286 -377598
33932 -377598 -719204 -1157644 -1647544 -2118814 -2507859 -2773816 -2899532 -2893035 -2785441 -2617433
33922 -2617433 -2428853 -2261271 -2150871 -2097880 -2050857 -1945457 -1763736 -1543367 -1333353 -1162988
33912 -1162988 -1055225 -1038114 -1115714 -1235195 -1305690 -1259408 -1094902 -867480 -644810 -465647
33902 -465647 -327199 -205638 -91194 -4561 24473 -2956 -38516 -16212 96768 277013
33892 277013 470018 630334 731616 750227 665773 489273 274080 79357 -76087 -216834
33882 -216834 -376196 -565448 -760404 -898283 -900472 -731883 -450326 -185652 -65176 -159644
33872a59644l16612m85650n42947m63649k83490o3381J64581L87121N61501O25478
33862e76692N63716M26272K68019J04434n4259j62488j74249j09619n1445o5660
33852A68029j40133k09058k25122j94678j45674q1168J7300J46440K66222L36198
33842f1644L45213K94297J79560K0434j19515j83334j86239j91270k22540k46085
33832c71123k38847k23243k12083j70135p0370M7061J19654J46487J79367K37378
33822e55854K77506K58841J99055J49355J35557J39599J25667P2573j0160q7613
33812G04526j23750j05209m2513M4332J32203J93281K03088J54655O0512n4473
33802A166652j55490k05517j92053j47541j27554j64796k51600l58988m52471
$$ plain form
33872 -159644 -476256 -961906 -1504853 -1968502 -2251992 -2315373 -2150792 -1763671 -1202170 -576692
33862 -576692 -12976 413296 681315 785749 731490 569002 394753 285134 233689 168029
33852 168029 27896 -181162 -406284 -600962 -746636 -827804 -810504 -664064 -397842 -61644
33842 -61644 283569 577866 757426 777860 658345 475011 288772 97502 -125038 -371123
33832 -371123 -609970 -833213 -1045296 -1215431 -1285801 -1238740 -1119086 -972599 -793232 -555854
33822 -555854 -278348 -19507 179548 328903 464460 604059 729726 802299 792139 704526
33812 704526 580776 475567 433054 477386 609589 802870 1005958 1160613 1221125 1166652
33802 1166652 1011162 805645 613592 466051 338497 173701 -77899 -436887 -889358
33793h89358m91940m44459l11935j33798M3890J88444K70561K65823J88457J04881
33783a209434Q4936J40434K25888K91385L17290L06962K71974K26157J73420R9515
33773I28527m307j09259j67651j72362j69700j93343k08591j52650k1859J10335
33763a60860J66129J35727P4541M3891N8215P9891O3215Q400l4776k6280J4469
33752D22562L7965L0601J9757J9033J1105m657P530O2941J14569J09234O5715
33741H96355N2368R1861J29245J02007J2030p9857j06477l8008R6083K14085K34478
33730A604170J41465r240j52388k61315l29478l36691k63391j27335J9257J29133
33720D14187J83433J83469J39086O7021j2932q4676j34052j45924j15842o5463
$$ plain form
33793 -889358 -1381298 -1825757 -2137692 -2271490 -2227600 -2039156 -1768595 -1502772 -1314315 -1209434
33783 -1209434 -1124498 -984064 -758176 -466791 -149501 157461 429435 655592 829012 928527
33773 928527 924220 814961 647310 474948 305248 111905 -96686 -249336 -271195 -160860
33763 -160860 5269 140996 215537 259428 317643 397534 460749 469149 434373 408093 422562
33752 422562 460527 491128 510885 529918 541023 536366 543896 606837 721406 830640 896355
33741 896355 948723 1040584 1169829 1271836 1283866 1204009 1097532 1059524 1155607 1369692 1604170
33730 1604170 1745635 1736395 1584007 1322692 993214 656523 393132 265797 285054 414187
33720 414187 597620 781089 920175 987196 974264 889588 755536 609612 493770 428307
33710D28307l5881o0911j47239k71200l81294m10892l17791j30342N7852J62029
33700a107362J77646J66034J72870J83155J61938J10886O0572K6450O235J1008
33690c0568N5854J13912J23897O4435j7164p7704j38892k29833l01995k70366
33680g08424j37535j1333K3399K790K6026J36040K87755M05711M40113L86177
33670H50719K83597J90448J32191Q0410j014r9073j62686j65245j36245j30844
33660H42258j80748k71162l52373l75318l27038k34891j37528n8682n349K8891
33650a071940O6054J29926K17154K95402L37364L38401K95937K04329R0852K3874
33640I27353M6701J18313J55582J27430P7640O3556J04674J84352K64555K97752
$$ plain form
33710 428307 392426 331515 184276 -86924 -468218 -879110 -1196901 -1327243 -1269391 -1107362
33700 -1107362 -929716 -763682 -590812 -407657 -245719 -134833 -74261 -47811 -41576 -30568
33690 -30568 25286 139198 263095 327530 310366 232662 93770 -136063 -438058 -708424
33680 -708424 -845959 -857292 -833893 -831103 -805077 -669037 -381282 24429 464542 850719
33670 850719 1134316 1324764 1456955 1537365 1536351 1437278 1274592 1109347 973102 842258
33660 842258 661510 390348 37975 -337343 -664381 -899272 -1036800 -1095482 -1100831 -1071940
33650 -1071940 -1005886 -875960 -658806 -363404 -26040 312361 608298 812627 903479 927353
33640 927353 974054 1092367 1247949 1375379 1453019 1516575 1621249 1805601 2070156 2367908
33630B367908K60057J80203J06452M1229n6604j95668l17599l62189l36944k92285
33620A394560k49461j89956j10252n1020n7736j27640k07998k42883k17277j59899
33610b19562j09675q1867o3773l7986q381o566o9229j93706l08264l04785j29014
33599a532808J54547M00517M94783M32554K97517J80260J17188R1527P5750O2805
33589G74640N4983L8020q794p4067j12383r4056l2765N1381J62124K86943L58786
33578A404812L15625J92693R8691Q7181R7594M3423q0800k04960k62439k35649
33568A456171j49039m8775K3237N7574O9785N4987k4571j84512l73511n13010
33558C68336n69220n61070n12040m28021l20331k19121j50497j09302n7876M7044
$$ plain form
33630 2367908 2627965 2808168 2914620 2955849 2899245 2703577 2385978 2023789 1686845 1394560
33620 1394560 1145099 955143 844891 793871 736135 608495 400497 157614 -59663 -219562
33610 -219562 -329237 -411104 -474877 -512863 -521244 -527810 -597039 -790745 -1099009 -1403794 -1532808
33599 -1532808 -1378261 -977744 -482961 -50407 247110 427370 544558 636085 711835 774640
33589 774640 829623 867643 858849 784782 672399 578343 545578 596959 759083 1046026 1404812
33578 1404812 1720437 1913130 2011821 2099002 2196596 2240019 2159219 1954259 1691820 1456171
33568 1456171 1307132 1258357 1281594 1339168 1408953 1463940 1439369 1254857 881346 368336
33558 368336 -200884 -761954 -1273994 -1702015 -2022346 -2241467 -2391964 -2501266 -2559142 -2512098
33548b512098K10586L72422M41273L77894K37099J14966O5800P9024J09941J06676
33538c96417L0776j07319k37788k89083k54441j75919p5201N8967K16972L48277
33528h81176M09311L97643L28174K14502R3994L1780O0619J32492J61440J08881
33518A057660Q534p9406j15762r6005m5739m338N968j873j597J2149K3997K4766
33506G88354K0408J6336R583k070j6011l0654m3768m4566j9090L3834R9027J55555
33494I66938J83203J64383R5700l01q7842j46414j78204j88654j75463j42779
33484D90567j10717r5567q5000m6532L5583J37559K13495K33006J99167J34721
33474A106282O3731J2027N976M1340N5394l0246k13464l83205m21070l20109j72193
$$ plain form
33548 -2512098 -2301512 -1929090 -1487817 -1109923 -872824 -757858 -692058 -613034 -503093 -396417
33538 -396417 -365641 -472960 -710748 -999831 -1254272 -1430191 -1505392 -1446425 -1229453 -881176
33528 -881176 -471865 -74222 253952 468454 562448 594228 654847 787339 948779 1057660
33518 1057660 1066194 986788 871026 775021 729282 724944 730912 729039 727442 739591 763588 788354
33506 788354 808762 825098 834681 832611 816600 785946 742178 697612 678522 712356 811383 966938
33494 966938 1150141 1314524 1410224 1409923 1322081 1175667 997463 808809 633346 490567
33484 490567 379850 284283 199283 152751 188334 325893 539388 772394 971561 1106282
33474 1106282 1170013 1182040 1188016 1229356 1284750 1254504 1041040 657835 236765 -83344 -255537
33463b55537n1795M2619J33979K10179K49244K61886K73139K81381K64001K09192
33453A618288J21350J3966q1459j23322j05816p5799p2821p6556n4060l4102p4535
33442A055134j61802k07330j59100o3620M392K5953K5278J9825K0361M5606R5235
33431F99932J31234J22821R0376P0808O0423L0465j9595o9246j25210k10277k98877
33420D82854l12243k02489j7744J35181J82435J33662N8425K0329K5610L4638
33410E40658K4428K0786N1764R2282R0781M2290k801l937K8273N8002N9827K6478
33398A028831k5025n1823k7906M147l2992j47826k50027k48603j45645p048J20723
33387B16806K24869K88654K92180K43189J66789O9468m9898j58837k06604j93167
$$ plain form
33463 -255537 -307332 -264713 -130734 79445 328689 590575 863714 1145095 1409096 1618288
33453 1618288 1739638 1753604 1672145 1548823 1443007 1367208 1294387 1217831 1163771 1129669 1055134
33442 1055134 893332 686002 526902 463282 467674 493627 518905 538730 559091 604697 699932
33431 699932 831166 953987 1044363 1115171 1175594 1206059 1186464 1117218 992008 781731 482854
33420 482854 170611 -31878 -49622 85559 267994 401656 460081 480410 506020 540658
33410 540658 565086 585872 637636 729918 820699 862989 860188 856251 884524 942526 1002353 1028831
33398 1028831 1003806 951983 924077 928224 895232 747406 497379 248776 103131 96083 216806
33387 216806 441675 730329 1022509 1265698 1432487 1501955 1452057 1293220 1086616 893449
33377H93449j86951k49452l58264m24281l80339k44065r7651j1663J0672J4081
33367a034464K4035J9460j9258o2585o5014l5038l0901p6514j15719p5086M5627
$$ plain form
33377 893449 706498 457046 98782 -325499 -705838 -949903 -1047554 -1059217 -1048545 -1034464
33367 -1034464 -1010429 -990969 -1010227 -1072812 -1137826 -1172864 -1203765 -1280279 -1395998 -1471084 -1425457
$$ [...]
##END NTUPLES=NMR SPECTRUM
##END=
