##TITLE=31Pdec_DE-23_15m_rm
 
  24 sc
 1.11.2023
##JCAMPDX= 6.0         $$ Bruker NMR JCAMP-DX V2.0
##DATA TYPE= NMR SPECTRUM
##DATA CLASS= NTUPLES
##ORIGIN= UXNMR, Bruker Analytische Messtechnik GmbH
##OWNER= root
$$ XWIN-NMR		Version 3.5
$$ Wed Nov  1 15:08:44 2023 Russian Standard Time (UT+4h)  she@DPX200
##.OBSERVE FREQUENCY= 81.013821
##.OBSERVE NUCLEUS= ^31P
##.ACQUISITION MODE= SIMULTANEOUS
##.ACQUISITION SCHEME= undefined
##.AVERAGES= 24
##.DIGITISER RES= 16
##SPECTROMETER/DATA SYSTEM= spect
##.PULSE SEQUENCE= zgpg30
##.SOLVENT NAME= CDCl3
##.SHIFT REFERENCE= (INTERNAL, CDCl3, 0, 248.564)
##AUDIT TRAIL= $$ (NUMBER, WHEN, WHO, WHERE, WHAT)
$$ ##TITLE= Audit trail, XWIN-NMR		Version 3.5
$$ ##JCAMPDX= 5.01
$$ ##ORIGIN= Bruker BioSpin GmbH
$$ ##OWNER= she
$$ F:/spectra/data/she/nmr/P31/1/pdata/1/auditp.txt
$$ ##AUDIT TRAIL=  $$ (NUMBER, WHEN, WHO, WHERE, WHAT)
(   1,<2023-11-01 15:07:42.98 +0400>,<she>,<DPX200>,
      <created by zg, POWCHK disabled, PULCHK disabled
       configuration hash MD5:
       00 E9 B6 7A A2 85 ED C7 34 08 36 98 17 FE 4E 26
       data hash MD5: 32K
       78 9A 0C AA 0E C1 E0 7B B7 00 4C 2B 5E DB E3 37>)
(   2,<2023-11-01 15:07:51.09 +0400>,<she>,<DPX200>,
      <Start of raw data processing
       efp BC_mod = 2 LB = 5 FT_mod = 6 PKNL = 1 PHC0 = -10632.91 PHC1 = 36.4902 SI = 64K 
       data hash MD5: 64K
       1D EC 33 3E 26 5A 0D 85 FC C7 C2 B1 B1 EB 2C CE>)
(   3,<2023-11-01 15:08:07.25 +0400>,<she>,<DPX200>,
      <pk PHC0 = -17.21649 PHC1 = 0 
       data hash MD5: 64K
       9A 8B BF 6E 3A D0 79 9D AD B7 D3 B8 37 DF E8 54>)
(   4,<2023-11-01 15:08:10.67 +0400>,<she>,<DPX200>,
      <abs ABSG = 5 
       data hash MD5: 64K
       ED B5 67 C8 82 29 33 0B 0A 7E BC A3 58 35 91 A2>)
$$ ##END=
$$ 
$$ hash MD5
$$ 9B BC 39 2B 85 DF 8E 45 FD 4D D7 42 E8 28 14 04
##$RELAX= 
##$RELAX= 
##$RELAX= 
##$RELAX= 
##$RELAX= 
##$RELAX= 
##$RELAX= 
##$RELAX= 
##$RELAX= 
$$ Bruker specific parameters
$$ --------------------------
##$DU= <F:/spectra>
##$EXPNO= 1
##$NAME= <P31>
##$PROCNO= 1
##$TYPE= <nmr>
##$USER= <she>
##$AMP= (0..31)
100 100 100 100 100 100 100 100 100 100 100 100 100 100 100 100 100 100 
100 100 100 100 100 100 100 100 100 100 100 100 100 100 
##$AQSEQ= 0
##$AQ_mod= 1
##$AUNM= <au_zg>
##$AUTOPOS= <>
##$BF1= 81.014009
##$BF2= 200.13
##$BF3= 200.13
##$BF4= 200.13
##$BF5= 200.13
##$BF6= 200.13
##$BF7= 200.13
##$BF8= 200.13
##$BYTORDA= 1
##$CFDGTYP= 0
##$CFRGTYP= 5
##$CHEMSTR= <none>
##$CNST= (0..31)
1 1 145 1 1 1 1 1 1 1 1 1 1 1 1 1 1 1 1 1 1 1 1 1 1 1 1 1 1 1 1 1 
##$CPDPRG= <waltz16>
##$CPDPRG1= <>
##$CPDPRG2= <waltz16>
##$CPDPRG3= <>
##$CPDPRG4= <mlev>
##$CPDPRG5= <mlev>
##$CPDPRG6= <mlev>
##$CPDPRG7= <mlev>
##$CPDPRG8= <mlev>
##$CPDPRGB= <>
##$CPDPRGT= <>
##$D= (0..31)
0 1 0 0 0 0 0 0 0 0 0 0.03 2e-05 3e-06 0 0 0 0 0 0 0 0 0 0 0 0 0 0 0 0 
0 0 
##$DATE= 1698836862
##$DBL= (0..7)
120 120 120 11 120 120 24 19 
##$DBP= (0..7)
150 150 150 150 150 150 150 150 
##$DBP07= 0
##$DBPNAM0= <>
##$DBPNAM1= <>
$$ [...]
##$SUBNAM3= <"">
##$SUBNAM4= <"">
##$SUBNAM5= <"">
##$SUBNAM6= <"">
##$SUBNAM7= <"">
##$SUBNAM8= <"">
##$SUBNAM9= <"">
##$SW= 501.771253377433
##$SWIBOX= (0..15)
0 1 3 0 0 0 0 0 0 0 0 0 0 0 0 0 
##$SW_h= 40650.406504065
##$TD= 32768
##$TD0= 1
##$TE= 0
##$TE2= 300
##$TE3= 300
##$TEG= 300
##$TL= (0..7)
0 120 53 12 22 120 120 120 
##$TP= (0..7)
150 150 150 150 150 150 150 150 
##$TP07= 0
##$TPNAME0= <>
##$TPNAME1= <>
##$TPNAME2= <>
##$TPNAME3= <>
##$TPNAME4= <>
##$TPNAME5= <>
##$TPNAME6= <>
##$TPNAME7= <>
##$TPOAL= (0..7)
0.5 0.5 0.5 0.5 0.5 0.5 0.5 0.5 
##$TPOFFS= (0..7)
0 0 0 0 0 0 0 0 
##$TUNHIN= 0
##$TUNHOUT= 0
##$TUNXOUT= 0
##$USERA1= <user>
##$USERA2= <user>
##$USERA3= <user>
##$USERA4= <user>
##$USERA5= <user>
##$V9= 5
##$VALIST= <valist>
##$VCLIST= <CCCCCCCCCCCCCCC>
##$VD= 0
##$VDLIST= <DDDDDDDDDDDDDDD>
##$VPLIST= <PPPPPPPPPPPPPPP>
##$VTLIST= <TTTTTTTTTTTTTTT>
##$WBST= 1024
##$WBSW= 4
##$XGAIN= (0..3)
0 0 0 0 
##$XL= 0
##$YL= 0
##$YMAX_a= 17790
##$YMIN_a= -14000
##$ZGOPTNS= <>
##$ZL1= 120
##$ZL2= 120
##$ZL3= 120
##$ZL4= 120
##$ABSF1= 248.5645
##$ABSF2= -253.2056
##$ABSG= 5
##$ABSL= 3
##$ALPHA= 0
##$AQORDER= 0
##$ASSFAC= 0
##$ASSFACI= 0
##$ASSFACX= 0
##$ASSWID= 0
##$AUNMP= <proc_1d>
##$AZFE= 0.1
##$AZFW= 0.5
##$BCFW= 0
##$BC_mod= 2
##$BYTORDP= 0
##$COROFFS= 0
##$CY= -3
##$DATMOD= 1
##$DC= 0
##$DFILT= <>
##$DTYPP= 0
##$F1P= 0
##$F2P= 0
##$FCOR= 1
##$FTSIZE= 65536
##$FT_mod= 6
##$GAMMA= 0
##$GB= 0
##$INTBC= 1
##$INTSCL= 6.047779e-11
##$ISEN= 30
##$LB= 5
##$LEV0= 0
##$LPBIN= 0
##$MAXI= 10000
##$MC2= 0
##$MEAN= 0
##$ME_mod= 0
##$MI= 50
##$NCOEF= 0
##$NC_proc= -7
##$NLEV= 6
##$NOISF1= 182.463
##$NOISF2= 159.3651
##$NSP= 0
##$NTH_PI= 0
##$NZP= 0
##$OFFSET= 248.5645
##$PC= 4
##$PHC0= -10650.13
##$PHC1= 36.4902
##$PH_mod= 1
##$PKNL= yes
##$PPARMOD= 0
##$PSCAL= 0
##$PSIGN= 0
##$REVERSE= no
##$SF= 81.0140089999694
##$SI= 65536
##$SIGF1= 159.3651
##$SIGF2= -187.1042
##$SINO= 113.3802
##$SIOLD= 16384
##$SREGLST= <1H.CDCl3>
##$SSB= 0
##$STSI= 65536
##$STSR= 0
##$SW_p= 40650.406504065
##$SYMM= 0
##$S_DEV= 0
##$TDeff= 32768
##$TDoff= 0
##$TI= <>
##$TILT= no
##$TM1= 0
##$TM2= 0
##$TOPLEV= 0
##$USERP1= <user>
##$USERP2= <user>
##$USERP3= <user>
##$USERP4= <user>
##$USERP5= <user>
##$WDW= 1
##$XDIM= 65536
##$YMAX_p= 485819949
##$YMIN_p= -7118480
$$ End of Bruker specific parameters
$$ ---------------------------------
##NTUPLES= NMR SPECTRUM
##VAR_NAME=  FREQUENCY,     SPECTRUM/REAL,   SPECTRUM/IMAG
##SYMBOL=    X,             R,               I
##VAR_TYPE=  INDEPENDENT,   DEPENDENT,       DEPENDENT
##VAR_FORM=  AFFN,          ASDF,            ASDF
##VAR_DIM=   65536,         65536,           65536
##UNITS=     HZ,            ARBITRARY UNITS, ARBITRARY UNITS
##FACTOR=    0.620285442955139, 1,           1
##FIRST=     20137.2065510682, 0,            0
##LAST=      -20513.1999529968, 0,           0
##MIN=       -20513.1999529968, -7118480,    0
##MAX=       20137.2065510682, 485819949,    0
$$ Real data points
##PAGE= N=1
##DATA TABLE= (X++(R..R)), XYDATA
$$ [...]
38898I99150k48452l03376k51245r4505Q9329K26117K91781K87986K17733J07652
38888A322170K3454K4822J04051J88120K03812J32093O126j21563k02245k02879
38878A477961j23776j1146O4443N7420k4148j37346k36961k84027k48804j38547
38868C95069j7166L6909L892o4282j04874r3085l0627P1208J73404K07599J29641
38857G07688l6097k23842l73877m31239l39325r5890J93180L76078L89142K97365
38847D63183K01447J50187J51554K08595L00876L65779L49435K69013J91979J60080
38837B812128J60694J65259J65490J69456J81646J87132J44703J3043j86993l47128
38827C465430l50106j84062M9081K45153L83525M88711N51324N33871M42957L52050
$$ y = [999150, 750698, 447322, 196077, 101572, 190901, 417018, 708799, 996785, 1214518, 1322170, 1345624, 1370446, 1474497, 1662617, 1866429, 1998522, 2004648, 1883085, 1680840, 1477961, 1354185, 1343039, 1407482, 1464902, 1440754, 1303408, 1066447, 782420, 533616, 395069, 377903, 414812, 418704, 354422, 249548, 156463, 125836, 197044, 370448, 578047, 707688, 671591, 447749, 73872, -357367, -696692, -792582, -599402, -223324, 165818, 463183, 664630, 814817, 966371, 1174966, 1475842, 1841621, 2191056, 2460069, 2652048, 2812128, 2972822, 3138081, 3303571, 3473027, 3654673, 3841805, 3986508, 3999551, 3812558, 3465430, 3115324, 2931262, 2980343, 3225496, 3609021, 4097732, 4649056, 5182927, 5625884, 5977934]
38817E977934L40679M28571N69129O86640P21522O69567N91505N63690O00420
38808A1149657O34061N85133M44755K79565J67777J42789J83431K33322K32510
38799A4053000J58395N0367j6938K868R1220J89062K47147K49094J98336R8982
38789A5321533m3956k06180l31630l53140k43678n2304J19898J89067J39632J7920
38779A4557162j13055k17495l03639m01460n11435n73982n09870l05578m9712
38770A1570936J27318J47183K0025j86331l89174n16374n29132m44112l27173
38761I473166k48293k30658k36450k00470q6136P9328K22127K81397K59472K17434
38751I530917K22260K94250L96901M73059M95873M92279N19912O20963P94547
$$ y = [5977934, 6318613, 6747184, 7316313, 8002953, 8724475, 9394042, 9985547, 10549237, 11149657, 11783718, 12368851, 12813606, 13093171, 13260948, 13403737, 13587168, 13820490, 14053000, 14211395, 14261762, 14244824, 14247692, 14338912, 14527974, 14775121, 15024215, 15222551, 15321533, 15277577, 15071397, 14739767, 14386627, 14142949, 14090645, 14210543, 14399610, 14539242, 14557162, 14444107, 14226612, 13922973, 13521513, 13010078, 12436096, 11926226, 11620648, 11570936, 11698254, 11845437, 11865462, 11679131, 11289957, 10773583, 10244451, 9800339, 9473166, 9224873, 8994215, 8757765, 8557295, 8471159, 8550487, 8772614, 9054011, 9313483, 9530917, 9753177, 10047427, 10444328, 10917387, 11413260, 11905539, 12425451, 13046414, 13840961]
38742A3840961J000513J176416J257862J208154J042542Q14649N73405L45631
38734B1260133J62964P5888J10569K20724L14108L36508L14372L09417L46213
38725B3450896L94429M13327M00507L91990M16191M55324M62933M19277L53403
38716B7158277L01635K59296J89452P0279q1990k28789l31683l70419l62710l60602
38706B6242746m00599m56636m67878m15536l44390l01931k88620k86530l07069
38697B2973557l75831m78751n52871n37150m23981k67065j50794j41115k41375
38688A9804624l88729n05439n60878n81950o08667o51560o92889p14652p11857
38679A4388003o79820o03916m79394l43566k67830k94901l85661m46673m12854
$$ y = [13840961, 14841474, 16017890, 17275752, 18483906, 19526448, 20341097, 20914502, 21260133, 21423097, 21498985, 21609554, 21830278, 22144386, 22480894, 22795266, 23104683, 23450896, 23845325, 24258652, 24659159, 25051149, 25467340, 25922664, 26385597, 26804874, 27158277, 27459912, 27719208, 27908660, 27978939, 27896949, 27668160, 27336477, 26966058, 26603348, 26242746, 25842147, 25385511, 24917633, 24502097, 24157707, 23855776, 23567156, 23280626, 22973557, 22597726, 22118975, 21566104, 21028954, 20604973, 20337908, 20187114, 20045999, 19804624, 19415895, 18910456, 18349578, 17767628, 17158961, 16507401, 15814512, 15099860, 14388003, 13708183, 13104267, 12624873, 12281307, 12013477, 11718576, 11332915, 10886242, 10473388]
38670A0473388k90159j24527M0320J68293K30640K26524J85105J27159M7523l9212
38660A1045054o3258M3862K63514N01297O83607Q02612Q63883Q43846P30600N73259
38650A6288276M53457M20395M75103N95963P44960Q59694Q78885P88280O25878
38641B2130891M39685K54816Q1650o0902j37331j07531M3305K71291M77116N66579
38631B3959569N17374L82267K36913J41940J40815K48180M16447N39101N21744
38622B7104350L55298J10891j31565l41303n36527p48961r91104j240841j444547
38613B2135691j539632j490873j321366j110711r46687q60502q10516p41568o55350
38604A2658486o03892o15807o55478o64421o19230n34117m29449l20572k20601
$$ y = [10473388, 10183229, 10058702, 10099022, 10267315, 10497955, 10724479, 10909584, 11036743, 11084266, 11045054, 10981796, 11025658, 11289172, 11790469, 12474076, 13276688, 14140571, 14984417, 15715017, 16288276, 16741733, 17162128, 17637231, 18233194, 18978154, 19837848, 20716733, 21505013, 22130891, 22570576, 22825392, 22907042, 22846140, 22708809, 22601278, 22644583, 22915874, 23392990, 23959569, 24476943, 24859210, 25096123, 25238063, 25378878, 25627058, 26043505, 26582606, 27104350, 27459648, 27570539, 27438974, 27097671, 26561144, 25812183, 24821079, 23580238, 22135691, 20596059, 19105186, 17783820, 16673109, 15726422, 14865920, 14055404, 13313836, 12658486, 12054594, 11438787, 10783309, 10118888, 9499658, 8965541, 8536092, 8215520, 7994919]
38595G994919j28709k8372P6677J39089J16908M0967p946M620L5817M9651Q9897
38584H383518K28929M64848P11357Q83651R57344R44326Q56050P14676N71644
38575A4716343M79793M47962M40172M15741L54987K50962R9595r2506l01954m96324
38565A6314771o38669o85249o03522m11515j85049l32J27764K30723L17272L51948
38555A4818142L09600K18813J30065O2334L763n2936j03117j47090j87953k19909
38545A4831712k44274k89688l85814n17694o35177p08616p44355p42683o80651
38536I882760n56478m20014l31607l07937l28689l76194m40225m95500n04456
38527F121660m44880l21543j58494L443J12298J35733R2154L7781K1155N8812
$$ y = [7994919, 7866210, 7837838, 7914515, 8053604, 8170512, 8211479, 8203533, 8208153, 8243970, 8293621, 8383518, 8612447, 9077295, 9788652, 10672303, 11629647, 12573973, 13430023, 14144699, 14716343, 15196136, 15644098, 16084270, 16500011, 16854998, 17105960, 17205555, 17113049, 16811095, 16314771, 15676102, 14990853, 14387331, 13975816, 13790767, 13790435, 13918199, 14148922, 14466194, 14818142, 15127742, 15346555, 15476620, 15538954, 15542717, 15489781, 15386664, 15239574, 15051621, 14831712, 14587438, 14297750, 13911936, 13394242, 12759065, 12050449, 11306094, 10563411, 9882760, 9326282, 8906268, 8574661, 8266724, 7938035, 7561841, 7121616, 6626116, 6121660, 5676780, 5355237, 5196743, 5200186, 5312484, 5448217, 5540371, 5578152, 5599307, 5658119]
38517E658119J46780K73241M14160N32384N94267N89499N38391M84043M70089
38508I700973N12656N90171O62843P01100O99756O83185P07327Q37463J095945
38499A6191419J430253J751998K014921K247055K508125K828765L189739L532886
38491C5695161L762063L730263L261982K250657P84507q24411k182903l036781
38483D3440538l376925l355784l133662k804647k413695j987528j549859j138564
38475B3679874q08828n96755m82900m12745l47128k71711j73040m6791O9221J14256
38465B0723453P6673J8697J0115N9127J26678J85918K40320K95653L44461L82384
38455B2463479M20353M69043N16060N28431M87172M23529M11827N11753P15503
$$ y = [5658119, 5804899, 6078140, 6492300, 7024684, 7618951, 8208450, 8746841, 9230884, 9700973, 10213629, 10803800, 11466643, 12167743, 12867499, 13550684, 14258011, 15095474, 16191419, 17621672, 19373670, 21388591, 23635646, 26143771, 28972536, 32162275, 35695161, 39457224, 43187487, 46449469, 48700126, 49484633, 48660222, 46477319, 43440538, 40063613, 36707829, 33574167, 30769520, 28355825, 26368297, 24818438, 23679874, 22871046, 22274291, 21791391, 21378646, 21031518, 20759807, 20586767, 20539976, 20609197, 20723453, 20800126, 20818823, 20828938, 20888065, 21014743, 21200661, 21440981, 21736634, 22081095, 22463479, 22883832, 23352875, 23868935, 24397366, 24884538, 25308067, 25719894, 26231647, 26947150]
38446B6947150R58578J179319J361166J530076J731171J994039K275620K417649
38438D0394768K195193J459058K60208j152149k448783l361842l775146l739184
38430B9832123l415505k982866k561634k194771j875423j587628j334971j141870
38422A2737455j026398r72038r32095q61943p44721n96554m59684l78040l54791
38413F411191l38452k78035j90255j39536j48215j67843j57489j48326j92498
38404D650542k75044l23388k95492k13769j07934L0528K10229L82250M59857M04634
38394D922413K75827J77664J57054J64239J20553J3556r0474j22310p6554l147
38384E538821M1253K4466m6575j11310p1401J35163M54879P28888Q07882O73939
$$ y = [26947150, 27905728, 29085047, 30446213, 31976289, 33707460, 35701499, 37977119, 40394768, 42589961, 44049019, 44309227, 43157078, 40708295, 37346453, 33571307, 29832123, 26416618, 23433752, 20872118, 18677347, 16801924, 15214296, 13879325, 12737455, 11711057, 10739019, 9806924, 8944981, 8200260, 7603706, 7144022, 6765982, 6411191, 6072739, 5794704, 5604449, 5464913, 5316698, 5148855, 4991366, 4843040, 4650542, 4375498, 4052110, 3756618, 3542849, 3434915, 3465443, 3675672, 4057922, 4517779, 4922413, 5198240, 5375904, 5532958, 5697197, 5817750, 5831306, 5740832, 5618522, 5541968, 5538821, 5580074, 5604540, 5557965, 5446655, 5375254, 5510417, 5965296, 6694184, 7502066, 8176005]
38374H176005M54608L12715L13673L95747M63277M91845N32903O38245Q11454
38365A2590472J024711J243607J428426J550540J632122J747615J965426K301660
38357B5484579K737335L251843L823230M428658N076288N818155O703077P728980
38349F5052145Q860558J0068857J1309693J2440990J3140115J2880645J1055957
38342A44808960P320806J998765l838003q837895j2071201j3387016j3223583
38335A02770833j2192806j0809767r415191q167627p075544o091077n198434m416858
38327C9403529l754101l193376k712539k289915j904692j555047j260388j021492
38319B1711979p95676n43398k90957j15247o4567j14614j97703k49848k29726
$$ y = [8176005, 8630613, 8943328, 9257001, 9652748, 10116025, 10607870, 11140773, 11779018, 12590472, 13615183, 14858790, 16287216, 17837756, 19469878, 21217493, 23182919, 25484579, 28221914, 31473757, 35296987, 39725645, 44801933, 50620088, 57323165, 65052145, 73912703, 83981560, 95291253, 107732243, 120872358, 133753003, 144808960, 152129766, 154128531, 150290528, 141452633, 129381432, 115994416, 102770833, 90578027, 79768260, 70353069, 62185442, 55109898, 49018821, 43820387, 39403529, 35649428, 32456052, 29743513, 27453598, 25548906, 23993859, 22733471, 21711979, 20916303, 20372905, 20081948, 19966701, 19902134, 19787520, 19589817, 19339969, 19110243]
38310A9110243j22259N5311K55372M17505M91875M61455L56070K37643J52234
38301B1415449R1947J2808j11028k61799m05949n32557o55071p80344q86064r35496
38291A6951896r16003q56952q01479p63711p26007o76947o32499o10660o02945
38282A0364693n88018n62573n39417n19119m81394m06416k94385j65923n3166
38273F754282J4278K9283J3466p118k9932o8290j22963j82314k49112l39045m39328
38262E373207m90814m34837k72975o8440J02217J86535J63976N1252r3329j96594
38252D320198k22762j97796j77341j93624k29795k34032j62946l3880O1027K1327
38242B950376j59072l69317m78005m37656k82570o1574J78857L63361M09795L11191
$$ y = [19110243, 18987984, 19043295, 19298667, 19716172, 20208047, 20669502, 21025572, 21263215, 21415449, 21507396, 21520204, 21409176, 21147377, 20741428, 20208871, 19553800, 18773456, 17887392, 16951896, 16035893, 15178941, 14377462, 13613751, 12887744, 12210797, 11578298, 10967638, 10364693, 9776675, 9214102, 8674685, 8155566, 7674172, 7267756, 6973371, 6807448, 6754282, 6768560, 6797843, 6811309, 6804191, 6774259, 6705969, 6583006, 6400692, 6151580, 5812535, 5373207, 4882393, 4447556, 4174581, 4106141, 4208358, 4394893, 4558869, 4610121, 4516792, 4320198, 4097436, 3899640, 3722299, 3528675, 3298880, 3064848, 2901902, 2868022, 2929049, 2950376, 2791304, 2421987, 1943982, 1506326, 1223756, 1162182, 1341039, 1704400, 2114195, 2425386]
38232B425386J59043N8146M0217P4330J25279J70177J84425J51500Q0944n402
38222C464045r2603j60338j77143j39724r7420r6661j13503q6400j1382M4812
38212B533683L5760n882k1748n550l86l7785j01771j43589j20398l0696P9791
38201B181429J57061J86360J90874J91277J90583J94267K10495K22477J93257
38192C918080J12505J1724p9380j62517k43294l09117l58428m18587m98647n45595
38182A426744m86889l10696p7685J35781K77515L15072K35098O3351j33767k83309
38172A161215l43744l18306k42893j57349p9195p061N1741P5094N6611K5055J9275
38161B40443N5499J25766K06720K59084K47990J87425J39089J39039J49358J15201
$$ y = [2425386, 2584429, 2642575, 2682792, 2757122, 2882401, 3052578, 3237003, 3388503, 3469447, 3464045, 3371442, 3211104, 3033961, 2894237, 2796817, 2700156, 2586653, 2500253, 2488871, 2533683, 2569443, 2563561, 2541813, 2536263, 2535877, 2498092, 2396321, 2252732, 2132334, 2101638, 2181429, 2338490, 2524850, 2715724, 2907001, 3097584, 3291851, 3502346, 3724823, 3918080, 4030585, 4042309, 3962929, 3800412, 3557118, 3248001, 2889573, 2470986, 1972339, 1426744, 939855, 629159, 551474, 687255, 964770, 1279842, 1514940, 1578291, 1444524, 1161215, 817471, 499165, 256272, 98923, 19728, 12667, 64408, 139502, 196113, 221168, 240443, 295942, 421708, 628428, 887512, 1135502, 1322927, 1462016, 1601055, 1750413, 1865614]
38151A865614M5905k631q060O052L0283Q6892J77743K61108K99125K96108K75478
38140C333617K47229K08914J50184M8894j03262k60949l49534l47565l08739k80346
38130B338443k39482j43057n223J20532K14816L01145L92668M76455N48633O19960
38120D624890O78867O90927O54388O24774O59628P57598Q73469R79109J088479
38111A1632129J232211J429014J678275J958764K225902K415951K452797K250535
38103B7275578J733142Q92182j57105j197523k016840k506910k671902k574773
38095A8775849k304092j970674j677614j462034j283447j086990q64388o45585
38087G481025m62919l52087l59497m96547o86592q04124p86472o81215n72639
$$ y = [1865614, 1911519, 1908888, 1900828, 1906880, 1937163, 2024055, 2201798, 2462906, 2762031, 3058139, 3333617, 3580846, 3789760, 3939944, 3988838, 3885576, 3624627, 3275093, 2927528, 2618789, 2338443, 2098961, 1955904, 1950681, 2071213, 2286029, 2587174, 2979842, 3456297, 4004930, 4624890, 5303757, 5994684, 6649072, 7273846, 7933474, 8691072, 9564541, 10543650, 11632129, 12864340, 14293354, 15971629, 17930393, 20156295, 22572246, 25025043, 27275578, 29008720, 29900902, 29743797, 28546274, 26529434, 24022524, 21350622, 18775849, 16471757, 14501083, 12823469, 11361435, 10077988, 8990998, 8126610, 7481025, 7018106, 6666019, 6306522, 5809975, 5123383, 4319259, 3532787, 2851572, 2278933]
38078B278933m92124m18417l33161k40058j41958l2910Q4002J90150K63527K84526
38068A442510K35644J16955l2909j45885j65640q2728O2851K04706K82855K72650
38058B191009J91509P6922m0133j38783j97318j96268j37198n2281Q061o5q8263
38047A617192k20684l28111l52710k86093j63132k6740R0891J62892J70794J24590
38037G88889O5156L1167K5531K1308l547m4783q1604r7747q9079n6128O24P0501
38025F30288J22375J22655P7172M4418Q2487J77032K42083K07418R2777k1088
38015A777617q5102j21699j71667k27935k40163j74213n0386P1990J32210R5674
38005A006326k8765j82754k84372k85299k08551j19932o1324k4540O859J1457
$$ y = [2278933, 1786809, 1368392, 1035231, 795173, 653215, 620305, 704307, 894457, 1157984, 1442510, 1678154, 1795109, 1762200, 1616315, 1450675, 1367947, 1430798, 1635504, 1918359, 2191009, 2382518, 2459440, 2419307, 2280524, 2083206, 1886938, 1749740, 1697459, 1705520, 1705455, 1617192, 1396508, 1068397, 715687, 429594, 266462, 239722, 330613, 493505, 664299, 788889, 854045, 885212, 910743, 932051, 928504, 883721, 802117, 704370, 615291, 559163, 559787, 630288, 752663, 875318, 952490, 996908, 1079395, 1256427, 1498510, 1705928, 1798705, 1777617, 1692515, 1570816, 1399149, 1171214, 931051, 756838, 706452, 778442, 910652, 1006326, 977561, 794807, 510435, 225136, 16585, -103347, -164671, -189211, -182352, -170895]
37995a70895n0993j76534k95041l25406k48111j16929o012M4796L9994P598j7198
37984a314731P31Q0155K01959L13477L68938L66417L37284L03309K60127K04823
37974A122489J55859J25573Q8981J2688q6196j47296j48456j42560j76754k01662
37964F02666j18612P9175K68048L24265K53411J55007R1921M5085j8797r2753
37954A589416j50208j72531j39603l4830J14505K34372K72010K44928J96617J29904
37944B284580K0687j21075k48022l27750l57822l29193k21440n2697J01636J70177
37934I19081J52152J06133Q6351J04138J35780J48217J25069Q3954O3429Q1162
37924B005466J11439J14789Q2591M1666K3218L9212P9846J17716J19967P4640
$$ y = [-170895, -221888, -398422, -693463, -1018869, -1266980, -1383909, -1389921, -1345125, -1305131, -1297533, -1314731, -1314000, -1233845, -1031886, -718409, -349471, 16946, 354230, 657539, 917666, 1122489, 1278348, 1403921, 1492902, 1505590, 1419394, 1272098, 1123642, 981082, 804328, 602666, 484054, 563229, 831277, 1155542, 1408953, 1563960, 1655881, 1700966, 1682169, 1589416, 1439208, 1266677, 1127074, 1092244, 1206749, 1441121, 1713131, 1958059, 2154676, 2284580, 2305267, 2184192, 1936170, 1608420, 1250598, 921405, 699965, 647268, 748904, 919081, 1071233, 1177366, 1263717, 1367855, 1503635, 1651852, 1776921, 1860875, 1924304, 2005466, 2116905, 2231694, 2314285, 2355951, 2379169, 2418381, 2498227, 2615943, 2735910, 2810550]
37914B810550N984m8845p6969r1497j00078r0722n3044K505N4160Q5285Q4510
37903B581839M5111j9448o7154n5915J1987Q4654J10787R4343R1726J50865K56218
37892C285013L39007L42600K74290J92155J46868J40981J39807J11393N3367j0212
37882E015269m9534m8485j2987L3695O6143P5384P9696J16406K12797L54264M82675
37871F325323N41439N35211N40224O38700Q35469J048503J190080J249947J290192
37862A4195088J370988J502909J668957J865624K111960K440745K893126L492521
37854C1541918M191701M857902N334330N492473N186360M203814K395724o6285
37846F3137937k618699m600807n663783n893449n592169n028256m377499l763717
$$ y = [2810550, 2816534, 2767689, 2690720, 2599223, 2499145, 2408423, 2355379, 2357884, 2412044, 2497329, 2581839, 2626950, 2607502, 2540348, 2484433, 2496420, 2581074, 2691861, 2786204, 2877930, 3028795, 3285013, 3624020, 3966620, 4240910, 4433065, 4579933, 4720914, 4860721, 4972114, 5025481, 5015269, 4965735, 4917250, 4904263, 4937958, 5004101, 5079485, 5159181, 5275587, 5488384, 5842648, 6325323, 6866762, 7401973, 7942197, 8580897, 9416366, 10464869, 11654949, 12904896, 14195088, 15566076, 17068985, 18737942, 20603566, 22715526, 25156271, 28049397, 31541918, 35733619, 40591521, 45925851, 51418324, 56604684, 60808498, 63204222, 63137937, 60519238, 55918431, 50254648, 44361199, 38769030, 33740774, 29363275, 25599558]
37838B5599558l244542k789013k350360j958239j683871j523932j386837j206396
37830I456368j006838q29154o53397m44552k34626r5378m3490l1681l3667p9094
37820F004491j85564l06167l79460l99488l98160l79452l15162k03310r1404k8185
37810C318139j5333k0458k1718k4728m4385q4753j35658j79052j97560j84727
37800B409767j51633j18319r0849m9132K8393J20771J61112R9687l1888j43064
37790B234845j77658j65558j73905k29217l03090l53625l56830l09075k22912
37781e7025j17266J193J33443K49896K83027J96130M6539o4019j01975j21950
37771D47993j69494k12701j91958r6523L6950J66352K49372K38802J22912l6467
$$ y = [25599558, 22355016, 19566003, 17215643, 15257404, 13573533, 12049601, 10662764, 9456368, 8449530, 7620376, 6966979, 6522427, 6287801, 6192423, 6148933, 6117252, 6083585, 6004491, 5818927, 5512760, 5133300, 4733812, 4335652, 3956200, 3641038, 3437728, 3346324, 3318139, 3302806, 3282348, 3260630, 3235902, 3191517, 3106764, 2971106, 2792054, 2594494, 2409767, 2258134, 2139815, 2048966, 1999834, 2028227, 2148998, 2310110, 2409797, 2377909, 2234845, 2057187, 1891629, 1717724, 1488507, 1185417, 831792, 474962, 165887, -57025, -174291, -173098, -39655, 210241, 493268, 689398, 735937, 671918, 569943, 447993, 278499, 65798, -126160, -222683, -185733, -19381, 229991, 468793, 591705, 555238]
37761E55238j45166j57712r5155L903J13389K06592K55987K59352K38449K02650
37751A437527J41204O2127Q079J0211M4795O0036L6819J649j6891k4520m8372
37740A712664r8260j50506j74059j70222j74171k05051k24820j73378n0664O2374
37730C53907Q4965K4674l5639k9235L7603J11873J46649J22267M6399m1216p7200
37719G45047j9251J05126K05442J95956O2124j31824k89788l40527k71476j31358
37709A29471j214N6692L9117m902k2510J493M6505Q4816R9266Q2807L9947p143
37697E44345k8727j6575Q50j6558p7353j45607j73369j42380p2722K122O0367
37686f5607R5930J11531J15696J19240J24666J21275R8510N9907J2263n5800j64399
$$ y = [555238, 410072, 252360, 157205, 161108, 274497, 481089, 737076, 996428, 1234877, 1437527, 1578731, 1640858, 1648937, 1659148, 1703943, 1763979, 1800798, 1802447, 1785556, 1761036, 1712664, 1614404, 1463898, 1289839, 1119617, 945446, 740395, 515575, 342197, 291533, 353907, 438872, 463546, 427907, 398672, 436275, 548148, 694797, 817064, 863463, 822247, 745047, 725796, 830922, 1036364, 1232320, 1294444, 1162620, 872832, 532305, 260829, 129471, 128257, 184949, 224066, 219164, 196654, 198147, 244652, 329468, 428734, 511541, 551488, 544345, 515618, 499043, 499893, 483335, 405982, 260375, 87006, -55374, -128096, -125974, -65607, 30323, 141854, 257550, 376790, 501456, 622731, 721241, 781148, 793411, 737611, 573212]
37675E73212l01984m09946m26760l46369k21280j09026k6513M3536J16437J86538
37665i22155K39801K74960L05773L40459L61594L33520K35497Q8136n2106j21451
37655A084028p8643P1635K68456M17837M50875L70221K36305J11119K2149l1341
37645B922641o3694r8444j51329k00593j93276j03204K8901J37304K06771K80150
37635B765227L90756N15145O02151O24834N91528N30861M87263N08618O02300
37626G618683P05610P26726O17610L90233P4957k96215o60302r24241j028987
37617G224074r94488q79512p18653n25359l33591j92804j20900r1659o9971l6182
37607C260955J7971Q4108J24776R8931J1136q8277j58716k00652k28661k47510
$$ y = [573212, 271228, -138718, -565478, -911847, -1133127, -1242153, -1268666, -1225130, -1108693, -922155, -682354, -407394, -101621, 238838, 600432, 933952, 1169449, 1257585, 1205479, 1084028, 1005385, 1077020, 1345476, 1763313, 2214188, 2584409, 2820714, 2931833, 2953982, 2922641, 2858947, 2760503, 2609174, 2408581, 2215305, 2112101, 2141002, 2278306, 2485077, 2765227, 3155983, 3671128, 4273279, 4898113, 5489641, 6020502, 6507765, 7016383, 7618683, 8324293, 9051019, 9668629, 10058862, 10133819, 9837604, 9177302, 8253061, 7224074, 6229586, 5350074, 4631421, 4106062, 3772471, 3579667, 3458767, 3367108, 3297137, 3260955, 3278926, 3363034, 3487810, 3586741, 3597877, 3509600, 3350884, 3150232, 2921571, 2674061]
37597B674061k68292l14853l91408m67541n13577n25519m98449m11236k69006
37588i85820j29454m5527m041L5653O3218L3640m3407q9335m4875P3221K15759
37577i20968L50165M40479M29387K93132R6746m9797r0278n1989J2983Q1095J47706
37566G38661J96049J99473J50941P8816K6217Q713p019o9993j81780k76814k79493
37555E83771j76557k1318J26838K47862L45667M10853M18212L57672K53052J44762
37545B690814N9904M028k4458k5617r377m160l5956r3363j24132p7313N2683K29754
37533B642807M19650O16639Q19768R93557J074116J025675Q81577P16382N83266
37524I773437M92560M41096M29520M39256M21360L36150J96096N3841l9911n2993
$$ y = [2674061, 2405769, 2090916, 1699508, 1231967, 718390, 192871, -305578, -716814, -985820, -1115274, -1160801, -1164842, -1129189, -1065971, -1032331, -1075738, -1165073, -1209948, -1136727, -920968, -570803, -130324, 299063, 592195, 688941, 639144, 548866, 496877, 509860, 590955, 738661, 934710, 1134183, 1285124, 1363940, 1390157, 1398870, 1391851, 1321858, 1140078, 863264, 583771, 407214, 385896, 512734, 760596, 1106263, 1517116, 1935328, 2293000, 2546052, 2690814, 2750718, 2754746, 2730288, 2704671, 2695294, 2691134, 2655178, 2561815, 2437683, 2360370, 2413053, 2642807, 3062457, 3679096, 4498864, 5492421, 6566537, 7592212, 8473789, 9190171, 9773437, 10265997, 10707093, 11136613, 11575869, 11997229, 12333379, 12529475, 12583316, 12543405, 12490412]
37514A2490412K6570J66906K81081K86821J91211Q6374N0350Q0767J35725K00354
37504A3996571K81915L65287M13348M06697L55335K75221J80420R8455O4278Q4815
37494A6522342J24591J41435J33421J42593K09302L20978M07565L98582K94682
37485A8695491J78317J43929K17946L48812M61719N09286M82525M03368L13227
37476B1754620K43131J77390O3658j18371l06843m02181l62921k32976o8114J30738
37466B0878131L81578O41320Q11817Q38963P72353P03704O66655O20266N15486
37457B6830273L51111J72028L6513k0500j7535k0017q1691j92606l04923m03169
37447B6349484n15621o51467p63763p97660p54903o88904o47165o33528o15827
$$ y = [12490412, 12516982, 12683888, 12964969, 13251790, 13443001, 13529375, 13579725, 13660492, 13796217, 13996571, 14278486, 14643773, 15057121, 15463818, 15819153, 16094374, 16274794, 16373249, 16437527, 16522342, 16646933, 16788368, 16921789, 17064382, 17273684, 17594662, 18002227, 18400809, 18695491, 18873808, 19017737, 19235683, 19584495, 20046214, 20555500, 21038025, 21441393, 21754620, 21997751, 22175141, 22238799, 22120428, 21813585, 21411404, 21048483, 20815507, 20747393, 20878131, 21259709, 21901029, 22712846, 23551809, 24324162, 25027866, 25694521, 26314787, 26830273, 27181384, 27353412, 27389925, 27369425, 27351890, 27331873, 27250182, 27057576, 26752653, 26349484, 25833863, 25182396, 24418633, 23620973, 22866070, 22177166, 21530001, 20896473, 20280646]
37438B0280646n55347m35779k75030j05129O1753K36849M22860N94876P18082
37429B0943781P66702P18873N55844K86159l6709l31209n20688n62562m76273
37420B1343918l47336k68025k52073k28069j28375M4557K52270M75272O98555
37411B1590694Q80268R87717J047731J110966J172213J171333J071831Q97211
37403B9929964O91661M92478L49317L21609M29984O36918Q90155J153916J377650
37394C6273652J468572J338173R79719M86208n930l88608o17671p04603o90141
37385C8139371o34123o19907p24352r41583j152125j222352j151878j087875j174338
37376B9430838j411136j671818j825783j821216j682879j473829j260203j089714
$$ y = [20280646, 19725299, 19289520, 19014490, 18909361, 18971114, 19207963, 19630823, 20225699, 20943781, 21710483, 22429356, 22985200, 23271359, 23234650, 22903441, 22382753, 21820191, 21343918, 20996582, 20728557, 20476484, 20248415, 20120040, 20164597, 20416867, 20892139, 21590694, 22470962, 23458679, 24506410, 25617376, 26789589, 27960922, 29032753, 29929964, 30621625, 31114103, 31463420, 31785029, 32215013, 32851931, 33742086, 34896002, 36273652, 37742224, 39080397, 40060116, 40546324, 40540394, 40151786, 39534115, 38829512, 38139371, 37505248, 36885341, 36160989, 35219406, 34067281, 32844929, 31693051, 30605176, 29430838, 28019702, 26347884, 24522101, 22700885, 21018006, 19544177, 18283974, 17194260]
37368A7194260r92329r87468j063099j147484j146255j038365r08322q47990q43010
37359H219938p92471o33835m15345k44559j90401k34907k96225k94194k11338
37350D906663r5937k190N9537J01382J11567O4141l3206j38285k23350k89618
37340D460704l25326k87627j51401M5869K31934L59568M20183M12653L26113J57483
37330E650153o4680k74264l87405l51563j97754l3211M5455L4090j613k3494n9527
37319D336187j33158j93746j60655k7649J17666J87949J79753J50082J38963J41957
37309D737349J42159J36571J29546J21980J11891R4667O5672L4486K8494O5171
37299E667986J29851K03018K97840M35535N86594O80989O91092O65282O57837
$$ y = [17194260, 16201931, 15214463, 14151364, 13003880, 11857625, 10819260, 9910938, 9062948, 8219938, 7427467, 6793632, 6378287, 6133728, 5943327, 5708420, 5412195, 5118001, 4906663, 4810726, 4808536, 4868073, 4969455, 5081022, 5145163, 5111957, 4973672, 4750322, 4460704, 4135378, 3847751, 3696350, 3742219, 3974153, 4333721, 4753904, 5166557, 5492670, 5650153, 5585473, 5311209, 4923804, 4572241, 4374487, 4341276, 4386731, 4420821, 4419208, 4395714, 4336187, 4203029, 4009283, 3848628, 3820979, 3938645, 4126594, 4306347, 4456429, 4595392, 4737349, 4879508, 5016079, 5145625, 5267605, 5379496, 5474163, 5539835, 5574321, 5602815, 5667986, 5797837, 6000855, 6298695, 6734230, 7320824, 8001813, 8692905, 9358187, 10016024]
37290A0016024O64148O58340O60402P15481Q16844Q91853Q63637O96999L95597
37281A6379325J137l97374o96698q46696q69576q10617p00933n76811m92631m76881
37271A0512245m90353m59767l52586k03507p4718o711O45j7936j6035K7985Q7449
37260I006711J08217O0457l1721j11827j38181j11993o8810m8032o4008r3322
37250H507491q4360R592J86989L79832M90664M62879L18600J30391l3062j32725
37240A0236291j58137j28949r2255r3044j40901k15441k96810l71657m17317m10530
37230G911250l55687k78072j85405o7031O0531J45568J62942J53321J69961K11400
37220G928778K44195K71895L30634M15909M61947M12551K80869J21456k5806j36475
$$ y = [10016024, 10680172, 11338512, 11998914, 12714395, 13531239, 14423092, 15286729, 15983728, 16379325, 16380462, 15983088, 15286390, 14439694, 13570118, 12759501, 12058568, 11481757, 10989126, 10512245, 10021892, 9562125, 9209539, 9006032, 8931314, 8924603, 8925248, 8907312, 8891277, 8919262, 9006711, 9114928, 9175385, 9143664, 9031837, 8893656, 8781663, 8712853, 8664821, 8600813, 8507491, 8423131, 8432723, 8619712, 8999544, 9490208, 9953087, 10271687, 10402078, 10369016, 10236291, 10078154, 9949205, 9856950, 9763906, 9623005, 9407564, 9110754, 8739097, 8321780, 7911250, 7555563, 7277491, 7092086, 7025055, 7085586, 7231154, 7394096, 7547417, 7717378, 7928778, 8172973, 8444868, 8775502, 9191411, 9653358, 10065909, 10346778, 10468234, 10442428, 10305953]
37210A0305953j71053q7899J05939L42620N46511O88795P82154Q36841Q43014
37201A4192875P95115P10076O06099M77025L10550J29526q316n9789l1046L7243
37191A7159358R3888Q0331m9372k73541m87047n85208n64899n08592m68247m08038
37181A3988633k79879j18727k7508p7352k43470m30403n45268n60410n28410n33482
37171A0643724o11789p19988p89646q00019p79261p44425o70257n26223l26663
37162D675453j31445j567M3228L0656M595j5432m2852q9575j32699j31308p4642
37151D134412M313O8272J12902J55875K02721K37736K42267K10890J56695J14292
37141E640375J30322K28054L73919M95662N48901N61745O04370P15578Q60075
$$ y = [10305953, 10134900, 10047001, 10152940, 10495560, 11042071, 11730866, 12513020, 13349861, 14192875, 14987990, 15698066, 16304165, 16781190, 17091740, 17221266, 17212950, 17153161, 17122115, 17159358, 17253246, 17333577, 17284205, 17010664, 16523617, 15938409, 15373510, 14864918, 14396671, 13988633, 13708754, 13590027, 13562519, 13485167, 13241697, 12811294, 12266026, 11705616, 11177206, 10643724, 10031935, 9311947, 8522301, 7722282, 6943021, 6198596, 5528339, 5002116, 4675453, 4544008, 4542441, 4585669, 4616325, 4620920, 4605488, 4562636, 4473061, 4340362, 4209054, 4134412, 4138725, 4206997, 4319899, 4475774, 4678495, 4916231, 5158498, 5369388, 5526083, 5640375, 5770697, 5998751, 6372670, 6868332, 7417233, 7978978, 8583348, 9298926, 10159001]
37132A0159001R45467Q72352N89061J35952l53010p22803r04248r50452r57308
37123H814012r58970r17987q01336o27271m32104k30056l2384J19676J80880J59344
37113E273804J17017J03402J09117R5728N2520L583l2623o5005j01645j17342
37103E438556p2213L5103J52085K23877K48826K64061K82787K73343K07814J06072
37093G160311J3668m6453p9369q9970p7980n7551n3031o6669p0568m2942j481
37082F587965R472l8434j27790k00364j94296r2376N9189J85828K38931K11430
37072F639555J13625l9061k10152l39981l78577l15557j76857q337J37134K27389
37062E649181K85591L75602N28781P01314Q30099R17750J030612J216578J451725
$$ y = [10159001, 11104468, 11976820, 12565881, 12701833, 12348823, 11626020, 10721772, 9771320, 8814012, 7855042, 6937055, 6135719, 5508448, 5076344, 4846288, 4813904, 4933580, 5114460, 5273804, 5390821, 5494223, 5603340, 5699068, 5751588, 5755171, 5722548, 5657543, 5555898, 5438556, 5366343, 5401446, 5553531, 5777408, 6026234, 6290295, 6573082, 6846425, 7054239, 7160311, 7173979, 7127526, 7048157, 6958187, 6880207, 6822656, 6769625, 6702956, 6632388, 6589446, 6587965, 6597437, 6559003, 6431213, 6230849, 6036553, 5944177, 6003366, 6189194, 6428125, 6639555, 6753180, 6714119, 6503967, 6163986, 5785409, 5469852, 5292995, 5284658, 5421792, 5649181, 5934772, 6310374, 6839155, 7540469, 8370568, 9288318, 10318930, 11535508, 12987233]
37053A2987233J658650J736481J573337J093660L48406m57637j080262j401428
37045A6458440j478524j443079j378118j292019j169564j013050q41992o81529
37037G160565n57111m81920m39259l88758l02782j94207j02010n3813m9291p4260
37027D517154j17877j73321k30798k77175l02987l09444l08257l10103l10291
37018B176901k90613k39266j63294p8752j447M5002L3339k9178p9835n4965L1933
37007A349825J02778J16217J17654J64600K38942K74535K49723K03371J63195
36998B980840J05742J63j42837k80639l69688l75180k83917j33994p895L6941
36988A529536K1945P789J3124M548l8090q7810j16797j41797j90718k40413k26474
$$ y = [12987233, 14645883, 16382364, 17955701, 19049361, 19397767, 18940130, 17859868, 16458440, 14979916, 13536837, 12158719, 10866700, 9697136, 8684086, 7842094, 7160565, 6603454, 6121534, 5682275, 5293517, 4990735, 4796528, 4694518, 4640705, 4591414, 4517154, 4399277, 4225956, 3995158, 3717983, 3414996, 3105552, 2797295, 2487192, 2176901, 1886288, 1647022, 1483728, 1404976, 1403529, 1448531, 1481870, 1452692, 1372857, 1317892, 1349825, 1452603, 1568820, 1686474, 1851074, 2090016, 2364551, 2614274, 2817645, 2980840, 3086582, 3086745, 2943908, 2663269, 2293581, 1918401, 1634484, 1500490, 1492595, 1529536, 1551481, 1559270, 1572394, 1576942, 1538852, 1451042, 1334245, 1192448, 1001730, 761317, 534843]
36977E34843j21134K5340J33340J64838J33530O7126j2166p7897j02740q2852
36967F62228m2244l660L4917R2268J84575L11193M37818M93909M21700K46943
36957B839647P3723j6643m0248o0069r1885j07409j13228j61883k69050l71050
36947A681905l95320l38492k43049j26697K1609J87602L17722L68427L44229K79732
36937B097668K05583J42527J09566J16500J49385J76786J76821J55206J34101
36928C464143J26678J27806J26892J17957R2426L5606n4332j50148k15938k43950
36918C427140k55827k66647k64991k33261j70897q9390O79Q6056J44494J53830
36908B531186J04974N431j19098k25054k69980k42953j70837r3276m0935l1429
$$ y = [534843, 413709, 439049, 572389, 737227, 870757, 937883, 925717, 847820, 745080, 662228, 619984, 616324, 651241, 743509, 928084, 1239277, 1677095, 2171004, 2592704, 2839647, 2913370, 2896727, 2856479, 2796410, 2704525, 2597116, 2483888, 2322005, 2052955, 1681905, 1286585, 948093, 705044, 578347, 599956, 787558, 1105280, 1473707, 1817936, 2097668, 2303251, 2445778, 2555344, 2671844, 2821229, 2998015, 3174836, 3330042, 3464143, 3590821, 3718627, 3845519, 3963476, 4055902, 4091508, 4037176, 3887028, 3671090, 3427140, 3171313, 2904666, 2639675, 2406414, 2235517, 2146127, 2146806, 2232862, 2377356, 2531186, 2636160, 2641591, 2522493, 2297439, 2027459, 1784506, 1613669, 1520393, 1479458, 1448029]
36898A448029n9847q7546o8452o46P1488J18164J55293J94143J98913J38344N5044
36887B162927K7985O8390J02170O4307l1323j26801j80243j69471p8793P4792
36877A913940K19749K74899K20392J07364M241m6069k3869P9026K50727M48809
36867C449209O13329O97535O92025O26810N53105N18990N51891O50131P84643
36858I137668R19083J039416J152539J235482J196771R30108M29824j66603o74687
36849A5199601r96194j150301j199801j181265j102061r68727p99812o24532m79849
36840F697059l99487l95350m49975n25801n76719n60028m60504l12282j80774
36831B836139j04516n5939K9768J83756L62666M77038M62294L31159J62708L6085
$$ y = [1448029, 1388182, 1300636, 1232184, 1231538, 1303026, 1421190, 1576483, 1770626, 1969539, 2107883, 2162927, 2190912, 2259302, 2361472, 2425779, 2394456, 2267655, 2087412, 1917941, 1839148, 1913940, 2133689, 2408588, 2628980, 2736344, 2740585, 2694516, 2670647, 2749673, 3000400, 3449209, 4062538, 4760073, 5452098, 6078908, 6632013, 7151003, 7702894, 8353025, 9137668, 10056751, 11096167, 12248706, 13484188, 14680959, 15611067, 16040891, 15874288, 15199601, 14203407, 13053106, 11853305, 10672040, 9569979, 8601252, 7801440, 7176908, 6697059, 6297572, 5902222, 5452247, 4926446, 4349727, 3789699, 3329195, 3016913, 2836139, 2731623, 2675684, 2705452, 2889208, 3251874, 3728912, 4191206, 4522365, 4685073, 4721158]
36821D721158l0486p6484j40423k15441k64175k61190k07771j17110p675Q7628
36811C488031J28271R7605J9643o8232j55760k60534l86639m93979n18554m23931
36801A425921k31986q214J77807K83722L04692K67067K09159J54970R9896K6295
36791B709329o4217j38529j55026r5651K2372J53093K34044K10709P6810j02561
36781B850373k23775k16878r2798P3309K00178K52625K55929K63237K98282L28181
36771C988663L00683K02201O2770q7362k32801l41196l60530k79647j64324r4408
36761B994049p7773o1604j6508L5001P2336J08747J50933J67845J30622N8010
36751C561658r458o3977j27841k05190k67976k93194k90926k86508k86751k70342
$$ y = [4721158, 4690672, 4614188, 4473765, 4258324, 3994149, 3732959, 3525188, 3408078, 3400403, 3488031, 3616302, 3713907, 3733550, 3665318, 3509558, 3249024, 2862385, 2368406, 1849852, 1425921, 1193935, 1185721, 1363528, 1647250, 1951942, 2219009, 2428168, 2583138, 2683034, 2709329, 2645112, 2506583, 2351557, 2255906, 2278278, 2431371, 2665415, 2876124, 2952934, 2850373, 2626598, 2409720, 2316922, 2390231, 2590409, 2843034, 3098963, 3362200, 3660482, 3988663, 4289346, 4491547, 4554317, 4466955, 4234154, 3892958, 3532428, 3252781, 3088457, 2994049, 2916276, 2854672, 2838164, 2873165, 2945501, 3054248, 3205181, 3373026, 3503648, 3561658, 3552200, 3488223, 3360382, 3155192, 2887216, 2594022, 2303096, 2016588, 1729837, 1459495]
36741A459495k07095q6968O6073K12142L28966M17396M70825M61969L83276K88322
36731C794401K60046L28997M41633N15864N09646M26954K81246Q2911j38350l24421
36721F178927m19465m06982l10382j64701k990J29876J76717J11746j4164r9665
36711E178917q4590p357M2893K3739k6940m9699l4191k2979n7435j31561j96708
36700D634089k04130j40367k4278J21379K84184M49074N90098O90317P59103Q09475
36690G968944Q23307P66845O51224N55839N70158P14822R23785J085890J091034
36681A5151848Q67762M32163q4158m95593o93608p15437o68862o07994n13164
36672A2672957l78029k62771k37265l01129l88274m36432m29753l84376l17069
$$ y = [1459495, 1252400, 1165432, 1231505, 1443647, 1772613, 2190009, 2660834, 3122803, 3506079, 3794401, 4054447, 4383444, 4825077, 5340941, 5850587, 6277541, 6558787, 6641698, 6503348, 6178927, 5759462, 5352480, 5042098, 4877397, 4874407, 5004283, 5181000, 5292746, 5278582, 5178917, 5094327, 5086970, 5129863, 5153602, 5126662, 5076963, 5042772, 5019793, 4962358, 4830797, 4634089, 4429959, 4289592, 4265314, 4386693, 4670877, 5119951, 5710049, 6400366, 7159469, 7968944, 8792251, 9559096, 10210320, 10766159, 11336317, 12051139, 12974924, 14060814, 15151848, 16019610, 16451773, 16367615, 15872022, 15178414, 14462977, 13794115, 13186121, 12672957, 12294928, 12032157, 11794892, 11493763, 11105489, 10669057, 10239304, 9854928, 9537859]
36663I537859k28727j06199N6430K32799L75057M62123N21829N91161O75977P72297
36653A2890606R04541J107687J383536J706915K063055K444406K820763L138748
36645B8460257L315476L182056K493939J141729o03945k168523l093188l355418
36637B9372383l245076l008314k699082k307908j882612j489101j148811q66052
36629A2725427o64385n55352n07167m76737m46143m02856l10582j33254J15860
36620I344811L65430N31103N79403N62138N78276O77862Q06131Q62704Q07255
36611A5115113O82355N47558M31034L39054K65426J86786R5021M4186J14924L10113
36601A8131570N31533O89775P92977Q81056R02532P19115K46716m31415j098580
$$ y = [9537859, 9309132, 9202933, 9259363, 9492162, 9867219, 10329342, 10851171, 11442332, 12118309, 12890606, 13795147, 14902834, 16286370, 17993285, 20056340, 22500746, 25321509, 28460257, 31775733, 34957789, 37451728, 38593457, 37989512, 35820989, 32727801, 29372383, 26127307, 23118993, 20419911, 18112003, 16229391, 14740290, 13591479, 12725427, 12061042, 11505690, 10998523, 10521786, 10075643, 9672787, 9362205, 9228951, 9344811, 9710241, 10241344, 10820747, 11382885, 11961161, 12639023, 13445154, 14307858, 15115113, 15797468, 16345026, 16776060, 17115114, 17380540, 17567326, 17662347, 17706533, 17821457, 18131570, 18663103, 19352878, 20145855, 21026911, 21929443, 22648558, 22895274, 22463859, 21365279]
36592B1365279j546609j701566j636249j469846j261787j012424p45651n35893
36584A1455254m29971l84031l20670k29541j70223j81554k24959k23132j31784
36575I159389K9114J94016K97040L16065K81254K36869J97934J48457P0015m0432
36565A0889721j68403k77714l16699k56263j30418k3029j561o4601j54168k12836
36555I284029k26750k18763k07609j81791j18776k3924O2066R6440O5763j5231
36545H515454j21243k27239l14782l77981m18793m33970m14070l55577k64974
36536E586825j54418m8780Q910j0676p3390q7410J8275K24951M39090N64942N62491
36525G030810M60482L31153K37884J90176J55659J19020J07427J45810K11567
$$ y = [21365279, 19818670, 18117104, 16480855, 15011009, 13749222, 12736798, 11991147, 11455254, 11025283, 10641252, 10320582, 10091041, 9920818, 9739264, 9514305, 9291173, 9159389, 9188503, 9382519, 9679559, 9995624, 10276878, 10513747, 10711681, 10860138, 10930153, 10889721, 10721318, 10443604, 10126905, 9870642, 9740224, 9717195, 9715634, 9651033, 9496865, 9284029, 9057279, 8838516, 8630907, 8449116, 8330340, 8306416, 8368482, 8464922, 8530685, 8515454, 8394211, 8166972, 7852190, 7474209, 7055416, 6621446, 6207376, 5851799, 5586825, 5432407, 5383627, 5392537, 5381861, 5308471, 5221061, 5239336, 5464287, 5903377, 6468319, 7030810, 7491292, 7822445, 8060329, 8250505, 8406164, 8525184, 8632611, 8778421, 8989988]
36516H989988K57351K63556K44919K18772J93919J82829J93305K03531J71232
36507A0919402Q2879j6139n1966J6059J62664L18622M20864M44306L98754L16691
36497A3012136K50525K53380L28848M08755M18174L65398L31799L66942M37116
36488A6173073M95850N58141O64542Q03726R20865R91709J044752J111555J192881
36479B3957094J279146J372416J475698J579773J670575J739197J782987J806343
36471C6663229J815412J796400J703885J493261J173611Q17683N11598K95173
36463D6270252J47229K0957j08453k29529l26137m13116n24124o66080q08130
36454D3362869r22313j011493j083008j118144j094372j028631r73328r65312
$$ y = [8989988, 9247339, 9510895, 9755814, 9974586, 10168505, 10351334, 10544639, 10748170, 10919402, 11002281, 10986142, 10934176, 10950235, 11112899, 11431521, 11852385, 12296691, 12695445, 13012136, 13262661, 13516041, 13844889, 14253644, 14671818, 15037216, 15369015, 15735957, 16173073, 16668923, 17227064, 17891606, 18695332, 19616197, 20607906, 21652658, 22764213, 23957094, 25236240, 26608656, 28084354, 29664127, 31334702, 33073899, 34856886, 36663229, 38478641, 40275041, 41978926, 43472187, 44645798, 45463481, 45975079, 46270252, 46417481, 46438438, 46329985, 46100456, 45774319, 45361203, 44837079, 44170999, 43362869, 42440556, 41429063, 40346055, 39227911, 38133539, 37104908, 36131580, 35166268]
36446C5166268r89393r93545r35289q14926o67011n24470m04966l35165l53489
36437B9148014m50427n27735m77040l06692j37043n2778j3890N7673J56732K09803
36427B7606617J76840Q5755j5644r2540j14719o0550N9738K06447L41431M48054
36417B8641429N26087N77058N93889N71509N40017N69850P08880R22388J134026
36408C4785133J314721J480706J620514J703795J769872J922186K206122K564560
36400D9367609K938783L337646L787665M308334M964785N837044O895067Q019719
36392H9456652R200820J0595800J2344933J4474914J7031489K0096412K3559401
36385A96760421K7055631L0132184L1991199L0804750K4037862J0646302o758424
$$ y = [35166268, 34176875, 33183330, 32248041, 31433115, 30766104, 30241634, 29836668, 29501503, 29148014, 28697587, 28169852, 27692812, 27386120, 27249077, 27196299, 27182409, 27240082, 27396814, 27606617, 27783457, 27869212, 27853568, 27761028, 27646309, 27585759, 27645497, 27851944, 28193375, 28641429, 29167516, 29744574, 30338463, 30909972, 31449989, 32019839, 32728719, 33651107, 34785133, 36099854, 37580560, 39201074, 40904869, 42674741, 44596927, 46803049, 49367609, 52306392, 55644038, 59431703, 63740037, 68704822, 74541866, 81436933, 89456652, 98657472, 109253272, 121598205, 136073119, 153104608, 173201020, 196760421, 223816052, 253948236, 285939435, 316744185, 340782047, 351428349, 344669925]
36378C44669925k2716746l2588433l5471696l3642383k9848284k5608986k1474587
36371A43318810j7761073j4645550j2045613r819616p978073o572028n539685
36364F8957172m782763m255713l881131l504793l035048k532145k085016j691712
36356D3188851j328115j040679q91688q80199r78765j180342j447042j675726
36348C3766295j783632j789484j761247j724830j667539j587228j488032j358101
36340B0606202j194411j027996q94442q00256p36331o94505o52590n76766m61615
36331A3567290l40896k43210j67084j11780r3955j10856j18501p3312J9964J12226
36321A2439886J44188P8957o6718k18214l01195l09727k90780k70688k41357k14790
$$ y = [344669925, 321953179, 289364746, 253893050, 220250667, 190402383, 164793397, 143318810, 125557737, 110912187, 98866574, 89046958, 81068885, 74496857, 68957172, 64174409, 59918696, 56037565, 52532772, 49497724, 46965579, 44880563, 43188851, 41860736, 40820057, 39928369, 39048170, 38069405, 36889063, 35442021, 33766295, 31982663, 30193179, 28431932, 26707102, 25039563, 23452335, 21964303, 20606202, 19411791, 18383795, 17489353, 16689097, 15952766, 15258261, 14605671, 14028905, 13567290, 13226394, 12983184, 12816100, 12704320, 12610365, 12499509, 12381008, 12307696, 12327660, 12439886, 12584074, 12663031, 12596313, 12378099, 12076904, 11767177, 11476397, 11205709, 10964352, 10749562]
36311A0749562k31169k94214l48327l44557k89275k07209j00956K1105J11831
36302I066791J18844L9019p7290j60902j58904o7389N5898J37627J58244J49715
36292I261653J24362N2760o8716j74247j90052j16323j8295M7625P5151Q9665
36282I083583J10225J26120J05550L6791m3219p9603n2001K6891J47411K90283
36272I752031L85434L52163K09746R6923J36487L03626M59108M92622M08593K93333
36262A2890066K29151K30472K39648J87644P0373l9232n8907K8257J58691K32350
36252A4168513J83458L5532j15818j95120k11185k08114j83157j04378Q873Q9286
36242A3467890J05557Q0485K2857q5445k15530k78946k28282j13439J077J21907
$$ y = [10749562, 10518393, 10224179, 9875852, 9531295, 9242020, 9034811, 8933855, 8954960, 9066791, 9185635, 9224654, 9147364, 8986462, 8827558, 8760169, 8816067, 8953694, 9111938, 9261653, 9386015, 9438775, 9370059, 9195812, 9005760, 8889437, 8871142, 8918767, 8993918, 9083583, 9193808, 9319928, 9425478, 9462269, 9419050, 9339447, 9287446, 9314337, 9461748, 9752031, 10137465, 10489628, 10699374, 10796297, 10932784, 11236410, 11695518, 12188140, 12596733, 12890066, 13119217, 13349689, 13589337, 13776981, 13847354, 13808122, 13749215, 13777472, 13936163, 14168513, 14351971, 14387503, 14271685, 14076565, 13865380, 13657266, 13474109, 13369731, 13378604, 13467890, 13573447, 13653932, 13676789, 13591344, 13375814, 13096868, 12868586, 12755147, 12756224, 12878131]
36232A2878131K86749M86055O73886Q22356R21019R52455R12630Q35076P60824
36223A9529181P04830O78062P14250Q41780J048056J294142J543448J763395J934239
36214C0051383K077649K244633K457507K697192K956580L255039L580328L876129
36206E3196440M129489M429330M897739N590004O485108P538918Q725129J0061569
36198A05053726J1619572J3481584J5684648J8226352K1088609K4185121K7277827
36191B36617439K9907957L1212859K9726341K3823335J3152462r2855j1849694
36184C52497844j8742186k0104781j7544575j2989308p520821j602972M482800
36177B78476001J0654230J6961308K3236855K9013623L3621007L5710693L2702584
$$ y = [12878131, 13164880, 13650935, 14324821, 15147177, 16068196, 17020651, 17933281, 18768357, 19529181, 20234011, 20912073, 21626323, 22468103, 23516159, 24810301, 26353749, 28117144, 30051383, 32129032, 34373665, 36831172, 39528364, 42484944, 45739983, 49320311, 53196440, 57325929, 61755259, 66652998, 72243002, 78728110, 86267028, 94992157, 105053726, 116673298, 130154882, 145839530, 164065882, 185154491, 209339612, 236617439, 266525396, 297738255, 327464596, 351287931, 364440393, 364347538, 352497844, 333755658, 313650877, 296106302, 283116994, 275596173, 273993201, 278476001, 289130231, 306091539, 329328394, 358342017, 391963024, 427673717, 460376301]
36170D60376301K1927767L515881j7997451l5922305m5815602m7738466m4677052
36163B93669073l9592026l4064003k8729582k3933894j9848870j6469220j3745994
36156A17285484j1622578r941401q484996p147742n961252m950784m078427l328057
36148F1770247k726404k249935j800979j303651p47883j21971O08516J417434
36140E4845374K198029K874468L435058L749467L426177K047331l52273l104927
36132F9118704n306312o418402o500208n948566n132698m262951l449356k748390
36124B9351821k162681j673550j288389j022646q49337p18377o24881o05808o58082
36115A9748070p10366p01074o46729o04142n93104n86732n56678m94720m00682
$$ y = [460376301, 482304068, 485819949, 467822498, 431900193, 386084591, 338346125, 293669073, 254077047, 220013044, 191283462, 167349568, 147500698, 131031478, 117285484, 105662906, 95721505, 87236509, 80088767, 74127515, 69176731, 65098304, 61770247, 59043843, 56793908, 54992929, 53689278, 52941395, 52819424, 53427940, 54845374, 57043403, 59917871, 63352929, 67102396, 70528573, 72575904, 72223631, 69118704, 63812392, 57393990, 50893782, 44945216, 39812518, 35549567, 32100211, 29351821, 27189140, 25515590, 24227201, 23204555, 22355218, 21636841, 21011960, 20406152, 19748070, 19037704, 18336630, 17689901, 17085759, 16492655, 15905923, 15349245, 14854525, 14453843]
36106A4453843k81794j66146r3730q4880j24470j78255k21052k54569l03893l89473
36096A2355581m93447n59334n37961m35990l13505k32085k06554k03591j79664
36087I193450j17004k9233N2976R1070M6409q9098k55693l43764k80920r9338
36077H168855J03537K65255L95883N23247O39211P12854P26824O81190N84418
36068A2801274M62044L54314K78826K09755J23233N3668O8437J80452L16176L86251
36058A5234430L68544L06901K48569K09720J95300K19337K86835L67669M11440
36049A7848745L98934L74096M13885N57825P66950R58285J083625J171647J291346
36040B4865338J482017J725749J979015K213924K429848K646250K894233L196944
$$ y = [14453843, 14172049, 14005903, 13912173, 13827293, 13702823, 13524568, 13303516, 13048947, 12745054, 12355581, 11862134, 11302800, 10764839, 10328849, 10015344, 9783259, 9576705, 9373114, 9193450, 9076446, 9047213, 9100189, 9191259, 9237668, 9148570, 8892877, 8549113, 8268193, 8168855, 8272392, 8537647, 8933530, 9456777, 10095988, 10808842, 11535666, 12216856, 12801274, 13263318, 13617632, 13896458, 14106213, 14229446, 14283114, 14351551, 14532003, 14848179, 15234430, 15602974, 15909875, 16158444, 16368164, 16563464, 16782801, 17069636, 17437305, 17848745, 18247679, 18621775, 19035660, 19593485, 20360435, 21318720, 22402345, 23573992, 24865338, 26347355, 28073104, 30052119, 32266043, 34695891, 37342141, 40236374, 43433318]
36032D3433318L542553L893540M247986M680049N281496O051942O875123P623503
36024H5629510Q270319Q881530R510427J0115504J0563354J0680263J0299442
36017A53950349R287752P560757N107334K041861j347177m633731p405068r424571
36009A55137506j0669532j1238755j1253219j0833694j0116401r243546q337242
36002H3445117p491420o770653o192303n716081n276055m831143m376916l914594
35994C8875952l431545k923215k420939j981982j651353j438117j322803j275239
35986B2430759j263246j254467j216965j116048r15399o01644k21020J25711L53255
35977A6320936M56957M86663M59330L33933Q6709k25911n12760p33451r00646
$$ y = [43433318, 46975871, 50869411, 55117397, 59797446, 65078942, 71130884, 78006007, 85629510, 93899829, 102781359, 112291786, 122407290, 132970644, 143650907, 153950349, 163238101, 170798858, 175906192, 177948053, 176600876, 171967145, 164562077, 155137506, 144467974, 133229219, 121976000, 111142306, 101025905, 91782359, 83445117, 75953697, 69183044, 62990741, 57274660, 51998605, 47167462, 42790546, 38875952, 35444407, 32521192, 30100253, 28118271, 26466918, 25028801, 23705998, 22430759, 21167513, 19913046, 18696081, 17580033, 16664634, 16062990, 15841970, 15967681, 16320936, 16777893, 17264556, 17723886, 18057819, 18144528, 17918617, 17405857, 16672406, 15771760]
35968A5771760j012196j029351r30305p50099n55420m04341l31989l37708l72618
35959A0047733l76721l50443l56655m26346m98738m95917m29321l79300l79849
35950F354443l79763l25582k33011j55560j22085j32808j86436k76234l72711
35941D170253m38559m56065m24404l44298k28089j13033l4896J1879O4298J39154
35931B346240K12807K56295K67187K54527K11426J23327j810j28114k19504k66706
35921C055675k88000l09263l42254l75572l83840l48074k69845j68802p1547n107
35911D93371O950m2030j22237j69813j31341k0915P6637Q0448m297r3032j13112
35900c9371o9732j4382K4196N2271P6535R8917J42689K38477L65774M41593L95908
$$ y = [15771760, 14759564, 13730213, 12799908, 12049809, 11494389, 11090048, 10758059, 10420351, 10047733, 9671012, 9320569, 8963914, 8537568, 8038830, 7542913, 7113592, 6734292, 6354443, 5974680, 5649098, 5416087, 5260527, 5138442, 5005634, 4819198, 4542964, 4170253, 3731694, 3275629, 2851225, 2506927, 2278838, 2165805, 2130909, 2142788, 2207086, 2346240, 2559047, 2815342, 3082529, 3337056, 3548482, 3671809, 3669999, 3541885, 3322381, 3055675, 2767675, 2458412, 2116158, 1740586, 1356746, 1008672, 738827, 570025, 498478, 493371, 500321, 458291, 336054, 166241, 34900, 13985, 90622, 171070, 166773, 73741, -39371, -109103, -123485, -99289, -47018, 29517, 128434, 271123, 509600, 875374, 1316967, 1712875]
35889A712875K44407P1196l9755l9108Q6909L02749N17620O38147O40830N71032
35879D706902M71979L48606K07741R2147M4207N5870Q1249Q5563N8088q726j17100
35868F026526k35640k99756k58706j19372N8624K06166K87976L20275L54315M34500
35858F774908N60619O84530P42225O96248N63640M12175L17035L03137L32323
35849A1386840L60529M01102N09524P06320R45232J172450J390427J634277J901213
35840B0407914K141673K320117K443665K512466K479849K306022K042683J821148
35832C8475537J739578J777991J822786J738560J401221P14594l23961j546689
35824D5799617k647563l351002l580192l470118l228065k987163k771526k554609
$$ y = [1712875, 1957282, 2028478, 1988723, 1949615, 2036524, 2339273, 2856893, 3495040, 4135870, 4706902, 5178881, 5527487, 5735228, 5827375, 5871582, 5927452, 6008701, 6094264, 6152352, 6143626, 6026526, 5790886, 5491130, 5232424, 5113052, 5171676, 5377842, 5665818, 5986093, 6340408, 6774908, 7335527, 8020057, 8762282, 9458530, 10022170, 10434345, 10751380, 11054517, 11386840, 11747369, 12148471, 12657995, 13364315, 14309547, 15481997, 16872424, 18506701, 20407914, 22549587, 24869704, 27313369, 29825835, 32305684, 34611706, 36654389, 38475537, 40215115, 41993106, 43815892, 45554452, 46955673, 47670267, 47346306, 45799617, 43152054, 39801052, 36220860, 32750742, 29522677, 26535514, 23763988, 21209379]
35816B1209379k315535k047804j754762j462906j223375j070329r79879q96407
35808I458382p99658p13764o43476n46068l98637k58440k06688k46230l03574
35799E341847l26800l28602l27645l06873k57560k15711k12778k20668j86232
35790B958978j00198K992R2245J46946J37045M8305p2530j42302j20720l4754
35780B916007P4828J88914K81748L02640K19339O1533r9996k03020k12090j17849
35770C412054M8022K08477K87832K75325K30013K16193K38460K40509J62299k656
35760E316528k01793l67339m57712m59666l75901k35535j03345l8489l2161j5721
35750C028866M8708J05890N9690j20561l62457n51114o13148n52333m26743k96782
$$ y = [21209379, 18893844, 16846040, 15091278, 13628372, 12404997, 11334668, 10354789, 9458382, 8658724, 7944960, 7301484, 6755416, 6356779, 6098339, 5891651, 5645421, 5341847, 5015047, 4686445, 4358800, 4051927, 3794367, 3578656, 3365878, 3145210, 2958978, 2858780, 2861772, 2954017, 3100963, 3238008, 3286313, 3213783, 3071481, 2950761, 2916007, 2990835, 3179749, 3461497, 3764137, 3983476, 4045009, 3945013, 3741993, 3529903, 3412054, 3460076, 3668553, 3956385, 4231710, 4461723, 4677916, 4916376, 5156885, 5319184, 5316528, 5114735, 4747396, 4289684, 3830018, 3454117, 3218582, 3115237, 3076748, 3044587, 3028866, 3077574, 3183464, 3243154, 3122593, 2760136, 2209022, 1595874, 1043541, 616798, 320016]
35740C20016j86180q8038j242N6267P5029P3778P5696Q0711P9903Q2322J01964
35729F70226J26448J26725R7386O1455L1381r919p9252j63822k33716k69188k63830
35718I3894k13691j21502j1611P0341Q0917R605j06527k01070k21850j63205n8644
35707h43343M9317J28281J62883J64178J65799J88494K10358J94721J45701J06819
35697F73208R9111R3103N8348J2192m177K2819P4097J22496J35889P9557m3668
35686A322975j65009k03473j51585p6084l5895l8998q0720j66149k61978k73245
35676a30161j27830J22481L29743L87550L16911K14464J45071R9014L4642o1041
35666A330844j58680k24672k59041k81396k84095k28623j05096L1492J17284J56058
$$ y = [320016, 133836, 45798, 44556, 100823, 175852, 249630, 325326, 406037, 485940, 568262, 670226, 796674, 923399, 1020785, 1082240, 1113621, 1103702, 1024450, 860628, 626912, 357724, 93894, -119797, -241299, -252910, -182569, -101652, -92047, -198574, -399644, -621494, -784699, -843343, -794026, -665745, -502862, -338684, -172885, 15609, 225967, 420688, 566389, 673208, 772319, 865422, 923770, 935962, 931785, 954604, 1028701, 1151197, 1287086, 1366643, 1322975, 1157966, 954493, 802908, 726824, 690929, 651931, 571211, 405062, 143084, -130161, -257991, -135510, 194233, 581783, 898694, 1113158, 1258229, 1357243, 1391885, 1330844, 1172164, 947492, 688451, 407055, 122960, -105663, -210759, -179267, -61983, 94075]
35656I4075J98286K49152K50334J72833Q1704O7530J37220K15041K42353K34111
35646A942639K31760K38524K23317J68625Q9217N611q3552j92499l12338l92215
35636A919089l69738k26454n050K33182M52493O32965P42521P60330P29324P43025
35626E611687Q54904J022404J159376J214876J165951R61011N42383m7279o27204
35617A1858109r99480j107647j052793r65711q99228q41447p79460p11863o25335
35608C875145n07594l87707l28388l60962m44310n00142m78056l81123k46676
35599B40187j17158j8505M9587J00636J35435J41208J22530J12184J30949J50591
35589A047644J23163M3946l6156n9587o856R7226J92518K03826R4978p8267j99267
$$ y = [94075, 292361, 541513, 791847, 964680, 1046384, 1113914, 1251134, 1466175, 1708528, 1942639, 2174399, 2412923, 2636240, 2804865, 2894082, 2899693, 2816141, 2623642, 2311304, 1919089, 1549351, 1322897, 1317847, 1551029, 2003522, 2636487, 3379008, 4139338, 4868662, 5611687, 6466591, 7488995, 8648371, 9863247, 11029198, 11990209, 12532592, 12485313, 11858109, 10858629, 9750982, 8698189, 7732478, 6833250, 5991803, 5212343, 4500480, 3875145, 3367551, 2979844, 2651456, 2290494, 1846184, 1346042, 867986, 486863, 240187, 123029, 104524, 154111, 254747, 390182, 531390, 653920, 766104, 897053, 1047644, 1170807, 1214753, 1178597, 1119010, 1112154, 1209380, 1401898, 1605724, 1700702, 1622435, 1423168]
35578A423168k00960j30485q6658j14064j82826k49723k96679l11439k74153j84028
35568f07847p6680M885M5443N3403L8748J2969j885J1050L9009N0004K9594j0937
35556d12244o6350j51825k66569l60401l67535k76093j42747l4093K5964M5767
35546b006126L2127r858o0882j00310j30590j65653j98460k04847j79161j37725
35536c161485q0295K0895J72650L21612L91333L56440K64647J87566J60987J70582
35526a195068J84070J91786K12561K55326K84579K47170J38509J8619n0931o5430
35516B21191n7906m8288l9859m5261p6148j13220j25202j19248j33519j68872
35506g06332j65218o9261R7825K60890L58195L68776K98568J76749O0849J1842
$$ y = [1423168, 1222208, 1091723, 1005065, 891001, 708175, 458452, 161773, -149666, -423819, -607847, -684527, -679642, -634199, -580796, -542048, -529079, -530964, -519914, -480905, -430901, -401307, -412244, -478594, -630419, -896988, -1257389, -1624924, -1901017, -2043764, -2077857, -2051893, -2006126, -1973999, -1983857, -2044739, -2145049, -2275639, -2441292, -2639752, -2844599, -3023760, -3161485, -3241780, -3220885, -3048235, -2726623, -2335290, -1978850, -1714203, -1526637, -1365650, -1195068, -1010998, -819212, -606651, -351325, -66746, 180424, 318933, 337552, 286621, 221191, 163285, 114997, 75138, 29877, -46271, -159491, -284693, -403941, -537460, -706332, -871550, -940811, -842986, -582096, -223901, 144875, 443443, 620192, 681041, 692883]
35496F92883N1480J53735K75555L80569M35753M08874K84352P8690j62601l82080
35486B217210n32999n99112n93282n30267m09164k37007n8629O8129J33994J86714
35476c54413K59433L12607K75623J38008k7571j33377j45264q3217J6300J19801
35466C77930J95901K21537J94796J34656O6912R293l9817j02961j99925l08622
35456E49700l60389k96841j34076M4395J60766J95688J69659R8021j5868j53820
35446B57235k73497l34910l30885k88510k42400k05283j60705q3159L3938J68517
35436a459659K83815L49099L52579L03754K24139J30621L0428o2880j21375j31802
35426a01281j28054j64541k45836l07761k86932j89564o9985M0005J49600K66389
$$ y = [692883, 744363, 898098, 1173653, 1554222, 1989975, 2398849, 2683201, 2761891, 2599290, 2217210, 1684211, 1085099, 491817, -38450, -447614, -684621, -743250, -675121, -541127, -354413, -94980, 217627, 493250, 631258, 603687, 470310, 325046, 241829, 258129, 377930, 573831, 795368, 990164, 1124820, 1191732, 1201025, 1161208, 1058247, 858322, 549700, 189311, -107530, -241606, -197211, -36445, 159243, 328902, 426923, 411055, 257235, -16262, -351172, -682057, -970567, -1212967, -1418250, -1578955, -1662114, -1628176, -1459659, -1175844, -826745, -474166, -170412, 53727, 184348, 214776, 151896, 30521, -101281, -229335, -393876, -639712, -947473, -1234405, -1423969, -1493954, -1453949, -1304349, -1037960]
35416a037960L70244M34597M47495M03593K98621J46660j0059j22136j62331j35404
35406F33320o8651Q251Q5710J74003K66249L08147K34013M5258j65827k86437
35396A234036k73381j76841r6273j16469k54882m42335n63203n38479l80396j72844
35386a781067r930N4387L0796j3795j3402K8023M4579L750l4242J5031J53721
35375a522149L04210M05027M57522M79237M63148M02851L20562K45020J84258
35366A739686J34564Q8082J4442j29606l37226n19818n78050n00003l61818k41031
35356f90778j62481j22407j18215j33394j24117n4216O0298J60047J97639J78204
35346h09420J48085J49019J80664K03102J76357R7826O40p8222j19418j16921
$$ y = [-1037960, -667716, -233119, 214376, 617969, 916590, 1063250, 1053191, 931055, 768724, 633320, 564669, 572920, 658630, 832633, 1098882, 1407029, 1641042, 1686300, 1520473, 1234036, 960655, 783814, 687541, 571072, 316190, -126145, -689348, -1227827, -1608223, -1781067, -1790997, -1736610, -1705814, -1719609, -1733011, -1704988, -1660409, -1656659, -1690901, -1675870, -1522149, -1217939, -812912, -355390, 123847, 586995, 989846, 1310408, 1555428, 1739686, 1874250, 1962332, 1976774, 1847168, 1509942, 990124, 412074, -87929, -449747, -690778, -853259, -975666, -1093881, -1227275, -1351392, -1405608, -1345310, -1185263, -987624, -809420, -661335, -512316, -331652, -128550, 47807, 145633, 146273, 68051, -51367, -168288]
35336a68288p0855P341R3920J67701K22238K57250K62051K13140Q8085j14479
35326I58104l56194n56657o26885n26817k95520k0720K19878L86858M65883M52482
35316A00412L61127K38487J48014J25877J46996J43068O8170n2027j47892j81624
35306I50608j74175j50255r0795K5659J55372K15750J86868J41735J53221K06543
35296A620531K32178J92940R9858l0280j77656k88156l01414k28174j51411j22753
35286H45663r8128j3052J10663J82102J50526M9786o2240j58279k24378k35873
35276E46790j83024r5951j5419M5465Q9208J06141R2940Q5617J30938K19221K82118
35265A304044K73108K20814J79979J53729R8429j178r4596j12849l5823R4750
$$ y = [-168288, -239143, -231802, -137882, 29819, 252057, 509307, 771358, 984498, 1072583, 958104, 601910, 45253, -581632, -1108449, -1403969, -1424689, -1204811, -817953, -352070, 100412, 461539, 700026, 848040, 973917, 1120913, 1263981, 1332151, 1280124, 1132232, 950608, 776433, 626178, 535383, 561042, 716414, 932164, 1119032, 1260767, 1413988, 1620531, 1852709, 2045649, 2145507, 2115227, 1937571, 1649415, 1348001, 1119827, 968416, 845663, 747535, 734483, 845146, 1027248, 1177774, 1227560, 1165320, 1007041, 782663, 546790, 363766, 267815, 252396, 297861, 387069, 493210, 586150, 671767, 802705, 1021926, 1304044, 1577152, 1797966, 1977945, 2131674, 2230103, 2228925, 2134329, 2021480, 1985657, 2080407]
35255B080407K14801K80583K82773K33697J46365K7397j08911k27735k89219k81086
35245B359072k28293j68133j23832j02803j05203j22730j36103j25169q2547j8632
35235A145627L7080L9063m8686k11707l78185m70566m62413l77228k48443j04926
35225a080384J5533P6677P8252N4635K9377l051l8367l8293K5008J20280J86108
35214e74225J98496J78936J45018R2981L1988o334j1568j5928m7386q4964q7774
35203a80760m9942L405N9598J20552J67443J66637J21161P7557N9515K7585o1215
35192E11536j74865k29525j88330r8692k3034L1896R4559J62748J91481J45248
35182D23022M1716o0651j09344r4414m9749j8849j3920j2571L82N93m9944j51977
$$ y = [2080407, 2295208, 2575791, 2858564, 3092261, 3238626, 3266023, 3157112, 2929377, 2640158, 2359072, 2130779, 1962646, 1838814, 1736011, 1630808, 1508078, 1371975, 1246806, 1164259, 1145627, 1182707, 1221770, 1173084, 961377, 583192, 112626, -349787, -727015, -975458, -1080384, -1064851, -988174, -909922, -855287, -825910, -828961, -867328, -905621, -880613, -760333, -574225, -375729, -196793, -51775, 41206, 73194, 66860, 55292, 39364, -8022, -92986, -180760, -230702, -227297, -167699, -47147, 120296, 286933, 408094, 485651, 545166, 572751, 511536, 336671, 107146, -81184, -179876, -202910, -171014, -76455, 86293, 277774, 423022, 464738, 404087, 294743, 200329, 150580, 131731, 117811, 105240, 105622, 106215, 56271, -95706]
35170i5706k64904l50760l95706l81341k68252m2254K29108M18603M37488L10421
35160d03303J48962N1606K7549J0888n8651j74769k81346l34344l30629k82463
35150a626500j93224p4436L2131P5653M0536l9881j05514r5471K5431K27713M04114
35139a329448M36562L04178J10690j4296l1778l41J2287l391j2082J6952Q1930
35128d28737J47713J61422Q6998n6722j96908k59360k23290j25117k0799M6540
35118h68260N7546K3555j1446K423P2859J48275J62533R9221O475m9979m1411
35107c98209J3122P7341J30528J73225K08787K27899K19083J94834J93638K41180
35097A281428L13570L57167L48474L16328K94249K68042J92541N6139r1114j77985
$$ y = [-95706, -360610, -711370, -1107076, -1488417, -1756669, -1798923, -1569815, -1151212, -713724, -403303, -254341, -202735, -175186, -164298, -222949, -397718, -679064, -1013408, -1344037, -1626500, -1819724, -1894160, -1862029, -1786376, -1745840, -1785721, -1891235, -1986706, -1961275, -1733562, -1329448, -892886, -588708, -478018, -492314, -524092, -524433, -512146, -515537, -527619, -510667, -428737, -281024, -119602, -32604, -89326, -286234, -545594, -768884, -894001, -914800, -868260, -810714, -787159, -798605, -796182, -723323, -575048, -412515, -313294, -306819, -356798, -398209, -385087, -307746, -177218, -3993, 204794, 432693, 651776, 846610, 1040248, 1281428, 1594998, 1952165, 2300639, 2616967, 2911216, 3179258, 3371799, 3427938, 3336824, 3158839]
35087C158839j69908q8606P530N5790K0305q6311k07589k78596k67427j91220
35077A952807r8661l5310j5605k0345j9810J146L9260Q3140J15006J07217L7472
35066B146317q3216k08830k92823l15972k76939j76326l1213J05529J70961J48066
35056A185554Q2858L7768L5152M7540K8774n2150j90674l38970m20985l77616
35046C7251k15606j4571J23592J46825Q7542K8401K7825P5634J21034J34020J22491
35035F74438R2179K1913r5891k07233k28055j33322J1620J23364J81100K12287
35025F52400K17552J52581l170j88024k95447k68441j45877j8131N4144Q0557
35015B38144J12527J79441K51227K64551J86004M3725j04737k23745l08598l56528
$$ y = [3158839, 2988931, 2900325, 2907855, 2963645, 2983950, 2897639, 2690050, 2411454, 2144027, 1952807, 1854146, 1818836, 1803231, 1782886, 1763076, 1764222, 1803482, 1886622, 2001628, 2108845, 2146317, 2063101, 1854271, 1561448, 1245476, 968537, 792211, 760998, 866527, 1037488, 1185554, 1268412, 1306180, 1341332, 1388872, 1417646, 1365496, 1174822, 835852, 414867, 37251, -178355, -192926, -69334, 77491, 165033, 193434, 221259, 296893, 417927, 551947, 674438, 766617, 788530, 692639, 485406, 257351, 124029, 135649, 259013, 440113, 652400, 869952, 1022533, 1019363, 831339, 535892, 267451, 121574, 103443, 157587, 238144, 350671, 530112, 781339, 1045890, 1231894, 1275619, 1170882, 947137, 638539, 282011]
35005B82011l54635l03215k31690j75081j40872j10665p0135k5383R989L4092
34995a085584O0693J08728J85847K73790L30323L17737K37919J35209N7410J3621
34985F35693k6899r5837j88452k63369k77790k26393j50065j04557j13859j49763
34975i61291j56918r8924J7342J54902K74404L47820L55272K82491J30105p2360
34965B72843k63830l72223l54347k29322p1542M1653Q3120P7002N1668N939p0642
34954h29681j57648k04752j77106q9829O863P1868J05243J47323K43778L92255
34944d91686N16167N13280L54284J28052l1400o5066k4843K474j8618o5529j05924
34933G11191j27306j30458j20144j06308r9488r9943r9125r2763q4322p6232o8526
$$ y = [282011, -72624, -375839, -607529, -782610, -923482, -1034147, -1104282, -1129665, -1119676, -1085584, -1024891, -916163, -730316, -456526, -126203, 191534, 429453, 564662, 622072, 635693, 608794, 512957, 324505, 61136, -216654, -443047, -593112, -697669, -811528, -961291, -1118209, -1217133, -1199791, -1044889, -770485, -422665, -67393, 215098, 345203, 272843, 9013, -363210, -717557, -946879, -1018421, -976768, -893648, -816646, -764978, -759039, -829681, -987329, -1192081, -1369187, -1459016, -1452153, -1380285, -1275042, -1127719, -883941, -491686, 24481, 537761, 892045, 1020097, 988697, 923631, 898788, 901262, 882644, 817115, 711191, 583885, 453427, 333283, 226975, 127487, 27544, -71581, -164344, -248666, -324898, -393424]
34922c93424o7502q2662j07289j11671o8659J3226Q9120J13744P8726J6953k6919
34911e46357l0894n203K6147M7727N7163N6130M4056J6924l3498j11723j97019
34900f76547k35220j74828k2416J50146K65071K98289K74702K20640J40395L3563
34890B73795q5919j93682k66403k86796k48624j62482n1737N7365J37187J60204
34880f67092J19711N2131J7857M5937J08373J59156J85020K01099K07759J77445
34870F07396Q8062m9179k01051l33082m07323l78386k22381K2255K60291M02510
34860b10888M23655L56426K40569R4624o4719j99647k67678k58787k04921j52429
34850b43795j31162j45115j78382k05261k04404j71620j18911o2252j5250R139
$$ y = [-393424, -460926, -543588, -650877, -762548, -831207, -817981, -728861, -615117, -536391, -519438, -546357, -577251, -582454, -556307, -508580, -451417, -395287, -351231, -334307, -367805, -479528, -676547, -911767, -1086595, -1109011, -958865, -693794, -395505, -120803, 99837, 240232, 273795, 187876, -5806, -272209, -559005, -807629, -970111, -1021848, -964483, -827296, -667092, -547381, -495250, -477393, -431456, -323083, -163927, 21093, 222192, 429951, 607396, 695458, 646279, 445228, 112146, -295177, -673563, -895944, -873689, -613398, -210888, 212767, 569193, 809762, 904386, 839667, 640020, 372342, 113555, -91366, -243795, -374957, -520072, -698454, -903715, -1108119, -1279739, -1398650, -1460902, -1476152, -1467013]
34840a467013M116j9142l6324l5031k8210l4690n1598n4333k1177M7421J28914
34829a567067J90863K08786J84311J48026J37419J67351K19804K55849K34246
34820A79588J31197l7109k06024k93038k56364j28018J7658J32138K26485L35623
34810A02136M55994N30054M95800L44682J27860q4047k38557l11581l04096k37423
34800H80822j43666n5721o684k7087j23159k56556l62974l97928l56807k57258
34790a107018j26264o791N4514M7779J3325j89K2108P0476J40217K33427L45821
34779c12595M65515N65489N86110M62265K04410p2397k45641l01684l18100l47455
34769F85917l71074l61213l24535k65639j62606j1413J42915K50718L03730L10897
$$ y = [-1467013, -1462897, -1482039, -1518363, -1553394, -1581604, -1616294, -1667892, -1722225, -1743402, -1695981, -1567067, -1376204, -1167418, -983107, -835081, -697662, -530311, -310507, -54658, 179588, 310785, 273676, 67652, -225386, -481750, -609768, -592110, -459972, -233487, 102136, 558130, 1088184, 1583984, 1928666, 2056526, 1972479, 1733922, 1422341, 1118245, 880822, 737156, 681435, 674751, 647664, 524505, 267949, -95025, -492953, -849760, -1107018, -1233282, -1240073, -1185559, -1137780, -1124455, -1124644, -1102536, -1032060, -891843, -658416, -312595, 152920, 718409, 1304519, 1766784, 1971194, 1898797, 1653156, 1351472, 1033372, 685917, 314843, -46370, -370905, -636544, -799150, -810563, -667648, -416930, -113200, 197697]
34759A97697K62058J51790J5121r8888j74587k18330k16997j50460m3008L6943
34749b38661M1355j3171p1120r1373p2134m0493k6648m2151p7540j16157j40541
34738h88634j27379n8192N3020J59658K23030K37409K06305J23147J082j03078
34728a73632j32496q9897k4880K7177O2475P8901P3212P0116J11741K01836K87925
34717D92478L12911K64872J70266O3021k9900r5587j41148j78023j96417j73599
34707D88874j07460j5922R8387K47971M13019N28818N43811M66624L36747J76772
34697C177641O26j56468k54953k90436k87442k60136k07182j42425j01371j08982
34687A368872j56644k13554k47928k39610j91644j35685j12687j38127j86395
$$ y = [197697, 459755, 611545, 626666, 527778, 353191, 134861, -82136, -232596, -275604, -238661, -197306, -210477, -281597, -372970, -445104, -485597, -512245, -554396, -631936, -748093, -888634, -1016013, -1074205, -1021185, -861527, -638497, -401088, -194783, -71636, -70554, -173632, -306128, -396025, -420905, -393728, -331253, -252352, -179140, -109024, 2717, 204553, 492478, 805389, 1070261, 1240527, 1303548, 1273648, 1178061, 1036913, 858890, 662473, 488874, 381414, 365492, 463879, 711850, 1124869, 1653687, 2197498, 2664122, 3000869, 3177641, 3178267, 3021799, 2766846, 2476410, 2188968, 1928832, 1721650, 1579225, 1477854, 1368872, 1212228, 998674, 750746, 511136, 319492, 183807, 71120, -67007, -253402]
34678b53402k08095j62840m7024R8548K13450K61452K50127K07225J52104R9170
34668F10715P0093P9046J13145J49267J86049K36190K87200K94773K26402R9937
34658B352817k6495r5150q4817k8143J368o0074k11533l83533m90387m82655l60668
34647A30730j66036K8575J44645J40520L4456j17440k59614l53083l73284l13090
34637a103621j88420l2221J17691K26608K73749K66365K34040J97137J47695P2276
34627B11299j6612q9142j32596j57595j70091j55644r6041J1738J53406K95874
34617a45404L85407L73746K65270J24763J9399m1499r7949j83081k92460l97919
34607A0273m66206m65096l76628k15848k6841J42037K51951K76869K24071J54763
$$ y = [-253402, -461497, -624337, -671361, -572813, -359363, -97911, 152216, 359441, 511545, 610715, 680808, 759854, 872999, 1022266, 1208315, 1444505, 1731705, 2026478, 2252880, 2352817, 2326322, 2231172, 2146355, 2118212, 2119580, 2059506, 1847973, 1464440, 974053, 491398, 130730, -35306, -6731, 137914, 278434, 312890, 195450, -64164, -417247, -790531, -1103621, -1292041, -1324262, -1206571, -979963, -706214, -439849, -205809, -8672, 139023, 211299, 194687, 105545, -27051, -184646, -354737, -510381, -606422, -594684, -441278, -145404, 240003, 613749, 879019, 1003782, 1023181, 981682, 883733, 700652, 408192, 10273, -455933, -921029, -1297657, -1513505, -1540346, -1398309, -1146358, -869489, -645418, -490655]
34597d90655J51477K44990L88442N11086N72503N53415M34024K22837j2050j85731
34587B390338k71110l00705l00855k64292j92060j20025q2500p5840p6494p3736
34577F32721o8525o1136n7584o9661r1384r3672o1425j9379k062j4580m2684q1514
34565c0885j25512j45028j09514l3353L1265N1827M4308M4155P1704J28795K04264
34554A32026K71305K94909K52600J44083j2685j78847k96303l21308k64156j76767
34544a55143r8953l8561k193o758m2787n8571j0446Q7402J85353K51908K80394
34533C91645K64437K07147J49409J48022K12947K90226L15945K67943J62615L0367
34523B440703r2913j78014k28725k77902l36401l64610l22446k32195j54668j08043
$$ y = [-490655, -339178, -94188, 294254, 805340, 1377843, 1931258, 2365282, 2588119, 2576069, 2390338, 2119228, 1818523, 1517668, 1253376, 1061316, 941291, 858791, 782951, 706457, 632721, 564196, 503060, 445476, 375815, 284431, 190759, 129334, 109955, 107893, 93313, 50629, -30885, -156397, -301425, -410939, -444292, -413027, -361200, -316892, -272737, -201033, -72238, 132026, 403331, 698240, 950840, 1094923, 1082238, 903391, 607088, 285780, 21624, -155143, -254096, -292657, -294850, -301608, -344395, -402966, -413412, -326010, -140657, 111251, 391645, 656082, 863229, 1012638, 1160660, 1373607, 1663833, 1979778, 2247721, 2410336, 2440703, 2347790, 2169776, 1941051, 1663149, 1326748, 962138, 639692, 407497, 252829, 144786]
34513A44786n3411K9738R9949J16826J12039J47813K17164K39400J66574N0555
34503A271433k0212j8121J8381M8690N9033M3855N700k4516r861L8167O5555N3453
34491A531557N0464R6878J51297J39731O0319j2851l0099k1413m0488r9723j82643
34480A643029k76828l56986l68873k81558j45108n0056k8911l6776k9558j3634
34470E4741k410K9100J08695K11054K74711K65814J99117J07388J8954m1789o3397
34459A161978o0645n7512n7156m9072m0866n2525p4950o6040l755P9950J35451
34448I14858J47388J32536J03506O0667J4379j0526n73K9196N3552O8668R7235
34437A610886J57363K28839K59754K12341R6115m7323j76946k58604k62075j86106
$$ y = [144786, 91375, 121113, 221062, 337888, 449927, 597740, 814904, 1054304, 1220878, 1271433, 1251221, 1233100, 1251481, 1300171, 1359204, 1403059, 1408759, 1384243, 1374382, 1412549, 1478104, 1531557, 1582021, 1678899, 1830196, 1969927, 2030246, 2017395, 1987296, 1965883, 1925395, 1825672, 1643029, 1366201, 1009215, 640342, 358784, 213676, 163620, 134709, 97933, 68375, 54741, 52331, 81431, 190126, 401180, 675891, 941705, 1140822, 1248210, 1267164, 1225375, 1161978, 1101333, 1043821, 986665, 937593, 896727, 844202, 769252, 703212, 699457, 779407, 914858, 1062246, 1194782, 1298288, 1358955, 1373334, 1362808, 1362235, 1391431, 1444983, 1513651, 1610886, 1768249, 1997088, 2256842, 2469183, 2565298, 2517975, 2341029, 2082425, 1820350, 1634244]
34427A634244q2070j9760k4649p2786j41078k21141k79475k56645j34537L2405
34417D34508J78958K82743L27819K69308R6298j03238k15489k32162k41294k85407
34407E12044l01719k27007r6966J493L2015J7090k2090q0378j33303j33177n0328
34396d82326J02262K83935M45480N35131N11691L70931J61804k8538j21466j01853
34386A677051l3892p910o2105j61507k45213k69094k06108n1561J43148K75404
34376A058213K75456J79635Q7019M6982K1405m2159j37111k13601k40701k28245
34366H06893j98346j60402j17590q1100o5433p3408r5681j24005j51536j55036
34356d15644r7442K6263J52371J91381J21436J6811l3303j7485K743k7452j04923
$$ y = [1634244, 1552174, 1532414, 1507765, 1434979, 1293901, 1072760, 793285, 536640, 402103, 434508, 613466, 896209, 1224028, 1493336, 1589634, 1486396, 1270907, 1038745, 797451, 512044, 210325, -16682, -113648, -112155, -80140, -63050, -85140, -165518, -298821, -431998, -482326, -380064, -96129, 349351, 884482, 1396173, 1767104, 1928908, 1900370, 1778904, 1677051, 1643159, 1635249, 1573144, 1411637, 1166424, 897330, 691222, 639661, 782809, 1058213, 1333669, 1513304, 1600323, 1647305, 1668710, 1626551, 1489440, 1275839, 1035138, 806893, 608547, 448145, 330555, 249455, 184022, 110614, 14933, -109072, -260608, -415644, -513086, -486823, -334452, -143071, -21635, -4824, -38127, -55612, -52869, -80321, -185244]
34345a85244j84694k18731j80540p8504M5400J45628K11071K65381L26235L73567
34335E19569L63984K72921J20366m2179j68952k43982k68275k34857j38929j6495
34325A63171N7092L5975l8179p3378k1707Q3781J81719K41116K57989K24010J29398
34314A240987o240j29014j88566j78206j34231r7752q1796p7424q3764j15729
34304A48265j74570k23981k14836j38338m5059m503m5189j32595k01678k10042
34294a242526j62388r0168k0081L0643M3770J1735l8245n7432k5656K9049P0316
34283a450983R1563J02078J02727J00517J23644J87373K58719K90484K79845K53257
34273C39224K00350P6046j16427k91462l63057l35619k85088k69325k85367l00231
$$ y = [-185244, -369938, -588669, -769209, -847713, -802313, -656685, -445614, -180233, 146002, 519569, 883553, 1156474, 1276840, 1234661, 1065709, 821727, 553452, 318595, 179666, 163171, 220263, 256238, 218059, 144681, 122974, 206755, 388474, 629590, 887579, 1111589, 1240987, 1234747, 1105733, 917167, 738961, 604730, 506978, 425182, 347758, 263994, 148265, -26305, -250286, -465122, -603460, -648519, -653022, -698211, -830806, -1032484, -1242526, -1404914, -1495082, -1515163, -1484520, -1440750, -1429015, -1467260, -1524692, -1550348, -1521299, -1450983, -1359420, -1257342, -1154615, -1054098, -930454, -743081, -484362, -193878, 85967, 339224, 539574, 615620, 499193, 207731, -155326, -490945, -776033, -1045358, -1330725, -1630956]
34263a630956k90208k49924j89478j31738r7744q4609o2133K631J14961K44704
34253b374494L50567M15256M52444M74257M63208L93656K74848J48696M3642m3679
34243E98401j14516j45662j20049n7775O295O0507J09226J41324J34575Q9329
34233G01655L5319L738P637M3512Q8681R7317K7647j10879k51160l24078l16657
34222B732k68613k20304j77785j28946p8001m6295l6444j4289N2074J39854J85480
34211e90537J61260J13749J05666J40689J76687K00160K43405L18417L73201L43940
34201A586637K34367J16782N9815P4474J25397J70550J84787J65314J29116R7477
34191B944716P2373L3893k8658q8564j00419m9849K8825R0117J17733J16232Q0184
$$ y = [-1630956, -1921164, -2171088, -2360566, -2492304, -2590048, -2674657, -2736790, -2734159, -2619198, -2374494, -2023927, -1608671, -1156227, -681970, -218762, 174894, 449742, 598438, 642080, 598401, 483885, 338223, 218174, 160399, 166694, 227201, 336427, 477751, 612326, 701655, 736974, 740712, 748349, 791861, 880542, 977859, 1005506, 894627, 643467, 319389, 2732, -265881, -486185, -663970, -792916, -870917, -917212, -953656, -967945, -915871, -776017, -590537, -429277, -315528, -209862, -69173, 107514, 307674, 551079, 869496, 1242697, 1586637, 1821004, 1937786, 1997601, 2072075, 2197472, 2368022, 2552809, 2718123, 2847239, 2944716, 3017089, 3050982, 3022324, 2933760, 2833341, 2783492, 2812317, 2902434, 3020167, 3136399, 3216583]
34180C216583m73j07615j99439k59882l17008l91049m46101m26157l31934k28550
34170E08375j72323j58096j48640j28317j06407q4980n0658K820O0452R5758Q6193
34159i5823K3334q0174j94043k87971l43055l41855k62418j03712Q6023K29952
34149a369742K81571K53706J90101J26973Q5620P6210Q9276R9142R7554J14239
34139D4650J81650K82823L54288L40342K30600N4444j34308k71293l18352l02428
34129D62416k90980l10230l10290k30881p8212Q8565K22811L04498L07403K09114
34119C74214M6827q2306j08984o0506j8887k6736n7569o5399l4772J5193M8667
34108B9742K9037n7847j77473k54865k30364j12534L2656J45617K14583K51362
$$ y = [3216583, 3216110, 3108495, 2909056, 2649174, 2332166, 1941117, 1495016, 1068859, 736925, 508375, 336052, 177956, 29316, -99001, -205408, -290388, -341046, -338226, -277774, -182016, -95823, -72489, -152663, -346706, -634677, -977732, -1319587, -1582005, -1685717, -1599694, -1369742, -1088171, -834465, -644364, -517391, -431771, -355561, -266285, -167143, -69589, 44650, 226300, 509123, 863411, 1203753, 1434353, 1488797, 1354489, 1083196, 764844, 462416, 171436, -138794, -449084, -679965, -758177, -669612, -446801, -142303, 165100, 374214, 421041, 338735, 229751, 169245, 150358, 123622, 66053, 654, -34118, -18925, 29742, 58779, 932, -176541, -431406, -661770, -774304, -741648, -596031, -381448, -130086]
34098a30086K48318J86895Q5781P673j668L5590N8968L8252p808m8800o9740o4319
34086C39056l2783N494K3061K0890L4689R1288J71704K26726K17548J39106K5078
34075A261857o2484p4967k8889O68m3100j41137k31329k79756k98557l09040l12760
34064e19494k91857k20279q7795O6879J65077J61546R8510N4783N0970M3193M729
34053d73738l4831m1188j7838K5797J04703K17943L07841L06900K17239J04251
34043G17079J3930o4694j48146k09574k08205j47683p4677k1658K5266R3402J74356
34032A49396K23894K08714J39413N1585l4081j18241j93731k32115k13754j60412
34022a79332j17362j01163q3131l4563K6916N5396L4926l572k6659l4358l9020
$$ y = [-130086, 118232, 305127, 390908, 398581, 396913, 432503, 491471, 529723, 521915, 473115, 403375, 339056, 306273, 311767, 334828, 355718, 390407, 481695, 653399, 880125, 1097673, 1236779, 1261857, 1199373, 1124406, 1095517, 1096185, 1053085, 911948, 680619, 400863, 102306, -206734, -519494, -811351, -1031630, -1119425, -1052546, -887469, -725923, -627413, -572630, -521660, -478467, -473738, -508569, -549757, -567595, -541798, -437095, -219152, 88689, 395589, 612828, 717079, 731009, 666315, 518169, 308595, 100390, -47293, -121970, -143628, -118362, -24960, 149396, 373290, 582004, 721417, 773002, 738921, 620680, 426949, 194834, -18920, -179332, -296694, -397857, -480988, -515551, -488635, -433239, -398313, -401885, -428544, -462902, -501922]
34011e01922l5092j8951k0832p5126j58682j98964j55219n6518N2815J60870K53371
34000g54250K78651K03574Q3312J7836M1592J02699J45430J57389J31396M6586
33990D54215q2519j89647k30333k36752k59262k82278k42689j16169N3932K01997
33980i29505K78752K57270J44788n721j25661j80336j75299j25541m4893M2979
33970h63167J14576J64648J88034J55194M6680r0222j66622j48550r1936o6145
33960g57510p8472r4081r4178q2363n6831r384N7890J35635K14170K71872K78158
33949b15094K31606J76145J51374J41290J01185K4413m7184p2229m2900K0533
33939D69139P6841P3350j3649j43106k42628k81420k85239k83356k76936k62356
$$ y = [-501922, -537014, -555965, -576797, -651923, -810605, -1009569, -1164788, -1221306, -1168491, -1007621, -754250, -475599, -272025, -188713, -170877, -129285, -26586, 118844, 276233, 407629, 454215, 371696, 182049, -48284, -285036, -544298, -826576, -1069265, -1185434, -1131502, -929505, -650753, -393483, -248695, -254416, -380077, -560413, -735712, -861253, -906146, -863167, -748591, -583943, -395909, -240715, -194035, -284257, -450879, -599429, -691365, -757510, -835982, -930063, -1024241, -1106604, -1163435, -1172819, -1114929, -979294, -765124, -493252, -215094, 16512, 192657, 344031, 485321, 586506, 610919, 563735, 491506, 448606, 469139, 545980, 619330, 605681, 462575, 219947, -61473, -346712, -630068, -907004, -1169360]
33929a169360k43844k09185j32725k5094N4517O3900K9056L120O91L602N917J3708
33917a605697J7925J0511J7957P3949J58870K09562J97150J56703J28075J05671
33907e29324O7523K1184r540k4771m7200q8591j37708j75955j91527j85694j75577
33896a477180j78860j83740j49285n4271O5143J46991J66735J51600J40011J48540
33886a224316J73775K00247K02939J66930J14972R4642J22133J53710J32568N7077
33876A94677j6820m0656k2146k632l225j1774j8792m4310j15481k24633l22251
33865f28043l52960k94945j71390l5748N7298Q4356O6349M2401K8324J1209j3837
33854a206986k0936J8258R4725J67551K05858K11946K03653J84473J34147K8755
$$ y = [-1169360, -1413204, -1622389, -1755114, -1780208, -1725691, -1661791, -1632735, -1629615, -1628924, -1625322, -1619405, -1605697, -1587772, -1577261, -1559304, -1485355, -1326485, -1116923, -919773, -763070, -634995, -529324, -461801, -440617, -450157, -474928, -522128, -610719, -748427, -924382, -1115909, -1301603, -1477180, -1656040, -1839780, -1989065, -2043336, -1978193, -1831202, -1664467, -1512867, -1372856, -1224316, -1050541, -850294, -647355, -480425, -365453, -270811, -148678, 5032, 137600, 194677, 177857, 137201, 115055, 112423, 109198, 97424, 78632, 34322, -81159, -305792, -628043, -981003, -1275948, -1447338, -1483086, -1425788, -1341432, -1275083, -1232682, -1204358, -1193149, -1206986, -1227922, -1209664, -1114939, -947388, -741530, -529584, -325931, -141458, -7311, 21444]
33844B1444j21131k48013k60385j20528J09854L13943M09637L91272K99533J77196
33834I72822N3461n6320j50304k28133k74139k68953k26412k00000k32414l03538
33824i13930l42521k90317j43551N3626K42688L74498M18794L68251K39434O9959
33814G6931q7965j81507j81973j07788j9741K0297l567n5050q8232r0887q0246
33803g99728o5110l0543L6311J20448J87886K10843J80907J15509O3213Q0938
33793A00674J76471K77716K86060J68253j6562j78114k64882k76962k40523j86480
33783a54349j38937j06343q4188o7791n4765l7673j1687Q398R75k1729o585Q6926
33771e87748K35282L68007M29174M11759L44144K61243J82628J01571k615j28765
$$ y = [21444, -99687, -347700, -608085, -728613, -618759, -304816, 104821, 496093, 795626, 972822, 1026283, 969963, 819659, 591526, 317387, 48434, -177978, -377978, -610392, -913930, -1256451, -1546768, -1690319, -1636693, -1394005, -1019507, -600713, -232462, 6972, 76931, -11034, -192541, -374514, -482302, -502043, -481746, -485313, -540363, -628595, -719482, -799728, -864838, -895381, -859070, -738622, -550736, -339893, -158986, -43477, 19736, 100674, 277145, 554861, 840921, 1009174, 992612, 814498, 549616, 272654, 32131, -154349, -293286, -399629, -483817, -551608, -606373, -644046, -655733, -647335, -646360, -668089, -674674, -587748, -352466, 15541, 444715, 856474, 1200618, 1461861, 1644489, 1746060, 1743445, 1614680]
33761A614680k36453k81340k64332k25918j91437j45571p1623M790L3648k780
33751B33664o9348j14884j14045o9135Q279R5958J49685J24208K1310r7535j63603
33740D554j60710j23655r0891p6774p7378p3874l1922O8869J93285K64350K36552
33729A32406J39576L8798k6774n4713n5608m8134o1139j06974j54322j51553p8040
33718d26477M3519J77963K97909L77987L97768L58994K82089J79313M5446j21738
33708A612773l05634m77021o01664o42153n72313l98621j59143R5631L06495M02662
33698g38988L37338J46137n5652j62030j57681j02016n1888k0640L080K9286O2773
33687g10281J02067J32595J32483R1821K1134n7546j19367j40944j12926n2609
$$ y = [1614680, 1378227, 1096887, 832555, 606637, 415200, 269629, 198006, 202796, 236444, 233664, 164316, 49432, -64613, -133748, -125469, -29511, 120174, 244382, 265692, 168157, 4554, -156156, -279811, -370702, -447476, -524854, -598728, -630650, -561781, -368496, -104146, 132406, 271982, 310780, 284006, 229293, 173685, 125551, 64412, -42562, -196884, -348437, -426477, -382958, -204995, 92914, 470901, 868669, 1227663, 1509752, 1689065, 1734511, 1612773, 1307139, 830118, 228454, -413699, -986012, -1384633, -1543776, -1448145, -1141650, -738988, -401650, -255513, -311165, -473195, -630876, -732892, -784780, -805420, -802340, -773054, -710281, -608214, -475619, -343136, -251315, -230181, -287727, -407094, -548038, -660964, -713573]
33677g13573Q830N7228J01915J45351J61760J23156M1807l0333m8313j1246M7557
33666a15861R3845J09214Q7780L3632l6041r4699j19287j01182m9952Q628M4451
33655a39472M3690J6576k2588p5640j43716j95943j87186j21889p1250r2932j45215
33644a135565j20522K6809K16240L21793K97414K04348J33478J30097J88554K83183
33634E45829L83368M54664M70773M29005L44794K31521R5527n0033j80812k77057
33624B447579l33518l48086l15580k46497j77908j41259j22928q2711j6173K6449
33614F89368m585j03722k21753l10424l39178k92155j81333n6491K5075M1809
33604g53389R650m6147r7149j02172l0859R2729J96210K22493J73661Q9082K832
$$ y = [-713573, -704743, -647515, -545600, -400249, -238489, -115333, -73526, -103859, -152172, -163418, -115861, -22016, 87198, 174978, 208610, 172569, 77870, -41417, -142599, -192551, -183923, -139472, -95782, -79206, -101794, -177434, -321150, -517093, -704279, -826168, -897418, -990350, -1135565, -1256087, -1229278, -1013038, -691245, -393831, -189483, -56005, 74092, 262646, 545829, 929197, 1383861, 1854634, 2283639, 2628433, 2859954, 2955481, 2905448, 2724636, 2447579, 2114061, 1765975, 1450395, 1203898, 1025990, 884731, 761803, 679092, 662919, 689368, 684783, 581061, 359308, 48884, -290294, -582449, -763782, -820273, -795198, -753389, -743739, -789886, -887035, -989207, -1020066, -927337, -731127, -508634, -334973, -245891, -243059]
33593b43059o7248j09742j18254r4823m8794J759L1876L0303J6489J5407J8005
33582e68081j819k7508N16J04120K25408L00127L41189M01065M68798M62121L31254
33571B037190J28370m2463j14781q7925k108Q6082J23870R2733K3069l5903o4526
33560B143608q7850j45833k49639l58979m01080l26606j58886J7283J23378J41664
33550F97060J04897M9652p758o1735j05517j30945j27636q1061J4886J36235K30097
33539G18175K51615K03477J33714R0804Q1038O9152J6379q4149k02831k93922
33529I83452l20004k68009j51643L9J55488K79352L28185K73320J42264J7919
33519A440363l1960k2962l0708j01317k09736l07613l76945m16424m04782l15293
$$ y = [-243059, -310307, -420049, -538303, -633126, -681920, -680161, -648285, -617982, -601493, -586086, -568081, -569900, -597408, -596892, -492772, -267364, 32763, 373952, 775017, 1243815, 1705936, 2037190, 2165560, 2123097, 2008316, 1920391, 1918283, 2004365, 2128235, 2220968, 2244037, 2208134, 2143608, 2055758, 1909925, 1660286, 1301307, 900227, 573621, 414735, 432018, 555396, 697060, 801957, 851609, 843851, 782116, 676599, 545654, 418018, 336957, 351843, 488078, 718175, 969790, 1173267, 1306981, 1397785, 1478823, 1547975, 1564354, 1480205, 1277374, 983452, 663448, 395439, 243796, 243835, 399323, 678675, 1006860, 1280180, 1422444, 1440363, 1408403, 1385441, 1354733, 1253416, 1043680, 736067, 359122, -57302, -462084, -777377]
33509g77377j60763N443J34662K08333K21616J71163P0110m5104j36939j86226
33499d95082j86660j39510o4317M019M6268P4860J03976J18279R3120L5301k2943
33488d32689o8049j16505j78262k33892k58336k47536k10441j54273r3120n4040
33478b047143n1930o4144m8978R280Q2950J26943J18215P6985N1600O6819Q1122
33467a598281K1263j19477k42514k40478j20830O562N8723M7370J3356m3124j27406
33456b344836j91870j74048q1079J5928P3615J17546J82236K52707K90053K85749
33446a573999K60089K21724J59381P2924r648n3321m4982L86N3252Q5970Q3197
33435g45027M5866q201m7315m0893J3003P5077R6741P3312N1311O9516J04577
$$ y = [-777377, -938140, -932697, -798035, -589702, -368086, -196923, -126813, -171917, -308856, -495082, -681742, -821252, -885569, -881550, -835282, -760422, -656446, -538167, -445047, -409746, -432689, -500738, -617243, -795505, -1029397, -1287733, -1535269, -1745710, -1899983, -1993103, -2047143, -2099073, -2163217, -2212195, -2202915, -2119965, -1993022, -1874807, -1797822, -1746222, -1679403, -1598281, -1577018, -1696495, -1939009, -2179487, -2300317, -2293755, -2235032, -2187662, -2174306, -2217430, -2344836, -2536706, -2710754, -2791833, -2775905, -2702290, -2584744, -2402508, -2149801, -1859748, -1573999, -1313910, -1092186, -932805, -859881, -869529, -922850, -967832, -967446, -914194, -828224, -745027, -699161, -707362, -754677, -795570, -782567, -707490, -610749, -537437, -486126, -416610, -312033]
33424c12033R5801K0943p4155j26898j20975q7038n4435k1583K5072P6773R8491
33413d80037O3215j0261o0720l7418M6694J22593J31189P4912J261m9075o3259
33402b60906l9346K2489J04178J64944J68701J14521L6826k0136l1633j1003j576
33391B47059l5267r4404j29654j19419r0096p0207n5066m0397o2104j59832l08420
33380i17807m25460m51187l91051k80697j49997l2600L3261M6238N9658J25188
33370b384454K28998L06280L08902K41303J46151P8798Q0374J42234J97960J78157
33360d75297P8598m1040j20994j43315j17917n9903J0738P2288J17882J54167
33350e24793J77190J68949J28288Q6457P5174Q8952R1603N2036l5046j50897k58859
$$ y = [-312033, -216232, -195289, -269444, -396342, -517317, -604355, -658790, -680373, -655301, -578528, -480037, -416822, -427083, -487803, -525221, -478527, -355934, -224745, -149833, -148572, -197647, -260906, -300252, -277763, -173585, -8641, 160060, 274581, 311407, 291271, 259638, 248635, 247059, 211792, 117388, -12266, -131685, -221781, -291988, -347054, -387451, -449555, -609387, -917807, -1343267, -1794454, -2185505, -2466202, -2616199, -2648799, -2615538, -2569300, -2509642, -2384454, -2155456, -1849176, -1540274, -1298971, -1152820, -1074022, -993648, -851414, -653454, -475297, -396699, -437739, -558733, -702048, -819965, -879868, -869130, -796842, -678960, -524793, -347603, -178654, -50366, 36091, 111265, 200217, 291820, 343856, 308810, 157913, -100946]
33339a00946l15211k92666k00973q3658M148K1029l5659j14853j36028n4854Q9737
33328a219934K08613K48909K37119K31096K44562K38627J87233J29305J37114
33319F42644K34435L59691M16048L53519K03941M9537l6272l2953K0219N8272
33309B269081M1489k3585j11076k08304l09035l88991m14906l79467l07305k24444
33299e6543j42274p4256m1522m7595o7685p9947r1385j16761j50585j84241k35694
33288a288488l26094m23704m43370l23521r5490J34973K72196K95591K53511K06177
33278a738219J76380J49385J09638O3126J9045l3941j12010j99271k49869k38703
33268b054439j96292j76885j96314k16699j95009j32349o3519n772O0943J53725
$$ y = [-100946, -416157, -708823, -909796, -993454, -989306, -968277, -1003936, -1118789, -1254817, -1309671, -1219934, -1011321, -762412, -525293, -294197, -49635, 188992, 376225, 505530, 642644, 877079, 1236770, 1652818, 2006337, 2210278, 2259815, 2223543, 2190590, 2210809, 2269081, 2310570, 2286985, 2175909, 1967605, 1658570, 1269579, 854673, 475206, 167901, -56543, -198817, -273073, -314595, -362190, -429875, -509822, -601207, -717968, -868553, -1052794, -1288488, -1614582, -2038286, -2481656, -2805177, -2900667, -2765694, -2493498, -2197907, -1944396, -1738219, -1561839, -1412454, -1302816, -1239690, -1220645, -1254586, -1366596, -1565867, -1815736, -2054439, -2250731, -2427616, -2623930, -2840629, -3035638, -3167987, -3231506, -3237278, -3176335, -3022610]
33258c022610K44277K81388K54730K09668J86045J66066J09432K7555j3424K8223
$$ y = [-3022610, -2778333, -2496945, -2242215, -2032547, -1846502, -1680436, -1571004, -1543449, -1556873, -1528650]
$$ [...]
##END NTUPLES=NMR SPECTRUM
##END=
